##TITLE=1H_CA-8802-6
 CDCl3, 8 sc, 
 29.12.2020
##JCAMPDX= 6.0         $$ Bruker NMR JCAMP-DX V2.0
##DATA TYPE= NMR SPECTRUM
##DATA CLASS= NTUPLES
##ORIGIN= UXNMR, Bruker Analytische Messtechnik GmbH
##OWNER= root
$$ XWIN-NMR		Version 3.5
$$ Wed Dec 30 10:38:30 2020 Russian Standard Time (UT+4h)  she@DPX200
##.OBSERVE FREQUENCY= 200.1315066352
##.OBSERVE NUCLEUS= ^1H
##.ACQUISITION MODE= SIMULTANEOUS
##.ACQUISITION SCHEME= undefined
##.AVERAGES= 8
##.DIGITISER RES= 18
##SPECTROMETER/DATA SYSTEM= spect
##.PULSE SEQUENCE= zg30
##.SOLVENT NAME= CDCl3
##.SHIFT REFERENCE= (INTERNAL, CDCl3, 0, 15.9854)
##AUDIT TRAIL= $$ (NUMBER, WHEN, WHO, WHERE, WHAT)
$$ ##TITLE= Audit trail, XWIN-NMR		Version 3.5
$$ ##JCAMPDX= 5.01
$$ ##ORIGIN= Bruker BioSpin GmbH
$$ ##OWNER= she
$$ F:/spectra/data/she/nmr/H-F/1/pdata/1/auditp.txt
$$ ##AUDIT TRAIL=  $$ (NUMBER, WHEN, WHO, WHERE, WHAT)
(   1,<2020-12-30 10:37:16.43 +0400>,<she>,<DPX200>,
      <created by zg, POWCHK disabled, PULCHK disabled
       configuration hash MD5:
       00 E9 B6 7A A2 85 ED C7 34 08 36 98 17 FE 4E 26
       data hash MD5: 16K
       7E 0F 25 1F 52 83 44 B8 CE E8 BB A3 2D 57 52 E4>)
(   2,<2020-12-30 10:37:19.71 +0400>,<she>,<DPX200>,
      <Start of raw data processing
       efp BC_mod = 2 LB = 0.24 FT_mod = 6 PKNL = 1 PHC0 = -10760.82 PHC1 = 7.20095 SI = 16K 
       data hash MD5: 16K
       4F 55 66 B3 E4 C6 C9 84 47 74 EB 42 F0 D3 40 3B>)
(   3,<2020-12-30 10:37:43.32 +0400>,<she>,<DPX200>,
      <pk PHC0 = -0.3226582 PHC1 = 1.8 
       data hash MD5: 16K
       F3 03 9A C2 D2 18 85 B8 B4 DC 1B 10 FC E7 E0 D0>)
(   4,<2020-12-30 10:37:46.76 +0400>,<she>,<DPX200>,
      <abs ABSG = 5 
       data hash MD5: 16K
       59 6D 16 47 C7 0E 2D 6D 36 88 09 E9 C4 9F 57 AB>)
$$ ##END=
$$ 
$$ hash MD5
$$ BF C6 3D 90 3B B0 8E 64 10 94 A6 69 41 CB B3 72
##$RELAX= 
##$RELAX= 
##$RELAX= 
##$RELAX= 
##$RELAX= 
##$RELAX= 
$$ Bruker specific parameters
$$ --------------------------
##$DU= <F:/spectra>
##$EXPNO= 1
##$NAME= <H-F>
##$PROCNO= 1
##$TYPE= <nmr>
##$USER= <she>
##$AMP= (0..31)
100 100 100 100 100 100 100 100 100 100 100 100 100 100 100 100 100 100 
100 100 100 100 100 100 100 100 100 100 100 100 100 100 
##$AQSEQ= 0
##$AQ_mod= 1
##$AUNM= <au_zg>
##$AUTOPOS= <>
##$BF1= 200.13
##$BF2= 200.13
##$BF3= 200.13
##$BF4= 200.13
##$BF5= 200.13
##$BF6= 200.13
##$BF7= 200.13
##$BF8= 200.13
##$BYTORDA= 1
##$CFDGTYP= 0
##$CFRGTYP= 5
##$CHEMSTR= <none>
##$CNST= (0..31)
1 1 145 1 1 1 1 1 1 1 1 1 1 1 1 1 1 1 1 1 1 1 1 1 1 1 1 1 1 1 1 1 
##$CPDPRG= <>
##$CPDPRG1= <>
##$CPDPRG2= <>
##$CPDPRG3= <>
##$CPDPRG4= <mlev>
##$CPDPRG5= <mlev>
##$CPDPRG6= <mlev>
##$CPDPRG7= <mlev>
##$CPDPRG8= <mlev>
##$CPDPRGB= <>
##$CPDPRGT= <>
##$D= (0..31)
0 1.2 0 0 0 0 0 0 0 0.06 0 0.03 0 0 0 0 0.0002 0 0 0 0 0 0 0 0 0 0 0 0 
0 0 0 
##$DATE= 1609310235
##$DBL= (0..7)
120 120 120 120 120 120 120 120 
##$DBP= (0..7)
150 150 150 150 150 150 150 150 
##$DBP07= 0
##$DBPNAM0= <>
##$DBPNAM1= <>
##$DBPNAM2= <>
##$DBPNAM3= <>
##$DBPNAM4= <>
$$ [...]
##$SUBNAM3= <"">
##$SUBNAM4= <"">
##$SUBNAM5= <"">
##$SUBNAM6= <"">
##$SUBNAM7= <"">
##$SUBNAM8= <"">
##$SUBNAM9= <"">
##$SW= 16.9725356469052
##$SWIBOX= (0..15)
0 0 2 0 0 0 0 0 0 0 0 0 0 0 0 0 
##$SW_h= 3396.73913043478
##$TD= 16384
##$TD0= 1
##$TE= 0
##$TE2= 300
##$TE3= 300
##$TEG= 300
##$TL= (0..7)
0 120 120 120 120 120 120 120 
##$TP= (0..7)
150 150 150 150 150 150 150 150 
##$TP07= 0
##$TPNAME0= <>
##$TPNAME1= <>
##$TPNAME2= <>
##$TPNAME3= <>
##$TPNAME4= <>
##$TPNAME5= <>
##$TPNAME6= <>
##$TPNAME7= <>
##$TPOAL= (0..7)
0.5 0.5 0.5 0.5 0.5 0.5 0.5 0.5 
##$TPOFFS= (0..7)
0 0 0 0 0 0 0 0 
##$TUNHIN= 0
##$TUNHOUT= 0
##$TUNXOUT= 0
##$USERA1= <user>
##$USERA2= <user>
##$USERA3= <user>
##$USERA4= <user>
##$USERA5= <user>
##$V9= 5
##$VALIST= <valist>
##$VCLIST= <CCCCCCCCCCCCCCC>
##$VD= 0
##$VDLIST= <DDDDDDDDDDDDDDD>
##$VPLIST= <PPPPPPPPPPPPPPP>
##$VTLIST= <TTTTTTTTTTTTTTT>
##$WBST= 1024
##$WBSW= 4
##$XGAIN= (0..3)
0 0 0 0 
##$XL= 0
##$YL= 0
##$YMAX_a= 309228
##$YMIN_a= -129702
##$ZGOPTNS= <>
##$ZL1= 120
##$ZL2= 120
##$ZL3= 120
##$ZL4= 120
##$ABSF1= 16.0051
##$ABSF2= -0.9675636
##$ABSG= 5
##$ABSL= 3
##$ALPHA= 0
##$AQORDER= 0
##$ASSFAC= 0
##$ASSFACI= 0
##$ASSFACX= 0
##$ASSWID= 0
##$AUNMP= <proc_1d>
##$AZFE= 0.1
##$AZFW= 0.1
##$BCFW= 0
##$BC_mod= 2
##$BYTORDP= 0
##$COROFFS= 0
##$CY= -3
##$DATMOD= 1
##$DC= 0
##$DFILT= <>
##$DTYPP= 0
##$F1P= 0
##$F2P= 0
##$FCOR= 1
##$FTSIZE= 16384
##$FT_mod= 6
##$GAMMA= 0
##$GB= 0
##$INTBC= 1
##$INTSCL= 2.992141e-10
##$ISEN= 128
##$LB= 0.24
##$LEV0= 0
##$LPBIN= 0
##$MAXI= 10000
##$MC2= 0
##$MEAN= 0
##$ME_mod= 0
##$MI= 1.114404
##$NCOEF= 0
##$NC_proc= -7
##$NLEV= 6
##$NOISF1= 3.799351
##$NOISF2= 2.8
##$NSP= 0
##$NTH_PI= 0
##$NZP= 0
##$OFFSET= 15.98542
##$PC= 1
##$PHC0= -10761.14
##$PHC1= 9.00095
##$PH_mod= 1
##$PKNL= yes
##$PPARMOD= 0
##$PSCAL= 0
##$PSIGN= 0
##$REVERSE= no
##$SF= 200.130005841548
##$SI= 16384
##$SIGF1= 3
##$SIGF2= 2
##$SINO= 5.538805
##$SIOLD= 16384
##$SREGLST= <1H.CDCl3>
##$SSB= 0
##$STSI= 16384
##$STSR= 0
##$SW_p= 3396.73913043478
##$SYMM= 0
##$S_DEV= 0
##$TDeff= 16384
##$TDoff= 0
##$TI= <>
##$TILT= no
##$TM1= 0
##$TM2= 0
##$TOPLEV= 0
##$USERP1= <user>
##$USERP2= <user>
##$USERP3= <user>
##$USERP4= <user>
##$USERP5= <user>
##$WDW= 1
##$XDIM= 16384
##$YMAX_p= 309504310
##$YMIN_p= -717480
$$ End of Bruker specific parameters
$$ ---------------------------------
##NTUPLES= NMR SPECTRUM
##VAR_NAME=  FREQUENCY,     SPECTRUM/REAL,   SPECTRUM/IMAG
##SYMBOL=    X,             R,               I
##VAR_TYPE=  INDEPENDENT,   DEPENDENT,       DEPENDENT
##VAR_FORM=  AFFN,          ASDF,            ASDF
##VAR_DIM=   16384,         16384,           16384
##UNITS=     HZ,            ARBITRARY UNITS, ARBITRARY UNITS
##FACTOR=    0.207333158178281, 1,           1
##FIRST=     3199.16224341927, 0,            0
##LAST=      -197.576887015507, 0,           0
##MIN=       -197.576887015507, -717480,     0
##MAX=       3199.16224341927, 309504310,    0
$$ Real data points
##PAGE= N=1
##DATA TABLE= (X++(R..R)), XYDATA
$$ [...]
8163 55707327 57080879 59093287 61487529 64456032 68101770 72117017 75639466 78658300
8155 78658300 80656816 82133078 84066081 86237998 88493495 90030846 89574030 88228983
8147 88228983 87295455 86696154 86453764 85104404 82699296 80583849 79077904 78057483 76964140
8138 76964140 75960148 75523646 75341942 75364639 75389132 75569465 75850057 76438215 77418440 78611362
8128 78611362 80303236 82413985 84629791 86555195 88107157 89865806 92745947 96840432
8120 96840432 102119603 108287506 115228289 122279947 127907388 131031333 132462317 132914010
8112 132914010 132572373 131233877 128739892 126141481 124062183 122291142 119991302 116347389
8104 116347389 112434856 108937647 106453718 105148455 105007300 105331763 105605881 105505554 105379229
8095 105379229 105257903 105044553 105127541 105601115 106014667 106861245 107848746 108548992 109683149
8086 109683149 111885595 115194023 118980968 123497796 128394621 134041894 140489101 147974695
8078 147974695 156119172 164404310 172558946 180584740 187895118 192128965 194007515 194599091
8070 194599091 195050457 195860808 196831568 197693387 197057679 193146595 186667085 175838293 162268419
8061 162268419 150440868 142001324 135904449 131499520 128047911 125552554 123337497 121345134
8053 121345134 118707974 115466540 112243712 109915834 108983879 108864138 109313366 110206846 111788142
8044 111788142 114290728 117931138 122410085 127489476 132202296 135743008 137657411 138700966
8036 138700966 139631159 141610596 143744546 145573586 146380340 144228548 139250105 133173161
8028 133173161 126667452 120960850 115834407 111345997 107502269 103365693 98182658 93443135
8020 93443135 89844508 86965669 85053082 83534931 82257963 81008836 79753807 78834268
8012 78834268 78074053 77604658 77468813 77787673 77877148 77287321 77192035 78065706 79222211 80925599
8002 80925599 82706440 84296185 85553092 87384680 88639682 88739085 87254731 85375331
7994 85375331 83501829 82462833 82020661 82149754 82855689 84708556 86711200 90043172 93678466
7985 93678466 98066207 101963965 106527737 112018007 120310452 130650494 144804213 160347492
7977 160347492 181936993 209858320 246974568 282535386 309504310 293044222 234166788
7970 234166788 188356728 155601263 134111719 118698167 108636961 100966321 95186188
7963 95186188 89450861 84252899 79579799 76480159 73721974 71747956 69456626 67573576
7955 67573576 65803877 64298565 62625130 61202232 60060836 59013827 57603359 55809523
7947 55809523 53897702 52499857 51265649 50067521 49137939 48075241 47333711 46615704 46282296
7938 46282296 45415931 44979101 44635149 44778595 44729732 44586634 44779113 45534205 46070522 46838366
7928 46838366 47741321 49582289 51565773 53628118 54863803 55167892 54908253 55116258 56007986
7919 56007986 56741032 57184221 56640143 55201153 53549500 52357744 50796285 49424549 47047342
7910 47047342 44185621 41778435 39878634 38313977 37177081 36352809 35856188 35248944 34893828
7901 34893828 34527800 34509973 34492644 34654389 35012960 35506682 36302531 37253358 38286866 39155918
7891 39155918 39912301 40619100 41411573 42443676 43953448 45588554 47579645 49127908 49629397
7882 49629397 48879268 46973615 43747057 40269748 37177608 34590322 32540987 31265985
7874 31265985 30164370 29322768 28211350 26633774 25217081 24011827 23082107 22447220 22011436
7865 22011436 21296522 20661139 20313392 20023850 19561004 19305007 19054477 19184087 19334519
7856 19334519 19699623 20252245 20483360 20942257 21228139 21358386 21103374 20952436 21163207
7847 21163207 21320705 20743822 19602029 18264208 17233609 16672874 16347724 15589491 14527690
7838 14527690 13260654 12678489 12156028 11722680 11158794 10486248 10065265 9853772 9780860
7829 9780860 9230654 8818815 8723333 8625449 8332729 8191645 7971778 7633031 7609724 7851511
7819 7851511 7582573 7001465 6827123 6971929 7068692 6737978 6380627 6340304 6190995 6337451
7809 6337451 6152339 6066334 5840473 5678607 5701893 5523949 5182532 5026804 5361748 5384206
7799 5384206 5143331 4970213 4914494 4842857 4759671 4849997 4898720 4620957 4458828 4401001 4515750
7788 4515750 4337335 4287842 4180245 4291725 4340103 4516211 4080800 3959537 3859371 3885039
7778 3885039 3607965 3713011 3656385 3704571 3591324 3410841 3415593 3319782 3543336 3533579 3402596
7767 3402596 3065081 3114738 3061190 3345963 2960800 2933101 2791654 3254264 3042145 2946000
7757 2946000 3052489 2988610 2872333 2961878 2809284 2823899 2830760 2901040 3000132 3018997 3077672
7746 3077672 3062899 2942213 2657903 2640397 2415602 2618837 2654192 2704754 2488547 2499001
7736 2499001 2402056 2550031 2399882 2498697 2377597 2529237 2395082 2501261 2206638 2290727
7726 2290727 2259957 2241612 2287900 2303410 2285706 2327948 2356906 2326288 2416412 2139899 2260110
7715 2260110 2171395 2300616 2328471 2183677 2145117 2213586 2003621 2111164 2168891 2152537 1857140
7704 1857140 1820738 1830630 1850886 1827790 2030345 2015488 1829231 2045667 1991546 1882339 1808867
7693 1808867 1695731 1742341 1757911 1793369 1951029 1969194 1833274 1981928 2154540 2360189
7683 2360189 2048417 1882706 1801228 1926122 1865937 1787428 1713681 1725490 1845719 2099586
7673 2099586 1911363 1610512 1536542 1743393 1813113 1598132 1495756 1495712 1679269 1654218 1453698
7662 1453698 1527386 1702517 1445129 1517970 1488590 1347658 1560898 1476743 1434414 1406033 1333030
7651 1333030 1381856 1498636 1473707 1597604 1390225 1521590 1559876 1452420 1425535 1440079
7641 1440079 1382326 1469525 1354255 1337873 1266775 1284140 1158361 1123190 1195154 1360927 1325372
7630 1325372 1177966 1084125 1123614 1226000 1287695 1231395 1029762 1149415 1196760 1179832 955451
7619 955451 926989 963926 999858 874948 1019562 998189 1137877 1016418 1025662 768120 743005
7608 743005 721749 897454 1063093 908734 826527 1029727 966497 877932 805561 806748 862042
7597 862042 712724 606896 625249 697161 568079 543784 644698 715634 736052 952533 1091282
7586 1091282 892273 813277 545433 547825 628359 891697 1052325 755059 792554 908915
7576 908915 824057 836242 755728 820251 815742 730912 704569 783829 616740 789363 717038
7565 717038 673328 733036 765879 536725 562063 376964 392203 588035 775795 600551 724150
7554 724150 913608 918482 1035519 904710 546883 667991 920962 662056 527127 607111
7544 607111 694101 573456 511031 335357 572066 659484 642815 472849 538849 610585 855183
7533 855183 719408 579019 479904 504807 699614 888669 758894 515028 650380 625672
7523 625672 880459 687082 578633 652095 844726 809554 854908 508929 479669 883917
7513 883917 976166 719621 564549 436974 395814 431796 436557 514702 354544 496778 714328
7502 714328 767837 271426 313054 459757 778367 343933 185648 516558 794916 512724
7492 512724 663861 483175 672236 608537 773674 645730 409550 464851 694546 751505
7482 751505 616946 670220 757593 684668 656833 765659 711957 695627 559623 865541 1026003
7471 1026003 1197714 1212692 1449606 1660392 1578567 1789812 2060913 1910852 1367155 985274
7461 985274 716682 599134 436445 492292 566175 602329 364299 383732 513529 578831 390087
7450 390087 466310 264046 255008 552817 540110 529786 466938 471407 320682 444003 216635
7439 216635 350559 145601 365261 269789 304589 313214 289172 96196 216583 237560 253778
7428 253778 14178 126190 226213 214241 74796 -148600 -183832 -67283 130733 -52903
7418 -52903 -22326 40497 204707 81869 13910 -209735 -206833 -145208 36191 91887 106808
7407 106808 96732 192857 71384 4717 64179 102568 97602 37263 77253 103302 107152 -4277
7395 -4277 71268 154138 283267 290754 220456 198537 35523 50042 250324 147437 -20814
7384 -20814 -60481 153014 176557 -97768 -27928 331361 336768 32017 29069 36952 75177 56864
7372 56864 171865 -82066 -182754 -53183 188734 -40954 -18122 26054 58375 61474 -160739
7361 -160739 -64460 40828 69420 27570 233625 117981 342693 165762 458447 291082
7351 291082 -128093 -377032 103668 254509 256886 202096 355974 363063 147504 -19397 -101949
7340 -101949 -2301 184495 138529 157473 -51816 -7243 34753 240411 40824 -232342 99144
7329 99144 254289 165419 115916 177654 84572 155627 419 -19833 68127 -68265 48282
7318 48282 287807 153704 53694 54755 203602 101016 -28956 24137 144739 121134 247282
7307 247282 99944 1022 -278194 129665 279152 368210 148173 41686 -47471 247582
7297 247582 203291 171599 -16504 207791 224790 205675 39615 9407 41596 113658 122010
7286 122010 -32711 -27974 114290 239566 247516 39431 -131255 115568 90562 -3300 -173010
7275 -173010 -210113 -96179 -18906 -42588 -122694 -223670 -172124 -137346 257433 110724 85558
7264 85558 105596 283734 119594 84841 254149 283313 77577 29810 39103 144302 110375
7253 110375 -247156 -170259 -73203 -193286 -280033 47099 66520 -52867 -23717 106938 51576
7242 51576 2616 74021 116097 -8442 -89643 7536 6891 -23924 100314 191360 25839 -70993
7230 -70993 -5935 -2867 11539 26893 32625 237495 185546 166203 97376 34683 -70605 -27922
7218 -27922 28672 -17757 -204996 -178171 70894 190957 -75704 171337 133480 102510 -231176
7207 -231176 -324964 -249139 -140533 -161810 -51007 -171310 -369420 -66774 92920 179460
7197 179460 171993 244682 204657 188416 271454 99300 -50713 -89355 -220090 -19002 24694
7186 24694 -47119 -150886 5761 -131213 -118011 -193641 -138187 -236086 -15423 80245 -50470
7175 -50470 22409 127098 -28674 39599 126425 158839 141975 85844 408823 262457 -6081
7164 -6081 -158108 -126951 -40045 101970 133539 219751 109359 180694 468719 301701 74013
7153 74013 77738 215833 252295 139313 116713 255717 85729 102937 100777 180952 216356
7142 216356 116762 64002 129996 136912 70641 93817 256911 78820 129341 240882 223801
7131 223801 168997 7913 -158222 25051 147608 96724 129739 107847 40739 -140810 -237397
7120 -237397 -90282 -184427 -150189 -21707 -119850 -49420 149857 307921 283775 -30837 -11694
7109 -11694 254923 37694 -153171 -78066 9583 -244954 -124535 -16237 -101493 30906
7099 30906 222389 230325 218298 61457 27163 -26658 -174691 -246768 -286040 -27186 182643
7088 182643 -46126 51007 -133375 -182902 -121 65687 -87267 -13766 -6930 -183917 -237581
7077 -237581 -162781 -95994 -105794 128853 209504 156644 168424 101564 -33215 -70999 -132784
7066 -132784 -122603 -127351 -243148 122938 119895 170382 76266 -31408 123691 -24135 -102617
7055 -102617 -76373 -140211 75779 48941 -35078 3901 58816 268921 359291 174256 -169583
7044 -169583 -72520 257900 216583 -28399 47141 96893 110215 -32709 -39960 25730 -64624
7033 -64624 79404 214273 31598 66027 112087 194769 230081 80086 120295 249594 183070
7022 183070 8216 -79149 107916 176102 98857 74590 -33604 133315 188483 111353 108843
7011 108843 -5485 -81135 157361 153322 73010 52910 130179 349815 76183 -76823 138869
7000 138869 278296 189586 128327 -55179 -81986 -76427 64814 -73487 -217190 -147186 56990
6989 56990 54315 -117934 -167965 -143422 -25264 26337 97718 33386 -66094 -53580 182077
6978 182077 127822 86711 -192730 -10546 -49877 -77876 -99702 28944 58575 -59346 308510
6967 308510 155212 -47293 -160371 4679 53258 -8484 -98370 -45780 -79552 95418 38205
6956 38205 244019 86717 166386 151226 145358 -83717 -52985 -69756 -88999 -51861 46215
6945 46215 4464 64104 -21774 69777 245207 162766 104001 93211 131594 233169 353553
6934 353553 350510 120160 110618 268562 -11848 -183620 -187356 -44710 -35055 -156998 -205995
6923 -205995 -148123 -121720 60367 243307 111797 -60716 73559 197278 212818 10787
6913 10787 251569 293466 200001 189225 96889 159076 118447 -92027 125356 80167 11427
6902 11427 -31970 -13193 -167365 -67605 110711 258420 285606 106724 183661 359419 191772
6891 191772 122414 -13010 22409 126910 213152 197565 109191 98254 176360 -53812 -94725
6880 -94725 177408 231944 259636 89124 -146348 64391 244632 251497 -4140 135732 83124
6869 83124 110019 220404 114218 39028 -1490 49447 164999 -7376 52350 167859 286594
6858 286594 142776 -1464 76317 179845 123806 77950 131016 165243 277850 247099 265656
6847 265656 196160 139756 197249 188015 94404 35382 131384 231892 11263 28279 144681
6836 144681 67247 84044 158458 113898 70512 144695 120586 216821 198372 280123 98783
6825 98783 177760 382208 371664 476923 251037 7528 140730 284679 317266 175732
6815 175732 71218 167539 107551 251725 204640 31816 -1404 478887 365602 92588
6805 92588 -26112 232211 313075 570018 465144 172709 -1054 342159 380382 234522
6795 234522 -9442 68646 108540 147879 88066 107381 65954 137424 268026 428756 461373
6784 461373 405969 362824 482622 504327 130252 -19487 194729 325870 321928 6207 -31097
6773 -31097 293275 402729 580602 479490 167258 -6392 120734 99681 105934 227921
6763 227921 293798 452514 555087 425302 408411 241436 333627 453163 493166 241375
6753 241375 364591 225529 331008 569962 524670 547287 282524 348438 710641 584232
6743 584232 308456 286746 339391 648250 553292 585473 513273 535831 794354 808589 653968
6732 653968 558017 464788 538045 399579 279293 4969 76427 310507 502236 656630
6722 656630 405365 385858 493522 510838 375558 407693 390920 462877 552283 764343 749384
6711 749384 563775 359312 603199 411288 441861 315034 204178 63279 194355 427248
6701 427248 467151 363676 305067 393108 659396 778143 437015 112557 473057 840595
6691 840595 722779 498942 292957 383079 528829 644441 497023 367838 439953 827453
6681 827453 745669 416328 231619 378419 568977 573819 548663 616227 562578 675874 616043
6670 616043 735290 668609 454071 623353 581782 667960 777092 514767 488120 585755 487864
6659 487864 589575 671080 570680 466086 537899 422310 315078 309340 734952 975507
6649 975507 977027 733140 779996 848106 931157 985753 906571 831887 928627 1303560 1326794
6638 1326794 924277 827466 990611 1289808 1008222 840723 829012 960179 968769 978710 950544
6627 950544 900133 950108 1194197 1322535 1090304 1045199 1076115 1119165 1214751 1199266 1131626
6616 1131626 1262701 1389324 1617365 1681813 1550933 1424847 1815064 1672342 1571823 1694989
6606 1694989 1693192 1606899 1586216 1581015 1566623 1603216 1699763 1807173 1955669 1663336 1544143
6595 1544143 1552690 1632161 1675948 1834834 1629864 1350290 1429074 1653808 1631829 1814587 2203217
6584 2203217 2239950 1921774 1885791 2030951 2110587 1994975 1878675 1968133 2071999 1972374
6574 1972374 2131986 2062187 1946065 1776831 1672771 1842087 1903076 1733860 1634059 1910243
6564 1910243 1869789 1933302 1778714 1771827 1673236 1631769 1703532 1961947 2067853 1940780 2147724
6553 2147724 2023442 1852146 1818768 1885507 1773374 1762598 1818748 1917966 2009843 2191054 2187762
6542 2187762 2267369 2270548 2151526 2349878 2487855 2451926 2445953 2579635 2647840 2589620 2367983
6531 2367983 2234611 2130894 2207921 2261706 2317905 2201689 2226601 2136034 2230311 2157310 2006470
6520 2006470 2240012 2380890 2230032 2170782 2142111 2124725 2090864 2040613 2176717 2141986 2151884
6509 2151884 2356591 2431169 2202506 2094305 2081936 2162802 2086127 2017862 2003674 2044082 2124016
6498 2124016 2018119 1797135 1769118 1922531 1886788 1844927 1705255 1683507 1594555 1761647
6488 1761647 1560052 1301031 1185072 1472785 1597937 1520777 1391250 1498855 1606420 1779559
6478 1779559 1550949 1292223 1479971 1473746 1594589 1633916 1524105 1302528 1707109 1863382
6468 1863382 1613581 1382514 1631525 1751508 1705276 1425587 1597461 1653383 1730415 1751562
6458 1751562 1548350 1669903 1700764 1693505 1966379 1870796 1649893 1778443 1915277 1829162
6448 1829162 1771993 1867674 1751996 1887135 1946367 1908260 1775704 1716602 1488271 1541767 1668710
6437 1668710 1686631 1594547 1603171 1619252 1758550 1834373 1786323 1620659 1451548 1604934 1521765
6426 1521765 1488955 1214929 1204893 1338144 1468239 1469475 1726336 1714977 1757489 1791985 1735570
6415 1735570 1511918 1387093 1486502 1363427 1329923 1512690 1579828 1450515 1587808 1545499
6405 1545499 1614375 1426638 1783163 1739920 1647197 1598608 1625714 1675241 1932635 1767743 1845490
6394 1845490 1618519 1712967 1965507 2208625 2205636 2085670 2265769 2521859 2576607 2699696
6384 2699696 2939121 3274660 3607066 3915839 4141270 4058386 4093663 3939338 3888594 3508940
6374 3508940 3391312 3460713 3643378 3696286 4089578 4140916 4099385 3713341 3391021 3132420
6364 3132420 3096444 2813259 2667033 2524124 2552745 2619060 2230514 2139393 2089761 2078022 2284110
6353 2284110 2339047 2312029 2278717 2310706 2581183 2278397 2202546 2237111 2357316 2305522 2485192
6342 2485192 2431440 2203035 2366995 2627904 2698227 2533338 2521967 2604061 2800733 2734328
6332 2734328 2739182 2647169 2888908 2973252 3104512 2963733 3067300 3201592 3262544 3324361 3510907
6321 3510907 3434887 3706049 3838391 4054905 4311774 4522607 4622077 4563424 4939942 5135056
6311 5135056 5111526 5025183 5004007 4949765 4809050 4836784 4900881 4822618 5040769 4908732 4949754
6300 4949754 4956324 5003546 5219421 5508145 5733251 5767768 5811730 5971005 6469024 6996663
6290 6996663 7357952 7679214 8267360 8929602 9676065 9984802 10535117 11214926 11630039 11720278
6280 11720278 12080234 12541855 13198063 14301111 15476375 16546716 17031271 17167184 16689843
6271 16689843 15919284 15040564 13991826 13191546 12763808 12528963 12322376 12219244 12430754
6262 12430754 12650018 13313108 13688261 14343908 15217056 16288503 17344513 18393881 19690798
6253 19690798 21179678 22348127 22883346 22790053 21598644 19944363 18020171 16397981 14959784
6244 14959784 13817044 13062056 12785935 12568304 12381332 12048059 12089996 12338756 12337299 12416923
6234 12416923 12350241 12848346 13244988 13361291 13428184 13888191 14335199 14965279 15592960 16196319
6224 16196319 16755277 17641425 18805366 20170403 21483574 22877285 24636292 26907580
6216 26907580 29699848 32695029 36222469 40242925 44913829 49629334 53902472 57991384
6208 57991384 61648058 63738164 64103331 63309959 61753088 59104638 55222881 50506709
6200 50506709 45175693 40111707 35469610 31730088 28175474 25326492 23028278 21368654
6192 21368654 19850885 18658510 17788898 17535483 17131852 16948634 16788955 17116205 17105622
6183 17105622 17540098 18427229 19400046 20658651 22301736 24075447 25731384 26863182 27123426
6174 27123426 26152813 23825114 20836608 18014484 16041247 14150779 12872456 11526834
6166 11526834 10461038 9645974 9269216 8538753 7862282 7431758 7348360 7120491 6758278
6157 6758278 6335902 6267768 6216815 5896271 5515969 5409600 5253880 5345353 5050404 4783065
6147 4783065 4379553 4481655 4549056 4256192 3960370 4076909 4245905 4040883 3439156 3364862
6137 3364862 3388651 3525577 3424032 3359192 3272187 3350908 3324966 3309379 3155497 3175708 2859194
6126 2859194 2811148 2642204 2745450 2727905 2716967 2742051 2617400 2450474 2466068 2689615
6116 2689615 2237526 2106505 2054827 2151093 2017673 2028350 2113665 2061541 1844039 2099011
6106 2099011 2130218 2106583 1851047 1952892 1825839 1765799 1674068 1934008 1871211 1731663
6096 1731663 1609482 1738683 1799634 1900013 1937555 1649722 1586728 1517442 1635295 1618842
6086 1618842 1679781 1647743 1838342 1588840 1578738 1607236 1680252 1513471 1436134 1368773 1256556
6075 1256556 1340565 1419373 1418731 1224841 1280386 1522034 1354785 1297792 1137755 1381689 1478048
6064 1478048 1280773 1345340 1288813 1521913 1506536 1735283 1135301 1184771 1062469 1405646
6054 1405646 1223860 1241230 1360364 1666136 1556711 1381214 1293532 1372172 1487579 1689246
6044 1689246 1480096 1318420 1179095 1330087 1441859 1346956 1388913 1336546 1560128 1571690
6034 1571690 1644046 1456138 1688845 1633584 1902711 1877812 1935531 1845844 2040083 2069641 2145763
6023 2145763 1779336 1655324 1799208 1662122 1456956 1545586 1314962 1447431 1346006 1216515
6013 1216515 1329268 1547046 1551812 1571204 1595484 1409507 1244951 1233168 1275949 1166441 928099
6002 928099 1001778 1099080 937376 882455 704580 821261 997152 910993 905539 874537 869524
5991 869524 1022827 1252026 1058770 1036383 1180195 977220 1030668 868576 889086 796017
5981 796017 1045246 836475 834129 1035945 933685 727777 932767 819232 865805 959802
5971 959802 1070265 1135828 1191273 1133812 1204763 1176464 1368043 1269760 1178919 1222041 1149323
5960 1149323 1281714 1409884 1113226 957170 1131128 1251047 1343833 1205393 1305222 1161644
5950 1161644 1469691 1321921 1165566 959827 992260 921651 1002910 849643 785978 789722 933116
5939 933116 1077458 941313 869646 817955 1138980 1024252 810685 738015 759788 833274 925419
5928 925419 742679 597444 722332 957167 788122 584240 609041 818270 872740 640171
5918 640171 596477 756367 814863 765639 616657 681233 692966 599367 679564 703086 616139
5907 616139 603395 803531 928403 772564 651353 806571 836484 844348 722048 951774
5897 951774 1032901 841389 709484 679798 739934 937967 851129 959139 958673 906158 827596
5886 827596 680605 691978 673014 623927 554082 733545 976081 1115420 1159032 990388 987295
5875 987295 1166565 1218693 895720 812019 887841 985492 961990 945747 1019003 968733 983020
5864 983020 1027023 1050494 1007683 913548 977090 1186861 918517 732762 893644 962241 877726
5853 877726 818548 945852 1016430 1255019 1284329 1097281 1031602 1188424 1329423 1265814 1092617
5842 1092617 1170369 1253035 1262007 1232364 1183374 1418400 1424642 1459804 1274768 969372 1063357
5831 1063357 1434542 1324237 1084107 718593 1027043 1522564 1473365 1180624 1077381 1223629
5821 1223629 1377100 1407753 1172093 904661 1035871 1260898 1249859 1094751 991257 1353411
5811 1353411 1595008 1231121 1121416 1202468 997935 1114342 1173453 1152653 1002401 979934
5801 979934 1429970 1781299 1447333 1086048 1300742 1390888 1409570 1331501 1179766 916386
5791 916386 1244282 1665540 1777517 1529704 1478865 1732708 1952046 1782853 1875822 1691811
5781 1691811 1535177 1678986 1900410 1992066 1653333 1864306 2063167 2321979 2168827 2210264
5771 2210264 2282800 2515272 2652654 2516352 2483411 2587105 2523174 2505884 2331955 2329046 2332951
5760 2332951 2264289 2568874 2664954 2953959 2889048 2677156 2730863 2699786 2639482 2800801 2664362
5749 2664362 2585416 2539577 2813381 2781105 2744527 2744520 2961015 3201385 3172884 3034484 2890417
5738 2890417 2734046 2789329 2766285 2653786 2684105 2555383 2838905 2784678 2785139 2776094 3059987
5727 3059987 3300666 3433551 3270212 3085285 3110216 3141886 3166381 2981455 2701799 2645333
5717 2645333 2737551 2918735 3012459 3009078 2890650 2815862 2990737 2983794 2623776 2465562 2593309
5706 2593309 2584156 2479151 2455099 2585142 2705558 2750729 2916423 2882228 2678527 2506645
5696 2506645 2394177 2202699 2219583 2042916 2172005 2200550 2075110 2181359 2165035 1867898
5686 1867898 1827176 2243255 2286760 2059522 1936291 1823564 1667854 1531390 1429080 1608872
5676 1608872 1472281 1632250 1670155 1631001 1308207 1360425 1466989 1437572 1259140 1336521
5666 1336521 1588439 1620579 1668217 1538537 1557015 1473481 1398002 1474550 1660851 1546824 1650688
5655 1650688 1529989 1609206 1654463 1908072 1584603 1349808 1419043 1486800 1407281 1396375 1322624
5644 1322624 1180854 1317877 1396155 1269933 1040696 1110522 1426153 1654281 1392166 1377529
5634 1377529 1273355 1334678 1207235 1307930 1005567 1104037 1353781 1725602 1567501 1446504
5624 1446504 1407435 1506388 1582486 1554826 1229200 1245311 1497766 1739436 1552736 1306933
5614 1306933 1318528 1509418 1564085 1377989 1257405 1053029 1311988 1425504 1577659 1287606
5604 1287606 1274847 1179496 1425384 1387771 1458333 1367827 1430480 1474406 1442096 1289586 1453437
5593 1453437 1424483 1558173 1767425 1585639 1331197 1572080 1676543 1585135 1442670 1502792
5583 1502792 1535481 1474968 1447368 1225007 1354337 1440469 1444672 1526989 1320670 1144228 1133420
5572 1133420 1186273 1236013 1199056 1231028 1249454 1363733 1363684 1356753 1221389 1085460 1126668 1185943
5560 1185943 1053350 1186852 1412905 1481760 1416020 1083313 1178084 1258697 1065289 883331
5550 883331 872111 1158214 1254380 1419563 1459954 1262088 1002972 1175113 1208014 1280347 1328426
5539 1328426 1070121 1292848 1368770 1273601 1180746 1189206 1126662 1341919 1507504 1214925 1248360
5528 1248360 1275277 1261170 1169686 1043227 1041791 1106763 1081055 1220904 1167081 1058721 1102470
5517 1102470 1402301 1331364 1214739 1013908 1014796 1080607 1215401 1200899 1093271 1105523 1189752
5506 1189752 1117244 1060082 893530 1265293 1342077 1239126 1011516 1089618 1117984 1132320 1001714
5495 1001714 958355 903809 1051805 1133346 1098773 626473 557149 837116 884606 683297 707254
5484 707254 837472 976121 1275909 1219192 1112308 949573 1179275 1011512 898151 796339
5474 796339 1064926 1149767 1216387 1179760 1093937 982724 1018867 899389 1039706 1061976 1100720
5463 1100720 1001242 1055595 979007 863809 895567 1108040 968656 823722 697427 941587
5453 941587 1056743 1121467 1193589 1010596 1015696 1085904 1390048 1553812 1484625 1284402 1122632
5442 1122632 1387725 1386315 1079560 905239 1000096 1061394 1119029 1211875 1344240 1315739 1181521
5431 1181521 1121333 1272826 948765 888264 1148372 1385159 1305193 1234732 1582684 1610517
5421 1610517 1409469 1273039 1105554 1124350 1515986 1338979 1226515 1155255 1099854 1500090
5411 1500090 1722244 1486280 1287276 1323199 1569863 1363227 1292801 1145846 1305031 1318700
5401 1318700 1389490 1346396 1325951 1455279 1543937 1421791 1433215 1554244 1425050 1546319
5391 1546319 1431120 1334523 1396421 1777791 1763511 1925520 1724713 1854397 1983926 2001374
5381 2001374 1925802 1916895 1834986 1761561 1690704 1823890 1891968 1952754 2213196 2162651 2106302
5370 2106302 2097286 2288612 2348897 2265242 2015469 2040340 2239942 2387579 2305378 2375865 2286611
5359 2286611 2469363 2512242 2408765 2176988 2209602 2370292 2664464 2638302 2664604 2732276
5349 2732276 2763023 3071445 3169708 3164018 3429474 3474255 3752579 3940400 4099383 4322691
5339 4322691 4333263 4484807 4190809 4134501 3891890 3901368 3851218 3715037 3563668 3723921
5329 3723921 3711800 3652459 3634773 3888259 4017859 3978703 3831141 4063336 4347440 4192472
5319 4192472 4243281 4252463 4266257 4186175 4459881 4273388 4357039 4622785 5000433 5117155 5005852
5308 5005852 4924941 5300337 5463901 5860971 6065169 6290574 6748922 7358101 7876241 8249511
5298 8249511 8110371 7854235 7611330 6929499 6405231 5937770 5623555 5540988 5419004 5357565
5288 5357565 5362875 5287794 5260512 5219883 5038828 5116145 5140305 5149210 5078807 5075886 5070001 5024502
5276 5024502 5030256 5034183 5010827 5110675 5116150 5154063 5026371 5081205 5385515 5308219 5234350 5400013
5264 5400013 5617524 5912470 6365561 6616612 6875390 7162963 7367355 7400896 7230202 6527688
5254 6527688 6107152 5956268 6031062 5821529 5613377 5359065 5266586 5045162 5071987 4948215
5244 4948215 4935519 4680164 4848143 5079450 5176383 4862094 4683413 4874913 5060479 5065779
5234 5065779 4950992 4934557 4948357 4677410 4833384 5155808 5122908 5007546 4898262 4981566
5224 4981566 4950929 4783719 4820842 4986896 4977309 5179063 5086526 5022278 5021256 5103543 5186651
5213 5186651 5143577 4910946 5141217 5384925 5535225 5344901 5340037 5315209 5187393 5389075
5203 5389075 5531890 5235082 5274236 5667515 5947242 5962027 5555910 5351904 5522979 5826662
5193 5826662 6144302 5985570 5983069 6142500 6287465 6716410 6780862 6830297 7008294 7135078
5183 7135078 7100084 7282166 7505034 7844016 8239629 8564310 8781343 9109423 9414095 9278700
5173 9278700 8972765 8678588 8268218 7938823 7951414 7682865 7397322 7476901 7417828 7559429
5163 7559429 7391382 7134596 7348915 7728681 7639565 7471764 7673031 8021434 8099356 8236609
5153 8236609 8415077 8686995 9101457 9364390 9750169 10009060 9925857 9813150 9831157 9557124
5143 9557124 9537828 9421234 9535082 9889734 10089409 10331764 10330652 10432676 10643694 10804280
5133 10804280 10834353 10776926 10626401 10710669 10436260 10405125 10498891 10365062 10428268 10728349
5123 10728349 10772503 10891767 10650024 10476881 10516862 10463249 10587797 10546118 10252908 9999386
5113 9999386 9999402 10338211 10284040 10328663 10517693 10735942 11027147 11110390 11183255 10744208 10770725
5102 10770725 11024100 11014756 10847094 10662649 10830677 11083929 11186921 11538448 11829228 12171368
5092 12171368 12317174 12630045 12828107 13375479 13850474 14327502 14543552 15019224 15153233
5083 15153233 14967935 14742061 14905632 14855361 14813126 15008105 15151316 15190930 15463000 16049094
5073 16049094 16385636 16415164 16886461 17212548 17043796 16584092 16499503 16527032 16061876 15982403
5063 15982403 16004116 16075205 16001124 16046226 16155368 16147544 16029942 15961879 16061691 16139954 16227876
5052 16227876 16306760 16414303 16346992 16366937 16555411 16850788 16987413 17079616 17232156 17329402
5042 17329402 17567363 17995334 18220083 18302198 18523491 19028094 19243585 19623519 19667135 19909534
5032 19909534 20293030 20599422 20969781 21465273 21822226 22320271 22947867 23258554 23751733
5023 23751733 24293624 24954739 25696986 26461510 27038973 27983025 28989017 29801864 30614367
5014 30614367 31514027 32066652 32850391 33483708 34140217 34435931 34867204 35117733 35467992
5005 35467992 35506598 35820182 36139333 36328755 36463278 36675431 37164124 37833058 38789711 39403295
4995 39403295 39956022 40896894 41742385 42591957 43468523 44387270 45272372 46330976 47469400
4986 47469400 48765008 49899198 51173287 52654162 54634830 56623984 58985704 61784623
4978 61784623 65178394 68769950 72947821 77027787 81339097 85411846 89316661 92540050
4970 92540050 94759699 96497125 98194771 99611250 100376223 100985389 101376249 101447741 100913672
4961 100913672 99899618 98559557 97291234 95804545 94833853 93495018 92046326 90246147
4953 90246147 87889441 84952331 81774412 78584431 75520723 72875540 70594164 68505217
4945 68505217 67356564 66392437 65447612 64983666 64853175 64946419 65013241 65088369 64830276 64886908
4935 64886908 65062576 65265267 65240167 64934307 64497500 63586110 62360110 61139431 59438456
4926 59438456 57673416 56171245 54352145 52681195 51141315 49829100 48486747 47494328
4918 47494328 46382647 45411834 44507672 43738998 43247783 42461928 41823925 41599405 41325864
4909 41325864 40881432 40097418 39405086 38690348 37929155 37018476 36119063 35261115 34342197
4900 34342197 33481715 32536244 31238050 30044858 29151070 28541963 27847965 27054505 26449211
4891 26449211 25658538 24953202 24553794 24003077 23593028 23186765 22916250 22574465 22016696
4882 22016696 21632964 21501247 21033872 20619265 20344002 20013984 19571122 19370017 18949402
4873 18949402 18671184 18335954 18332798 18265446 17914160 17776505 17687169 17440551 17292174 17183474
4863 17183474 16983040 16645026 16246929 16210451 16124883 16200146 16041581 15724346 15468160 15329826
4853 15329826 15233529 15115150 14938989 14640688 14469457 14636187 14652452 14478306 14199608 14060403
4843 14060403 14039866 14048746 14133203 14026391 13817592 13625060 13470514 13179197 12784500 12682863
4833 12682863 12622381 12354088 11945491 11840827 11749082 11833851 11741108 11281512 11331174 11311368
4823 11311368 11118344 11215100 11188382 11022621 10927247 10926191 10940209 10700355 10832499 10817605 10750998
4812 10750998 10947710 11016452 11046144 11029905 10933818 10597650 10703871 10689463 10317658 10273660
4802 10273660 10172336 10126280 10107948 9995075 9972796 9852652 9959523 9913531 9901982 9776201
4792 9776201 9766093 9696744 9702319 9541712 9644207 9611835 9779065 9674210 9717425 9725806 9814181
4781 9814181 9483322 9232050 9209783 9068152 9009802 8848600 8927637 8784755 8774234 8697983
4771 8697983 8665646 8759524 8780489 8847576 8784271 8844632 8799644 8563415 8647113 8857673 8962396
4760 8962396 8779999 8629660 8656304 8853739 9020575 9207233 9215503 9039148 8957592 8906802
4750 8906802 8604479 8401614 8298962 8360536 8523381 8262850 8123120 8131384 8087893 8419217
4740 8419217 8597556 8540993 8567660 8559441 8632550 8559620 8421810 8347972 8403282 8410674 8463037
4729 8463037 8562181 8683243 8760539 8815213 8869234 9169885 9060146 9005606 9190569 9251844 9276344
4718 9276344 9469589 9611151 9395972 9374529 9368779 9472942 9518428 9637545 9449990 9700415
4708 9700415 9815570 9947398 9933241 10237358 10327785 10392615 10475653 10536888 10691809 10643026 10624553
4697 10624553 10534039 10450825 10520623 10566028 10576185 10776668 10892040 10882231 10786931 10890221 11044744
4686 11044744 11068421 11308805 11433232 11608309 11846392 12056090 12348678 12440243 12753057 12908274
4676 12908274 13085194 13343536 13581741 13940671 14019227 14212586 14697751 15332033 15786244 16190154
4666 16190154 16790376 17786484 19027046 20221042 21457035 22669346 24298701 25916214
4658 25916214 27058042 27128213 26254551 25033194 24000513 22944932 22031823 21392400 21547368
4649 21547368 21915896 22490286 23424621 24337621 25374906 26906635 28326001 29109051 28902829
4640 28902829 28119961 26666658 24528199 22671247 21258903 20127317 19211721 18619857 18100969
4631 18100969 17645821 17407167 16982290 16841785 16726568 16662355 16603443 16371171 16252348 15859714
4621 15859714 15592713 15479320 15548975 15737313 15755029 15560049 15734697 15830974 15966740 15818693
4611 15818693 16198086 16363260 16801512 16893044 17435661 17646991 17963583 18259043 18550893 18838503
4601 18838503 19175501 19353887 19534770 19991495 20517562 21189049 21873157 22500908 23270052
4592 23270052 24210837 25262341 26471597 28017389 29532964 31202168 33493284 35979967
4584 35979967 38914535 41499978 43427890 44066417 43430593 41538719 39204128 36718358
4576 36718358 34865296 33966312 33420501 33424120 33759473 34715348 36294174 38452543 40570117
4567 40570117 42715454 44342560 44781735 43954743 41369121 38248169 35238719 32512065
4559 32512065 30121997 28424024 27163379 26006711 25016018 24585741 23809898 23496770 23096006
4550 23096006 23091697 22901920 22764549 22453308 22734735 22811466 22746540 22547315 22593522 22587784 22417460
4539 22417460 22344009 22370430 22167080 22138389 22445213 22654821 22509052 22742360 23106714 23242810
4529 23242810 23493384 23592185 23804877 23936493 24077624 24451848 24694220 24694442 24851269 25037551
4519 25037551 25071803 25413539 25792424 26020932 26072270 26253124 26855351 27180621 27336584 27648511
4509 27648511 27797438 27949262 28095918 27824349 27368540 27071261 27291715 26893683 26533160
4500 26533160 26187752 26100005 26110306 25847819 25596046 25612664 25405033 25446622 25262277 24862955
4490 24862955 24546749 24341412 24443008 24382094 23975521 23734155 23797815 23949557 23734824 23419222
4480 23419222 23598718 23524057 23308223 23059520 23197603 23171804 23101164 22918614 22340584 21880935
4470 21880935 21900528 21659133 21092425 20637822 20390831 20310568 20071848 19974450 19735682 19588837
4460 19588837 19511121 19941334 20031537 19997394 19995487 20588882 20876216 21153735 21320598 21871703
4450 21871703 22427851 22964744 23162249 23366190 23560666 23776403 23903398 23739212 24057348
4441 24057348 24158526 24230412 24215878 24653363 24723551 24683011 24629504 24746018 24766335 24767389 24645511
4430 24645511 24773798 25108593 25226999 25130151 25081339 24901097 24895635 25043979 24759355 24204936
4420 24204936 23720658 23532961 23021285 22756284 22231614 22193311 21807917 21942346 22166409 21961460
4410 21961460 22006300 22323820 22827808 23388882 23981281 24969041 26244399 27763993 29718583
4401 29718583 32092637 34540053 37034120 39287215 40280886 39674475 37582532 34655677
4393 34655677 31785816 29374233 27287006 25667619 24347887 23287223 22435489 21797080
4385 21797080 21361176 20965226 20747265 20943661 21213060 21584743 22069495 22553438 23263484
4376 23263484 24058355 24904736 26045672 27270905 29168012 31468365 33822385 36060498
4368 36060498 38309368 39312593 38365405 35918429 32610370 29377457 26708662 24554269
4360 24554269 22946227 21176289 20087206 19044468 18050606 17250603 16540281 16172970 15674890
4351 15674890 15275966 14979225 14722346 14342460 14224976 14101847 14025501 13618856 13465288 13671383
4341 13671383 13472495 13391908 13463119 13558081 13354230 13100559 13289205 13667221 14085090 14249351
4331 14249351 14639478 15041978 15239184 15959790 16891695 17836878 18972562 20461695 21856327
4322 21856327 23294848 24088268 24248149 23399027 21917165 19937828 18260108 16961682 16132907
4313 16132907 15345827 14757498 14538808 14223093 13835676 13580062 13710798 13746616 13639546 13663205
4303 13663205 13844369 14089334 14293867 14712516 15386815 15961294 16804979 17609128 18914410
4294 18914410 20564908 22374804 23857675 24580631 24780898 23876532 22111020 20205042 18517882
4285 18517882 17171300 16321726 15356954 14764249 14320948 13790949 13172574 12812128 12354091
4276 12354091 12085357 11355934 10823294 10686602 10684437 10487963 10521253 10115702 9980509 10096704
4266 10096704 10182385 10081063 9669852 9809087 9978070 10327325 10471811 10753709 10804932 11248994
4256 11248994 11690167 12096720 12392843 12888764 13885326 15029397 15699234 16577002 17554221
4247 17554221 18579646 19225174 19514922 18933353 17751972 16482209 15483100 14346426 13278031
4238 13278031 12204009 11493858 10787123 10420931 10090550 9408531 9071252 8974582 9245852
4229 9245852 9137442 8653227 8499179 8328470 8420296 8340234 8067435 7629740 7389285 7324909
4219 7324909 7283092 6896781 6610676 6434904 6432641 6339236 6294267 6044524 5754525 5628622
4209 5628622 5853632 5872977 5790485 5678914 5564666 5594958 5586182 5403801 5410323 5533642 5727826
4198 5727826 5686726 5716155 5495620 5515728 5536508 5592745 5414337 5286129 5639597 5974175
4188 5974175 6077845 5984931 6014627 5769405 5833434 5987004 6104038 5920578 5877612 5777427
4178 5777427 5701367 5444955 5789736 5853216 5788994 5672939 5841858 5885671 5705170 5327092
4168 5327092 5135763 4798079 4976353 5184099 5077915 4694448 4686175 4658513 4693830 4580158
4158 4580158 4323023 3934762 3992204 4126846 4111675 4093619 3673143 3656975 3882118 3921716
4148 3921716 3885825 3768872 3700185 3755646 3810941 3700685 3420053 3547331 3556281 3596097 3526581
4137 3526581 3692428 3740060 3787239 3742752 3971244 3768274 3570841 3481586 3441841 3374181 3276956
4126 3276956 2994220 2887583 2976165 3088421 3162309 2928757 2663640 2639337 2824352 2862947
4116 2862947 2945059 2760580 2810731 2848870 2955780 2873417 2849177 2703527 2926932 2813563
4106 2813563 2572259 2602917 2398343 2635658 2826686 2585491 2711615 2482042 2370683 2541817
4096 2541817 2773114 2771052 2438020 2368803 2455453 2584162 2479429 2515662 2573123 2766894 2938590
4085 2938590 2843405 2592289 2458322 2401416 2548010 2803950 2701020 2594592 2496882 2512974
4075 2512974 2660978 2967707 2810598 2751477 2558943 2729660 2838818 2695458 2445859 2411783
4065 2411783 2677041 2710771 2487601 2570871 2642473 2706386 2715124 2671549 2946426 2969608 2888913
4054 2888913 2809580 2892283 2638301 2721785 2769309 2851413 2800434 2923035 2932008 2816410 2884655
4043 2884655 2990805 2904701 2912335 3086677 3183672 3134537 2998364 3166294 3277618 3186119 3093403
4032 3093403 3335019 3355694 3406998 3248759 3275760 3287821 3504465 3491062 3417581 3445965 3492263
4021 3492263 3407621 3362915 3285753 3485985 3557480 3508692 3565167 3380675 3481078 3473886 3678203
4010 3678203 3555613 3496806 3417602 3641528 3480999 3581912 3372335 3701622 3725863 3853398
4000 3853398 3751250 3738857 3565721 3623403 3618766 3860996 3748886 3832797 4006136 3897100
3990 3897100 3674694 3710463 3814468 3801733 3803690 3675036 3718823 3692304 3781450 3875190 3646179
3979 3646179 3694294 3625042 3584992 3915221 3857151 3845618 3786735 3883187 3799072 3755491 3659561
3968 3659561 3768363 3740909 3737993 3656165 3577649 3772238 3856272 3815836 4059991 3980433 3769023
3957 3769023 3570392 3594217 3521347 3680920 3773190 3941578 3711065 3977614 4172616 3969649
3947 3969649 3813093 3924924 4005466 3972848 3758923 3802063 3895814 3760096 3715773 3737323 3728249
3936 3728249 3693664 3648029 3627087 3688010 3634842 3695953 3620137 3728750 3754304 3813625 3562151
3925 3562151 3624945 3747287 3808819 3816866 3906996 4000414 3706693 3789126 3842601 3938476 3749538
3914 3749538 3783546 4058366 4030394 3872255 3822319 3577770 3553873 3616210 3724473 3692340 3687868
3903 3687868 3606305 3873399 3636178 3362373 3462118 3669587 3670202 3402357 3412147 3313959 3498891
3892 3498891 3398809 3315075 3277087 3207793 3286205 3551476 3394093 3285108 3307927 3372339 3416287
3881 3416287 3391373 3406274 3380212 3338478 3384379 3554670 3533375 3346406 3447392 3542841 3607921
3870 3607921 3579304 3498158 3490387 3248779 3249415 3380470 3510396 3340256 3341529 3492963 3701336
3859 3701336 3506781 3346464 3124382 3122699 3160533 3392129 3449402 3532347 3610009 3740308 3601672
3848 3601672 3502107 3518472 3536343 3667089 3641870 3511295 3483831 3464341 3545998 3823458 3919040
3837 3919040 3792469 3760448 4038059 4120150 4124286 3867661 3626597 3760701 3937488 3849344
3827 3849344 3809341 3890750 4058676 3960877 4078643 4259959 4061017 3863211 4119530 4256781
3817 4256781 4230574 4110760 4133824 4247345 4431317 4360979 4347939 4479828 4769846 4770287 4701902
3806 4701902 4643216 4737180 4777947 4965121 4995878 4950219 4809803 4989247 5051997 5336929 5296685
3795 5296685 5322466 5262235 5262403 5153201 5420976 5621442 5933537 5813979 5729586 5934707 6057958
3784 6057958 6029613 6149780 6213948 6273098 6531413 6821108 6880526 6918317 6840933 7160528 7546683
3773 7546683 7554339 7619499 7516886 8059540 8256520 8821614 8752752 8907875 9127389 9759003
3763 9759003 10161618 10564471 10881199 11570146 12108672 12498187 12908465 13120515 13189168 13479962
3753 13479962 14167082 14977268 15782769 16276131 16819498 17172245 17338468 17331195 17286395 17741813
3743 17741813 18235945 18874602 20041176 21173426 22386100 23674262 25156450 26556310
3735 26556310 27482929 27845088 28128775 28362793 28334650 28085285 27770230 27341548 27055244 26686548
3725 26686548 26879150 27567302 28497413 29640158 31196231 32870180 34001448 34190065 34120731
3716 34120731 33786310 33304883 32836130 32250295 31622334 30638523 30261133 30272654 30698171 31028679
3706 31028679 31673864 32222048 32619497 32951710 33421955 33494772 33279030 32477807 31105916
3697 31105916 29156944 27738058 27020787 26904362 26949512 27094962 27652836 28166496 28603761
3688 28603761 28715074 28629269 28230770 27700861 26903934 26085757 25023256 23754269 22647307
3679 22647307 21909996 21462498 21171372 20626994 20692396 21057780 21434518 21707704 21752053 21723797
3669 21723797 21047707 20105805 19513490 18925579 18239821 17905926 17824609 17952662 17706030 17755420
3659 17755420 17833948 18127844 18174189 18462657 18650850 18974965 19427125 20139656 20739656 21201818
3649 21201818 21744749 22297776 23047133 23507012 23932616 24257137 24475332 24618818 24643056 24642593
3639 24642593 24655544 24674270 24874117 24690785 24726623 24721328 24819215 24631721 24684536 24858152 24888355
3628 24888355 25005091 25201782 25242406 25338610 25599457 25970679 26439538 26607913 26691875 26641501
3618 26641501 25955346 24971619 24102607 23503766 22845336 22069084 21361265 20732731 20327084
3609 20327084 20251955 20161964 19850958 19600466 19678789 19920366 19937963 19705361 19668540 20137665
3599 20137665 20248179 20222933 20202660 20360377 20720042 20953168 21266666 21127552 21326378 21393936
3589 21393936 22089985 22455962 22707019 22841564 23406609 23701421 24132475 24403196 24825305
3580 24825305 25594583 26841211 27848099 29040012 30207198 31865741 33355652 34291076
3572 34291076 34951690 35522830 35787853 35770971 35380198 34519351 33593181 33053640 32701731 32204772
3562 32204772 31908068 31547897 31621382 31818306 32235543 32661354 33719889 34688990 35888198
3553 35888198 36895526 38002665 38692822 39298424 39509829 39311987 39070600 39062038 38816963
3544 38816963 38699004 38721424 38963239 39324782 40059160 40896350 42350403 44025792 46441229
3535 46441229 48172351 48572904 46628884 43435512 40544411 38274305 36509141 35634865
3527 35634865 35377261 35471399 35752652 36573027 37617911 39084156 41106178 43187067 45763575
3518 45763575 48735480 52103013 55766460 59098209 61245504 61310894 59897955 57319667
3510 57319667 52647121 47445770 43079348 39731316 37598190 35788522 34487426 33781585
3502 33781585 33423922 33122045 33657011 34625638 35661089 36498256 37859206 39528533 41482259
3493 41482259 42860635 42802080 40815918 37348858 33792330 30972935 28419089 26452408
3485 26452408 25446475 24596259 24012019 23483072 23219108 22898361 22776613 22304160 21813402
3476 21813402 21137947 20937393 20603272 20396908 19832320 19279413 18814813 18912044 18618636 18210750
3466 18210750 17900206 17688100 17322128 16923705 16380809 16172592 15948903 15913151 15766429 15815882
3456 15815882 15918658 15706295 15491650 15703684 15672396 15310233 15315099 15499702 15599665 15830541
3446 15830541 15977078 16297141 16377981 16190374 16161442 16071993 15851284 15834555 15628048 15429638
3436 15429638 15351000 15292247 15099995 15116727 14963302 14925546 14893188 14816465 14713640 14829210
3426 14829210 14915100 14766099 14785604 14877303 15000825 15062178 15158687 15034462 15012352 15277799
3416 15277799 15363341 15329725 15363523 15398457 15511603 15494368 15589639 15745153 16059085 16358164
3406 16358164 16818911 17296886 17659344 17850630 18441734 18941769 19472827 20113888 20966256
3397 20966256 21910107 22729877 23829511 25017552 26014863 26885165 27381807 27705328 27928274
3388 27928274 27805501 27637290 27428012 27219005 27175928 27475654 27947491 28105549 28474550 28859750
3378 28859750 29543037 29856754 30186393 30339844 30407762 30409589 30710209 30594239 30185745 29687354
3368 29687354 29433259 29084014 28590852 27914002 27326144 26722707 26135477 25542380 24642659
3359 24642659 23701161 22772420 22076563 21555065 20871815 20336017 19886186 19566326 19193641
3350 19193641 18994181 18831200 18766952 18719230 18445225 18360986 18177212 17907510 17577015 17127894
3340 17127894 17351689 17155334 16885270 16801460 16974288 16795460 16942469 17035583 17223234 17324593
3330 17324593 17566577 17900036 17991316 18008624 18237527 18788526 19344939 19784405 20374166 21085983
3320 21085983 21434274 22238019 22897989 23399694 23638647 23738276 23546681 23507588 23251026 23208173
3310 23208173 22828949 22564586 22407014 22582395 22348978 22401397 22428183 22681811 22753065 23013238
3300 23013238 23520522 24135461 24743263 25293949 25263248 24949404 24840049 24577406 24262226 23640775
3290 23640775 23097094 22784350 22574141 22027201 21566771 21228620 20714299 20301886 19934651
3281 19934651 19490855 19207875 19019648 19015998 18935192 18630430 18586760 18423323 18765770 18823812
3271 18823812 18815251 18826871 18901240 19254455 19358369 19185253 19185627 19449869 19581009 19600687 19592458
3260 19592458 19538484 19795299 19919678 20064556 19992865 20118708 20276917 20502781 20986565 21077327
3250 21077327 21305321 21608346 21966910 22185130 22383608 22613855 22881686 23507226 23966622
3241 23966622 24499395 24789439 25119187 25699279 26083122 26672870 27362211 27759997 28250125
3232 28250125 28911753 29511889 30118748 31122810 31928242 32916984 34070719 35141097 36610415
3223 36610415 37797928 39451448 41152470 42745508 44575440 46685250 49306777 52156270
3215 52156270 55464910 59268769 62540963 64124740 63832869 62124399 60648013 59822036
3207 59822036 60095476 61009861 62419758 64694338 67874021 71195462 74421493 76714969
3199 76714969 77634939 77023497 75602193 75192448 75584001 77218828 79805955 82990418 86244875
3190 86244875 89046097 90370364 90493535 89948878 89867168 90861111 93047181 95970695 100231487
3181 100231487 105416861 111510035 118579830 126785452 134570248 142262584 149937969 159941660
3173 159941660 173405508 191205980 212162953 234858462 255124916 270079948 271714668
3166 271714668 264195550 255776624 245664438 226788799 197464874 169676886 148252059
3159 148252059 132278845 120187370 111525901 104588990 99340291 95160449 91790171 89405132
3151 89405132 87868100 86823805 86700126 87403316 88377634 89936887 92469770 95532223 99025100
3142 99025100 102962486 107519426 112456712 117328456 120431707 122222388 122879390 123614365
3134 123614365 125341687 127769567 130185439 130285644 127666296 123419197 119931686 118375630
3126 118375630 117999571 118220621 119077096 120833924 123203127 125777979 126612642 123573832 116706044
3117 116706044 107205181 97968998 90052638 83599747 78918186 75146865 71868753 69046860
3109 69046860 66566927 64316424 62471334 61128050 60091911 58772586 57738372 56747995
3101 56747995 56333119 55443366 54843406 54369026 53975289 53668786 53750425 53534320 53388579 53225489
3091 53225489 53206849 52754534 52506200 52447280 52565891 52429879 52412446 52653761 53229273 53890783
3081 53890783 55061243 56630103 57797594 58804473 58809747 57420712 55326963 53648505 52418619
3072 52418619 51912004 51694873 51656515 51939289 52368538 52862843 53732668 54695238 55746568
3063 55746568 57074411 58479083 60003629 61579831 63363897 65757443 68252849 71077749
3055 71077749 74621139 78922698 83529904 89142620 95874815 103785896 113103673 123841421
3047 123841421 136095128 150521272 168825538 191404835 216650282 239473630 253955035
3040 253955035 251840740 228165328 193609268 162049702 137066266 118265704 103715702
3033 103715702 92622960 83566082 75851275 69773830 64443808 60324795 56456177 53313165
3025 53313165 50736893 48508900 46217300 44038243 41887498 40175805 38570425 37372517
3017 37372517 35999178 34975165 33769455 32749870 31638494 30727598 30019445 29151454 28419200
3008 28419200 27852298 27221213 26440701 26012763 25359236 25019532 24454161 23955468 23536122
2999 23536122 23035305 22743864 22425365 22041681 21740761 21469198 21282075 20901651 20576906
2990 20576906 20343491 20235361 20075049 19958893 19981002 19671374 19677177 19710976 19675888 19638248
2980 19638248 19293071 19149328 18850350 18275519 17880816 17419316 17018541 16536816 16221157
2971 16221157 16068418 15907646 15671952 15570571 15334366 15108413 15192706 15426319 15326082 15085888
2961 15085888 15146730 15277652 15311995 15174498 15333724 15516986 15675180 15801890 15901302 15955478
2951 15955478 15702366 15720412 15529102 15193137 14893509 14909489 15275357 15439283 15629021 15817142
2941 15817142 15996269 16122201 16251799 16221773 16038953 16197544 16675218 16891022 16926513 16519683
2931 16519683 15922634 15243289 14515405 13963414 13450932 12707278 12318952 11980583 11563574
2922 11563574 11254483 11325984 11455071 11343593 11101042 11015309 10897305 10828736 10420505 10292609
2912 10292609 10250635 10400286 10531562 10508026 10626013 10498499 10707514 10756397 10944812 10851577
2902 10851577 11045021 11536927 12221564 12736995 13097050 13371422 13653086 13837356 13508293
2893 13508293 12691454 12128597 11787724 11359216 10825191 10537056 10323083 10199550 10112878 9880025
2883 9880025 9795760 9643195 9936141 10142618 10187501 10189598 10600249 10912065 11242345 11661040
2873 11661040 12086502 12361187 12626165 13046413 12809279 12061078 11318429 10659845 10346593
2864 10346593 9896095 9807409 9713522 9441982 9242724 9391024 9377057 9431100 9332015 9391577
2854 9391577 9534780 9497450 9489341 9641496 9605442 9604007 9824605 9629050 9415460 9587571 10100515
2843 10100515 10296939 10594798 11026311 11639377 12156741 12573371 12455941 11986190 11431887
2834 11431887 10928354 10456697 10069906 9562320 9459256 9410344 9265070 9195759 9402355 9429623
2824 9429623 9774103 10034342 10289927 10652164 10950203 11790693 12756830 14072497 14985916
2815 14985916 15641962 15122436 13656476 12035384 10766561 9623157 8890462 8444306 8104812
2806 8104812 7820788 7642179 7433522 6869114 6526412 6154434 6214322 5998360 6093904 6007946
2796 6007946 5802428 5402438 5261928 5241070 5265707 5157218 5148300 5226145 5193993 5279474 5382766
2785 5382766 5320721 5219456 5298500 5137128 4917455 4499379 4486018 4348436 4488407 4422656
2775 4422656 4600322 4361121 4553167 4557402 4569544 4271716 4150922 4155424 4176933 4039124 3936358
2764 3936358 4128276 4199284 4451332 4538694 4607767 4328400 4260017 3828890 3966250 3571375
2754 3571375 3689031 3682504 3593348 3310669 3247802 3256260 3345740 3290957 3267297 3267114 3266926 3341333
2742 3341333 3272192 3443803 3615565 4119871 4010071 3952192 3724431 3734201 3803165 3699964
2732 3699964 3408493 3617533 3554574 3465274 3372365 3142198 2915090 2683117 2902700 2690008
2722 2690008 2575602 2544270 2591708 2603672 2539078 2310085 2326251 2257690 2394893 2323824 2150936
2711 2150936 1832578 1932745 1948078 2053349 2047631 2063379 1989681 1954921 2107394 1909440 2023392
2700 2023392 1903787 2149160 2207637 2128645 1924963 1917642 2096829 2295402 2115205 2088284
2690 2088284 1956368 2051103 1996734 1825431 1787638 1732593 1813052 1636849 1627467 1586404 1609118
2679 1609118 1403742 1702151 1685414 1517286 1523446 1692518 1646429 1446410 1440582 1725970 1799959
2668 1799959 1741632 1609701 1446627 1440607 1482523 1583193 1426728 1378820 1273140 1513873
2658 1513873 1439293 1257303 1204033 1360132 1177695 1238262 1483882 1585387 1383544 1460994
2648 1460994 1438702 1316539 1112816 942831 1268082 1350592 1257009 1355717 1272489 1187119 984917
2637 984917 1286264 1392822 1166089 1076402 1250060 1278533 1291900 1305479 1232901 1189559 1111595
2626 1111595 1160523 1288581 1355304 1376021 1611147 1609571 1360248 1259592 1263603 1456060 1516407
2615 1516407 1375786 1444667 1304402 1430502 1514748 1445142 1381391 1733067 1656859 1723467 1542976
2604 1542976 1618740 1681294 1529316 1394374 1316821 1297458 1158042 1307748 1159770 1126485
2594 1126485 1342211 1550814 1514229 1580809 1515340 1197198 1186336 1355067 1267417 1249367 1011132
2583 1011132 1202760 1433221 1189213 1176555 1253689 1282338 1297135 1378341 1405589 1485556 1142519
2572 1142519 1139343 1065707 1189302 1200403 1296832 1262830 1242275 1211871 1386014 1222512 1308626
2561 1308626 1172565 1174727 1392468 1335161 1536688 1427116 1597474 1630447 1639040 1499896 1541893
2550 1541893 1456374 1625124 1083369 1199895 1240292 1417738 1396113 1203593 1265112 1392477
2540 1392477 1407928 1349035 1349854 1284878 1193919 1137438 1030617 1022765 1125342 1110055 1230662
2529 1230662 1159623 1389375 1368027 1348062 1224198 1213197 1144834 1160922 1195172 1019726 869456
2518 869456 1001909 1107658 1337994 1251699 894936 926375 952810 1043616 923295 853840 850588
2507 850588 921317 1223868 1283576 1065651 1134749 1242951 1115236 969252 1041554 1300689
2497 1300689 1209865 1086455 1000072 1006952 864884 989330 959137 802213 769756 847021 914947
2486 914947 736372 628479 755556 838239 702197 861024 909804 796623 835734 889308
2476 889308 708394 531605 697122 767418 698141 525329 587710 755422 877728 1026866
2466 1026866 964211 761137 554854 650474 782890 943674 938455 799876 992691 985998 812335
2455 812335 567801 676443 675989 849670 742457 583625 587033 765131 820544 702445 541755
2444 541755 807387 803594 713013 688056 644429 583257 512025 550214 510826 573335 548778 648396
2432 648396 589524 681482 791968 716188 737259 894687 847845 690296 548675 735690 660938
2421 660938 695068 787620 780606 642274 760048 602733 659683 640034 651079 624404 693850
2410 693850 597141 743230 853553 1071458 688101 790341 928262 717067 710555 671971
2400 671971 457357 474237 653002 693999 644585 571424 737114 869415 863252 496372 338430
2389 338430 574759 708580 815158 741061 545713 632797 686652 625242 478264 661591
2379 661591 640082 756919 860183 760064 552560 552741 493914 553157 628847 615078 564971
2368 564971 721142 685952 667082 790425 694587 598532 641772 590736 635781 595771 353458
2357 353458 461117 439535 627711 587052 694372 521456 739162 840493 773198 742239
2347 742239 526938 616223 763642 751246 650669 659865 498464 850890 996663 704033
2337 704033 436159 632059 833066 956540 710575 823220 652476 628045 744823 1053089
2327 1053089 770862 633709 698690 771624 737935 681575 917873 824553 667710 607318 964689
2316 964689 936968 770712 751311 899843 922639 850049 669267 654820 631436 859315 948061
2305 948061 896678 854774 707550 702771 597387 610167 645364 949482 914575 942679 775930
2294 775930 850694 968428 1040294 762040 873077 622778 729799 871809 1130732 979273
2284 979273 937057 851365 840833 1035037 1089603 868811 876992 1091719 1067449 1072321 851421
2273 851421 860815 948796 1192516 1188194 1101568 1096947 1469654 1310231 1194023 1057398 1072065
2262 1072065 1069214 1081457 952555 1120987 1097395 1165883 1338622 1376030 1282032 1355737 1360803
2251 1360803 1360044 1105868 1136118 1041552 1204856 1333808 1732095 1571972 1519780 1581134 1704092
2240 1704092 1561597 1536663 1518564 1648340 1639708 1586204 1556659 1758497 1809760 1957390 1933769
2229 1933769 1848964 1996827 2120819 2158390 1982534 2130979 2207660 2255891 2046837 2043365 2243918
2218 2243918 2543731 2328277 2367551 2262563 2225788 2266308 2530734 2603265 2245852 2326014
2208 2326014 2490505 2598243 2415624 2522215 2729756 2830301 2689870 2673040 2810409 2927287
2198 2927287 2859680 3164348 3269468 3293440 3442733 3628868 3720014 3769889 4001754 4118357
2188 4118357 4030069 3975772 4182935 4226981 4284902 4325488 4604313 4634993 4872641 4835847 5219326
2177 5219326 5268268 5757701 5830223 6190830 6443005 6859720 7260105 7713368 8138647 8436872
2167 8436872 8854411 9152199 9393889 9319117 8638204 7916250 7451919 6875530 6720448 6423888
2157 6423888 6014382 5721499 5606054 5619443 5496722 5146358 5280451 5367016 5454314 5933544
2147 5933544 6198814 6307926 6366473 6309481 5714827 5188697 4624800 4316201 4041268 3788458
2137 3788458 3362037 3321875 3516223 3472606 3516520 3322099 3427451 3346986 3353785 3222924 3389987
2126 3389987 3327628 3290496 3590474 3742752 3656969 3738410 3947339 4170668 4274135 4420399
2116 4420399 4881606 5424594 6189241 6959593 7585806 7898153 7450051 6332544 5492972
2107 5492972 4726846 4108476 3555586 3231731 2987609 2819145 2732874 2631428 2469433 2630296
2097 2630296 2525465 2396830 2065650 1892040 1779040 2068066 2174607 2164594 2234715 2075555
2087 2075555 2151967 2401363 2447239 2367598 2697754 3042262 3500552 3556092 3745020 4021753
2077 4021753 4367589 4142043 3499306 2717052 2478706 2253578 2320919 1999617 1787038 1479906
2067 1479906 1615736 1494000 1396027 1242941 1364786 1472800 1357266 1186982 1205965 1310624
2057 1310624 1268471 1113492 947743 1054478 891780 846950 745017 729936 860788 926848
2047 926848 1086001 1134386 934836 1034365 831684 836348 842187 854092 877656 743785 827566
2036 827566 1059251 1028973 619603 624428 679739 537987 526781 633705 463651 768134 865635
2025 865635 563590 486736 642282 790734 792834 634967 432178 410306 459959 474599 700130
2014 700130 593215 451584 557223 854206 879322 541431 542220 586574 487594 368075 412477
2003 412477 432801 489273 432101 602864 657599 468137 268314 618403 752602 608639
1993 608639 558364 670193 641017 446418 520332 553418 565517 508373 486411 499021 278479
1982 278479 149261 229655 342455 506579 570536 336960 374670 442613 568245 356506
1972 356506 280773 156278 249249 452556 447271 288018 508959 523315 522728 390810 472963
1961 472963 320389 402158 367126 231006 53412 252690 159798 97532 299120 316531 320149
1950 320149 266003 285942 378225 540674 537426 368674 237509 150631 266418 463268 263075
1939 263075 358348 454741 542401 418786 381397 252596 455211 399521 402133 225051 75345
1928 75345 233764 418127 495357 368922 310826 381380 436541 259186 194001 50644 68306
1917 68306 173955 348326 386853 353215 440485 563491 459097 129328 329938 463778
1907 463778 381680 313447 266245 212320 380512 198314 374461 473971 683110 521728 495288
1896 495288 449393 367945 380615 297697 362107 508051 496016 580833 442091 568498 491670
1885 491670 147278 252256 165793 183200 169971 247785 292350 463163 422215 670121 428340
1874 428340 293898 266268 505366 498178 283588 291415 354070 315470 424282 353833 426492
1863 426492 497108 375861 375003 388859 413550 500168 451996 335230 381385 310482 580313
1852 580313 380770 487325 475075 540972 561769 678950 579126 604659 635600 555130 718133
1841 718133 823457 804918 1076176 1300047 1004658 742669 684952 665451 800720 832850
1831 832850 614836 705380 936863 721685 728060 800777 872624 951205 982564 869716 660915
1820 660915 588909 743062 812719 818322 665765 927205 1058302 912066 875128 869398 972431
1809 972431 1154341 1057924 1125898 1128545 1090247 1230835 1276989 1252017 1204411 1575718 1394234
1798 1394234 1184604 802597 835318 865289 912996 873410 912039 823958 880628 1103389 1104804
1787 1104804 1051529 844642 856109 819611 779738 719143 935941 1148638 1180643 1020494 972199
1776 972199 941637 942086 757505 939306 964545 950454 943826 861912 941325 997509 944829 767155
1764 767155 707615 791272 1027250 852107 787380 256615 617295 897250 870773 523365
1754 523365 524370 475525 725916 555510 589507 627662 606753 844992 905810 528577 357652
1743 357652 474546 736400 782937 591719 474329 383044 638933 546371 499861 269476
1733 269476 464070 522894 498438 350302 54538 166796 190406 330640 421547 457303 656232
1722 656232 745788 412647 131713 98763 404198 509238 495532 561877 570774 353075 247483
1711 247483 373298 449846 313163 484565 607084 401669 507335 437817 483339 444323
1701 444323 419735 584430 510570 420617 474561 485810 557503 598788 554726 293037 333524
1690 333524 348225 422758 340457 181580 104690 117378 91434 146793 -54584 -24344 288029
1679 288029 271352 354343 351425 439526 472903 229241 120702 -38650 -100121 68168 395683
1668 395683 193280 244098 27986 -20484 91978 92633 189963 162119 58774 54667 90821
1657 90821 328035 45472 24710 104544 319499 311222 167895 -31663 161120 218443 230454
1646 230454 61581 116665 51946 52957 164931 6610 -64202 95075 435985 489051 269207
1635 269207 124342 53125 261135 360833 271623 38232 -50904 39475 -46486 -5982 576
1624 576 87298 -44161 113827 29494 -89716 -158634 113555 169597 180961 -111963 -25459
1613 -25459 -2920 -42813 -41246 97154 61076 128402 202603 202057 -64476 -167352 90829 300866
1601 300866 166022 34801 57027 124492 -122969 -59667 2808 -101630 -261478 -95737
1591 -95737 196418 -81899 -244539 -130857 268951 298370 -92015 -224929 -260042 -235294
1581 -235294 66143 48723 -113765 -311001 129138 238404 76852 20373 -114909 -214786
1571 -214786 -147386 -299646 -221419 -394881 -309000 195197 270948 -137337 -383908 -72467
1561 -72467 76292 35274 -129838 -13659 126423 232520 131718 -38561 -239538 -87335
1551 -87335 -134501 118576 41884 -3059 148951 114657 171071 123288 -163913 13078 120915
1540 120915 185507 60418 -14181 3832 -11021 56831 41681 -24069 -136528 -170940 -95436
1529 -95436 -53200 -308127 -280842 -140482 -44060 -159258 69136 117618 -142667 -269386 -32074
1518 -32074 -707 354 -2828 156499 236352 21876 -9352 -23800 -147334 3667 145824
1507 145824 52360 -20921 -119884 -108314 -48724 -43479 -41577 117016 -107894 39015 -95258
1496 -95258 -269594 -500227 -118323 -25430 -183265 -251560 -154537 -173979 -106469 233086 102942
1485 102942 -262290 -201016 -28417 133517 -34273 -99203 1221 75671 200484 108415
1475 108415 22606 -125622 -92239 197255 369971 2344 131379 248424 125591 28064
1465 28064 39423 -162412 -27154 39072 24638 -270720 -376288 -322646 124111 12433 2861
1454 2861 -71588 -110784 -124025 17412 -50442 -157427 -245897 71688 95576 -62648 -16449
1443 -16449 136233 11768 -78144 39414 101118 -114606 -158456 72681 123043 -114212 -291006
1432 -291006 9163 134420 -84467 -120922 -58052 -155180 -22017 120023 148768 -98325
1422 -98325 -45316 52631 -23967 -120981 -328323 -224139 -99437 -46396 -93776 43515 -60743
1411 -60743 -190524 -108930 -128271 -203062 -196314 -10109 150516 -47396 29730 309953 -34540
1400 -34540 96238 138871 146864 -73974 -84705 -115582 -215378 -95243 18613 55771 12997
1389 12997 28977 414495 344444 191458 -57082 -9564 19677 69129 -71675 -59682 55033
1378 55033 143123 6379 -152083 -273617 -108401 -53945 -62433 42569 393 8652 34126
1367 34126 54521 -109343 -144050 -67295 60821 -39962 -146783 -204773 -104542 -104092 -59352
1356 -59352 -192131 -173732 -217823 15769 143610 195067 -25716 -1256 83362 125685 41324
1345 41324 34680 -121691 -155476 -14849 65921 -113766 -336415 -144288 -185927 -91215 -56231
1334 -56231 -18233 -291345 -321716 -98929 37840 -43301 154251 75960 115337 -120015 13212
1323 13212 58810 38434 51982 102647 -146191 -213140 -185055 -31046 158294 74566 66052
1312 66052 71322 67327 -79558 -75398 -66563 -86698 -68902 -47746 -104857 6684 116254 191985
1300 191985 166169 146398 -24160 46238 -91407 -35977 52616 -1997 -20879 -73989 -60015
1289 -60015 36700 -73465 9804 -5810 -53687 -36007 -12601 -35242 55266 64422 107126 165813
1277 165813 25250 231028 83488 138788 -32014 -20238 -50672 -141765 -89227 -7470 -49778
1266 -49778 145129 251307 168041 191783 95072 191672 111975 74230 74284 -5325 -103824 -16427
1254 -16427 32068 128718 89939 122848 171494 188624 136879 93151 5346 186555 289493
1243 289493 313129 264271 138489 305914 298237 394253 457044 410181 339012 510349 460636
1232 460636 182742 85447 162398 211285 294470 200314 141477 79248 167877 151875 -10289
1221 -10289 25539 -202631 -118259 -37324 46830 -28576 68490 247566 349461 115907 256917
1210 256917 118809 13211 -78963 81454 157325 130945 18763 12488 -2534 184266 271109
1199 271109 116 -131840 105430 298685 71185 -65180 45466 196133 144798 108766
1189 108766 -20636 127386 383642 479348 369149 241207 58672 215016 271024 119094
1179 119094 29676 59130 225234 197847 351525 329488 331896 368661 667897 551346 311718
1168 311718 -99676 186858 227429 227136 180362 235885 339669 258915 424312 427509 160700
1157 160700 96769 125161 323363 355657 69178 65731 52321 186363 298842 388016 138754
1146 138754 76811 163149 505971 279752 75916 -15838 196830 595804 544970 470
1136 470 17452 48226 304622 355442 395201 222684 323050 402932 478401 360817 190463
1125 190463 85839 320810 358006 281398 152945 247316 283518 712536 477309 246125
1115 246125 68555 349702 353612 450808 312425 227176 162128 74197 101314 120554 143126
1104 143126 309990 545336 599148 531131 541593 472998 540868 642879 494597 636393 441791
1093 441791 528820 611938 724514 359970 658031 644968 476703 460002 686385 727035 637532
1082 637532 501404 699264 840314 573254 445946 392090 711741 821844 985744 913065
1072 913065 886873 843864 1143414 1091054 736591 843132 952530 1102306 915730 985417
1062 985417 981467 988355 711893 1014555 1095082 1018851 873983 943562 824182 1022969 899216
1051 899216 974331 1075166 1399399 1128342 1097441 1030264 1151969 1178382 1205955 1224364 1206682
1040 1206682 1381784 1477953 1334596 1303226 1431914 1456295 1660697 1604991 1560955 1414063
1030 1414063 1576958 1557993 1671570 1556720 1474584 1438681 1678666 1973331 1848412 1712628
1020 1712628 1641284 1970686 1874557 1807713 1943329 2135715 2263837 2233312 2121040 2206637
1010 2206637 2367419 2379736 2528587 2412946 2575732 2719864 2782642 2733307 2815631 2987165
1000 2987165 3083630 3196939 3394214 3440862 3377130 3457692 3783195 3713464 3875252 4209160
990 4209160 4456135 4722189 4747433 4976758 5341300 5545040 5725410 6045431 6322197 6565027
980 6565027 7029136 7372499 7584382 8006387 8572464 9091399 9392187 10050032 10964321 11904171
970 11904171 12557642 13603808 14272497 14721001 15630422 17207199 18563598 19780130 21853347
961 21853347 24447708 27506444 31452234 36054264 41934645 49517396 59584730 70368003
953 70368003 79213771 81255606 67050010 50985449 40026197 32085802 26855874 22896157
945 22896157 19871434 17375444 15729509 14331189 13030095 12353508 11974001 11320032 10494794
936 10494794 10079421 9329497 8357635 7661023 6979008 6480573 6348940 6057197 5635038 5319966
926 5319966 4903796 4850894 4631264 4361873 4081953 3991508 3767256 3646418 3332302 3358819
916 3358819 3238678 3230363 3222031 3049366 2870839 2866268 2614181 2546255 2182536 2214064 2308958
905 2308958 2295723 2055113 2110346 2251234 2209913 2060234 1934763 1672263 1691439 1786835 1598345
894 1598345 1578560 1783112 1777021 1656250 1717207 1628573 1485202 1307197 1320129 1296465 1264336
883 1264336 1312971 1411051 1220424 1455554 1433365 1271727 893833 799118 1040657 1190382
873 1190382 944412 723754 811476 1003717 1133157 801835 869926 893875 1114302 1062645
863 1062645 1067840 651858 636194 714298 970467 833902 642343 701497 815953 689163 662693
852 662693 582413 418633 395304 558704 516090 366596 409453 389181 379283 200307 484247
841 484247 372041 362471 396212 445040 153699 94104 178252 455783 406392 432454 329313
830 329313 321388 376091 312721 447011 452268 487805 404156 470684 192719 52732 99112 294920
818 294920 94925 134148 141854 155997 278129 573356 455567 231008 64366 269452 216689
807 216689 148847 300459 306782 111275 211586 211362 129197 122034 -46346 181059 205308 235576
795 235576 173555 116651 -48829 10371 83542 351428 93873 233205 160535 133012 57818
784 57818 50707 -93152 -86005 -39029 25478 -102060 -168260 -116515 58816 142912 11156 -69789
772 -69789 130501 158083 371206 338021 87683 136778 149239 140618 179450 290690 48293
761 48293 69521 89806 37874 -53049 -373767 -164689 89839 95698 -60016 -246871 -71185
750 -71185 124490 6541 -2003 42042 102030 43964 107914 140268 -28660 -63389 -70694 -40667
738 -40667 -20758 130561 -22902 -96688 107119 168838 57448 -87801 -26429 39091 82167
727 82167 -51377 -126660 -240282 -4659 126712 106277 -114715 -303943 -196285 118305
717 118305 101143 -20561 -219810 -264772 32448 153422 12004 -233311 -150564 -245982 -27112
706 -27112 -88508 -141928 -103405 -17851 -206450 -94251 5943 -92211 -200115 -59634 -101658
695 -101658 -33878 -61486 54575 92219 213988 113495 128802 102385 38392 137931 250034
684 250034 -166410 -95587 85346 82048 -149853 -112674 -24910 7231 -250612 -209956 53157
673 53157 62549 109343 389396 507462 226741 279591 279350 377347 133210 120083 40656 144817
661 144817 -29011 8791 -36311 -159807 -97727 -110010 -121237 -64071 -83206 -22326 -70109
650 -70109 -200729 -83219 69604 141147 11332 37680 -2320 160741 -22933 -91009 -183887
639 -183887 -140892 -197170 -201437 -400469 -350941 -253054 -30966 16246 138373 5826 -20986
628 -20986 131690 -83044 -49423 -51343 58390 45975 112163 19485 -129592 -181958 -82173
617 -82173 -139036 -60554 -55676 -30599 -183270 -132538 -3612 -19871 12996 132871 4352
606 4352 -66861 -64176 88277 -41405 -43856 80933 -47476 -80710 -116845 9866 -158396
595 -158396 -235412 -14776 -98365 11923 -55840 21193 55190 138071 -84700 -202412 -151410
584 -151410 -4447 -59699 -92392 25387 -21549 -206388 -27165 -122176 -193917 -242508 -234403
573 -234403 -95891 -120992 -294806 -104874 26904 62972 -24007 -149987 -122400 -123498 -109002
562 -109002 19784 -92869 -208542 -175102 -168662 -251273 -461340 -585652 -83405 46313 -31469
551 -31469 -276802 16901 -153412 -155217 -55706 -201936 -463349 -345981 -355426 -126598 -215199
540 -215199 -95762 80590 -30185 -221509 -306371 -290689 -232444 -192401 -187202 -23318 -49392
529 -49392 -68508 -328967 -245698 -38677 3153 -225319 -240690 -439772 -268303 -201403 -214323
518 -214323 -321124 -247093 -237149 -101926 -188888 -88678 -130528 151738 -57736 -90004 -409075
507 -409075 -103884 -87327 160876 46205 -162674 -395503 -114585 -91347 -48665 -386456
497 -386456 -232121 -25955 -91503 -372470 -214676 -247219 -248454 -133330 -49562 -164469 -138351
486 -138351 -103696 -72754 -141155 -197626 -266845 -248575 -75881 87260 197698 -212342 -196663
475 -196663 55942 129506 -44052 -285235 -543698 -365775 -152572 -75529 -363956 -233686
465 -233686 7902 122071 -180208 -471649 -545495 -181440 45300 44832 -207163 -357453 -299677
454 -299677 40746 -148031 -460111 -437544 -151167 1031 -350505 -274761 -286498 -61948
444 -61948 -112198 -102441 -185922 -164477 -95708 -48612 -159381 -229880 -38950 -207507 -232680 -374877
432 -374877 -412788 -224296 -86836 -275005 -152951 -192004 -268386 -304356 -271990 -169899 -226363
421 -226363 -198418 108608 119960 197038 75185 -56926 -154822 2590 -10579 -49305 -230956
410 -230956 -173840 -263845 -260199 -461692 -529455 -345864 47381 -94449 -263618 -423559 -433018
399 -433018 -223196 -300214 -430528 -295393 -310048 -223021 -255129 -400875 -512884 -403970 -343221
388 -343221 -114208 -250906 -307112 -72859 86100 -76232 -355349 -307608 -109382 -265296
378 -265296 -249764 -374553 -273415 -257959 32662 -52382 -217878 -262992 -145295 -76542 -62488
367 -62488 -222572 -399467 -426244 -351097 -335127 -427860 -306098 -297312 -379601 -337083 -214655
356 -214655 -207535 -169639 -244471 -326862 -571802 -505752 -528458 -308122 -495945 -402227 -424610
345 -424610 -73800 62899 -93710 -247284 -311085 -315689 -93911 -422554 -676057 -363358
335 -363358 -52998 107262 -272689 -483384 -294099 -86304 -75709 -389842 -501177 -555810
325 -555810 -547777 -560387 -495234 -368390 -399548 -481459 -168468 -237014 -463580 -554652 -336337
314 -336337 -231912 -337994 -576880 -537261 -732978 -479647 -436410 -212381 -437498 -459233
304 -459233 -394207 -243229 -450579 -315063 -299343 -188116 -273642 -287566 -158800 -364039 -468927
293 -468927 -484992 -141927 -133852 -228552 -263297 -244709 -188538 -260398 -318785 -409325 -395597 -267178
281 -267178 -221898 -231660 -502557 -489098 -346148 -463361 -457489 -467113 -420680 -308197 -88157
270 -88157 -125353 -364023 -409672 -409293 -362167 -198699 -337392 -672036 -458663 -532287 -353544
259 -353544 -432746 -386580 -421993 -257126 -160779 -18947 -231927 -442908 -558128 -326613 -328615
248 -328615 -446331 -717825 -564272 -349508 -88179 -268368 -475366 -507074 -334598 -266864
238 -266864 -384002 -433258 -608301 -488190 -366910 -307134 -492955 -414209 -484262 -460908 -487939
227 -487939 -273331 -406606 -361741 -199968 -174905 -353109 -528366 -465668 -376092 -115167 -138648
216 -138648 -376497 -519649 -395522 -183083 -317719 -525936 -485211 -521654 -332747 -338426 -328447
205 -328447 -675174 -504779 -312168 -359645 -556966 -566512 -414286 -408638 -493943 -524253 -362108
194 -362108 -356438 -132426 -120489 -284500 -494192 -521288 -375409 -219281 -349585 -469055 -386513
183 -386513 -360774 -180961 -227016 -419462 -499494 -559016 -371084 -316060 -293173 -219594 -389046
172 -389046 -278474 -352992 -484129 -524634 -458640 -550798 -576779 -705636 -674308 -701054 -553763
161 -553763 -468918 -477491 -598602 -549646 -389641 -158480 -376140 -610284 -531581 -443552 -496728
150 -496728 -350399 -283804 -438350 -456687 -467995 -452824 -722822 -739527 -539046 -211938 -316962
139 -316962 -571008 -613152 -522920 -535089 -461236 -543929 -568067 -434101 -243504 -301787 -738149
128 -738149 -802936 -663247 -390881 -345484 -376137 -476375 -385861 -231884 -224908 -358931 -589686
117 -589686 -438499 -368153 -303092 -629482 -590389 -414631 -205601 -417418 -407106 -330753 -407551
106 -407551 -333058 -402843 -664635 -591708 -442316 -309790 -390023 -316835 -255182 -318558 -392412
95 -392412 -252566 -389090 -465765 -471323 -544319 -545159 -546711 -719772 -613926 -580350 -589453 -598499
83 -598499 -662162 -643619 -604671 -683563 -505104 -455669 -474193 -570002 -526345 -466668 -476714 -522134
71 -522134 -503065 -510950 -366109 -386603 -570933 -574584 -514438 -456505 -347962 -400313 -637079 -639620
59 -639620 -595175 -351882 -470031 -389024 -418958 -483805 -489307 -450755 -640067 -649755 -605998 -552971
47 -552971 -603301 -544241 -564849 -490985 -450844 -507346 -519572 -403283 -506086 -651672 -509463
36 -509463 -402738 -554474 -579291 -340818 -357004 -441187 -503605 -489458 -498934 -447665 -470525 -426929
24 -426929 -410749 -535596 -635434 -597829 -457780 -649818 -729402 -756844 -729318 -699953 -618798
13 -618798 -595030 -571484 -475863 -422940 -445404 -472498 -452056 -559696 -464067 -423907 -536945 -622358
1 -622358 -503694
0 -503694
$$ Imaginary data points
##PAGE= N=2
##DATA TABLE= (X++(I..I)), XYDATA
16383 -2337374 -2223054 -2152021 -2147773 -2069489 -1860971 -1928645 -2036221 -2025037 -1758156 -1698471 -1698949
16372 -1698949 -1812195 -1706936 -1672277 -1722316 -1660461 -1528395 -1497795 -1739578 -1496338 -1426803
16362 -1426803 -1452908 -1441476 -1306175 -1343087 -1231179 -1235274 -1146582 -1091031 -1039105 -1094042 -953973
16351 -953973 -1014278 -1038047 -1010909 -898888 -823513 -762758 -732470 -663676 -707553 -701402 -591859
16340 -591859 -689185 -567752 -555565 -416054 -359564 -480650 -504497 -424729 -478354 -368718 -264617
16329 -264617 -115642 -278991 -332751 -327806 -174943 -124965 -75969 -7455 53865 137447 -52323
16318 -52323 -35680 -109183 147418 110958 159535 139382 262913 283172 222493 271441 471173
16307 471173 366466 376814 496026 545042 599171 700478 628055 629686 779545 711345 669013
16296 669013 670732 708333 762131 962515 919794 903961 943183 900051 931387 853733 816071
16285 816071 887166 1039567 1180321 1190054 998043 946598 1148848 1278235 1324056 1294791 1359156
16274 1359156 1320365 1349990 1405786 1432606 1423863 1331967 1290752 1464952 1516609 1578712 1444348
16263 1444348 1664464 1777065 1618843 1536404 1566976 1582254 1795352 1905552 1954641 1863677
16253 1863677 1746299 2052491 1989998 1886001 1779708 1887072 1838972 1870505 1770830 1921869
16243 1921869 1972709 2018167 2165471 2235760 2103260 2027729 2195137 2145238 2043358 2142712
16233 2142712 2285915 2203332 2228083 2048736 2309248 2243320 2433420 2484550 2497755 2211558
16223 2211558 2266123 2365726 2468124 2224079 2204106 2382330 2552674 2693327 2668555 2678192
16213 2678192 2532838 2607634 2699582 2725121 2578615 2645881 2495062 2684842 2667054 2772601
16203 2772601 2710396 2896560 2763827 2788967 2684104 2922700 2885052 2878612 2738290 2793630
16193 2793630 2802333 2846353 2909811 3064442 3233833 3118581 3054893 3087807 3096259 2965129 3026486
16182 3026486 3070089 3333237 3052748 3023622 3203726 3268186 2991837 3020161 3115819 3225854
16172 3225854 3010206 2804805 2806925 3048721 3164024 3128962 3184742 3067835 3091322 3321655
16162 3321655 3124394 2985751 2899726 2994714 3078472 3020578 2992935 3231376 3311645 3301010 3151301
16151 3151301 3128137 3228969 3268314 3303816 3285134 3087596 3275591 3422411 3353661 3349035 3224010
16140 3224010 3405838 3332769 3170026 3285715 3336894 3128614 3112572 3292953 3489228 3378318
16130 3378318 3314080 3247809 3398797 3212140 3259601 3355106 3245781 3070154 3024642 3306057
16120 3306057 3431579 3207765 3116972 3491611 3664825 3560663 3282501 3414146 3125189 3229712
16110 3229712 3334399 3417504 3120159 3377821 3623264 3607242 3387136 3446381 3421890 3271641
16100 3271641 3322007 3316252 3364987 3334873 3618947 3446451 3481079 3262802 3428808 3524168 3586886
16089 3586886 3447418 3586492 3503549 3517605 3452491 3530875 3454554 3617079 3547486 3430698
16079 3430698 3399107 3478262 3561952 3553468 3286959 3356727 3460646 3370685 3442473 3600403 3587702
16068 3587702 3587601 3603015 3613233 3603462 3356286 3414407 3532214 3576326 3410832 3471794 3404768
16057 3404768 3523261 3414657 3488167 3598554 3694054 3606043 3598715 3519985 3605476 3649661 3488345
16046 3488345 3310167 3442555 3430931 3546365 3514663 3568627 3627112 3637599 3363874 3279859
16036 3279859 3407390 3620649 3566332 3499668 3532040 3680250 3801202 3569968 3504028 3432996
16026 3432996 3411073 3435851 3352402 3377048 3433968 3339281 3455916 3458689 3645992 3568567 3479956
16015 3479956 3485707 3553555 3562834 3703432 3504757 3282077 3522701 3651872 3692873 3557095
16005 3557095 3618542 3778134 3747114 3688472 3648226 3519464 3248513 3461611 3821225 3724069
15995 3724069 3437678 3666718 3760462 3816016 3529028 3585944 3694549 3536992 3517123 3637983
15985 3637983 3439360 3470725 3663675 3880678 3624056 3636689 3552453 3584459 3465106 3474691
15975 3474691 3422328 3338057 3453468 3491207 3524461 3604494 3828934 3635429 3495239 3411256
15965 3411256 3413946 3332979 3466859 3578307 3578428 3628161 3629265 3575424 3673546 3491831 3536411
15954 3536411 3530437 3479519 3456627 3666346 3618616 3571694 3510378 3678424 3639856 3364617 3440395
15943 3440395 3560079 3398556 3491265 3544746 3527093 3471108 3499039 3650557 3590176 3456851
15933 3456851 3554233 3561788 3612552 3663662 3571734 3416004 3398512 3443096 3607302 3325567 3371028
15922 3371028 3549961 3583660 3649130 3585638 3419373 3335989 3353517 3543311 3539147 3472649 3575044
15911 3575044 3518900 3551522 3521620 3639754 3560992 3564093 3672688 3696763 3650829 3485717 3343291
15900 3343291 3721029 3660447 3465818 3394992 3600762 3712324 3606603 3428807 3592210 3512706
15890 3512706 3626292 3913758 3905372 3491962 3369999 3620637 3663130 3401423 3299456 3422499
15880 3422499 3437242 3494825 3714217 3521511 3397693 3594838 3718980 4035725 3705732 3768782
15870 3768782 3550972 3781982 3699808 3744833 3672275 3677698 3730295 3884573 3791194 3684434 3734960
15859 3734960 3635998 3583846 3537519 3459319 3453410 3514678 3798471 3780903 3580114 3354071 3511052
15848 3511052 3655969 3500839 3355485 3408457 3540357 3546354 3767333 3531105 3511731 3400791
15838 3400791 3774030 3821393 3833062 3617876 3878479 3827400 3761795 3795776 3645465 3595934
15828 3595934 3715446 3886265 3775445 3601763 3469442 3857438 3897097 3880601 3690906 3491570
15818 3491570 3326702 3351330 3589353 3588526 3607664 3611617 3617602 3757412 3619829 3569554 3437037
15807 3437037 3571996 3824315 3769811 3680019 3477738 3596616 3681237 3652959 3486133 3530785
15797 3530785 3226222 3668199 3678752 3681024 3415127 3527765 3718751 3841205 3596050 3508605
15787 3508605 3653917 3830173 3916275 3645880 3464638 3538399 3739178 3883751 3792714 3456621
15777 3456621 3569966 3497072 3768571 3567849 3579251 3614596 3785406 3771961 3740033 3474981
15767 3474981 3602891 3553262 3658694 3490233 3608604 3692437 3634465 3582611 3770466 3807110
15757 3807110 3540453 3648883 3618361 3770540 3639889 3751164 3669808 3740011 3650092 3792558
15747 3792558 3677638 3573746 3483906 3577850 3676831 3812958 3574711 3733816 3844439 3696691
15737 3696691 3640517 3684158 3425743 3511382 3592895 3636065 3590760 3489680 3656303 3506767
15727 3506767 3620807 3638485 3671455 3671918 3713674 3728660 3651984 3487508 3570734 3786537 3910066
15716 3910066 3864097 3678388 3623786 3678450 3770157 3870351 3735999 3601786 3587528 3660237
15706 3660237 3791552 3783686 3700493 3712626 3554639 3735810 3794012 3743577 3588956 3678101 3770167
15695 3770167 3817987 3689007 3772636 3454813 3598349 3754861 3960297 3778981 3654729 3561324
15685 3561324 3577955 3663673 3481781 3629096 3650594 3778399 3715119 3605233 3454670 3562848
15675 3562848 3799982 4000133 3731333 3675360 3735955 3823400 3752703 3682205 3733391 3853944
15665 3853944 3795587 3690844 3579403 3482650 3666188 3694390 3651150 3636354 3894515 3813073
15655 3813073 3719043 3560043 3767037 3573617 3671403 3673174 3931531 3710397 3956417 3930543
15645 3930543 3681420 3495392 3737501 3748918 3562783 3536146 3563575 3755213 3745563 3592189
15635 3592189 3609592 3723227 3629070 3858760 3792696 3716310 3596046 3808894 3559609 3611725
15625 3611725 3438704 3516462 3444400 3590770 3540387 3747338 3614775 3559192 3663334 3615526
15615 3615526 3584775 3738111 3712687 3630881 3473263 3525666 3583455 3723714 3783735 3866224 3823562
15604 3823562 3778701 3814821 3691239 3600925 3528234 3769836 3859591 3562987 3598575 3804225
15594 3804225 3658088 3766290 3689035 3572238 3477487 3719106 3884421 3795139 3619811 3720016
15584 3720016 3779402 4035137 3985731 3662854 3650903 3859870 4034849 3977062 3786489 3461712
15574 3461712 3552975 3664157 3700300 3602446 3580125 3696911 3974503 3805121 3888494 3481167
15564 3481167 3505823 3774624 4015818 3706210 3632327 3463262 3711629 3789293 3872239 3842436
15554 3842436 3639536 3799040 3944338 3860628 3556393 3546518 3591932 3675696 3329600 3471284
15544 3471284 3326187 3603235 3665048 3916670 3573474 3762700 3826231 4035059 3970080 3978806
15534 3978806 3799603 3707959 3700697 3919590 4085590 3584164 3513866 3757644 3935033 3937427
15524 3937427 3965960 3639875 3939275 3781761 3766573 3540218 3555314 3489005 3714452 3790988
15514 3790988 3883058 3617065 3576087 3558200 3902033 3770348 3619635 3572553 3554790 3794760
15504 3794760 3936827 3723284 3528396 3673518 3781851 3963671 3984139 3849801 3978731 4081017
15494 4081017 3845287 3949748 3780007 3756730 3869050 4090643 3851923 3825766 3559662 3601961
15484 3601961 3753346 3734695 3479424 3643613 3637864 3707943 3541487 3693956 3702982 3685101 3594257
15473 3594257 3486901 3514267 3748129 3744317 3634078 3544583 3683892 3746753 3891244 3716497
15463 3716497 3637982 3646217 3923415 3924795 3699612 3582033 3865191 4040193 4000104 3850408
15453 3850408 3720555 3775387 3792939 3905157 3876639 3707100 3630719 3646532 3631846 3617355 3446338
15442 3446338 3656239 3811202 3908003 3618717 3856050 3957935 4043422 3916446 3697561 3691518
15432 3691518 3705277 3850329 3914957 3674359 3663451 3640705 3656565 3687957 3603116 3651536 3688100
15421 3688100 3714135 3868762 3934648 3827570 3942820 3941930 4065589 3961212 3794589 3620057
15411 3620057 3561505 3694880 3734692 3709776 3808813 3794667 3990863 3943866 3867583 3743828 3509783
15400 3509783 3576586 3703670 3906653 3837138 3872407 3861005 3959224 3922840 3896622 3775031 3887906
15389 3887906 3766611 3778359 3823039 3784965 3692507 3862195 3674462 3585931 3721219 3837119
15379 3837119 3872438 3716852 3717551 3612680 3645518 3698594 3752172 3802746 3678132 3693443 3898449
15368 3898449 3794657 3767355 3915709 3758519 3696469 3697600 3859042 3809913 3888644 3829420 3836343
15357 3836343 3976292 3908839 3692849 3600006 3759199 3697513 3754650 3854864 3709160 3698439
15347 3698439 3845180 3855067 3657833 3735268 3863378 3892234 3861593 3753046 3566629 3665758
15337 3665758 3581599 3728544 3545981 3573567 3737453 3989495 3923152 3950727 3951348 4001628 4049442
15326 4049442 3925253 3855181 3728163 3650036 3803315 4087444 3917967 3938092 4044590 4221367
15316 4221367 3923751 3800641 3705624 3642027 3717073 3885001 3529799 3654740 3656364 3896880
15306 3896880 4032584 3868003 3708496 3681778 3872885 3706262 3725433 3713933 3517380 3710676
15296 3710676 3836903 3950684 4026540 3938482 4007398 4010920 3995646 3740712 3737366 3645209 3893232
15285 3893232 3791847 3631655 3718933 3634637 3779706 3941170 3891505 3656308 3723067 3973356
15275 3973356 3978315 3831253 3786623 3699743 3916354 3955342 4127036 3978434 3955970 3866898 4044875
15264 4044875 3950422 3787410 3732503 3911729 3857734 4075108 4199608 4076583 3848356 3875150
15254 3875150 3985246 3867170 4012214 3954599 3935119 3971728 3886928 3620372 3693482 3768845
15244 3768845 3897643 3805417 3728026 3789867 3930850 3819604 3891706 3824439 3674666 3843539
15234 3843539 3844837 3795062 3612515 3746603 3794879 3881908 3874770 3950992 3817467 3889724 3659070
15223 3659070 3812631 3897648 3739286 3743838 3867640 4041059 3807221 3508809 3512644 3963413
15213 3963413 4000442 3959595 3790601 3982100 4033322 4099479 3933900 4065395 3991555 3962026
15203 3962026 3848978 3827892 3796999 3854854 3805843 3857764 3864704 3762923 3839759 3539421 3768533
15192 3768533 4008636 3925251 3898609 3871858 3875910 3911255 3570463 3673179 3910752 4006652 4079273
15181 4079273 4132756 3790424 3704503 4034946 4078149 4009534 3652785 3757381 4010032 3886025
15171 3886025 3740625 3869097 3815639 3975644 3973956 3804762 3690834 3623587 3739928 3882925
15161 3882925 3846083 3837495 3834865 3816892 3757565 3902345 4124483 4004636 3975514 3814986 3555246
15150 3555246 3677201 3584255 3645850 3838892 3754189 4079716 4043118 3970168 3745436 3883566
15140 3883566 4028586 4003486 3857509 3664334 3922776 4127209 3931924 3782344 3894201 4169588
15130 4169588 4178016 4128342 3930377 3848587 3795898 3811651 3942753 3857459 3636793 3798511 3961277
15119 3961277 3843154 3912150 4043924 3907546 3871990 3890648 3743887 3720460 3682437 3936193
15109 3936193 3810064 3929916 3910134 4061038 4070831 4143107 3908205 3879784 3807470 3928482
15099 3928482 3964911 3975524 3956433 4006074 3828716 4047884 3957192 3839777 3857485 3915970 3886501
15088 3886501 3931057 3797821 3799522 3950654 4088491 4182567 4177452 4112250 4050402 4145204 3980281
15077 3980281 3989696 3699648 3585244 3578571 3822977 4007319 4085639 3945526 4201229 4128056
15067 4128056 4112358 3871672 3798579 3852439 4072237 4017849 3966739 3975047 4090172 4100621 4142030
15056 4142030 3926337 3968843 4165899 4008445 3890250 3696109 3893489 3898855 3889580 3921662
15046 3921662 3919595 3789388 4138428 4265498 4136495 3923612 3882528 3903481 3956935 3737110
15036 3737110 3664989 3916463 4093203 4238534 4182094 4168983 4051215 4005530 3896763 3947013
15026 3947013 3948875 3939637 3929782 4024354 3919403 4218150 4194106 4251477 4273501 4136682 3776537
15015 3776537 3618156 3644403 3775885 3903948 4120025 4071031 4279910 4247699 4256813 4093922
15005 4093922 4163428 4014292 3991667 3785074 3719420 4074620 4039932 3864467 3861185 4091852
14995 4091852 4214429 4362963 3986040 3989270 3823886 3798093 3699031 4047743 3917699 3877893
14985 3877893 3925289 4175940 4067350 4056104 3956242 4135863 4060738 3851307 3666805 3583110
14975 3583110 3789094 3911680 4044783 4000443 4116037 4005212 3986641 3956952 3724848 3799030
14965 3799030 4052525 4025807 3800709 3540342 3867061 4129364 4320416 4139381 4126577 3950316
14955 3950316 3981282 4000682 3918616 3778178 3636764 3652100 3707160 3821164 3816433 3778316 4000324
14944 4000324 4048160 3917046 3789949 3732291 3799802 3770815 3824393 3833563 3834686 4011814 4171966
14933 4171966 4298413 4020909 3900063 3821946 3932080 3931864 3964112 3976573 3933285 3915253 4006526
14922 4006526 4049416 4168116 4035356 3941855 4083386 3982860 3960786 3893375 3791665 3787628
14912 3787628 4035631 3934695 4207256 4179943 4235897 4188954 4251046 3933036 3866414 3755516
14902 3755516 3799392 3820409 3761051 3810915 4202349 4330852 4234170 4139186 3997626 3909683 3976433
14891 3976433 3895145 3940372 3938252 3929306 3886204 3819774 3953913 3857861 3993433 4074964 4200416
14880 4200416 4130953 3927971 3996170 3989766 4262851 4208257 4087631 4110511 4027336 4019682 4061442
14869 4061442 3941773 4066521 3931250 3740211 3636339 3793831 4072864 4231952 4010817
14860 4010817 4031940 3979848 4042615 4056692 3984754 4005798 4008577 4003218 3824281 3760725 4007111
14849 4007111 4112404 4210493 4189042 4051450 4135573 4035903 4101140 3944700 4064513 4022779
14839 4022779 4078247 4084857 4042030 4098621 4188471 4145228 4091961 3884853 3877195 3831868 3932085
14828 3932085 4023039 3930636 4033484 4130730 4049747 4163104 4162673 4177099 4026111 3991276 3929025
14817 3929025 4008982 4074935 4133924 4139886 4042942 3980116 4131411 4197012 4194006 4245879 4070158
14806 4070158 4230657 4284247 4133543 4043010 3825034 4155420 4178350 4152500 3972261 4163647
14796 4163647 4204663 4352823 4173584 4038099 3933516 4248888 4230426 4074408 3974314 3891370
14786 3891370 3990048 4044984 4076879 4058948 4221383 4353266 4396914 4028273 3976387 4014271 4062439
14775 4062439 4129512 4140108 4108967 4205791 4103506 4147551 4170535 4164705 4134691 4037164 3964548
14764 3964548 4127397 4156803 4007857 3869563 3871691 4034220 4102871 4063540 3904323 4106639
14754 4106639 4215020 4168617 3956227 4209203 4272505 4357379 4059568 4067266 4060862 4129323 4284855
14743 4284855 4234475 4179850 3885590 3856797 3993982 4107014 3857122 4219481 4083669 4183303
14733 4183303 3927016 4281920 4169501 4120941 3940133 4079043 4102375 4369539 4205846 4256879
14723 4256879 4078944 4018782 4089370 3985796 3925263 3934080 4147358 4244146 4161002 3977134 3895987
14712 3895987 3826308 4062698 4055665 4100705 4023802 4445109 4304097 4312267 4077456 4130553 4221725
14701 4221725 4268331 3973438 3936862 3994113 4082667 4057863 4172141 4127681 4040378 4064035 4141448
14690 4141448 4297795 4198620 4239725 4164833 4242450 4178649 4246535 4174604 4164062 4110338 4021253
14679 4021253 3935855 3897076 4063627 4233866 4176462 4019644 4106544 4179569 4278730 4212942 4075951
14668 4075951 4065030 4174328 4120468 4240337 4000284 4010571 4004552 4389574 4484926 4174017
14658 4174017 4211384 4119708 4205010 4041657 3899175 3768488 3874039 3885791 4265639 3993785
14648 3993785 4217691 4141688 4126908 4019109 4011499 3951741 4048552 4040488 4021112 3990053 3976531
14637 3976531 3871566 3910153 4057113 4011140 4113284 4185951 3884729 3939692 4311375 4249461
14627 4249461 4271609 4147282 4361226 4268472 4242250 4108518 4238698 4165126 4174355 4030863
14617 4030863 3952434 3948665 4256917 4245319 4344612 4289650 4179235 4050041 4183659 4280206 4305299
14606 4305299 4161302 4193838 4327409 4260234 4162087 4204654 4312119 4200305 4220187 4043428
14596 4043428 4170507 4092911 4224515 4350942 4312433 4060046 4314462 4037498 4168124 4054618
14586 4054618 3933304 4162821 4212729 4241548 4310372 4174110 4309126 4307975 4241178 4211797 4136575
14575 4136575 4237024 4278156 4187876 4132332 4080360 3925875 4082001 4027183 4050196 3832750
14565 3832750 4080404 4283565 4299347 4101562 4016734 4039469 4242064 4190058 4230411 3927947
14555 3927947 3973561 3831567 3787351 3934044 3853836 3998353 4098754 4310391 4008776 3784607
14545 3784607 4082397 4269792 4159380 3981269 4069439 4112136 4352204 4459952 4402850 4157779
14535 4157779 4313963 4267805 4196004 4075431 4205084 4183018 4005344 4048925 4174577 4067679
14525 4067679 4168427 4290358 4029960 4012865 4116271 4329976 4418752 4388959 4229820 4142464
14515 4142464 4036489 4077376 4234275 4301149 4169955 4244021 4259700 4162907 4155540 4135709 4200467
14504 4200467 4155463 3999056 4085150 4243257 4302174 4448942 4323006 4326311 4174982 4197115
14494 4197115 4173320 4145075 4085797 4183084 4142193 4339854 4390151 4496207 4486746 4393090 4261910
14483 4261910 4131586 4121342 4233158 4118366 4081379 4250707 4120131 4249414 4360551 4441845
14473 4441845 4316862 4366452 4392587 4270122 3941399 4083618 4122777 4473435 4143848 4106837
14463 4106837 4094579 4224125 4337592 4413009 4059571 4107333 4151195 4355578 4237480 4022221
14453 4022221 4116209 4221241 4117661 4220845 4203868 4286952 4123776 4172586 4034873 4103626
14443 4103626 4221838 4304586 4095159 4198305 4033059 4110416 4259739 4126260 4045767 4277788
14433 4277788 4314607 4205958 4118184 4300793 4455970 4085632 4166871 4236829 4253575 4275414
14423 4275414 4275582 4135366 4116307 4089720 4271518 4222759 4237039 4217566 4562942 4470873 4499281
14412 4499281 4341410 4260583 4059009 4428066 4295500 4190557 4086525 4153317 4309402 4300073
14402 4300073 4396651 4211392 4219451 4333956 4266101 4088203 4015680 4081293 4424079 4310392
14392 4310392 4159708 4250144 4482008 4500857 4486263 4374086 4128063 4115927 4172069 4390998
14382 4390998 4361390 3995253 3990413 4328058 4247942 4280894 4055557 4038283 4163897 4354938
14372 4354938 4162568 3931662 3947425 4303291 4168683 4177984 4114931 4212580 4318276 4320402 4323785
$$ [...]
##END NTUPLES=NMR SPECTRUM
##END=
