##TITLE=1H_CA-8802-5
 CDCl3, 8 sc, 
 29.12.2020
##JCAMPDX= 6.0         $$ Bruker NMR JCAMP-DX V2.0
##DATA TYPE= NMR SPECTRUM
##DATA CLASS= NTUPLES
##ORIGIN= UXNMR, Bruker Analytische Messtechnik GmbH
##OWNER= root
$$ XWIN-NMR		Version 3.5
$$ Tue Dec 29 10:34:14 2020 Russian Standard Time (UT+4h)  she@DPX200
##.OBSERVE FREQUENCY= 200.1315066352
##.OBSERVE NUCLEUS= ^1H
##.ACQUISITION MODE= SIMULTANEOUS
##.ACQUISITION SCHEME= undefined
##.AVERAGES= 8
##.DIGITISER RES= 18
##SPECTROMETER/DATA SYSTEM= spect
##.PULSE SEQUENCE= zg30
##.SOLVENT NAME= CDCl3
##.SHIFT REFERENCE= (INTERNAL, CDCl3, 0, 15.9833)
##AUDIT TRAIL= $$ (NUMBER, WHEN, WHO, WHERE, WHAT)
$$ ##TITLE= Audit trail, XWIN-NMR		Version 3.5
$$ ##JCAMPDX= 5.01
$$ ##ORIGIN= Bruker BioSpin GmbH
$$ ##OWNER= she
$$ F:/spectra/data/she/nmr/H-F/1/pdata/1/auditp.txt
$$ ##AUDIT TRAIL=  $$ (NUMBER, WHEN, WHO, WHERE, WHAT)
(   1,<2020-12-29 10:30:53.21 +0400>,<she>,<DPX200>,
      <created by zg, POWCHK disabled, PULCHK disabled
       configuration hash MD5:
       00 E9 B6 7A A2 85 ED C7 34 08 36 98 17 FE 4E 26
       data hash MD5: 16K
       83 EE 35 6B 7F F0 84 40 0F FC 6B F3 E6 16 F0 3B>)
(   2,<2020-12-29 10:32:51.96 +0400>,<she>,<DPX200>,
      <Start of raw data processing
       efp BC_mod = 2 LB = 0.24 FT_mod = 6 PKNL = 1 PHC0 = -10776.56 PHC1 = 28.40095 SI = 16K 
       data hash MD5: 16K
       4F B5 F8 A9 6A C5 9B C5 C5 30 7A D3 65 61 B1 BD>)
(   3,<2020-12-29 10:33:18.18 +0400>,<she>,<DPX200>,
      <pk PHC0 = 14.31244 PHC1 = -18 
       data hash MD5: 16K
       36 91 77 C2 09 02 0C 10 56 E2 E2 87 7E 80 C5 85>)
(   4,<2020-12-29 10:33:21.51 +0400>,<she>,<DPX200>,
      <abs ABSG = 5 
       data hash MD5: 16K
       80 2C 09 60 12 CC 01 86 C4 6E 83 58 76 D7 D1 0F>)
$$ ##END=
$$ 
$$ hash MD5
$$ 4C 22 FF 67 A4 42 21 E6 97 C7 99 9B CE 13 52 92
##$RELAX= 
##$RELAX= 
##$RELAX= 
##$RELAX= 
##$RELAX= 
##$RELAX= 
$$ Bruker specific parameters
$$ --------------------------
##$DU= <F:/spectra>
##$EXPNO= 1
##$NAME= <H-F>
##$PROCNO= 1
##$TYPE= <nmr>
##$USER= <she>
##$AMP= (0..31)
100 100 100 100 100 100 100 100 100 100 100 100 100 100 100 100 100 100 
100 100 100 100 100 100 100 100 100 100 100 100 100 100 
##$AQSEQ= 0
##$AQ_mod= 1
##$AUNM= <au_zg>
##$AUTOPOS= <>
##$BF1= 200.13
##$BF2= 200.13
##$BF3= 200.13
##$BF4= 200.13
##$BF5= 200.13
##$BF6= 200.13
##$BF7= 200.13
##$BF8= 200.13
##$BYTORDA= 1
##$CFDGTYP= 0
##$CFRGTYP= 5
##$CHEMSTR= <none>
##$CNST= (0..31)
1 1 145 1 1 1 1 1 1 1 1 1 1 1 1 1 1 1 1 1 1 1 1 1 1 1 1 1 1 1 1 1 
##$CPDPRG= <>
##$CPDPRG1= <>
##$CPDPRG2= <>
##$CPDPRG3= <>
##$CPDPRG4= <mlev>
##$CPDPRG5= <mlev>
##$CPDPRG6= <mlev>
##$CPDPRG7= <mlev>
##$CPDPRG8= <mlev>
##$CPDPRGB= <>
##$CPDPRGT= <>
##$D= (0..31)
0 1.2 0 0 0 0 0 0 0 0.06 0 0.03 0 0 0 0 0.0002 0 0 0 0 0 0 0 0 0 0 0 0 
0 0 0 
##$DATE= 1609223452
##$DBL= (0..7)
120 120 120 120 120 120 120 120 
##$DBP= (0..7)
150 150 150 150 150 150 150 150 
##$DBP07= 0
##$DBPNAM0= <>
##$DBPNAM1= <>
##$DBPNAM2= <>
##$DBPNAM3= <>
##$DBPNAM4= <>
$$ [...]
##$SUBNAM3= <"">
##$SUBNAM4= <"">
##$SUBNAM5= <"">
##$SUBNAM6= <"">
##$SUBNAM7= <"">
##$SUBNAM8= <"">
##$SUBNAM9= <"">
##$SW= 16.9725356469052
##$SWIBOX= (0..15)
0 0 2 0 0 0 0 0 0 0 0 0 0 0 0 0 
##$SW_h= 3396.73913043478
##$TD= 16384
##$TD0= 1
##$TE= 0
##$TE2= 300
##$TE3= 300
##$TEG= 300
##$TL= (0..7)
0 120 120 120 120 120 120 120 
##$TP= (0..7)
150 150 150 150 150 150 150 150 
##$TP07= 0
##$TPNAME0= <>
##$TPNAME1= <>
##$TPNAME2= <>
##$TPNAME3= <>
##$TPNAME4= <>
##$TPNAME5= <>
##$TPNAME6= <>
##$TPNAME7= <>
##$TPOAL= (0..7)
0.5 0.5 0.5 0.5 0.5 0.5 0.5 0.5 
##$TPOFFS= (0..7)
0 0 0 0 0 0 0 0 
##$TUNHIN= 0
##$TUNHOUT= 0
##$TUNXOUT= 0
##$USERA1= <user>
##$USERA2= <user>
##$USERA3= <user>
##$USERA4= <user>
##$USERA5= <user>
##$V9= 5
##$VALIST= <valist>
##$VCLIST= <CCCCCCCCCCCCCCC>
##$VD= 0
##$VDLIST= <DDDDDDDDDDDDDDD>
##$VPLIST= <PPPPPPPPPPPPPPP>
##$VTLIST= <TTTTTTTTTTTTTTT>
##$WBST= 1024
##$WBSW= 4
##$XGAIN= (0..3)
0 0 0 0 
##$XL= 0
##$YL= 0
##$YMAX_a= 470489
##$YMIN_a= -232445
##$ZGOPTNS= <>
##$ZL1= 120
##$ZL2= 120
##$ZL3= 120
##$ZL4= 120
##$ABSF1= 16.00511
##$ABSF2= -0.9675541
##$ABSG= 5
##$ABSL= 3
##$ALPHA= 0
##$AQORDER= 0
##$ASSFAC= 0
##$ASSFACI= 0
##$ASSFACX= 0
##$ASSWID= 0
##$AUNMP= <proc_1d>
##$AZFE= 0.1
##$AZFW= 0.1
##$BCFW= 0
##$BC_mod= 2
##$BYTORDP= 0
##$COROFFS= 0
##$CY= -3
##$DATMOD= 1
##$DC= 0
##$DFILT= <>
##$DTYPP= 0
##$F1P= 0
##$F2P= 0
##$FCOR= 1
##$FTSIZE= 16384
##$FT_mod= 6
##$GAMMA= 0
##$GB= 0
##$INTBC= 1
##$INTSCL= 2.992141e-10
##$ISEN= 128
##$LB= 0.24
##$LEV0= 0
##$LPBIN= 0
##$MAXI= 10000
##$MC2= 0
##$MEAN= 0
##$ME_mod= 0
##$MI= 1.114404
##$NCOEF= 0
##$NC_proc= -5
##$NLEV= 6
##$NOISF1= 3.799351
##$NOISF2= 2.8
##$NSP= 0
##$NTH_PI= 0
##$NZP= 0
##$OFFSET= 15.98335
##$PC= 1
##$PHC0= -10762.25
##$PHC1= 10.40095
##$PH_mod= 1
##$PKNL= yes
##$PPARMOD= 0
##$PSCAL= 0
##$PSIGN= 0
##$REVERSE= no
##$SF= 200.130006257534
##$SI= 16384
##$SIGF1= 3
##$SIGF2= 2
##$SINO= 5.538805
##$SIOLD= 16384
##$SREGLST= <1H.CDCl3>
##$SSB= 0
##$STSI= 16384
##$STSR= 0
##$SW_p= 3396.73913043478
##$SYMM= 0
##$S_DEV= 0
##$TDeff= 16384
##$TDoff= 0
##$TI= <>
##$TILT= no
##$TM1= 0
##$TM2= 0
##$TOPLEV= 0
##$USERP1= <user>
##$USERP2= <user>
##$USERP3= <user>
##$USERP4= <user>
##$USERP5= <user>
##$WDW= 1
##$XDIM= 16384
##$YMAX_p= 367578645
##$YMIN_p= -128613
$$ End of Bruker specific parameters
$$ ---------------------------------
##NTUPLES= NMR SPECTRUM
##VAR_NAME=  FREQUENCY,     SPECTRUM/REAL,   SPECTRUM/IMAG
##SYMBOL=    X,             R,               I
##VAR_TYPE=  INDEPENDENT,   DEPENDENT,       DEPENDENT
##VAR_FORM=  AFFN,          ASDF,            ASDF
##VAR_DIM=   16384,         16384,           16384
##UNITS=     HZ,            ARBITRARY UNITS, ARBITRARY UNITS
##FACTOR=    0.207333158178281, 1,           1
##FIRST=     3198.74789551234, 0,            0
##LAST=      -197.991234922438, 0,           0
##MIN=       -197.991234922438, -128613,     0
##MAX=       3198.74789551234, 367578645,    0
$$ Real data points
##PAGE= N=1
##DATA TABLE= (X++(R..R)), XYDATA
$$ [...]
6239E667352j42548j05472j75555j60220j46406j29678j49544j62150r3158j04670
6229D297951j28425o3591j02544j37024j18004j11958j27360q8855p5904p6151
6219C268135j06214l7566m5971K5630K772k9621j9682r0l473J8024l648p7194
6207B991102n9488o1674n0320j29089j54489j12535r5254j35963j24236o3728
6197B004326m8557l8456o9640k5745l4943n9561J187n6138m702k1157l5540m3519
6185A567555J0014j2295o7408n6242m6437k5774l7904q500L3813l3992l135k0225
6173A299470o6623k0495o673j2111m4376K4092K8533r3238J765k039N8373n1764
6161A114914n0438p7712k2077K05p0589m4046n3600k411K8805p4161m4295k9372
$$ plain form
6239 5667352 5524804 5419332 5243777 5083557 4937151 4807473 4657929 4495779 4402621 4297951
6229 4297951 4169526 4105935 4003391 3866367 3748363 3636405 3509045 3420190 3344286 3268135
6219 3268135 3161921 3124355 3078384 3104014 3106786 3077165 3057483 3057393 3053920 3071944 3068296 2991102
6207 2991102 2931614 2869940 2819620 2690531 2536042 2423507 2328253 2192290 2068054 2004326
6197 2004326 1955769 1917313 1847673 1821928 1786985 1727424 1728611 1672473 1667771 1646614 1611074 1567555
6185 1567555 1577569 1565274 1497866 1441624 1395187 1369413 1331509 1323009 1356822 1322830 1319695 1299470
6173 1299470 1232847 1212352 1205679 1193568 1149192 1173284 1201817 1108579 1110344 1108305 1166678 1114914
6161 1114914 1064476 986764 964687 964892 894303 850257 796657 794246 823051 748890 704595 675223
6149F75223K8330O538m8685l8511j348J4023j732m7641n4661J6802P736j9783
6137E36291P01j0664m0797k5155K9705r444j5490O042l0409K3197k2481l9175
6125D02321M832n4655R148O0077p7169J6572k1645L5258O1709k7241o5362l604
6113C40241M940l3163M3249L1325O061k0737n8139k0628j1790j199J5693l1147
6101B64706k5417j0133j3025J1903N1402k0366m6108N889j3860P270j0166l6023
6089A66072m869m75M5737O8303m1297m8442J2274k2343l442J4983j230k4823K8509
6076A88957L0168k3445n9638J4876K6945J0919k104j9765k8669J8638M3088l7025
6064A62945K182J2975n052J0019J222o0171K866L111O2106j7424m6515j626L9012
$$ plain form
6149 675223 703553 710091 661406 622895 621547 635570 633838 586197 531536 548338 556074 536291
6137 536291 536992 526328 485531 460376 490081 480637 465147 471189 440780 463977 441496 402321
6125 402321 407153 352498 361646 421723 344554 361126 339481 374739 436448 409207 343845 340241
6113 340241 345181 312018 355267 386592 392653 371916 313777 293149 281359 280160 295853 264706
6101 264706 239289 229156 216131 228034 279436 259070 212962 218851 204991 212261 202095 166072
6089 166072 161203 160728 206465 274768 233471 185029 197303 174960 171518 186501 185271 160448 188957
6076 188957 219125 195680 136042 150918 177863 188782 186678 166913 138244 156882 199970 162945
6064 162945 165127 178102 173050 183069 184291 124120 126986 130097 192203 174779 128264 126638 165650
6051A65650k6198j7941l1054K1842j9406P903K7783K5774l4674l4705l965M8436
6039A29445k0427j5993p693N100K8716j9648M3494k23o2250K6921L1618k6983
6027A12077l3000l0616J8048J4182j3193j6752Q163j1312L2461Q459m69j7599
6015G0449P47O075p068j1365j3567K6133K1808o968K418j7556P797N5516l4367
6002A00052Q745l0943P982N3401k9604o987j2462k0998k310K1993J7448R793m2410
5989G3700M6350j3273j3474j8869j7021J5090Q85k327l0991J308N6655j3517k4350
5976F0166k0970m1099l463N5096J2793j3853m0384M0487k5181m521R972q057K2909
5963D3895M5976q3770m5834M1820l6111j5556J847N7142M1555k9351R651n9209
$$ plain form
6051 165650 139452 121511 90457 112299 92893 100796 128579 154353 119679 84974 81009 129445
6039 129445 109018 93025 85332 90432 119148 99500 142994 142771 80521 107442 139060 112077
6027 112077 79077 48461 66509 80691 67498 50746 58909 47597 80058 88517 88048 70449
6015 70449 71196 77271 70203 58838 45271 71404 93212 86244 88662 71106 78903 134419 100052
6002 100052 108797 77854 85836 139237 109633 102646 90184 69186 66876 88869 106317 116110 73700
5989 73700 120050 106777 93303 74434 57413 72503 73388 71061 40070 41378 98033 84516 60166
5976 60166 39196 -1903 -5366 49730 62523 48670 8286 48773 23592 19071 29043 20986 43895
5963 43895 89871 6101 -39733 2087 -34024 -49580 -47733 9409 50964 21613 31264 -27945
5951b7945J5480M7394J5161m592j5593l547j1515k9917L6280M2568n1228J993
5939A4539K0690K4753K746J2190j6539J1242K240j4830P153L7927k7281n9430
5927A5400M633L3957K6995j9101J9006l095p523k0582m1973K1794J4608O3458
5915A07577n004n8458K228J9196l300L2634j583K379N5424p9172j8665K6224n8294
5902B1186N635K2239J3688J4980J4017k4555K1628R27J3987k3983n6128N3639
5890G7260R129j6799j8524K1504L125K7016q56o2884P7246l3624P376M2642k6925
5877A05686K5113k9k0083K1703J1570L1848j2824j5028j0043L723l7876P671L9032
5864A50463l6526l977J4996L5628L7624k9981j0143K8428K9931j328K5228N6465
$$ plain form
5951 -27945 -12465 34929 50090 45498 29905 26358 14843 -15074 21206 63774 12546 14539
5939 14539 35229 59982 62728 74918 58379 69621 71861 57031 64184 102111 74830 15400
5927 15400 20033 53990 80985 61884 80890 77795 70272 49690 7717 29511 44119 107577
5915 107577 102573 44115 46343 65539 62239 94873 93290 95669 151093 71921 53256 79480 21186
5902 21186 26821 49060 62748 77728 91745 67190 88818 89745 103732 79749 23621 77260
5890 77260 86389 69590 51066 72570 75695 102711 101855 38971 116217 82593 89969 132611 105686
5877 105686 130799 130770 110687 132390 143960 175808 162984 147956 137913 141636 103760 111431 150463
5864 150463 113937 109960 124956 160584 198208 168227 158084 186512 216443 215115 240343 296808
5852B96808N2615O4489N8129R7612P9063k0642m1406q1349p6155J0201p8029q6425
5840B74911k8369j7815m809P76m2058q1374J8710L9017l1026q7k9988K9259L4859
5827A62006k7834k834J5414j0158o223k6188q5j6226j9028K0893M0765P344n3279
5814H4567J0062m6936N492j5583j209k085Q407O2677j2807l3435l377o827J8817
5801F7763M6073l7723k8827K8631M916R018M3005l0791l9704L3689O841L3361
5789A36252O227j4552j4528j9258l9942m7537N2298M5133n5965k8827J4384Q422
5777D2107K9665L9465l9399m8394N5761l5142K391K4548K0934m2090l356N9513
5765A06003p49l7390l2149j0238K3119k1286m313N4673M5911k6836O122l5247
$$ plain form
5852 296808 349423 413912 472041 569653 648716 628074 586668 505319 429164 439365 361336 274911
5840 274911 246542 228727 223918 224694 182636 101262 119972 158989 127963 127876 97888 127147 162006
5827 162006 134172 131338 146752 136594 130371 104183 104098 87872 68844 89737 130502 137846 84567
5814 84567 94629 47693 53185 37602 36393 34308 42715 105392 92585 59150 55773 48946 67763
5801 67763 113836 76113 47286 75917 80833 89851 132856 102065 62361 96050 102891 136252
5789 136252 142479 127927 113399 94141 54199 6662 58960 104093 48128 19301 33685 42107
5777 42107 71772 111237 71838 23444 79205 44063 46454 71002 91936 49846 46490 106003
5765 106003 105254 67864 35715 25477 48596 27310 22997 77670 123581 96745 102867 67620
5753F7620n6612n233O3159K0580n2540N226J932l5258O8857J8655p6324P581M2604
5740G0247K5699k6231m3358J2587j936k4618Q989k153j0690M2864M1060m2955
5728D9505j6003j4230L5437M2454m4521k3279K3598k1511K0965j4761m0222l0888
5716c3456L0914O9774l0205m1350J6805n693N2936l8955j9930J1689j967J484
5704A2046l7723J592J9934M6805K1927q918k1497K1665J650Q291K0003m1291R186
5691E3670o981o9619j419J3507p290K5096k468j2613j1474K4414L023j574L3215
5678C9487J5022k1299j8327L33m6662L3811N0154J0530r54j1855k5979N6402K1837
5665A02500K1420J216n2115r098k3272k694p034K3825K7888J511j8607n847k6642
$$ plain form
5753 67620 11008 5775 68934 89514 36974 42200 44132 8874 77731 96386 20062 27643 70247
5740 70247 95946 69715 26357 38944 37008 12390 21379 19226 8536 51400 92460 49505
5728 49505 33502 19272 54709 97163 52642 29363 52961 31450 52415 37654 -2568 -33456
5716 -33456 -2542 67232 37027 -4323 12482 6789 59725 20770 840 12529 10562 12046
5704 12046 -25677 -24085 -4151 42654 64581 55663 34166 55831 57481 65772 85775 44484 53670
5691 53670 46689 -22930 -24349 -10842 -18132 6964 4496 -8117 -19591 4823 7846 6272 39487
5678 39487 54509 33210 14883 15216 -31446 2365 52519 63049 62095 50240 24261 80663 102500
5665 102500 123920 125136 73021 63923 40651 37957 30923 54748 82636 84147 65540 59693 33051
5652C3051K4833j919J1707J2615L859j6739m9421R292J3364R701L2423J1946j3841
5639H0871J4015m0806M5342L008k3013j0806L9674L662o3821m3571j008P4129
5627G7676M3446j4471l3024j0933M665n202k6235q238J9464J6692K8917K9831
5615A22588l7961m2235J8300r694J3017l9076L2719K4644j8580K2494K0423m2271
5603F4368p471J6004r141L7984M057L9899k3306j0483n529m1889J9897O6968j3998
5590A37360k4995L2871l751o8173j796j5295K1977J1106P842K4881n5562J9017
5578H5482K6380j4999K2577J1833R233l0825N144L8640K7225K3381j8707k8875
5566A56489r027K4241M2880n2370L4075o5316k279K5895n152j8084K6770m083
$$ plain form
5652 33051 57884 55965 67672 80287 84146 67407 17986 27278 40642 50343 82766 94712 80871
5639 80871 94886 54080 99422 102430 79417 68611 108285 111947 48126 4555 3547 77676
5627 77676 121122 106651 73627 62694 67359 62157 35922 27684 47148 63840 92757 122588
5615 122588 84627 42392 60692 50998 64015 24939 57658 82302 63722 86216 106639 64368
5603 64368 56897 72901 63760 101744 105801 145700 122394 111911 106382 64493 84390 151358 137360
5590 137360 112365 145236 141485 73312 71516 56221 78198 89304 97146 122027 66465 85482
5578 85482 111862 96863 119440 131273 140506 109681 114825 153465 180690 204071 185364 156489
5566 156489 147462 171703 214583 162213 196288 130972 128693 154588 149436 131352 158122 154039
5554A54039l953K8076k6718j0389O6422L6372l8023K721J4517M2759N1776l364
5542C14235k2823n1973R959M5156l4559j3452j4335K5128K538L5862K6736p099
5530C15373k4546l92k1292K8691m1188J7750J5352j4866K3100J0657J2779O6403
5518C87821M9475l3399j5901j8536l4969M0729l2147L7934M7215K2101L2437O570
5506D89330J9571K5289k5726j1902l3414q443k6672m0029k1375m8821Q306l9671
5494B86443r8J4907l1717J3273k2816K9337M7820l7672n3983k0744N7402M0159
5482C22311J2496K8514k1770m30N090J501L6378J1449j530L2505k1962k0390J2487
5469C96649L4335L546N7939J3230L4635P097l9787L1014r796n7102n4240k9768
$$ plain form
5554 154039 150086 178162 151444 141055 207477 243849 205826 208547 223064 265823 317599 314235
5542 314235 291412 239439 249398 294554 259995 246543 232208 257336 259874 295736 322472 315373
5530 315373 290827 290435 269143 297834 256646 274396 289748 274882 297982 308639 321418 387821
5518 387821 437296 403897 387996 369460 334491 375220 343073 381007 428222 450323 482760 489330
5506 489330 508901 534190 508464 496562 463148 454705 428033 388004 366629 317808 326114 286443
5494 286443 286345 301252 269535 282808 259992 289329 337149 299477 245494 224750 282152 322311
5482 322311 334807 363321 341551 341121 346211 347712 384090 395539 394009 426514 404552 384162 396649
5469 396649 430984 434530 492469 505699 540334 547431 507644 538658 528862 471760 417520 387752
5457C87752o034J3071m2681J1147J0364j5905K9002O3276n241O75m7593k4545
5445C73288P921l8188o8735J4659J9348l939m0339M5849j2044r0444k7717N3915
5433B33574J8117P516n2329L035J1193P721K2933R42o138k5766J1896J8011j2119
5420B38586K7964L5547l5608K4989R541k089N8404J5293o7041m5244o270J9072
5408B73144j8047J8524K7165M3838k6147m2590K4820J3921j255O251l4843j9847
5396B64934j5077K5597M3208j5228J7284K1861l064K6241J3534m016M558r380
5384C70452K3128j5997m7997j0059M021P751L6795j979M85L7576O762l7635O458
5371C79761j8313L602M2352M1122p680M0128m6542O5242O5515m6451K1173k2137
$$ plain form
5457 387752 381718 394789 352108 363255 373619 357714 386716 449992 444751 445426 397833 373288
5445 373288 381209 343021 274286 288945 308293 304354 264015 309864 297820 207376 179659 233574
5433 233574 251691 259207 206878 209913 221106 228827 251760 252702 246564 220798 232694 250705 238586
5420 238586 266550 302097 266489 291478 301019 298930 357334 372627 305586 260342 254072 273144
5408 273144 255097 273621 300786 344624 318477 275887 300707 314628 313373 319624 284781 264934
5396 264934 249857 275454 318662 303434 320718 342579 339515 365756 379290 375274 379832 370452
5384 370452 393580 377583 329586 319527 323548 331299 368094 366115 366600 404176 410938 373303 379761
5371 379761 361448 365050 407402 448524 440844 480972 434430 499672 565187 518736 539909 517772
5359E17772J04489P9986N1282J03069P6968J7575l5482r2758j06965l8348o8642
5348F08946n1576L067M4640j3154q541n461K9790j4722n9795k2247K6728M9548
5336E87223L849N1334K840L6540l3359J9097k3665l8493j3296J8180K4085k6993
5324F07342J4830K7524k0290K8644J5400k3911j7727m5913K2M4181J7804K227
5312F50133K2281k611J7085N4800j5604O063n2409k2594L8039J0192M1466N0206
5300G97047J100M3408J3795l6122M1415N7071J8820J8588Q770J05707K9565p0237
5288A028927l1362l9133r456k0473Qj6486M918J1969P257M3554l8298N402R052
5275I55879n280J9317M725J8714o149K165k0921K585K7608N35N1351N4361J9125
$$ plain form
5359 517772 622261 702247 753529 856598 933566 951141 915659 822901 715936 677588 608946
5348 608946 557370 560437 605077 591923 583382 577921 607711 592989 533194 510947 537675 587223
5336 587223 591072 642406 645246 681786 648427 667524 643859 605366 592070 610250 634335 607342
5324 607342 622172 649696 629406 658050 673450 649539 631812 585899 585921 630102 647906 650133
5312 650133 672414 669803 686888 741688 726084 732147 679738 657144 695183 705375 746841 797047
5300 797047 798147 841555 855350 819228 860643 917714 936534 955122 963892 1069599 1099164 1028927
5288 1028927 997565 958432 948976 928503 928511 912025 916943 928912 936169 979723 941425 946827 955879
5275 955879 950599 969916 974641 993355 987206 989371 968450 971035 998643 999178 1050529 1104890 1124015
5262A124015L2006Q1016l7650j1020N7111j329N0591O4647P0282N9658J4039J3273
5250A516639N5576k8820J5094J2498M1802O7006J489j0833N2283K4921J0847Q692
5238A767194M2722Q3821O4542M2196M2817O8203M8098n4251k735l9090L8955L2081
5226B134553O340K0460K9800K9793O0798M9143L4148N1315M8979O5465R5139L1710
5214B657643O6294N8733J5303O9286M7597O0609P7831N3560N2414J38755R3274
5203C391299J17113J31696J51237J28710J38092J21493J34402J72026K00341J95633
5193D882042J63440J96781K76062K61592K04645K59668L55863L49699M05209L93003
5183G748004M29134M97438N02140N98713P47728Q96527R99471J125369J248997
$$ plain form
5262 1124015 1156021 1237037 1199387 1188367 1245478 1244149 1294740 1359387 1429669 1489327 1503366 1516639
5250 1516639 1572215 1543395 1558489 1570987 1612789 1679795 1681284 1670451 1722734 1747655 1758502 1767194
5238 1767194 1809916 1893737 1958279 2000475 2043292 2111495 2159593 2105342 2102607 2063517 2102472 2134553
5226 2134553 2140893 2161353 2191153 2220946 2281744 2330887 2365035 2416350 2465329 2530794 2625933 2657643
5214 2657643 2723937 2782670 2797973 2867259 2914856 2975465 3053296 3106856 3159270 3298025 3391299
5203 3391299 3508412 3640108 3791345 3920055 4058147 4179640 4314042 4486068 4686409 4882042
5193 4882042 5045482 5242263 5518325 5779917 5984562 6244230 6600093 6949792 7355001 7748004
5183 7748004 8177138 8674576 9176716 9775429 10523157 11419684 12419155 13544524 14793521
5174A4793521J540284J984933K517277L290307M010020L926072J858391j345511
5166C2575294l450900l447777k333132j306927n27727R2611P37208J446633K349307
5157B6134590L259995L216173J066639k126320m335224m494822l401613k434557
5149A6884861j804865j366522j054264q42922o30027n03267l69767k89368j91948
5140I831911j44879r8374m0863L2200N0726R8807J49269J65931K29677L21533
5130A0595938L85449L44424M85627N26580O20609P93243Q82914J126852J274150
5121A7035786J431301J794990K205587K703818L545060M548209N333361M709376
5113D3307488J326131k714664m890994m370667k801324j533026o25522J72240
$$ plain form
5174 14793521 16333805 18318738 20836015 24126322 28136342 32062414 33920805 32575294
5166 32575294 29124394 25676617 23343485 22036558 21508831 21601442 22338650 23785283 26134590
5157 26134590 29394585 32610758 33677397 31551077 27215853 22721031 19319418 16884861
5149 16884861 15079996 13713474 12659210 11816288 11186261 10682994 10313227 10023859 9831911
5140 9831911 9687032 9588658 9547795 9579995 9630721 9729528 9878797 10044728 10274405 10595938
5130 10595938 10981387 11325811 11811438 12338018 12958627 13751870 14634784 15761636 17035786
5121 17035786 18467087 20262077 22467664 25171482 28716542 33264751 38598112 43307488
5113 43307488 44633619 41918955 37027961 32657294 29855970 28322944 27697422 27869662
5105B7869662J014801K080194L367019M266486L585359K82307l857510o200000
5097C2408318n786782m379013l267192k477042j956872j584143j297938j053901
5089A0605435q27373p32020o07072n80465n22548l97147l77823k76098k71002
5080F013887k88841k61074j78711j29048k01714j67545j71700j06582j49423j34878
5070D224371r9764j65018j08955q9198r6849q1481p5881m9247n9555j58366j54411
5059C085646o2355o0406p8183p6509O637j9150j11738p5228j9365n1828n4239
5048B483282m1429n545m263l0409m2387r405m7313l4734K2748p0009m8132k5009
5036B147395N956k0485K6575n4506J3381K2001K063J6921r2236p9347j9353p1946
$$ plain form
5105 27869662 28884463 30964657 34331676 38598162 42183521 42465828 38608318 32408318
5097 32408318 26621536 22242523 18975331 16498289 14541417 12957274 11659336 10605435
5089 10605435 9778062 9046042 8438970 7858505 7335957 6938810 6560987 6284889 6013887
5080 6013887 5725046 5463972 5285261 5156213 4954499 4786954 4615254 4508672 4359249 4224371
5070 4224371 4124607 3959589 3850634 3761436 3664587 3583106 3507225 3457978 3398423 3240057 3085646
5059 3085646 3023291 2962885 2884702 2808193 2814830 2795680 2683942 2608714 2589349 2537521 2483282
5048 2483282 2441853 2436308 2432045 2401636 2359249 2349844 2302531 2267797 2290545 2220536 2172404 2147395
5036 2147395 2153351 2132866 2159441 2104935 2118316 2140317 2142380 2159301 2067065 1987718 1968365 1896419
5024A896419l9289n4274l7234l6940m6786L959J341k7216J1229Q3318p913o3936
5012A682678m2089M1504L5345j3228j1197n0110j3229L204P550J7168k2457p612
5000A627527j1860M4640N0311K6327l5478Q533N308l752p2325n0618O111p07K2330
4987A616347j9782m0265q206m4534o3932Q580L4586O0593O8117Q4480j5843m865
4975A675276J467K9317k032m0156k3543J2800l6513o5704j1677j3489j115k1873
4963A502758J0529K9403l9957J2899J2912m966O202N0411l006J1823l4443o4080
4951A490485K6995L4180J2406J567P0839L3999j8126j8467L8536O8985P0852J1781
4939A824032O591M048j02688l3347P2259K2802M2284k9780o474m5481o9648n6039
$$ plain form
5024 1896419 1857130 1802856 1765622 1728682 1681896 1685855 1687196 1659980 1671209 1754527 1746614 1682678
5012 1682678 1640589 1682093 1717438 1704210 1693013 1642903 1629674 1632878 1640428 1657596 1635139 1627527
5000 1627527 1615667 1660307 1710618 1736945 1701467 1710000 1715308 1711556 1639231 1588613 1594724 1594017 1616347
4987 1616347 1596565 1556300 1548094 1503560 1439628 1448208 1482794 1543387 1611504 1695984 1680141 1675276
4975 1675276 1676743 1706060 1704028 1663872 1640329 1653129 1616616 1550912 1539235 1525746 1524631 1502758
4963 1502758 1513287 1542690 1502733 1515632 1528544 1523578 1529780 1580191 1577185 1589008 1554565 1490485
4951 1490485 1517480 1551660 1564066 1565633 1636472 1670471 1652345 1633878 1672414 1741399 1812251 1824032
4939 1824032 1830623 1834671 1731983 1698636 1770895 1793697 1835981 1806201 1799727 1754246 1684598 1628559
4927A628559m2879K8396N1997k5347j6719R630l6980P153L7133L8644K0368O1819
4915A761774O117J0215J6437P2319P7065k260R2515J11301J11006P1612P4441
4904B402542K0384p288l6005n6616j1527O603R274J13404Q9033m283Q052R3031
4892B626604J49174M2093o999K7787O8412N0433J4571o3921l6489j151J5461L374
4880B889349m4556M5781M27M9940N9112N1959K004N4941O9605Q851L729N2341
4868C243483K0806J3167J0894Q973L2544L4472K0541N0974J09986J3639K5042
4857C584521R3121P9083J12455J05415N7984J76283J89750J75017K18507K79602
4847E071738J81263K27084K10695J62405K29628K21852K00994K54556K78384K65596
$$ plain form
4927 1628559 1585680 1614076 1666073 1640726 1624007 1633637 1596657 1603810 1640943 1679587 1699955 1761774
4915 1761774 1767891 1778106 1794543 1866862 1943927 1941667 2034182 2145483 2256489 2328101 2402542
4904 2402542 2422926 2415638 2379633 2323017 2311490 2318093 2327367 2440771 2529804 2525521 2533573 2626604
4892 2626604 2775778 2817871 2810872 2838659 2907071 2957504 2972075 2908154 2871665 2870514 2885975 2889349
4880 2889349 2844793 2890574 2891001 2940941 3000053 3052012 3054016 3108957 3178562 3187413 3191142 3243483
4868 3243483 3264289 3277456 3288350 3297323 3329867 3364339 3384880 3435854 3545840 3559479 3584521
4857 3584521 3677642 3756725 3869180 3974595 4032579 4208862 4398612 4573629 4792136 5071738
4847 5071738 5253001 5480085 5690780 5853185 6082813 6304665 6505659 6760215 7038599 7304195
4837G304195K88246L31474L46426M42191N21253N51874P13904Q51349R83985J149165
4827A3484062J375426J591058J907667K518695L185419M136308M912039M547415
4819C7658089J837036k501116n350485n115612l789085k717712j985641j489694
4811A6545780j082002p95595n58250l90066k43025r562R4808J88899L62867N56321
4801A4670175P04344R00344J193818J436773J615838K167564K903857L789172
4793B9381885M826344N108923L293717j024206n057632o006774m804200l474052
4785B2244005k530554j881054j420170j093519q52432n65891m47235k99562r4243
4776A3059345K0653J96856L75582N90342P33948R47845J263030J672082K269646
$$ plain form
4837 7304195 7592441 7923915 8270341 8712532 9233785 9785659 10499563 11350912 12334897 13484062
4827 13484062 14859488 16450546 18358213 20876908 24062327 28198635 33110674 37658089
4819 37658089 39495125 36994009 31643524 26527912 22738827 20021115 18035474 16545780
4811 16545780 15463778 14668183 14109933 13719867 13476842 13467280 13562088 13750987 14113854 14670175
4801 14670175 15374519 16274863 17468681 18905454 20521292 22688856 25592713 29381885
4793 29381885 34208229 39317152 42610869 41586663 36529031 30522257 25718057 22244005
4785 22244005 19713451 17832397 16412227 15318708 14466276 13900385 13453150 13153588 13059345
4776 13059345 13079998 13276854 13652436 14242778 14976726 15924571 17187601 18859683 21129329
4767B1129329K995195L423827K933853N57776k627499m161820l677598k638198
4759A7934865j878126j451690j075355p96700n87613m57863l61233k63351o7480
4750A0995454l0819R1926J91003L55720M44638O40275P36675R49612J222672J641068
4740A7238224K208268K884661L643077L584272J789046j728982m427580m675765
4732B0515221l587595k544232j880399j496909j194213r35421q12086p10683o16944
4723F736739m44912l60992l42972l38692k98739k27996k21503k40883j88199j72405
4713C899446p1426r0378k16821j05750r5134j01786j5729o7113j56704p0014j580
4702B907011p0995m4531n3254q2622o3962m1563j6295n3529l3960l1733l2263
$$ plain form
4767 21129329 24124524 27548351 30482204 31039980 28412481 24250661 20573063 17934865
4759 17934865 16056739 14605049 13529694 12732994 12145381 11687518 11326285 11062934 10995454
4750 10995454 10964635 11056561 11247564 11603284 12047922 12688197 13424872 14374484 15597156 17238224
4740 17238224 19446492 22331153 25974230 29558502 31347548 29618566 25190986 20515221
4732 20515221 16927626 14383394 12502995 11006086 9811873 8876452 8064366 7353683 6736739
4723 6736739 6291827 5930835 5587863 5249171 4950432 4722436 4500933 4260050 4071851 3899446
4713 3899446 3828020 3737642 3520821 3415071 3319937 3218151 3202422 3135309 2978605 2908591 2907011
4702 2907011 2836016 2791485 2738231 2655609 2591647 2550084 2533789 2480260 2446300 2414567 2382304
4691B382304j20712q5987r4372q0033l2750o3292o7379J6055n9576l2115n8598
4680A703545k0192j3831n8920Q638j9270l7272j1684j8601P571n9234k1621k3206
4668A435923m0571j0355j1467l1672J1743l0047J0160K4573Q213K0287l6459n1349
4656A298979p7933o0672p394J6292p516n3059k9722j615K5152l0411l6504o7277
4644I68320N274O996k0633j6220k7834L5903Q520K3078M3351j3028j48m2723l5581
4631I35275M036p744l7623n6831m02L341j8619P080K5668m1276o656Q20k472J8048
4617H22645L4576l8785l4631Q807J1567k7439M501n2975K850N0104P777N4916
4605H43913K8429l0741o4182m5598J5J8750K599r895M840k7555Q440Q800k4974
$$ plain form
4691 2382304 2261592 2175605 2081233 2001200 1968450 1905158 1837779 1853834 1794258 1762143 1703545
4680 1703545 1683353 1669522 1610602 1619240 1599970 1562698 1551014 1532413 1539984 1480750 1459129 1435923
4668 1435923 1395352 1384997 1373530 1341858 1353601 1323554 1333714 1358287 1366500 1386787 1350328 1298979
4656 1298979 1221046 1160374 1152980 1169272 1161756 1108697 1078975 1077360 1102512 1072101 1035597 968320
4644 968320 973594 980590 959957 943737 915903 951806 960326 983404 1026755 1013727 1013579 970856 935275
4631 935275 939311 931567 893944 837113 836711 840052 821433 828513 854181 812905 806249 807069 804597 822645
4617 822645 857221 818436 783805 792612 804179 776740 781241 728266 731116 781220 788997 843913
4605 843913 872342 841601 777419 731821 731836 750586 753185 743290 748130 720575 729015 737815 712841
4592G12841j0738L2171K823j690P00n51J0508j0592L1567k261o6490p131K6640
4579G17797L8767j9392L4081k4352m84j1979k3618Q378n507l5212k6337j0487
4567F41655o265L3676r723o645O7094j9338m438j2314M0190J0486j0028L291n0131
4554F77510k1855K8052K2794k4296j2774j4774k9840P251M3625j1170l6697J6993
4542F44819K8076M67j2940q0408O1933K516j3095l0576L693L4673J1867K8006
4530F79031J1466p3902P903M5923J844k5455K5638p6K7054L4405m8430k009l6169
4517F47223n595L6913O706j6164j7844N998L2959O4991k565j2043K1119N7345
4505H19043J3118Q941O2832L5603r204R793l5149o6257m7517p50K2606L8093L0163
$$ plain form
4592 712841 702103 734274 737097 735407 736107 735556 746064 735472 767039 764778 698288 691157 717797
4579 717797 756564 737172 771253 746901 746417 734438 710820 719198 713691 678479 652142 641655
4567 641655 635390 669066 659343 652698 719792 700454 696016 683702 723892 734378 724350 727641 677510
4554 677510 655655 683707 706501 682205 669431 654657 624817 632068 675693 664523 627826 644819
4542 644819 672895 673362 660422 580014 641947 644463 631368 600792 604485 639158 651025 679031
4530 679031 690497 616595 624498 670421 672265 646810 672448 672372 699426 733831 685401 683392 647223
4517 647223 641628 678541 685247 669083 651239 657237 690196 755187 752622 740579 761698 819043
4505 819043 832161 841102 903934 939537 930333 940126 904977 838720 791203 790453 813059 851152 881315
4492H81315j1506N962O092j2965j9137o282k9900L8136k4627L5589M7970L540
4480I14187J3711O8355k448K6525J9725k4476j4816j4841r443L7927o1847o196
4468I46363P2201o2782l2403O5381J9021p373n646n5805N5361Q647j4267k2832
4456I65866J2905k7220K0774K9432p204n687R944J6164M8193m0397k899L714N657
4443A029242N9666K181L2491K5711J1840L5642M2205L1275R2374N9115l527O2075
4431A480290J8895J7193Q0875R1741Q6975R8953J9720M1462J13793M5216L5225
4420B130338M184j5321j7664k5526m3937M5180K2255j7405N3308O0014N5729O0637
4408B311792J6982P0011J03883R7591J32024J85663J66456J45068N6485l8048
$$ plain form
4492 881315 869809 875771 881863 868898 849761 843479 813579 851715 827088 862677 910647 914187
4480 914187 927898 996253 993805 1020330 1040055 1015579 1000763 985922 976479 1014406 952559 946363
4468 946363 1018564 955782 923379 988760 1007781 1000408 994762 938957 994318 1002965 988698 965866
4456 965866 978771 951551 972325 1001757 994553 988866 998810 1014974 1063167 1022770 1019871 1023585 1029242
4443 1029242 1088908 1091089 1123580 1149291 1161131 1196773 1238978 1270253 1362627 1421742 1418215 1480290
4431 1480290 1499185 1516378 1597253 1688994 1775969 1874922 1894642 1936104 2049897 2095113 2130338
4420 2130338 2134522 2119201 2101537 2076011 2032074 2077254 2099509 2082104 2135412 2195426 2251155 2311792
4408 2311792 2328774 2398785 2502668 2600259 2732283 2917946 3084402 3229470 3285955 3247907
4398C247907r2356j11432n449j86j51980j80366j78194j28973k1723o3989K8161
4387B341420O2046L3016l4471m9852q0090j6696J1635l2538j3328j09092r2112
4376B019938l7662J311P6422Q1483M1242N7137J3494p9678j48339j65366j32125
4365A727857m8937m646J80k627O1502N1425J1641n4163r4809j56240j18104r7756
4353A275323l9238m8142J3145J624o0276l6042l2376j1391k5354j1926O950k3646
4341A008651N9255J61n8895k1499K1644L0159Q260k5836l0194J1591N3509L4358
4329A091164n9323l5811J5822J1514j0119o3172k9909N6987K9594j6692m049n71
4317I85435M4592J9663m7805l223J40L4942K1460K7717n0622K4454j0869O0449
$$ plain form
4398 3247907 3155551 3044119 3038670 3038484 2886504 2706138 2527944 2398971 2377248 2313259 2341420
4387 2341420 2403466 2436482 2402011 2352159 2272069 2255373 2267008 2234470 2221142 2112050 2019938
4376 2019938 1982276 1983587 2060009 2141492 2182734 2239871 2253365 2173687 2025348 1859982 1727857
4365 1727857 1678920 1674274 1674454 1671827 1733329 1784754 1796395 1742232 1647423 1491183 1373079 1275323
4353 1275323 1236085 1187943 1201088 1202712 1142436 1106394 1074018 1062627 1037273 1025347 1032297 1008651
4341 1008651 1067906 1068067 1009172 987673 1009317 1039476 1047736 1021900 991706 1003297 1056806 1091164
4329 1091164 1031841 996030 1011852 1023366 1013247 950075 920166 977153 1006747 990055 986006 985435
4317 985435 1030027 1049690 1001885 998662 998802 1033744 1055204 1082921 1032299 1056753 1045884 1106333
4305A106333P514n8282K7029N1699N1092r659l4749K9799J4433L5149J0403l2602
4293A198159J7944n966K7096L8922l1818k143K8988L6160R156R223k9726P706
4281A303701J5007O451j7520L3184Q0074K947L3411M4759M0100J318m2127L4319
4269A535624N1376M4347M0900k1865L8246M5800l26J9557J4964L4254O8194N7103
4257A928174M855j4411M348M2258O3323L0714M4814J6498N5020O5383K213O3831
4245B307020N1704N2074Q2770K1443N367Q7508P6234N1783P7636n985M5731P1915
4233B925200M1875P0784L7640R5280P0457N4931P1298O0075Q7980J43772J27205
4222C786497P9790P1912O7783J36534J19364J14013J02180J55385J62615J80313
$$ plain form
4305 1106333 1113847 1055565 1082594 1134293 1185385 1175726 1140977 1170776 1185209 1220358 1230761 1198159
4293 1198159 1216103 1210137 1237233 1276155 1244337 1242194 1271182 1307342 1316498 1325721 1295995 1303701
4281 1303701 1318708 1325159 1307639 1340823 1420897 1423844 1457255 1502014 1542114 1543432 1501305 1535624
4269 1535624 1587000 1631347 1672247 1650382 1688628 1734428 1734102 1753659 1768623 1802877 1871071 1928174
4257 1928174 1933029 1918618 1922966 1965224 2028547 2059261 2104075 2120573 2175593 2240976 2243189 2307020
4245 2307020 2358724 2410798 2493568 2515011 2520378 2607886 2684120 2735903 2813539 2807554 2853285 2925200
4233 2925200 2967075 3037859 3075499 3170779 3241236 3296167 3367465 3427540 3515520 3659292 3786497
4222 3786497 3866287 3938199 4005982 4142516 4261880 4375893 4478073 4633458 4796073 4976386
4212D976386J40640J74630K09308K29077K03574K20333K25355K87326L09404L39013
4202G315046L78097M45693M83903N99420O91124P77664J000103J296013J513839
4193A4500902J342883N30004m58322n86974k88613M3230L58974N71311R40622
4184A6954017J314199J714465K320921K613603K226967M27326j392562j412296
4176B4766640n51223K39275Q87865J210742O63136j29219o9322O41239J359024
4167B9018157J553379R59775M53961M92195J07292L37058J124447J173091k27993
4158C4991362k279391k299995j272480l13276O77755J511127J771438R31614p94897
4149C2923257j156956k92443K40036j08216p44344r50407j535988j769848j055372
$$ plain form
4212 4976386 5117026 5291656 5500964 5730041 5933615 6153948 6379303 6666629 6976033 7315046
4202 7315046 7693143 8138836 8622739 9222159 9913283 10690947 11691050 12987063 14500902
4193 14500902 15843785 16373789 15915467 15328493 15039880 15083110 15442084 16013395 16954017
4184 16954017 18268216 19982681 22303602 24917205 27144172 27571498 26178936 24766640
4176 24766640 24215417 24454692 25342557 26553299 27216435 27087216 27017894 27659133 29018157
4167 29018157 30571536 31531311 31985272 32477467 32584759 32921817 34046264 35219355 34991362
4158 34991362 32711971 30411976 29139496 28826220 29503975 31015102 32786540 33718154 32923257
4149 32923257 31766301 31473858 31713894 31605678 30861334 29910927 28374939 26605091 25549719
4140B5549719k59766K9267l04918r06162q30985j12312O12000J214407J478313
4131B6469563M88164j817235k941947k356357j651314j168609q60859m52881j62644
4122A5545881M0201K63723M96045M09373j48932j198011j498272j132039p20938
4113A2057031n10617l27104l65243m26573k66989k06413k02423l53426l69823
4104I028420k92189j80773j08665r5048j46262j82889l2859m0536N62n8079N5771
4093G947453J21826J39506K14120K32683K89044L92918O27958Q45245O30831J67866
4083A1609450j71712j26824J69533j6427l84665n16668k96189q7205M4453j87406
4073A0036340l64010k33791n5922J29107K09498L66533N78189P05251N17490J95047
$$ plain form
4140 25549719 25289953 25319220 25014302 24108140 23277155 23164843 23776843 24991250 26469563
4131 26469563 26957727 25140492 22198545 19842188 18190874 17022265 16161406 15708525 15545881
4122 15545881 15586082 15849805 16345850 16755223 16606291 15408280 13910008 12777969 12057031
4113 12057031 11546414 11219310 10854067 10427494 10160505 9954092 9751669 9398243 9028420
4104 9028420 8736231 8555458 8446793 8351745 8205483 8022594 7989735 7949199 7949761 7891682 7947453
4093 7947453 8069279 8208785 8422905 8655588 8944632 9337550 9965508 10810753 11441584 11609450
4083 11609450 11437738 11310914 11480447 11464020 11079355 10562687 10266498 10179293 10223746 10036340
4073 10036340 9672330 9438539 9382617 9511724 9721222 10087755 10665944 11371195 11888685 12083732
4063A2083732K83334O01321P81324M79915J57834j5947J64733P67475J088539
4054A6392260R67799J51430l66492l96864l00520k87130k48985k74077n97313
4045A5040108o17088r27328j128024j129242j145542p48681m69674l93688j66635
4036H314206k6443J14468K72037K46846K0675k89478n72490l37091j52207m4301
4026G546222k58067k69806j08848r893q4464l22698k69002k03042j02364L2304
4016E950342j38829l92331m02973l06986k41240k21926l7311L884O1488J15416
4006D389534J30144O4042k17184m03225l52933k69631j78191j32602j20245n1111
3996B858598p5691j05821l3282j0782n9855l34K0658p7552l2110m5236m1477n4996
$$ plain form
4063 12083732 12367066 12968387 13749711 14229626 14387460 14371513 14536246 15303721 16392260
4054 16392260 17360059 17511489 17144997 16748133 16447613 16160483 15911498 15637421 15040108
4045 15040108 14423020 13495692 12367668 11238426 10092884 9344203 8874529 8480841 8314206
4036 8314206 8287763 8402231 8674268 8921114 8941789 8652311 8079821 7742730 7590523 7546222
4026 7546222 7288155 7018349 6909501 6899608 6815144 6492446 6223444 6020402 5918038 5950342
4016 5950342 5811513 5419182 5016209 4709223 4467983 4246057 4208746 4212630 4274118 4389534
4006 4389534 4519678 4583720 4366536 3963311 3610378 3340747 3162556 3029954 2909709 2858598
3996 2858598 2782907 2677086 2643804 2633022 2573167 2572833 2593491 2515939 2483829 2438593 2397116 2342120
3984B342120N655p0556j8334L0953j6331m050K7890K1254k7230J0783Q134l4450
3972B275838o898o945M3658l9969m2247L0124M9755P9784K1237q746m1460J2581
3960B366712O993J8758P4025O9844K1918M4942K3458Q0608N0588O7606J05389
3949B930841P9592O6929J53372J67876J62262J72942L38022M11681M58322N20883
3939E462722M55457L06745M21904N48679K25713k69098o34782q49074p72635n03001
3929D392630m57485k87233k18914j51892j05378r4655n6764J5285p4181M60K4664
3918B986537j248M8969M7091K5859N0820O0857Q9669J27207J33319J93148K75648
3907D037876K70825J82114J1012j2470Q6380J15786K01915L28130M06182N04114
$$ plain form
3984 2342120 2347775 2277219 2258885 2289838 2273507 2269457 2297347 2318601 2291371 2302154 2310288 2275838
3972 2275838 2268940 2261995 2305653 2265684 2223437 2253561 2303316 2383100 2404337 2395591 2354131 2366712
3960 2366712 2373705 2392463 2466488 2536332 2558250 2603192 2626650 2707258 2757846 2825452 2930841
3949 2930841 3010433 3077362 3230734 3398610 3560872 3733814 4071836 4483517 4941839 5462722
3939 5462722 5918179 6224924 6646828 7195507 7421220 7152122 6517340 5668266 4895631 4392630
3929 4392630 3935145 3647912 3428998 3277106 3171728 3077073 3020309 3035594 2961413 2961873 2986537
3918 2986537 2985289 3034258 3081349 3107208 3158028 3218885 3308554 3435761 3569080 3762228 4037876
3907 4037876 4308701 4490815 4501827 4489357 4575737 4691523 4893438 5221568 5627750 6131864
3897F131864N64401N11776N86518Q66891Q98017M6319j058984j198022o89320
3888F659460l97270k47357r9905k1491J3040O1709R8898J64609K70994O41958
3878G144645R03691P75600q2830r83819q71732o51158n78375m97237m35591k66874
3868D456320k51751j85953o1490p4727n2830o0546j98496j41317j09907p9244
3858C240059j5982r2104n9235p6m378k8906o9628J8109M4329j645J2117O9837
3846C112497N3263L1409N7134O4639O3141P2154J48628J51666K56871K65127L26364
3835D602893L18339R0069q5883j23231r5092m4085o7409o7974k031J09242J58283
3824D793121K46049K46166K70853M68615N85111O68140O92107L40579k62474k20980
$$ plain form
3897 6131864 6696265 7208041 7794559 8661450 9559467 9605786 8546802 7348780 6659460
3888 6659460 6262190 6014833 5914928 5893437 5906477 5968186 6067084 6231693 6502687 7144645
3878 7144645 8048336 8823936 8741106 7757287 6885555 6234397 5656022 5158785 4723194 4456320
3868 4456320 4204569 4018616 3957126 3882399 3829569 3769023 3570527 3429210 3319303 3240059
3858 3240059 3224077 3131973 3072738 3072662 3068284 3039378 2969750 2987859 3032188 3030543 3042660 3112497
3846 3112497 3165760 3197169 3254303 3318942 3382083 3454237 3602865 3754531 4011402 4276529 4602893
3835 4602893 4921232 5011301 4925418 4802187 4707095 4663010 4595601 4527627 4525596 4634838 4793121
3824 4793121 5039170 5285336 5556189 6024804 6609915 7278055 7970162 8310741 8048267 7827287
3814G827287R0811K70894J30268q9534l20159m10181k08934l2298K5312J80060
3804G463526L98802M95313N85628N11188L32673K85883K58798N31599Q53409Q04886
3794A2521705J68345p87679r64015n48256j59170j13601k48683j73918j36367
3785I558361j74642k95274j87422O0821K06959J22257j17915j4798J75357K51192
3775I584896J4409k290J75898K49397k22328p47064n67420l06600j82292j13360
3765G883246m2359j4402M2287O5928J30302J40475J44908K01733J77690K20400
3755H950208K94079L75644L60102M49773N12882N46799O89112Q33283R51316J076362
3745A5039560J265936J421163J831480K240852K908144L779299M647479M684793
$$ plain form
3814 7827287 7918098 8188992 8319260 8229726 7909567 7499386 7290452 7258154 7283466 7463526
3804 7463526 7862328 8357641 8943269 9454457 9787130 10073013 10331811 10863410 11716819 12521705
3794 12521705 12690050 11902371 10938356 10390100 10230930 10117329 9868646 9694728 9558361
3785 9558361 9383719 9088445 8901023 8961844 9168803 9291060 9173145 9158347 9333704 9584896
3775 9584896 9599305 9597015 9772913 10022310 9799982 9052918 8485498 8178898 7996606 7883246
3765 7883246 7840887 7826485 7868772 7934700 8065002 8205477 8350385 8552118 8729808 8950208
3755 8950208 9244287 9619931 9980033 10429806 10942688 11489487 12178599 13011882 13963198 15039560
3745 15039560 16305496 17726659 19558139 21798991 24707135 28486434 33133913 37818706
3737C7818706K089701k756080n110181m059046k708369j801110j164933n86994
3729B1721694j18200K18998N91240R41604J305012J690440K209669K905969L697873
3720C5164299M728732N992621O794588N839051K811715P44239l35025m536657
3712E7203563q454934q083031n849925m198447l121341k288767j583863r86327
3704B2636928n94578j89938K33165M84462R46211J452344K108423L065904M281632
3695C4424553M886619L664110j269172o238503o598431m866352l484313k753090
3687A7765421k079402j637726j289163j038301q67149p05314o00677n72071m63490
3678H512128m01081l58835k98207l18726k74254k58001k45932j68400j33684j54461
$$ plain form
3737 37818706 39908407 37152327 32042146 27983100 25274731 23473621 22308688 21721694
3729 21721694 21603494 21822492 22413732 23355336 24660348 26350788 28560457 31466426 35164299
3720 35164299 39893031 45885652 52680240 58519291 61331006 62075245 61740220 57203563
3712 57203563 48748629 40665598 34815673 30617226 27495885 25207118 23623255 22636928
3704 22636928 22042350 21852412 22085577 22570039 23516250 24968594 27077017 30142921 34424553
3695 34424553 39311172 42975282 41706110 35467607 28869176 24002824 20518511 17765421
3687 17765421 15686019 14048293 12759130 11720829 10853680 10148366 9547689 8975618 8512128
3678 8512128 8111047 7752212 7454005 7135279 6861025 6603024 6357092 6188692 6055008 5900547
3668E900547j75733j81174j12311j18997q0511n4468r2727m1708o2041o2181p0905
3657D847791p4271j1039j337k401p7464j57656n7079q651o9499p0245m5126J3810
3645D286833k3636J0400R380p9352o6274M5725N5673M0619M8099M4494J5950n2048
3633D335863l2936N0458J4213O5686k5048M7309L6136k1511N5489K8120j8467
3622D535312K021N8971O1613J9850O0558J9445P4529P4788O1768R3805N3700P5112
3610E191472P7271M4198R8730P4171O1071M8875R9991J44767R7773J38794J53625
3599F230738J79325J70120K11372K16621K04655K47480K74193K14033K77557L18412
3589H544506L39317L39424L86164M11165M46403M54282M59556O18063P06182P41981
$$ plain form
3668 5900547 5724814 5543640 5431329 5312332 5231821 5177353 5084626 5042918 4980877 4918696 4847791
3657 4847791 4773520 4762481 4761144 4758743 4681279 4523623 4466544 4457893 4388394 4318149 4273023 4286833
3645 4286833 4263197 4273597 4282977 4203625 4137351 4183076 4238749 4279368 4327467 4371961 4387911 4335863
3633 4335863 4302927 4353385 4367598 4433284 4408236 4455545 4491681 4470170 4525659 4553779 4535312
3622 4535312 4537333 4596304 4657917 4677767 4738325 4757770 4832299 4907087 4968855 5062660 5116360 5191472
3610 5191472 5268743 5312941 5411671 5485842 5546913 5595788 5695779 5840546 5938319 6077113 6230738
3599 6230738 6410063 6580183 6791555 7008176 7212831 7460311 7734504 7948537 8226094 8544506
3589 8544506 8883823 9223247 9609411 10020576 10466979 10921261 11380817 11998880 12705062 13447043
3579A3447043Q81217R88516J204958J433264J642666J903081K256703K813908
3571B6571356L650389M535527N525921N337504K862309j370303m391396m509355
3563C8211952l152066j678568n29520M77375J495401K541707L757504M584750
3555D5708535L826031P91123l156837n050302m320623k729831j209132l5236J338103
3546C5161831K449965K987070K062509p96899l622520m336346l517729k254898
3538B8132983j237579m15639K88136R43666J864688K692686K653164R43597k205836
3529C3659866m488290m591343l667263k660080k096962j559904j280563j084452
3521A2231009r23211p91082n98974m99228m57305l79152l89856k94738k26267
$$ plain form
3579 13447043 14328260 15316776 16521734 17954998 19597664 21500745 23757448 26571356
3571 26571356 30221745 34757272 40283193 45620697 48483006 47112703 42721307 38211952
3563 38211952 35059886 33381318 32851798 33329173 34824574 37366281 41123785 45708535
3555 45708535 49534566 50325689 47168852 42118550 37797927 35068096 33858964 33823728 35161831
3546 35161831 37611796 40598866 42661375 41864476 38241956 33905610 30387881 28132983
3538 28132983 26895404 26479765 26767901 27711567 29576255 32268941 34922105 35865702 33659866
3529 33659866 29171576 24580233 20912970 18252890 16155928 14596024 13315461 12231009
3521 12231009 11307798 10516716 9917742 9418514 8961209 8582057 8192201 7897463 7671196
3512G671196j94706k56955k70775k32690j71096j55126j63238j01727j10486j01246
3502E913151m6239n1472q3698q9410j18945j17911j36290o2151n2433m7563q4902
3491E022137l7527m8096p0394J18013K2902J3300k3354L7934J02552J53770Q8807
3480E380044J39638J82893J76006K29181L11394L53989L82846M94610P71438R32913
3470I354952J099670R23623J59119n26844q89795p14701k98977J0369K05907N11701
3460I835024Q63644R47444L95242q49987j362011r35180m91795k83201j16476
3451H002704M6632K68855M36096O43780Q35518P85378M06936l7237m07810n45645
3441A0435207o67010n98457k17651R6867L10757K78959j16318p16390j172742
$$ plain form
3512 7671196 7476490 7219535 6948760 6716070 6544974 6389848 6226610 6124883 6014397 5913151
3502 5913151 5866912 5815440 5731742 5642332 5523387 5405476 5269186 5207035 5154602 5107039 5022137
3491 5022137 4984610 4936514 4866120 4984133 5007035 5020335 4996981 5034915 5137467 5291237 5380044
3480 5380044 5519682 5702575 5878581 6107762 6419156 6773145 7155991 7650601 8422039 9354952
3470 9354952 10454622 11378245 11537364 11010520 10120725 9406024 9107047 9117416 9323323 9835024
3460 9835024 10698668 11646112 12041354 11191367 9829356 8894176 8402381 8119180 8002704
3451 8002704 8049336 8318191 8754287 9398067 10233585 11018963 11425899 11388662 10980852 10435207
3441 10435207 9768197 9169740 8952089 9048956 9359713 9638672 9522354 8805964 7633222
3432G633222j133108p51020n56196l70344l50790l05665k25787j34101j80822
3423C625389q7782j32507j20033j03263p1868m0501j05001m7998K485J4587O7223
3412C000731L7633L8080M9935p3260r8657l6070J2292J0034k0653r7692j14383
3401B707990j24361n3484m115k5345n2045n9303l9267m1826q3113n352M04l9078
3389B181105m2842l7771k6218k5247M0224l6358J4844Q6384j5228k0946K3250
3378B141197j3986O4976R6961L1152l4175k2262l1106J0189j0115l5964l258J0955
3366B204564L104n6276l6245o5054l4967K4204k0398n0918Q312M638p390j7990
3354A955584k9028L076K8969O4539J912l237l2052O3916k5419l7554Q470n0135
$$ plain form
3432 7633222 6500114 5749094 5192898 4822554 4471764 4166099 3940312 3806211 3625389
3423 3625389 3537607 3405100 3285067 3181804 3109936 3069435 2964434 2916436 2918921 2933508 3000731
3412 3000731 3038364 3076444 3126379 3053119 2954462 2918392 2930684 2940718 2920065 2822373 2707990
3401 2707990 2583629 2530145 2526030 2500685 2448640 2389337 2350070 2308244 2225131 2219779 2220183 2181105
3389 2181105 2138263 2100492 2074274 2049027 2089251 2052893 2067737 2154121 2138893 2117947 2141197
3378 2141197 2127211 2192187 2289148 2320300 2286125 2263863 2232757 2242946 2232831 2196867 2193609 2204564
3366 2204564 2207668 2151392 2115147 2050093 2015126 2039330 2018932 1968014 1976326 1980964 1973574 1955584
3354 1955584 1926556 1929632 1958601 2023140 2025052 2021815 1989763 2053679 2028260 1990706 1999176 1949041
3342A949041J5585n904P198l1396l7109L2710N7472O884p6997J4963L7604K6910
3330A996961k6937k2317J2134k7964L315P0846Q350l835M8890K9042K1917Q728
3318B119130Q803K9211j930N9334L1481k5629O7777M2432k2647L8594J9550p841
3306B358265j245k4128n2447J6291j0572Q356k3365J900P268J6052K8727L6868
3294B361970N2516J0427J12399N7567O5231M7480R974L5795N7171M586k5503k2761
3282B766852N52j5702k753K4028K9518K4421L0472J6900J3694P6369K1102j1294
3270B974159P3002M7260N0495M2193J4032Q5193O7589J7816J0404j904O011O5532
3258C451782J60224M3539k2158n183O3276Q1968M2114l5932Q2380M8714J00610
$$ plain form
3342 1949041 1964626 1958722 1965920 1934524 1897415 1930125 1987597 1994481 1917484 1932447 1970051 1996961
3330 1996961 1970024 1947707 1959841 1931877 1935192 2006038 2014388 2010553 2059443 2088485 2110402 2119130
3318 2119130 2127933 2157144 2155214 2214548 2246029 2220400 2288177 2330609 2307962 2346556 2366106 2358265
3306 2358265 2357020 2332892 2280445 2296736 2286164 2294520 2271155 2273055 2280323 2296375 2325102 2361970
3294 2361970 2414486 2424913 2537312 2594879 2660110 2707590 2717564 2753359 2810530 2815116 2789613 2766852
3282 2766852 2767404 2751702 2748949 2772977 2802495 2826916 2857388 2874288 2887982 2964351 2985453 2974159
3270 2974159 3047161 3094421 3144916 3187109 3201141 3286334 3353923 3371739 3382143 3380239 3386250 3451782
3258 3451782 3612006 3655545 3633387 3628204 3691480 3773448 3815562 3779630 3862010 3910724 4011334
3247D011334M7417j0212K1364J27344J35651J05278R5969J00118J24333J58064
3237D916660K24505K55418K74713K75441L02528K65944K65059L68204L26423M47183
3227G922078N28366O39105P94320R16145P66161M14075k63115n13703l95035l13788
3217A0494609j34673j9826J1010r2940j55034j18552j0539k4557K6993K3849k4716
3206I975624O9446M1236M3271j0108J8589R3351J75129K33490K18197K13848K89964
3195A1362037L14909L02610K70321K70215K79802L07864L49253L38761L47768
3186A4143540M26140L66875L88925M21026L63780L58292M06992M21407M73403
3177A7770380N88126N67840O26015P87859R14835R72769J192871J189120J268367
$$ plain form
3247 4011334 4058751 4048539 4069903 4197247 4332898 4438176 4534145 4634263 4758596 4916660
3237 4916660 5141165 5396583 5671296 5946737 6249265 6515209 6780268 7148472 7474895 7922078
3227 7922078 8450444 9089549 9883869 10800014 11566175 11980250 11717135 11203432 10808397 10494609
3217 10494609 10359936 10340110 10351120 10258180 10103146 9984594 9974055 9949498 9976491 10000340 9975624
3206 9975624 10045070 10086306 10129577 10119469 10138058 10231409 10406538 10640028 10858225 11072073 11362037
3195 11362037 11676946 11979556 12249877 12520092 12799894 13107758 13457011 13795772 14143540
3186 14143540 14569680 14936555 15325480 15746506 16110286 16468578 16875570 17296977 17770380
3177 17770380 18358506 18926346 19552361 20340220 21255055 22227824 23420695 24609815 25878182
3168B5878182J334611J498344J582288J729413J752022J899715K024229K114089
3160C9812893K119258K194233K369411K661230L019918L512189L757536M102003
3152F3548671M501160N128706O107104P493540Q907287J0644312J2421635J4718663
3144A33471078J7554702K2218535K9035183L9050891M9775294N1040659K5432303
3137C67578645j2472126m5677449n9628748m9316661l6190524k6856380k0476957
3130A16959800j5631412j2441954j0088439q409320o937248n880187m754200l998851
3122D8818189l220910k970589k771422k636890k464711k199404j847824j719003
3114B8987436j395438j283121j137815j081678r63714r51679q04029p09220o36225
$$ plain form
3168 25878182 27212793 28711137 30293425 32022838 33774860 35674575 37698804 39812893
3160 39812893 41932151 44126384 46495795 49157025 52176943 55689132 59446668 63548671
3152 63548671 68049831 73178537 79285641 86779181 95686468 106330780 118752415 133471078
3144 133471078 151025780 173244315 202279498 241330389 291105683 342146342 367578645
3137 367578645 355106519 309429070 249800322 200483661 164293137 137436757 116959800
3130 116959800 101328388 88886434 78797995 70388675 63451427 57571240 52817040 48818189
3122 48818189 45597279 42626690 39855268 37218378 34753667 32554263 30706439 28987436
3114 28987436 27591998 26308877 25171062 24089384 23125670 22173991 21369962 20660742 20024517
3105B0024517o23630o01283n14602m33076m76763n47755n63370n24890n50972
3096A5188176m26267m46611m15122m16202m73256n17808m56812l38486k53438
3087A1444174k36089j74581k50744j93280j19518p1686j68739j70285k30674j90443
3077I638135k09964k29802j80293k70151k45168j57523j66291j90374j79013j59824
3067G649732j93576j61738j42719j81454j24035j23967j27886j32882j13596q2697
3057F265182n5733p7201l244m2700n9573l9856p2895j34439p9512q2885o349r8819
3045E511976m4955k9297k9885p4169j42834r425M8196L1915l5210o2116m9620
3034E114576k0192j3074j45760j52934l3392l3725p1869j2282l6014p006K5360
$$ plain form
3105 20024517 19400887 18799604 18285002 17851926 17375163 16827408 16264038 15739148 15188176
3096 15188176 14761909 14315298 13900176 13483974 13010718 12492910 12036098 11697612 11444174
3087 11444174 11208085 11033504 10782760 10589480 10469962 10398276 10229537 10059252 9828578 9638135
3077 9638135 9428171 9198369 9018076 8747925 8502757 8345234 8178943 7988569 7809556 7649732
3067 7649732 7456156 7294418 7151699 6970245 6846210 6722243 6594357 6461475 6347879 6265182
3057 6265182 6209449 6132248 6129004 6086304 6026731 5986875 5913980 5779541 5700029 5617144 5610795 5511976
3045 5511976 5467021 5437724 5407839 5333670 5190836 5181411 5229607 5261522 5226312 5164196 5114576
3034 5114576 5094384 5081310 4935550 4782616 4749224 4715499 4643630 4631348 4595334 4588328 4613688
3023D613688R798K0845k622j0004J07474R0264J38716L0861j57399j65913r7394
3012D578314q9090n8304q0980l2116k3727m4807q6944m3602o7226k9521q6494
3001C935503r5299o7808L0203L6491j7625j2440M2184P4538p653j08904j27811
2990C681379o9976l0002j1627l6599n4480q9113j77524r6699n6370q1286k454
2979B975249k8346m7974l1328j00898p4680l6854p734m9864p6284m8550p6059
2968B396678m5817n5335n6260m5646q7873m840n552r7867K0691l4318p3672j6122
2956A894067m3126k6059K2211j2750l9760j2805l8115K2129m0947o7188R31K3211
2944A681799j2977M5753n3128K5764L2957p4284o3982p5998n0859j5049Q865Q864
$$ plain form
3023 4613688 4623486 4644331 4641709 4631705 4739179 4829443 4968159 4999020 4841621 4675708 4578314
3012 4578314 4489224 4430920 4349940 4317824 4294097 4249290 4162346 4118744 4051518 4021997 3935503
3001 3935503 3840204 3772396 3802599 3839090 3821465 3809025 3851209 3925747 3918094 3809190 3681379
2990 3681379 3611403 3581401 3569774 3533175 3478695 3389582 3212058 3115359 3058989 2977703 2975249
2979 2975249 2946903 2898929 2867601 2766703 2692023 2655169 2647435 2597571 2521287 2472737 2396678
2968 2396678 2350861 2295526 2239266 2193620 2105747 2100907 2095355 1997488 2018179 1983861 1910189 1894067
2956 1894067 1850941 1824882 1847093 1834343 1794583 1781778 1743663 1765792 1724845 1657657 1658588 1681799
2944 1681799 1668822 1714575 1661447 1687211 1720168 1645884 1581902 1505904 1455045 1439996 1448861 1457725
2932A457725P984m561j0375Q208k3323n400K5052o7923q262p562l9806l1368l
2919A300386q686m313o9475K2766j1942K9268J9101M1718J176K7964j7237j0750
2907A319976J0440L3091k430J2601K0297j7579J8984P4039R7684p478m876M4651
2895A599400K105l5023R280J8971j6502J6091o329K8135n7249n8577m531K8820
2883A524591k3813o0350j5712M6305k9243n2951k433N0107k9130j1859O3558l8768
2871A420302k8697l5766k5379K7829R272l1228j30J1170K2431L3651m4973j21913
2859A236569q4082l3300j566n2673m8842l5114l5138L6228k0843k267J2090J3953
2847I85015M5894M477M265n0877K1824L8868M6454M1760J2169N787N4958J11025
$$ plain form
2932 1457725 1465709 1461148 1450773 1458981 1435658 1430258 1455310 1387387 1379125 1371563 1331757 1300389 1300386
2919 1300386 1291700 1287387 1217912 1240678 1228736 1258004 1277105 1318823 1319999 1347963 1330726 1319976
2907 1319976 1330416 1363507 1361077 1373678 1393975 1376396 1395380 1469419 1567103 1559625 1554749 1599400
2895 1599400 1601505 1566482 1575762 1594733 1578231 1594322 1587993 1616128 1558879 1500302 1495771 1524591
2883 1524591 1500778 1440428 1424716 1471021 1441778 1388827 1386394 1436501 1407371 1395512 1459070 1420302
2871 1420302 1391605 1355839 1330460 1358289 1367561 1336333 1336203 1347373 1369804 1403455 1358482 1236569
2859 1236569 1152487 1119187 1117621 1064948 1016106 980992 945854 982082 961239 958972 971062 985015
2847 985015 1030909 1035386 1039651 988774 1010598 1049466 1095920 1137680 1149849 1155636 1210594 1321619
2835A321619J00899N3158J22144K18326K51904K51111J24082q1873j95949l02207
2825A863214k90800j85193q1599p6953n9089p146J1040J1422J9136l3421p6116
2814A094495j14522j11341l2560P117m5894q8075o4281K8154k1153j8272j7178
2803F16490J7736j6649n1535j4880k6626j9816n354q984M1041m387o2325J4870
2791D79581K1954L7810k8846r541m474k3768m3367q6687M2577M9523k3173j4436
2779C97153J7519k0911m6108J9131N072k921M3010j8192J087j0045R471k9678
2767C64588K1384K6870J231m0852l9824L5852j304J12M7373l676j604L799p1174
2754C42775q399k2071k0656L0229J8912J8319p495J6222J0503k105q470j2666
$$ plain form
2835 1321619 1422518 1475676 1597820 1816146 2068050 2319161 2443243 2361370 2165421 1863214
2825 1863214 1572414 1387221 1305622 1228669 1169580 1162434 1173474 1184896 1204032 1170611 1094495
2814 1094495 979973 868632 836072 843189 797295 709220 644939 673093 651940 633668 616490
2803 616490 634226 617577 566042 551162 524536 504720 499366 490382 531423 527036 464711 479581
2791 479581 501535 539345 510499 500958 496484 472716 429349 342662 385239 434762 411589 397153
2779 397153 414672 393761 347653 366784 371856 368935 411945 393753 394840 384795 394266 364588
2767 364588 385972 412842 414073 373221 333397 369249 367945 368057 415430 411754 410150 413949 342775
2754 342775 334376 312305 291649 321878 340790 359109 351614 367836 378339 376234 367764 355098
2742C55098k3403P608N910j9488j6873k0655K2930o2150O6294L2899l7683k5176
2730B85311K1499k0117K526L6151J0480j8323k2975r054K71j6224j7977J4447
2718B66015r471r780L3281J9643l7204l2264J5374O1721l3613q2847K8659L0814
2706B50328O903k537J2253K3744l5162m3297q460m1397M0154L1911j1318l4879
2694A88243k8180K1147M656k5969P660J945j1179m675L9485L7525j4233k7816
2682A88609q256R904J7178m1503l456O0706L9547J7477l4243n8328M4400k8174
2670B03861r80O9776m5177j1533L0396n019k7199m4214J9279M5459j2806Q917
2658B30760M863m0932K5784L2939m5903q591L7030M1486m2405L538K6417J9763
$$ plain form
2742 355098 331695 339303 345213 325725 308852 288197 311127 248977 315271 348170 310487 285311
2730 285311 306810 286693 289219 325370 335850 317527 294552 285498 285769 269545 251568 266015
2718 266015 256544 246764 280045 299688 262484 230220 245594 307315 273702 190855 219514 250328
2706 250328 257231 254694 266947 290691 255529 212232 203772 162375 202529 234440 223122 188243
2694 188243 160063 181210 185866 159897 167557 169502 158323 153648 193133 230658 216425 188609
2682 188609 180353 190257 207435 165932 162476 223182 262729 280206 245963 187635 232035 203861
2670 203861 202881 272657 227480 215947 246343 241324 214125 169911 189190 234649 221843 230760
2658 230760 235623 194691 220475 253414 207511 198920 235950 277436 235031 238569 264986 284749
2646B84749m7066P002j550P781r991L1757m91j3301j0515k1286L7154j1162M4114
2633B97195J4145l3207p86L7359n7881M4050K8397k3926P6294m169l8587K7959
2621C66843l0556p8267N2634k4114o06J4099k6739p724Q772P598J6328j8478M4210
2608C24000Ok3079K4001K7043o9207L0471K16n9150j0999J3160M4606K687K7050
2595C30805R501K7712k6296k4606M2945K4200l7012L4301J7735O503L4736m1054
2583C99470j3943R1782L3332R710J6241K252L3801j4066M7397N9302J6183M4916
2571G26377K8027M2182J3255P817K8086m629l3292O3713N1883J3316J2757N2090
2559A001582J1847k8967k9720n4159j2127m1698r480k0080n9548k033J7000j8932
$$ plain form
2646 284749 237683 244685 243135 250916 240925 272682 272191 258890 248375 227089 264243 253081 297195
2633 297195 311340 278133 277347 314706 256825 300875 329272 305346 381640 377471 338884 366843
2621 366843 336287 258020 310654 286540 285934 300033 273294 265570 274342 281940 298268 279790 324000
2608 324000 324006 300927 324928 351971 282764 313235 313451 254301 243302 256462 301068 303755 330805
2595 330805 340306 368018 341722 317116 360061 384261 347249 381550 399285 405788 440524 399470
2583 399470 385527 477309 510641 520351 536592 538844 572645 558579 605976 665278 681461 726377
2571 726377 754404 796586 809841 817658 845744 841115 807823 871536 923419 936735 949492 1001582
2559 1001582 1013429 984462 954742 900583 888456 846758 837278 817198 757650 755617 772617 753685
2547G53685j1150Q519j4121K1225p4637j9857K1755r508l0621o511m2027o249
2535E90503q1161n3849N221n8766L4801k6984K1820J0069k2007k5299J824N0023
2523D46195k3951K39j0557J5357j7227m9427l2198k6471L9030l0832k2323m253
2511B83582k9824K7920J6696J3793L8202L0715J2539k8519M9131k0774j6870J0712
2499C87303j9537j9032k5338m2942K1899l5878l5576J3177J5270k5174L5558M3975
2487C13705m6074L082l5087k8666Q478L6530J5611o2247k115q693J3182N1836
2475B59542m0268J7521K9275m452L113n63o0981K4465j3638k7657k944J7382M132
2462B04927K1694k104l332j4287j0916L4685P485K7913p588L1002O912j5647J1432
$$ plain form
2547 753685 742535 751054 736933 758158 683521 663664 685419 675911 645290 638779 596752 590503
2535 590503 509342 455493 460714 401948 436749 409765 431585 441654 419647 394348 396172 446195
2523 446195 422244 422483 411926 427283 410056 360629 328431 301960 340990 310158 287835 283582
2511 283582 253758 281678 298374 312167 350369 381084 393623 365104 414235 393461 376591 387303
2499 387303 367766 348734 323396 280454 302353 266475 230899 244076 259346 234172 269730 313705
2487 313705 267631 270713 235626 206960 215438 251968 267579 205332 203217 194524 207706 259542
2475 259542 219274 236795 266070 261618 264731 264168 203187 227652 214014 186357 183413 200795 204927
2462 204927 226621 224517 221185 206898 195982 230667 238152 266065 258477 289479 296391 280744 292176
2449B92176l4221k2060K5193L5502O502r757M700O5371k4173j8879K9222l8777
2437C10799q6453J5865O5968K2704M6282j1129m7026K0017Q615o4015k5370o097
2425B50160J6700Q155m0090k6822n236o440K8320K0467j8576j3083L3845R585
2413B56985K0495q502k5534p783J6293n4j754J5588k0627M7244k4612k8737N837
2400B44839K385L8466n79l1739m6856M8463L2074q297k5469k5689k0238R035J0596
2387B26991J1450k6623K634L9865L5303m5054n719J5351M2696j8369J712K3202
2375C03439L4414o758m7572j6211M59M7146P524K8362j3202J7946N4852J0659
2363D21058n9564K4903K5142L3416J5200K0911M0305M2179R5576r613m6992k0558
$$ plain form
2449 292176 257955 235895 261088 296590 303092 293335 298035 363406 339233 320354 349576 310799
2437 310799 224346 240211 306179 328883 375165 364036 317010 337027 345642 281627 256257 250160
2425 250160 266860 275015 234925 208103 202867 196427 224747 245214 226638 213555 247400 256985
2413 256985 277480 268978 243444 235661 251954 251900 250146 265734 245107 292351 267739 239002 244839
2400 244839 247224 285690 285111 253372 206516 254979 287053 278756 253287 227598 207360 216395 226991
2387 226991 238441 211818 214452 254317 289620 244566 238847 254198 296894 278525 280237 303439
2375 303439 337853 331095 283523 267312 267771 314917 322441 350803 337601 355547 410399 421058
2363 421058 361494 386397 411539 444955 460155 481066 521371 563550 659126 649513 602521 581963
2351E81963n6155m8733r701J0935k3999n6364M0517K3661l0130n2271k7858N2546
2339D04411K6218l5061M5597K2543K5186K0714J3132L9288J0729J05300Q4929
2328G62986L8810Q960J5807J1902N7101P7733Q9455R2645L1077o8787j37535j14526
2316H65628o6338n2554l4508k1907n2902l1836k3314p0031L651L5685k3605o2351
2304D65618l686K4508P835J3871L7925k7815M4765j2798l429L2263k5929j351
2292E51777K6136J0450N8183P8039P5439P6316O394p8319m8245m2528J5088J4206
2280G42936n7494l9119P2224R195o4480k1175k1224N7889k9909n1525r598J2750
2268F00470l2389N2109j4253L4666j1500k0962L5588N9517l028M8029M4256L251
$$ plain form
2351 581963 525808 477075 467374 478309 454310 397946 438463 462124 431994 379723 351865 404411
2339 404411 430629 395568 441165 463708 488894 509608 522740 562028 572757 678057 762986
2328 762986 801796 810756 826563 838465 895566 973299 1062754 1155399 1186476 1117689 980154 865628
2316 865628 799290 746736 712228 690321 637419 605583 582269 512238 515889 551574 527969 465618
2304 465618 461932 486440 494275 508146 546071 518256 563021 550223 546794 579057 553128 551777
2292 551777 577913 588363 646546 724585 800024 876340 882734 804415 756170 713642 728730 742936
2280 742936 685442 646323 718547 727742 663262 642087 620863 678752 648843 597318 587720 600470
2268 600470 568081 620190 605937 640603 629103 608141 643729 703246 700218 748247 792503 795754
2256G95754J32243J2192K6362K3338l1384l4930l5982n7427K4421L3045J7821
2245I05453l8550n1211K031N0860p721L042n516k049O3154N9437N853m71J3216
2232I97528J8245K4060j8656J5240J9740O9718N9815O9222L5287P2412P9967R3010
2220A535588J36152l1384p8516k6606n4547r2117p9038r609J283l340J2978k1442
2208A289402k568L3300L8747j7244n770N7653K0267N652O2108O5035J006P6705
2196A624293N5346O6096O3745M8211J7555J06417P2826P5107R8866R8146Q0105
2185B406713J23147P4983N3641P3910K7595P9843J22207J30342J55618J83029
2175C431028J56404J61627J67783K15935K43243K66485K76421J57972J01411q4553
$$ plain form
2256 795754 927997 940189 966551 989889 958505 923575 887593 830166 854587 887632 905453
2245 905453 866903 815692 817723 868583 860862 863904 858388 856339 919493 978930 984783 984312 997528
2232 997528 1015773 1039833 1021177 1036417 1056157 1125875 1185690 1254912 1290199 1362611 1442578 1535588
2220 1535588 1671740 1640356 1561840 1535234 1480687 1388570 1309532 1299923 1301206 1297866 1310844 1289402
2208 1289402 1286834 1320134 1358881 1341637 1335867 1393520 1413787 1419439 1481547 1546582 1547588 1624293
2196 1624293 1679639 1745735 1809480 1857691 1875246 1981663 2054489 2129596 2228462 2326608 2406713
2185 2406713 2529860 2604843 2658484 2732394 2759989 2839832 2962039 3092381 3247999 3431028
2175 3431028 3587432 3749059 3916842 4132777 4376020 4642505 4918926 5076898 5178309 5093756
2165E093756l03383m01361m24181l69985l27302k44796j64818j78574k35453j49789
2155B294114j7894j02188j51547n3826j18469q5285n6239p5677o2145m7209l1219
2144A492416l4342q0704n3419m7147k8573J8844l2655p0620j1796j4468l3147
2133A104389P303m5402m4880M2503n2653m8655K9671j8265j8295K6187n242J2555
2121I89216q5192o5708J2632j8282o1482m1795k5051P261q533J826l6395k9054
2109F39443J2790k395m9031N728L1589j7206M709L3727k432k099m1751n6648m75
2096E55949l780k9245j8618l3486L803k4275P122J6951N159j8280j8314N3189
2084D96175m9067l8286l7770q063M6201L6081j8124K7026p566L1917M112k6979
$$ plain form
2165 5093756 4790373 4389012 3964831 3594846 3267544 3022748 2857930 2679356 2443903 2294114
2155 2294114 2276220 2174032 2022485 1968659 1850190 1764905 1708666 1632989 1570844 1523635 1492416
2144 1492416 1458074 1377370 1323951 1276804 1248231 1267075 1234420 1163800 1152004 1137536 1104389
2133 1104389 1111692 1066290 1021410 1063913 1011260 962605 992276 974011 955716 981903 976661 989216
2121 989216 904024 838316 850948 832666 771184 729389 704338 711599 703066 704892 668497 639443
2109 639443 652233 649838 600807 606535 638124 620918 625627 659354 656922 654823 613072 556424 555949
2096 555949 552169 522924 504306 470820 474623 450348 457470 474421 479580 461300 442986 496175
2084 496175 447108 408822 371052 362989 409190 445271 427147 454173 446607 478524 482636 455657
2072D55657M271j9915m7213j4447k8731K8911J9973j3756j0162j1697m805l7997
2060C20089R922l488L1422N5210k6141p3397k4496J5576J6965L2511k0690n20
2048C32963K5072p7447P764K1290l1191N0813N359m2264L6179R925m1928k0536
2036B75999m3851K7843l6405k0925M4864l8954J5632L314L7874m0933M9179N459
2024B79096J4551j262m3829K1200n2925j6682J5634K4052p5008N898L2285K1119
2012B24129l9217K0113K8207L0613m0740k0311O108k9603k750N974n6748m095
2000A21680M0661m1508J4004p470N3720O2089k0078l7167n680K9606J4011R750
1988B33618o3540K0456K0540q401K6943k0181n0129n544O8122M056j7497l6359
$$ plain form
2072 455657 459928 440013 392800 378353 349622 378533 398506 384750 374588 362891 358086 320089
2060 320089 330011 326523 357945 413155 387014 313617 289121 304697 321662 354173 333483 332963
2048 332963 358035 280588 288352 309642 278451 329264 334623 292359 328538 338463 296535 275999
2036 275999 232148 259991 223586 202661 247525 208571 224203 227517 265391 224458 273637 279096
2024 279096 293647 292385 248556 269756 216831 200149 215783 239835 164827 170725 203010 224129
2012 224129 184912 205025 233232 263845 223105 202794 208902 179299 176549 182523 125775 121680
2000 121680 162341 120833 134837 127367 181087 243176 223098 185931 180251 209857 223868 233618
1988 233618 170078 190534 211074 202673 229616 209435 159306 153762 221884 225940 208443 172084
1976A72084j7041M23k1842J78M3742K5849j4616L9717j3256o4856L8353M1748
1964B30483M2686n9345o8396L1934L16K361j7365n6683J568j5127O353J0133K0991
1951A29909j496J7982J851J9407M6053j6216k6021l8457k3615L3697N5302l8030
1939A60366K2364m6902N837m414l5408M9931M4261m033j2495j6140l9834K6264
1927A49797k2813k4302K4329K8227O070L2165k7569K3858j6266j3201L1223M5548
1915B37066m7200l5374M8995k2581r668K5615M78K5337j920J1648J8119m4175
1903B06340N3986j3240k0979n6568J2204K5850Q7j5050l8362K24J7453M0821K0793
1890B33559j6927k180P894M1578R815j7284K2512k1732k034M1999j0633k70K2572
$$ plain form
1976 172084 155043 155466 133624 133802 177544 203393 188777 228494 215238 150382 188735 230483
1964 230483 273169 213824 145428 177362 177678 180039 162674 105991 107559 92432 98785 108918 129909
1951 129909 128413 146395 148246 167653 213706 197490 171469 133012 109397 143094 198396 160366
1939 160366 182730 135828 141665 137251 101843 151774 196035 192002 179507 163367 123533 149797
1927 149797 126984 102682 127011 155238 161308 193473 165904 189762 173496 160295 191518 237066
1915 237066 189866 154492 203487 180906 171238 196853 197331 222668 220748 232396 250515 206340
1903 206340 260326 247086 226107 169539 181743 207593 207680 192630 154268 154492 171945 212766 233559
1890 233559 216632 214452 222346 263924 273739 256455 278967 257235 255201 297200 286567 286297 308869
1877C08869J3938j8900p0000J7944P7835P1051m3013n3280K0292l5151j7065K4316
1865B96836l3921p674J3312J3702N7099m3922n7227L6154L3972L1529J1313l1368
1853C19805L2418M0420j4520K7884j7960L6940N5013n489j1990J7538M7530M5746
1841E73335J9819k0528n8464M2766M2819o053l479j4797k8342j3864L0097K0230
1829E83539j0512L7345J0236p815N0453L2073r2793l2994L3045J3444O3238Q826
1817F88085J1224N3395j3014L9181L6340L608J7250J5807n4828m0439O0692O7483
1805H84784M7060l390J3550L609o8766m5806l1758k2453j5882j3223M4096k4885
1793G66936P810q0418j649P32j9982L1451N752k5627J96L3167M4317m740k1051
$$ plain form
1877 308869 322807 303907 233907 251851 329686 400737 357724 304444 324736 289585 272520 296836
1865 296836 262915 255241 268553 282255 339354 295432 238205 274359 308331 339860 351173 319805
1853 319805 352223 392643 378123 406007 388047 424987 480000 474511 462521 480059 527589 573335
1841 573335 593154 572626 514162 556928 599747 593694 590215 575418 547076 533212 563309 583539
1829 583539 573027 610372 620608 612793 663246 695319 602526 569532 602577 616021 679259 688085
1817 688085 699309 752704 739690 778871 815211 818819 836069 851876 797048 756609 817301 884784
1805 884784 931844 928454 942004 945613 876847 831041 799283 776830 760948 747725 791821 766936
1793 766936 774746 694328 692679 693411 673429 704880 710632 685005 685201 718368 762685 757945 736894
1780G36894K6578L5458k1185m0857k5448M532L8467j3448l0808j490l128n2632
1768F52933n255k4387m51l4972n0508k1936l500K801l6040j5828q041N597l1296
1755D29117K3338k0758l0850K1041L7554l4288K5056j4554m6899m4331l945K4002
1743C64483J7876n0806o2931J9625m8685R170P499o144j753j4308r087L8065J3598
1730B76602n696k0350m2160L3426Q033k9734m7573J5072N645K8661k9500p1878
1718A20548N0701K9736j3427J2720j8804j03539O2138J2771m9018J7773L874P18
1706A26191K4099m0485k0085L7143L724L993j7279n7452O3978M7551l9093j3007
1694A19278n2035j5544M9120l8865Q280J3374o798N0845L0021m2950k4421k0023
$$ plain form
1780 736894 763472 798930 777745 736888 711440 715972 754439 740991 710183 708693 705565 652933
1768 652933 647678 623291 622840 587868 537360 515424 511924 514725 478685 462857 454816 460413 429117
1755 429117 452455 431697 400847 421888 459442 425154 450210 435656 388757 344426 340481 364483
1743 364483 382359 331553 268622 288247 239562 248732 256231 250087 248334 234026 224939 263004 276602
1730 276602 270906 250556 208396 241822 249855 220121 172548 187620 193265 221926 192426 120548
1718 120548 171249 200985 187558 200278 181474 77935 140073 152844 103826 121599 125473 126191
1706 126191 150290 109805 89720 126863 130587 134580 117301 59849 123827 171378 132285 119278
1694 119278 67243 51699 100819 61954 70234 83608 76810 127655 157676 114726 90305 70282
1682G0282K7320M1997k6886m1870l5566j1357L7554K2245n84L9729N306n673j8588
1669A03909j684k6495l2269m788L8359m8387l5296K7110N7525K5749m5397r272
1657D9064K5102j0229m9749K4020K6132N752n6768r674j325J9991o389K3447K269
1644D1643j1970K5127k4245J4826j5258L759L3500J5081k5538m9531n455J0263
1632A2202m5568l3061K1516j7128N0960M6073j3709K4088j6431O621O212l7317
1620D458L647M765K014k5282k0992L8619m753J080l5017k415K1505J6574L3955
1607C8158N530k9071l5259l18L9359n326n26j9799p107k2650k0914O825Q3845
1594C2747N929R145O091m5047k1659J0014L964k5502j4151N787K2079k143L8224
$$ plain form
1682 70282 97602 139599 112713 70843 35277 23920 61474 83719 83135 122864 128170 122497 103909
1669 103909 102225 75730 43461 38673 77032 28645 -6651 20459 77984 103733 58336 49064
1657 49064 74166 63937 14188 38208 64340 70092 13324 3650 2325 22316 15927 39374 41643
1644 41643 29673 54800 30555 45381 30123 33882 67382 82463 56925 7394 1939 12202
1632 12202 -33366 -66427 -44911 -62039 -11079 34994 21285 45373 28942 35563 41775 4458
1620 4458 8105 12870 14884 -10398 -31390 7229 2476 3556 -31461 -33876 -12371 4203 38158
1607 38158 43688 14617 -20642 -20960 18399 13073 12547 -7252 -14359 -37009 -57923 -51098 32747
1594 32747 38676 47821 53912 8865 -12794 -2780 1184 -24318 -38469 -32682 -10603 -12746 25478
1581B5478L8958j6956n520k5890k9122L1288m6731K7782p040j8852l2558O568
1569e2595M1142l0414M8010J3208m6938M4715q039j6913J8987j6191J7959n2447
1557c9516n6024P7635L9131M358n652n3643j3064O5204K5632k3378J2351m7463
1545a4429p852J7026j2033O7372l7576J2208P540q624j0517J824M080j5898k9985
1532b6864k6266M8547j3898K6757r248k4612l0j8615l586L1J923N80P4656J0537
1518C9912k1433k750l937k1995R152P5710o8876j3732K3233n3129k4205m098L8653
1505b7495J4798k4341J9409J4268J0382N159q150j6792L1371k2225Q450K0504
1493B5338m1337k9240N5447j4301l4631M7751l03K1723J3071j8643k3112j0888
$$ plain form
1581 25478 64436 47480 41960 16070 -13052 18236 -28495 -713 -7753 -26605 -59163 -52595
1569 -52595 -11453 -41867 6143 19351 -27587 17128 9089 -7824 11163 -5028 12931 -39516
1557 -39516 -95540 -17905 21226 25584 19932 -33711 -46775 18429 44061 20683 33034 -14429
1545 -14429 -22281 -5255 -17288 50084 12508 24716 32256 23632 13115 14939 19019 3121 -26864
1532 -26864 -53130 -4583 -18481 8276 -972 -25584 -25614 -44229 -47815 -47784 -45861 -45281 29375 39912
1518 39912 18479 15729 11792 -10203 -1051 74659 5783 -7949 15284 -37845 -62050 -66148 -27495
1505 -27495 -12697 -37038 -17629 -3361 7021 12180 4030 -12762 18609 -3616 4834 25338
1493 25338 -15999 -45239 10208 -4093 -38724 9027 8724 30447 43518 24875 1763 -9125
1481i125l236J4946M586j1772L3663q376K0710n494l3193l327j2266m00O646k6156
1467c2794k1068m629n75l6821M6970L6597O751L3998l0238k3909L2138K198j363
1454G255j826J1955O655n290j3729J628j5592R338O0051k0644l5682k3906k8588
1441d8375o837O6006N461k9835J6328K4185M688k1211n0465p321O768J0489M0704
1428A0585K7928O796j101r914j5667n3314m5323L1348N9984k4526L5927l7316
1416a4593m7262M5665L8646j1953M8171Q098o9740K7659L9622j9998m2010n7936
1404e5631j9399O2477K52j1076l2485R337P4267q015l7522J4186N4150k8045k4812
1391b316m6633J4657N3387j7276q5127M454M6502L7069P695k4510L0206K32q074
$$ plain form
1481 -9125 -12361 2585 7171 -4601 29062 20686 41396 35902 2709 -618 -12884 -13284 -6638 -32794
1467 -32794 -53862 -58491 -59066 -95887 -48917 -12320 -5569 28429 -1809 -25718 6420 8618 7255
1454 7255 5429 17384 24039 18749 5020 6648 -8944 394 60445 39801 4119 -19787 -48375
1441 -48375 -55212 10794 16255 -13580 2748 26933 31621 10410 -40055 -47376 -40608 -30119 10585
1428 10585 38513 45309 44208 34294 18627 -34687 -80010 -48662 11322 -13204 22723 -14593
1416 -14593 -61855 -16190 22456 10503 58674 66772 -2968 24691 64313 44315 2305 -55631
1404 -55631 -75030 -12553 -12301 -23377 -55862 -46525 27742 19727 -17795 -3609 50541 22496 -2316
1391 -2316 -48949 -34292 19095 1819 -83308 -78854 -32352 4717 12412 -12098 18108 18340 10266
1378A0266J4030m0106j3882K3192L6554j7542r97q626l2038J601l0008P778K5445
1365b4333M046m083J2513K2127k8737j8635J4129L3016o960l2463m1159P3074
1353B535N1719o474m988K723O796j2743j8993k5584j5506Q96J4600l5105J7736
1340b2388K5660k3972j3858J711j6881K7281k452J882k4346J9980j4334L6954
1328d763j0573P624N632k5901k3262m0891N6975Q5695l3060m3174k5871P361L6904
1315g304K8365n2405q471l88O937L8534j6713l5783K6936j2077J052J0338L5677
1302A4698J4690j7474k4447K4685J0105m3656k1979O168j9788K585K1630P628
1290b5155m782p617r045Q250M4413J6181M547k0108m5404k1200K5532K5359K0463
$$ plain form
1378 10266 24296 -15810 -29692 -6500 30054 12512 11515 2889 -29149 -27548 -57556 -49778 -24333
1365 -24333 -20287 -24370 -11857 10270 -18467 -37102 -22973 10043 3083 -29380 -70539 2535
1353 2535 54254 47780 42792 45515 52311 39568 20575 -5009 -20515 -19619 -5019 -40124 -22388
1340 -22388 3272 -20700 -34558 -32847 -49728 -22447 -24899 -23017 -47363 -27383 -41717 -4763
1328 -4763 -15336 -7712 -2080 -27981 -51243 -92134 -35159 50536 17476 -25698 -51569 -44208 -7304
1315 -7304 21061 -31344 -39815 -40203 -33266 5268 -11445 -47228 -20292 -32369 -31317 -20979 14698
1302 14698 29388 11914 -12533 12152 22257 -21399 -43378 -37210 -56998 -54413 -32783 -25155
1290 -25155 -29937 -37554 -46599 -38349 6064 22245 26792 6684 -38720 -59920 -34388 -9029 11434
1277A1434M654k2488n2661L9216O5474l9436m7824O9871K2381p801l5381J1285
1265A8724J8525k0252j8090j023n3552Q811N0996k6422k4776M7014M5482O0903
1253A06340K5522l5248l9176k0337k9575k5912k9628J6445L2199K0233J4598O4974
1241A00435l4890k2045M1410n280J8291R396m3322J0564j334l9438N1796k0185
1229F5398o5944K2239K0196j2251j4014q324l1479j6388M486K5578N496M3206
1217C8199Q454O5k2857j5486L7666l2696N985Q848K6327M0632n9758k576J2970
1204D5773j02760N949N8371j4022M2558O149p8052Q0390J438m6607j032N468j1205
1191g582j1559j6587j9735J9365P830K9567J4765j3369N7060j2767j7450P064
$$ plain form
1277 11434 16088 -6400 -59061 -19845 45629 6193 -41631 28240 50621 42820 7439 18724
1265 18724 37249 16997 -1093 -2116 -55668 -46857 4139 -22283 -47059 -45 45437 106340
1253 106340 131862 96614 57438 37101 7526 -18386 -48014 -31569 630 20863 35461 100435
1241 100435 65545 43500 84910 79630 97921 107317 63995 74559 73225 33787 85583 65398
1229 65398 -546 21693 41889 29638 15624 7300 -24179 -40567 -36081 -10503 -5007 38199
1217 38199 46653 46718 23861 8375 46041 13345 19330 28178 54505 95137 35379 32803 45773
1204 45773 -56987 -51038 7333 -6689 35869 42018 -36034 44356 45794 -813 -1845 3623 -7582
1191 -7582 -19141 -35728 -55463 -36098 -28268 1299 16064 2695 59755 46988 29538 36602
1179C6602j4833R007M1218l9316J2K0999m1349L6543j9884k1021L6641j3537K1459
1166E2541J3746l9344N026n508l1709K7212N2311K239o8267k0676L1901N8333
1154G7805J7895l4374j3091j0667K0111P7p762J6000N223m5086l1752L074q702
1141a1249k2411K86j286J2983l2058m981P6987N9714l9617L4991j3176N395N665
1128G1243k1491K5035k0687m9773j1872M3927M3956Q833Q776k5715l855L8603
1116A06980N2707k796l9853j9154K390J5334n6844l8548M6183N2028p606R282
1104A20103j115k4007k0879R914j2650O581K3372j1009M1110m4781l2053m518
1092E0068K485N714K1841l8688n437M8548o69J8796m3967J2289J3175L3694m6942
$$ plain form
1179 36602 21769 30776 71994 32678 32690 53689 12340 48883 28999 7978 44619 31082 52541
1166 52541 66287 26943 31969 26461 -5248 21964 74275 76514 8247 -12429 19472 77805
1154 77805 95700 61326 48235 37568 57679 57756 49994 65994 71217 26131 -5621 -2547 -11249
1141 -11249 -33660 -33374 -34660 -21677 -53735 -58716 18271 77985 38368 73359 60183 65578 71243
1128 71243 49752 74787 54100 4327 -7545 36382 80338 89171 97947 72232 68377 106980
1116 106980 159687 156891 117038 97884 100274 115608 58764 20216 66399 118427 110821 120103
1104 120103 118988 94981 74102 84016 71366 77947 101319 90310 131420 86639 54586 50068
1092 50068 52553 58267 80108 41420 35983 84531 83862 102658 58691 70980 84155 117849 70907
1079G0907k4021M8036M4167M266j9159m869J2071K1734R721J3497n576m0599M4611
1066A74786j7079L033l7634n4892j395O6029K894k3357M402M7457L1621j3364
1054A82501J4826n183K5372M6458l4391j3870P7939J2026k8584J7409L5968J4609
1042C45080m438K5971J0886l0756j6538M1289L430k8369J2049n116J8289J2369
1030C84146L2323J9749J3473j2817J0141L4337M9951p0050l4212k306L6655L0899
1018D92289r838j5998k8318N4417O6512J3546J8566k789l7067P5201L4704m9087
1006F12138L8882L0516k9535L6959n523L8341J2675O9254M0097m4873M3365L9228
994H81524M6843J2600L2745P559K4279P4130K4861P1980P7599M0189J15401R5933
$$ plain form
1079 70907 46886 94922 139089 143355 124196 119327 131398 153132 162853 176350 170774 130175 174786
1066 174786 157707 160740 123106 68214 66819 132848 135742 112385 116787 164244 195865 182501
1054 182501 197327 192144 217516 263974 229583 215713 293652 305678 277094 294503 330471 345080
1042 345080 340642 366613 377499 346743 330205 371494 374924 346555 358604 353488 371777 384146
1030 384146 416469 436218 449691 436874 447015 481352 531303 461253 427041 424735 461390 492289
1018 492289 482451 466453 438135 492552 559064 572610 591176 588387 551320 626521 661225 612138
1006 612138 651020 681536 652001 688960 683437 721778 734453 803707 843804 798931 842296 881524
994 881524 928367 940967 973712 981271 1005550 1079680 1104541 1176521 1254120 1294309 1409710 1505643
982A505643M4284J13835P9765J12462J54901J20663J22161J09909J44637K11992
972B720252K10166L00249K90744Q7721J13640K47898K61913L80781M40262N41872
962E595498P05247Q42373J020699J287028J617386K340396L307348M547431K220073
953B3483479l691961m959989l282488k218128j659049j217423r23045p41683n62041
944D227672m59949l66113l07965j93537q9864j23251j35771k00378k05950j77161
934A967733j96589j35602q5205j02172p7259o8038o0387n7516o4537k5262p6824
923A018342n2764J7783n3713k8601j8256m4446k1796K6314o0470m7670J1376r9116
911F46983l6804j5668N76k9573j6003j2757J1936l8694J7914n181n8726L785K171
$$ plain form
982 1505643 1549927 1663762 1743527 1855989 2010890 2131553 2253714 2363623 2508260 2720252
972 2720252 2930418 3230667 3521411 3609132 3722772 3970670 4232583 4613364 5053626 5595498
962 5595498 6300745 7143118 8163817 9450845 11068231 13408627 16715975 21263406 23483479
953 23483479 19791518 14831529 11549041 9330913 7671864 6454441 5531396 4789713 4227672
944 4227672 3767723 3401610 3093645 2900108 2810244 2686993 2551222 2350844 2144894 1967733
934 1967733 1771144 1635542 1550337 1448165 1370906 1302868 1242481 1184965 1120428 1095166 1018342
923 1018342 965578 983361 929648 901047 882791 838345 816549 842863 782393 734723 746099 646983
911 646983 610179 594511 595087 565514 549511 536754 548690 509996 527910 522729 464003 467788 469959
898D69959o4535K3384k9379R450J4599j0280o8295j8912l466J8443l1304j5332
886B94332m464n146K5720K2035l2188n3847l8317J659K7531k6254R842O1657j0909
873B71651l1368P520M659k6478Q575k0008J9819j3224l8088J0004K138L669j4079
860A84790l0530J9301L3957Q9l2215k924K1748L3102j8305p7462j0766N8908J1931
847A91624p1452k9941n325M6919N3858k2238l5357j3732K4098m5674L472J7866
835A14118R806l5497m757j7649k0154Q4672j1059k2047r518n61m7176J3841L347
822E7366L0997L0966k0087n0178j3061k618L7275J2972k8402L0414l6314j1268
810C8062J7429k5871L1055K0336r834n409j2407p3269N6423L651K5695k6830m1397
$$ plain form
898 469959 405424 428808 399429 408879 423478 413198 344903 325991 322525 340968 309664 294332
886 294332 289868 284722 310442 332477 300289 246442 208125 209784 237315 211061 220903 282560 271651
873 271651 240283 247803 252462 225984 234559 214551 234370 221146 183058 193062 195200 198869 184790
860 184790 154260 173561 207518 207607 175392 172468 194216 227318 209013 131551 120785 179693 191624
847 191624 120172 90231 84906 131825 185683 163445 128088 114356 138454 92780 96252 114118
835 114118 123924 88427 83670 66021 45867 130539 119480 97433 87915 87354 40178 54019 57366
822 57366 88363 119329 99242 49064 36003 33385 70660 83632 55230 85644 49330 38062
810 38062 55491 29620 60675 81011 71177 65768 53361 -19908 36515 40166 65861 39031 -2366
797b366O8645J293o6153L1401O0651l2489j5985J357k327L099q201r477n2341
784b2893Q317N1088J781n7774K5375k4506J4020L3614m4749p186K0947M3200m895
771C6339k1036j7042k775l1745m7458N3724J7662m406K3514k0854K8749p094P803
758A5381l897l0692P403L4339Q725n4467j1016K5845L0912n5331k7882N5219L4484
745B9023L8411k4018j8327n9588k1306M6901R473m203j0310j2359j7193L8849
733d647J3668k5012M4854k6995k9231K537K6622J2881n3948m9949J6436j8197
721i0981L1200M7386K9412Q072J5473K2271o4898n524M0529n3254k0186K6138
709a4362N601k4373M0217n499K0361j1288n6535n180K3568l230q289p223n767
$$ plain form
797 -2366 66279 67572 1419 32820 93471 60982 44997 46354 44027 47126 38925 29448 -22893
784 -22893 -14576 36512 38293 -19481 5894 -18612 -4592 29022 -15727 -22913 -1966 41234 36339
771 36339 15303 -1739 -4514 -36259 -83717 -29993 -12331 -16737 6777 -14077 14672 7578 15381
758 15381 11484 -19208 -11805 22534 31259 -23208 -34224 -8379 22533 -32798 -60680 -5461 29023
745 29023 67434 43416 25089 -34499 -55805 -8904 569 -3634 -13944 -26303 -43496 -4647
733 -4647 9021 -15991 28863 1868 -27363 -24826 1796 14677 -39271 -89220 -72784 -90981
721 -90981 -59781 -12395 17017 25089 40562 62833 -2065 -7589 32940 -20314 -40500 -14362
709 -14362 -8761 -33134 7083 1584 21945 10657 -45878 -51058 -27490 -30720 -39009 -46232 -51999
696e1999J5839l6836j3482N8135L9896k5358j7038P304P3929J3947l1752O512
684C9097M0738j8209N929j2226K296m4365J3581M7493l2499M6152j9054m6540
672B2393r690k845L2724M6162K7669K672n1022k7500K7056l5239l6783R941J585
659G123p595k0284l6730M9185L941P275L0961j1907l2649N9488L9884R088k3720
646G4060q9629J4686O070j6022k8565n4971L7502P2055J5729n011n6720J3087
634a7729K9010k7498m8480O3304M6024m9680l2422P073L5670k3468k4263M8619
622F160k1304k1427M689j1835L5956J8642m1019p675O325L8529l5551k8930J5605
609d1835L057l0844j598n548M405J0208J0529K5699J0646R156q201K8475J8255
$$ plain form
696 -51999 -36160 -72996 -86478 -28343 11553 -13805 -30843 -23539 50390 64337 32585 39097
684 39097 79835 61626 67555 55329 57625 13260 26841 74334 41835 87987 68933 22393
672 22393 12703 9858 42582 88744 116413 119085 68063 40563 67619 32380 -4403 5538 7123
659 7123 -472 -20756 -57486 -8301 -4360 2915 33876 21969 -10680 48808 88692 97780 74060
646 74060 -15569 -883 5187 -10835 -39400 -94371 -56869 15186 30915 25904 -30816 -17729
634 -17729 11281 -16217 -64697 -1393 44631 -5049 -37471 -30398 5272 -18196 -42459 6160
622 6160 -15144 -36571 -31882 -43717 -7761 10881 -30138 -37813 -31488 7041 -28510 -57440 -41835
609 -41835 -38778 -69622 -71220 -76768 -72363 -62155 -51626 -25927 -15281 -6125 -14326 14149 32404
596C2404j0480j6027k5607k8110J085P812l7653J3345k7199L7912j7865j6462
584h6845K8012l6184O2920K1312j5900q143J7733j1511j126M473m858k7927Q421
571d9623P0764j4943n288l5108m1606N6020l7454J1869j7618K0075q481K7769
559b3624K5896j1143l0191J6386Q8559l5953o4757Q161J9050J1042k5976P23J0454
546a1373N5964j4848n9484R261l0602K8742M4359k7959j8629l4008M1106P25K0903
533D157j8724m571M07l4226L2586L0542j808j2817k5635r42N99k1918J9871L4771
519B292m20K6218k909n9868P372J4974o313k7652n48n770L4586J9503L3195l9313
505d653k8430K7018J1494k5997K4806j6130j480j1205j6026k1970L3524J0320
$$ plain form
596 32404 21924 5897 -19710 -47820 -46735 -38923 -76576 -63231 -90430 -52518 -70383 -86845
584 -86845 -58833 -95017 -32097 -10785 -26685 -34828 -17095 -28606 -29732 -25259 -30117 -58044 -49623
571 -49623 21141 6198 910 -34198 -75804 -19784 -57238 -45369 -62987 -42912 -51393 -23624
559 -23624 2272 -8871 -39062 -22676 65883 29930 -34827 -26666 -7616 3426 -22550 -21827 -11373
546 -11373 44591 29743 -29741 -20480 -51082 -22340 22019 -5940 -24569 -58577 -17471 -16746 4157
533 4157 -14567 -19138 -18731 -52957 -20371 10171 8363 -4454 -30089 -31031 -30432 -52350 -32479 2292
519 2292 1872 28090 25181 -34687 -27315 -12341 -18654 -46306 -46854 -52624 -18038 1465 34660 -4653
505 -4653 -33083 -6065 5429 -20568 4238 -11892 -13372 -24577 -40603 -62573 -29049 -18729
493a8729J1967j8360m7447K9459j6465L880K4900P67O938R948K8487l6041l260
480b3956r537J9610j064l4210M7617j1345m4680j1257K4316J2275k7567j741N3501
467h038K910k1013j5178N20k2307J8719k937k3947K2539M4803L4256J9407l1381
454A8353K518n5387l926K6673J1320k5075j1145M5285k7238l2469j6897K4369
442d3619M0876P270p0664J7649L937O230L9940l3212k2910L6266k2459K4181n0852
429f7367Q733N6159k4757P197r632L5370J4695l4023k6539J3737J53L2424R570
416A5720k8079r856K389R837j2213N44j985q290K0983n1628K1062K6010k9985
403d5491M5539n434j4624p452P323j3025j0046K5124J1416k4441j5372K3015k0327
$$ plain form
493 -18729 -6762 -25122 -72569 -43110 -59575 -55695 -30795 -30028 -23090 -13142 15345 -20696 -23956
480 -23956 -33493 -13883 -14947 -49157 -1540 -12885 -57565 -68822 -44506 -32231 -59798 -61539 -8038
467 -8038 -5128 -26141 -41319 -40799 -63106 -44387 -47324 -71271 -48732 -3929 30327 49734 18353
454 18353 20871 -34516 -38442 -11769 -449 -25524 -36669 8616 -18622 -51091 -67988 -43619
442 -43619 -2743 4527 -66137 -48488 -44551 -38321 1619 -31593 -54503 -18237 -40696 -16515 -67367
429 -67367 -58634 -2475 -27232 -20035 -29667 5703 20398 -13625 -40164 -26427 -26274 6150 15720
416 15720 -12359 -22215 -19826 -9989 -22202 -21658 -23643 -31933 -10950 -62578 -41516 -15506 -45491
403 -45491 48 -5386 -20010 -27462 -20139 -33164 -43210 -18086 -6670 -31111 -46483 -23468 -43795
390d3795P496J9698K4730l8873j6021O7633K5349k5010k5353p082K3985o769N6882
377F2870j6620n0127l3061k9766L5760N7149j4657m9366J3429n695K832n519k6180
364e8951M7074J9049j3163J420J38l5537K8460N1447n1242j9307k9q044M7831
351I146K2112k3375N432J704L4660k8381n9202K990O140j1337k8474L983O3700
338i02J9178j1966J0546j0283o3237l19J9884N304k8308J3688q702L8133K1509
325D525l9458m7358J3784M2606K5093r2635O2983M2660l9969l284k1008L8650
313a3411k208j1646q6488J3965L2240j3422O155n009n62K8206J6636K3192K5062
300A2710m9024o441M225J2970J9523J7192j1044J9189N709l8464P589j2327J1580
$$ plain form
390 -43795 -36299 -16601 8129 -30744 -46765 20868 46217 21207 -4146 -11228 12757 5988 62870
377 62870 46250 -3877 -36938 -66704 -30944 26205 11548 -37818 -24389 -30084 -27252 -32771 -58951
364 -58951 -11877 7172 -5991 -4571 -4433 -39970 -11510 39937 -11305 -30612 -30641 -38685 9146
351 9146 31258 7883 13315 15019 49679 21298 -37904 -34914 -28774 -40111 -68585 -64602 -902
338 -902 18276 6310 16856 6573 -56664 -56983 -37099 -31795 -60103 -46415 -55117 -16984 4525
325 4525 -34933 -82291 -68507 -25901 -808 -93443 -30460 12200 -27769 -31053 -52061 -13411
313 -13411 -15619 -27265 -113753 -99788 -67548 -80970 -74815 -79824 -80386 -52180 -35544 -12352 12710
300 12710 -36314 -42755 -38530 -25560 -6037 11155 111 19300 25009 -13455 -5866 -18193 -6613
287f613J0295l137l4274M1420k5410r466L792J0345K508j6189j4930M2228M6195
274D6764o9585n2966J2528K8921m171k289L4850k8274l222O5167j7369m7595N1039
261A3798k2998m2746J0893l3522j5623K4309j4145M8166q373j6124L3481l9947
249f2831M8367J7434r2270M4578p65K4886R84l1001m1622J8321M6094l517l7382
236f8724k7509L0390O3151l6465l0472L4498K55R7175m5552l1696J806o9602j0475
223i3220N1264j7564K3610L2370p1469n43J6488j0303K2816k3076J7527j6130
211f8230Q810K0546L9415m817j3560k7889j3140O611L1721l6065M8762K3379n3209
198c7666K0694L27k754K8550j1272l447k9961J2675K4650K587k8415k3575J0328
$$ plain form
287 -6613 3682 545 -33729 7691 -17719 -27185 -23393 -13048 -10540 -26729 -41659 569 46764
274 46764 -22821 -75787 -63259 -34338 -38509 -40798 -5948 -34222 -37444 27723 10354 -37241 13798
261 13798 -9200 -51946 -41053 -74575 -90198 -65889 -80034 -31868 -40241 -56365 -22884 -62831
249 -62831 -14464 2970 -89300 -44722 -45487 -20601 -19617 -50618 -92240 -73919 -27825 -31342 -68724
236 -68724 -96233 -65843 -2692 -39157 -69629 -35131 -34876 62299 16747 -14949 -13143 -82745 -93220
223 -93220 -41956 -59520 -35910 -3540 -75009 -75552 -59064 -69367 -46551 -69627 -52100 -68230
211 -68230 -59420 -38874 541 -4276 -17836 -45725 -58865 -52254 -20533 -56598 -7836 15543 -37666
198 -37666 -16972 -16645 -19399 9151 -2121 -5568 -35529 -22854 1796 4383 -24032 -47607 -37279
185c7279R873J11P651J5438j0225j8034j858k5402l3482K6807K6256M3904N2184
172E5944k9874n7466J9121k004o4530L1453J126P884M4365k9073J2791m6462K1069
159c5656L5111P491m3885k310K7841J3323m7113K7159m84k5982o277J5249K1254
146a4279q995j3347O472j4192l029K6373Q841k1168m9427r923p329K3792N2063
133b4148k2978k0260R459L469J1257n4516N31K1214k7703l8640M0574N1770M821
120d5150K3845j5057m6545J6204L4886l3554k4800J2657k224O608o275K7918K8839
107b2648k3556J3349Q981k9530r293K4482L5165J8952l3385j1486l5147o324J6309
94e4131L86K8216l0451J402K2156k4531J0333M015M541k547j3230L944P499L9661
$$ plain form
185 -37279 -27406 -27295 -19644 -4206 -14431 -32465 -34323 -59725 -93207 -66400 -40144 3760 55944
172 55944 26070 -31396 -12275 -14279 -78809 -47356 -46230 -38346 6019 -23054 -10263 -56725 -35656
159 -35656 -545 6946 -36939 -39249 -11408 1915 -45198 -18039 -18523 -44505 -50782 -35533 -14279
146 -14279 -23274 -36621 -30149 -44341 -47370 -20997 -12156 -33324 -82751 -92674 -100003 -76211 -24148
133 -24148 -47126 -67386 -57927 -54458 -43201 -97717 -97186 -75972 -103675 -142315 -101741 -49971 -45150
120 -45150 -21305 -36362 -82907 -66703 -31817 -65371 -90171 -77514 -79738 -73130 -79405 -51487 -22648
107 -22648 -46204 -32855 -23874 -53404 -62697 -38215 -3050 15902 -17483 -28969 -64116 -70440 -54131
94 -54131 -53745 -25529 -55980 -54578 -32422 -56953 -46620 -42605 -38064 -40611 -53841 -49897 -42398 -2737
80b737r44n1188l0741j181k616K3661J2647l597n643j9427J0653L1273m8528O257
66h2111K7697J0418q689l2954J1203n364K0159Q846N462L4742J0006l2775n5326
53h8686L724N2827K3806n380j990m058N253l6499k357l3577l834M0025J6296j5133
39d9583L280L7621j1930j1621m6380Q845j013J5239K3570p172m6693K1234L1405
26c3198l7631K5655j0534p971N882j4781K339J240J0270O388j0625l0916K5081
13f8801J879Q931K0660j5984j3909R840M0316j046l2915m5251K2531J9495J853
0e2401
$$ plain form
80 -2737 -3681 -54869 -85610 -86791 -89407 -65746 -53099 -56696 -62339 -81766 -71113 -39840 -88368 -82111
66 -82111 -54414 -43996 -52685 -85639 -74436 -79800 -59641 -50795 -45333 -10591 -585 -33360 -88686
53 -88686 -84962 -32135 -8329 -13709 -15699 -19757 -14504 -51003 -53360 -86937 -90771 -50746 -34450 -49583
39 -49583 -46303 -8682 -20612 -32233 -78613 -69768 -70781 -55542 -31972 -39144 -85837 -64603 -33198
26 -33198 -70829 -45174 -55708 -63679 -57797 -72578 -70239 -68999 -58729 -52341 -62966 -93882 -68801
13 -68801 -66922 -57991 -37331 -53315 -67224 -57384 -17068 -18114 -51029 -96280 -73749 -54254 -52401
0 -52401
$$ Imaginary data points
##PAGE= N=2
##DATA TABLE= (X++(I..I)), XYDATA
16383h11803j0931J5170P6322l1797r909O2832L8236K4117k5227J1546K8356j2998
16371f46086R934K8141M4704J2657j7739M2874L3779K7006r297l2506K0848K6955
16359d58730J9367J07M5866J4737j1513p103R446j1856K4246M2311r080M8900
16347b93302M465p511J9613J5981N6L6878p647J241K1438m760j978K6583J3117
16334a75826K008J3339R439O601L7432L7236k208k2667o982K8469J0958L0703
16322c1498P043J312M2925K0925J307R493j6630L3055N1012j2288J6160P3J4751
16309A37640L6289k4009p414M4473J0651J3330n98K0147K0541J5217r142j428
16297B55697J3464J7561O740J0789L8732j3224o317K6511K8728J6953o410L82
$$ plain form
16383 -811803 -822734 -807564 -731242 -763039 -772948 -710116 -671880 -647763 -672990 -661444 -633088 -646086
16371 -646086 -636152 -608011 -563307 -550650 -568389 -525515 -491736 -464730 -474027 -506533 -485685 -458730
16359 -458730 -439363 -439256 -393390 -378653 -390166 -397269 -387823 -399679 -375433 -333122 -342202 -293302
16347 -293302 -288837 -296348 -276735 -260754 -260698 -223820 -231467 -230226 -208788 -213548 -215526 -188943 -175826
16334 -175826 -173818 -160479 -151040 -144439 -107007 -69771 -71979 -94646 -101628 -73159 -62201 -31498
16322 -31498 -24455 -23143 19782 40707 42014 51507 34877 67932 118944 106656 122816 122889 137640
16309 137640 173929 149920 142506 186979 197630 210960 210362 230509 251050 266267 257125 255697
16297 255697 269161 286722 293462 304251 342983 329759 323442 349953 378681 395634 389224 389606
16285C89606K9931K6184k1567m9013K7422O2405j4537J3145Q675J3072J2263j3812
16273D83774L1000J7678O067k3631m359K5520K2828J2315K2627J31m564j289K0541
16260F08638l4370j3873N6373L9540j6800J2630L0667K4278j4478J1930J7879
16249G22414l0923k2349L3825K2701R711j8556N6005M0546k2228p846m5463j3828
16237G24009O9371K5818m6652k7006N5493L7884K1797j773j4105K0206j780P709
16225H70971J7474j2308K3089M4460j747L4479n2304n2123M4505J8470k4777L8430
16213I48619k4139L9462M0783k3836J2447l4600J3119j862k6500O5788K7494N534
16201A042309K4287q875k4591N1172l7150j4330K1354q842l0324J3937k7875P582
$$ plain form
16285 389606 419537 445721 424154 375141 402563 464968 450431 463576 472251 485323 497586 483774
16273 483774 514774 532452 538519 514888 510529 536049 558877 571192 593819 593950 589386 588097 608638
16260 608638 574268 560395 616768 656308 639508 652138 682805 707083 692605 704535 722414
16249 722414 691491 669142 702967 725668 735379 716823 772828 813374 791146 783300 737837 724009
16237 724009 793380 819198 772546 745540 801033 838917 860714 858941 844836 865042 863262 870971
16225 870971 888445 876137 899226 943686 941939 976418 924114 871991 916496 934966 910189 948619
16213 948619 924480 963942 1004725 980889 993336 958736 971855 969993 943493 1009281 1036775 1042309
16201 1042309 1066596 1057721 1033130 1084302 1047152 1032822 1054176 1045334 1015010 1028947 1001072 1008654
16189A008654O1484L2321k5130k0418K2324J5183K9627m326j9077m7587J8611
16178A071666L6666k1682n3572O4085M7053N3852l3287j1597K1389J293j84k6777
16166A148905l095k6200J2291P766K473J8069l691J8923M7855k1195k141L033
16154A202993k4129N906R913R000N856K7655J5717l5964l4063r020K6759L0573
16142A231196o1482L5751K8438j5485j0684j4782L039j1104J0128J8859j3938
16131A199936r273Q111J888N1802K5074n8976L3449m258m8499P828K3051O6963
16119A297096L5638k6416p0763R77j6825J97M9589L8267M42j7479j8132P5467
16107A348058J2146l2054P392m4798R067Q0m7739j1114j255m019M7874m907j0453
$$ plain form
16189 1008654 1070138 1102459 1077329 1056911 1079235 1094418 1124045 1119719 1100642 1053055 1071666
16178 1071666 1108332 1086650 1033078 1097163 1144216 1198068 1164781 1153184 1174573 1175866 1175682 1148905
16166 1148905 1145810 1119610 1131901 1139667 1142140 1160209 1156518 1175441 1223296 1202101 1199960 1202993
16154 1202993 1178864 1184770 1194683 1203683 1209539 1237194 1252911 1216947 1182884 1173864 1200623 1231196
16142 1231196 1169714 1205465 1233903 1218418 1207734 1192952 1195991 1184887 1195015 1213874 1199936
16131 1199936 1190663 1198774 1200662 1252464 1277538 1218562 1252011 1247753 1199254 1207082 1230133 1297096
16119 1297096 1332734 1306318 1235555 1236532 1219707 1219904 1269493 1307760 1308202 1290723 1272591 1348058
16107 1348058 1360204 1328150 1335542 1290744 1299811 1299891 1252152 1241038 1239783 1235764 1283638 1278731 1268278
$$ [...]
##END NTUPLES=NMR SPECTRUM
##END=
