##TITLE=1H_CA-8802-4
 CDCl3, 8 sc, 
 28.12.2020
##JCAMPDX= 6.0         $$ Bruker NMR JCAMP-DX V2.0
##DATA TYPE= NMR SPECTRUM
##DATA CLASS= NTUPLES
##ORIGIN= UXNMR, Bruker Analytische Messtechnik GmbH
##OWNER= root
$$ XWIN-NMR		Version 3.5
$$ Mon Dec 28 11:57:02 2020 Russian Standard Time (UT+4h)  she@DPX200
##.OBSERVE FREQUENCY= 200.1315066352
##.OBSERVE NUCLEUS= ^1H
##.ACQUISITION MODE= SIMULTANEOUS
##.ACQUISITION SCHEME= undefined
##.AVERAGES= 8
##.DIGITISER RES= 18
##SPECTROMETER/DATA SYSTEM= spect
##.PULSE SEQUENCE= zg30
##.SOLVENT NAME= CDCl3
##.SHIFT REFERENCE= (INTERNAL, CDCl3, 0, 15.9916)
##AUDIT TRAIL= $$ (NUMBER, WHEN, WHO, WHERE, WHAT)
$$ ##TITLE= Audit trail, XWIN-NMR		Version 3.5
$$ ##JCAMPDX= 5.01
$$ ##ORIGIN= Bruker BioSpin GmbH
$$ ##OWNER= she
$$ F:/spectra/data/she/nmr/H-F/1/pdata/1/auditp.txt
$$ ##AUDIT TRAIL=  $$ (NUMBER, WHEN, WHO, WHERE, WHAT)
(   1,<2020-12-28 11:56:02.18 +0400>,<she>,<DPX200>,
      <created by zg, POWCHK disabled, PULCHK disabled
       configuration hash MD5:
       00 E9 B6 7A A2 85 ED C7 34 08 36 98 17 FE 4E 26
       data hash MD5: 16K
       40 2E 5B D0 9B 6A 60 59 48 E0 D7 0F 4C 37 A4 6F>)
(   2,<2020-12-28 11:56:05.90 +0400>,<she>,<DPX200>,
      <Start of raw data processing
       efp BC_mod = 2 LB = 0.24 FT_mod = 6 PKNL = 1 PHC0 = -10757.95 PHC1 = 8.200953 SI = 16K 
       data hash MD5: 16K
       AD CE 87 26 FB AE E5 4F A7 67 01 37 EA B5 9B 01>)
(   3,<2020-12-28 11:56:23.43 +0400>,<she>,<DPX200>,
      <pk PHC0 = -1.050991 PHC1 = -0.7999998 
       data hash MD5: 16K
       B8 5B 1A 98 1A DB 14 2D CB 2E F6 BC 85 BB 1C C3>)
(   4,<2020-12-28 11:56:26.60 +0400>,<she>,<DPX200>,
      <abs ABSG = 5 
       data hash MD5: 16K
       A2 3C 8E 4F AB 7B 22 93 C3 1B 61 8F 60 43 2F D2>)
$$ ##END=
$$ 
$$ hash MD5
$$ 17 B4 45 84 67 53 BF 26 80 39 0A A7 C6 1C B4 0B
##$RELAX= 
##$RELAX= 
##$RELAX= 
##$RELAX= 
##$RELAX= 
##$RELAX= 
$$ Bruker specific parameters
$$ --------------------------
##$DU= <F:/spectra>
##$EXPNO= 1
##$NAME= <H-F>
##$PROCNO= 1
##$TYPE= <nmr>
##$USER= <she>
##$AMP= (0..31)
100 100 100 100 100 100 100 100 100 100 100 100 100 100 100 100 100 100 
100 100 100 100 100 100 100 100 100 100 100 100 100 100 
##$AQSEQ= 0
##$AQ_mod= 1
##$AUNM= <au_zg>
##$AUTOPOS= <>
##$BF1= 200.13
##$BF2= 200.13
##$BF3= 200.13
##$BF4= 200.13
##$BF5= 200.13
##$BF6= 200.13
##$BF7= 200.13
##$BF8= 200.13
##$BYTORDA= 1
##$CFDGTYP= 0
##$CFRGTYP= 5
##$CHEMSTR= <none>
##$CNST= (0..31)
1 1 145 1 1 1 1 1 1 1 1 1 1 1 1 1 1 1 1 1 1 1 1 1 1 1 1 1 1 1 1 1 
##$CPDPRG= <>
##$CPDPRG1= <>
##$CPDPRG2= <>
##$CPDPRG3= <>
##$CPDPRG4= <mlev>
##$CPDPRG5= <mlev>
##$CPDPRG6= <mlev>
##$CPDPRG7= <mlev>
##$CPDPRG8= <mlev>
##$CPDPRGB= <>
##$CPDPRGT= <>
##$D= (0..31)
0 1.2 0 0 0 0 0 0 0 0.06 0 0.03 0 0 0 0 0.0002 0 0 0 0 0 0 0 0 0 0 0 0 
0 0 0 
##$DATE= 1609142161
##$DBL= (0..7)
120 120 120 120 120 120 120 120 
##$DBP= (0..7)
150 150 150 150 150 150 150 150 
##$DBP07= 0
##$DBPNAM0= <>
##$DBPNAM1= <>
##$DBPNAM2= <>
##$DBPNAM3= <>
$$ [...]
##$SUBNAM3= <"">
##$SUBNAM4= <"">
##$SUBNAM5= <"">
##$SUBNAM6= <"">
##$SUBNAM7= <"">
##$SUBNAM8= <"">
##$SUBNAM9= <"">
##$SW= 16.9725356469052
##$SWIBOX= (0..15)
0 0 2 0 0 0 0 0 0 0 0 0 0 0 0 0 
##$SW_h= 3396.73913043478
##$TD= 16384
##$TD0= 1
##$TE= 0
##$TE2= 300
##$TE3= 300
##$TEG= 300
##$TL= (0..7)
0 120 120 120 120 120 120 120 
##$TP= (0..7)
150 150 150 150 150 150 150 150 
##$TP07= 0
##$TPNAME0= <>
##$TPNAME1= <>
##$TPNAME2= <>
##$TPNAME3= <>
##$TPNAME4= <>
##$TPNAME5= <>
##$TPNAME6= <>
##$TPNAME7= <>
##$TPOAL= (0..7)
0.5 0.5 0.5 0.5 0.5 0.5 0.5 0.5 
##$TPOFFS= (0..7)
0 0 0 0 0 0 0 0 
##$TUNHIN= 0
##$TUNHOUT= 0
##$TUNXOUT= 0
##$USERA1= <user>
##$USERA2= <user>
##$USERA3= <user>
##$USERA4= <user>
##$USERA5= <user>
##$V9= 5
##$VALIST= <valist>
##$VCLIST= <CCCCCCCCCCCCCCC>
##$VD= 0
##$VDLIST= <DDDDDDDDDDDDDDD>
##$VPLIST= <PPPPPPPPPPPPPPP>
##$VTLIST= <TTTTTTTTTTTTTTT>
##$WBST= 1024
##$WBSW= 4
##$XGAIN= (0..3)
0 0 0 0 
##$XL= 0
##$YL= 0
##$YMAX_a= 396729
##$YMIN_a= -169303
##$ZGOPTNS= <>
##$ZL1= 120
##$ZL2= 120
##$ZL3= 120
##$ZL4= 120
##$ABSF1= 15.98335
##$ABSF2= -0.9893122
##$ABSG= 5
##$ABSL= 3
##$ALPHA= 0
##$AQORDER= 0
##$ASSFAC= 0
##$ASSFACI= 0
##$ASSFACX= 0
##$ASSWID= 0
##$AUNMP= <proc_1d>
##$AZFE= 0.1
##$AZFW= 0.1
##$BCFW= 0
##$BC_mod= 2
##$BYTORDP= 0
##$COROFFS= 0
##$CY= -3
##$DATMOD= 1
##$DC= 0
##$DFILT= <>
##$DTYPP= 0
##$F1P= 0
##$F2P= 0
##$FCOR= 1
##$FTSIZE= 16384
##$FT_mod= 6
##$GAMMA= 0
##$GB= 0
##$INTBC= 1
##$INTSCL= 2.992141e-10
##$ISEN= 128
##$LB= 0.24
##$LEV0= 0
##$LPBIN= 0
##$MAXI= 10000
##$MC2= 0
##$MEAN= 0
##$ME_mod= 0
##$MI= 1.114404
##$NCOEF= 0
##$NC_proc= -7
##$NLEV= 6
##$NOISF1= 3.799351
##$NOISF2= 2.8
##$NSP= 0
##$NTH_PI= 0
##$NZP= 0
##$OFFSET= 15.99164
##$PC= 1
##$PHC0= -10759
##$PHC1= 7.400953
##$PH_mod= 1
##$PKNL= yes
##$PPARMOD= 0
##$PSCAL= 0
##$PSIGN= 0
##$REVERSE= no
##$SF= 200.130004597706
##$SI= 16384
##$SIGF1= 3
##$SIGF2= 2
##$SINO= 5.538805
##$SIOLD= 16384
##$SREGLST= <1H.CDCl3>
##$SSB= 0
##$STSI= 16384
##$STSR= 0
##$SW_p= 3396.73913043478
##$SYMM= 0
##$S_DEV= 0
##$TDeff= 16384
##$TDoff= 0
##$TI= <>
##$TILT= no
##$TM1= 0
##$TM2= 0
##$TOPLEV= 0
##$USERP1= <user>
##$USERP2= <user>
##$USERP3= <user>
##$USERP4= <user>
##$USERP5= <user>
##$WDW= 1
##$XDIM= 16384
##$YMAX_p= 412783341
##$YMIN_p= -640592
$$ End of Bruker specific parameters
$$ ---------------------------------
##NTUPLES= NMR SPECTRUM
##VAR_NAME=  FREQUENCY,     SPECTRUM/REAL,   SPECTRUM/IMAG
##SYMBOL=    X,             R,               I
##VAR_TYPE=  INDEPENDENT,   DEPENDENT,       DEPENDENT
##VAR_FORM=  AFFN,          ASDF,            ASDF
##VAR_DIM=   16384,         16384,           16384
##UNITS=     HZ,            ARBITRARY UNITS, ARBITRARY UNITS
##FACTOR=    0.207333158178281, 1,           1
##FIRST=     3200.40700492516, 0,            0
##LAST=      -196.332125509621, 0,           0
##MIN=       -196.332125509621, -640592,     0
##MAX=       3200.40700492516, 412783341,    0
$$ Real data points
##PAGE= N=1
##DATA TABLE= (X++(R..R)), XYDATA
$$ [...]
5947E791902m27725m57737l75762m63220l50813j65391k14938k67301n1890J9553
5937C036678k19356j36769j49896Q2384j1279o4057j25733Q6967k34300q9493
5927B175146L4945Q4681m0728j26773m4494j1243J29581j07005P6020j64313O5200
5916B071017O933N9093O9445k8979q6242j65318K5833K3329m8602M739J33526
5905B064774n6808q6511j64642J07632J15776j21039l4148P2587j988j41469m8911
5894A705253N8361o431j70522j31423M5140O5863J45087m4590j62704Q0328J41792
5883A726154m7457O6947J37433j63910j58430l9956R4439J13681j02174o3555
5873A563172J48649K02478j19402l32465P0007m171j38857L1306J17953M9985
$$ plain form
5947 5791902 5364177 4906440 4530678 4067458 3716645 3551254 3336316 3069015 3017125 3036678
5937 3036678 2817322 2680553 2530657 2613041 2601762 2537705 2411972 2498939 2264639 2175146
5927 2175146 2210091 2294772 2254044 2127271 2082777 2071534 2201115 2094110 2170130 2005817 2071017
5916 2071017 2077950 2137043 2206488 2177509 2091267 1925949 1951782 1975111 1926509 1931248 2064774
5905 2064774 2007966 1921455 1756813 1864445 1980221 1859182 1825034 1897621 1895633 1754164 1705253
5894 1705253 1763614 1757183 1586661 1455238 1500378 1566241 1711328 1666738 1504034 1584362 1726154
5883 1726154 1678697 1745644 1883077 1719167 1560737 1520781 1615220 1728901 1626727 1563172
5873 1563172 1711821 1914299 1794897 1462432 1532439 1528268 1389411 1420717 1538670 1588655
5863A588655J1974O9862k08485r605J31006O1317j05507r0752K43905j47314m9490
5852A495566K19969J44885j47513o5561j2252Q5602J96040n8187j20632j46968
5842A590949J03461J61910J0596j68800j58882J48303j9488O5023J12168q1574
5832A763666j11390R1350L320k5179L3857J35571Q8504n9325k65126j51390K27362
5821A731220j4674n1213j59596K61628J26069o6024j60567j58102J75027O3492
5811A747260j0855j10097k6931J21540R1814l4411k8837O2247j4286j36351J32206
5800A793299M6999J02707K9121q4922j1833J65937k36312q7820k9127O2282J61797
5789A912128l2324R6221q7535J00781m6792J26565K1864K790r1690J14105L72420
$$ plain form
5863 1588655 1600629 1670491 1462006 1452401 1583407 1644724 1539217 1448465 1692370 1545056 1495566
5852 1495566 1715535 1860420 1712907 1647346 1635094 1720696 1916736 1858549 1737917 1590949
5842 1590949 1694410 1856320 1866916 1698116 1539234 1687537 1668049 1733072 1845240 1763666
5832 1763666 1652276 1743626 1746946 1721767 1755624 1891195 1979699 1920374 1655248 1503858 1731220
5821 1731220 1716546 1665333 1505737 1767365 1893434 1827410 1666843 1508741 1683768 1747260
5811 1747260 1736405 1626308 1599377 1720917 1812731 1778320 1749483 1811730 1797444 1661093 1793299
5800 1793299 1840298 1943005 1972126 1887204 1875371 2041308 1804996 1717176 1688049 1750331 1912128
5789 1912128 1879804 1976025 1888490 1989271 1942479 2069044 2090908 2093698 2002008 2116113 2488533
5778B488533K0686k1026N6466j0336M8552K357K5618K20018Q4184L2011J00067
5767C047130O2256q2782l1155J02413K20387J46612M1541J39785J6024q8142J51165
5756C725234J99772J1186o2257O6733P6286j74739j01026k57696K4641J72750
5746C680884N386P6462J04584Q5476O9032N6069j614P3284k88177k03062O8811
5735C727135o468j06038j1913K66175P1269R8143K14835J33941J5844j13479q7667
5724D201777k14090j70141p0254l8475K3708O2251j68288K04419K58684J54927
5714D244518K13076P3496n5072M0701l3730k98329M8928o9501j87107j61299p309
5703C808372n8554Q5053J21147r3604r4960j750n9728k82267Q0040p2705j41333
$$ plain form
5778 2488533 2509219 2488193 2544659 2534323 2582875 2585232 2610850 2830868 2915052 2947063 3047130
5767 3047130 3109386 3026604 2995449 3097862 3318249 3464861 3506402 3646187 3662211 3574069 3725234
5756 3725234 3925006 3936192 3873935 3940668 4016954 3842215 3741189 3483493 3508134 3680884
5746 3680884 3686270 3762732 3867316 3952792 4021824 4077893 4076279 4149563 3861386 3658324 3727135
5735 3727135 3720667 3614629 3602716 3868891 3940160 4038303 4253138 4387079 4402923 4289444 4201777
5724 4201777 3987687 3817546 3747292 3708817 3732525 3794776 3626488 3830907 4089591 4244518
5714 4244518 4457594 4531090 4476018 4516719 4482989 4184660 4233588 4164087 3976980 3815681 3808372
5703 3808372 3749818 3834871 3956018 3862414 3767454 3765704 3705976 3423709 3503749 3431044 3289711
5692C289711k22612J92720K85559O4234M4009j36258L6163J40836L623j81433
5682C516552Q9509j28798k83671j91113J57135r7540r5864J5582j77973o312K3430
5671B820937J05924P7901j81818j27989K9400n9326j21280N7768j41750m03986
5661B055781j14783J11368n9384J2254j62678R9242K1839P7134K1681r9791M7288
5650B009951P2601j05509J0373J11717n9397J5437n5463j07271K49822K3034k93462
5639A871833j61409J04330J34889j13291l5412l0095R7687k2143J47525l338p3374
5628A917202k04776r4072J13973J9500j9477O0445o7399j4555r7179j3586M4664
5617A644740J07648J97082N0732L4734N3899p7570j11824J10269L5370J58040
$$ plain form
5692 3289711 3067099 3259819 3545378 3609612 3653621 3517363 3553526 3694362 3697985 3516552
5682 3516552 3606061 3477263 3193592 3002479 3159614 3062074 2966210 2981792 2803819 2797507 2820937
5671 2820937 2926861 3004762 2822944 2694955 2724355 2665029 2543749 2601517 2459767 2055781
5661 2055781 1940998 2052366 1992982 2005236 1842558 1941800 1963639 2040773 2062454 1962663 2009951
5650 2009951 2082552 1977043 1987416 2099133 2039736 2055173 1999710 1892439 2142261 2165295 1871833
5639 1871833 1710424 1814754 1949643 1836352 1800940 1770845 1868532 1846389 1993914 1990576 1917202
5628 1917202 1712426 1618354 1732327 1751827 1732350 1792795 1725396 1710841 1613662 1600076 1644740
5617 1644740 1752388 1949470 2000202 2034936 2088835 2011265 1899441 2009710 2045080 2203120
5607B203120J795k26134J03036R8245M8686j75631K1602J44042J37077k12249
5597B143589l9782J87045j00709r7023Q110l6766J32088r391j7491j23154P5290
5586B121806J53270j31622K3920q7768r5929Q8781J87808k3927k49323M9774k9435
5575B007355R3249Q7374q2767j33680n8481J63167J44811m6563j41100J50423
5565B183788J35588n1716J11642M2571J48956L983J03281r8854j15719N3391r786
5554B507125k33702k59540L9966o4831J25129p4525L8914N0807R4598q6691k6036
5543B111214L7210J92818j17090k00235k50379K47048l2627j93080q248K01334
5533A987965K39385k4708j31546J1345Q5687J04675O6412K5779o1284o2438Q811
$$ plain form
5607 2203120 2204915 1978781 2081817 2180062 2228748 2053117 2074719 2218761 2355838 2143589
5597 2143589 2103807 2290852 2190143 2093120 2101230 2064464 2196552 2187161 2169670 2046516 2121806
5586 2121806 2275076 2143454 2167374 2079606 1983677 2072458 2260266 2236339 1987016 2036790 2007355
5575 2007355 2100604 2187978 2105211 1971531 1913050 2076217 2221028 2174465 2033365 2183788
5565 2183788 2319376 2267660 2379302 2421873 2570829 2574812 2678093 2579239 2463520 2516911 2507125
5554 2507125 2273423 2013883 2053849 1989018 2114147 2039622 2078536 2129343 2223941 2137250 2111214
5543 2111214 2148424 2341242 2224152 2023917 1773538 2020586 1987959 1794879 1786631 1987965
5533 1987965 2227350 2202642 2071096 2082441 2168128 2272803 2339215 2364994 2303710 2241272 2250083
5522B250083O8037m0493L6575j1759j01466n314L5347l6100k53630j96864pK25810
5510A970219o8010R845p9173l5412Q6043q681O1116Q617R2686K7297j3965M6711
5498B097293j83505p2640l6242J00527L4887j64534J54302J23996m7851K41442
5488B247675k46477l008J77967q9332k75828j33165J82528J50408p7005m5370
5478A888393K01125O9054k7751j69859J16672j2703M0675j4403j61547j01792
5468A827864J64898J29304j76317j31320K41071Q9677O0538L6653r6887J24461
5458B269942j1071o9673j8962J39232j63236l70314O3540K74247k3826j14600
5448A975279m7593J99347J49005j29938j3681J22068l7760L4971J31273n9022
$$ plain form
5522 2250083 2318120 2277627 2314202 2302443 2200977 2195663 2231010 2194910 1941280 1744416 1744409 1970219
5510 1970219 1902209 1912054 1832881 1797469 1883512 1874831 1935947 1944564 2037250 2064547 2050582 2097293
5498 2097293 1913788 1841148 1804906 1905433 1940320 1775786 1930088 2054084 2006233 2247675
5488 2247675 2001198 1998190 2176157 2086825 1810997 1677832 1860360 2010768 1933763 1888393
5478 1888393 2089518 2158572 2130821 1960962 2077634 2064931 2105606 2091203 1929656 1827864
5468 1827864 1992762 2122066 1945749 1814429 2055500 2145177 2205715 2242368 2145481 2269942
5458 2269942 2258871 2189198 2170236 2309468 2146232 1775918 1839458 2113705 2089879 1975279
5448 1975279 1927686 2127033 2276038 2146100 2132419 2254487 2216727 2251698 2382971 2323949
5438B323949P950p5801p6818k6063K57272P9610m2170K9000l9139j40691L2282
5427B329381m842j7551k4740r522M0778J63689J48037j56722J73014J58498j31525
5416B668495L5941J06257M58N3784j40507r7056P0236L2661n5156J39223Q985
5405B823321l1861Q885r92l36030n692K73446J60841j32066j15213J32820N3086
5394B830545j70166Q8953r8143J47126J80889K3536j75338k42549K65057J73566
5384C023476M8956j45329q009J82958J37840O6494j37698n4662j13457R1872j43038
5373B949403M9551K10158J5864j83879J33447J15505N4745M2887o7442N5457l6171
5362C339525M4999j07007J31930q7571k1644J07236l7028q3541J44918k769j2863
$$ plain form
5438 2323949 2331899 2256098 2179280 2153217 2410489 2490099 2447929 2476929 2437790 2297099 2329381
5427 2329381 2324539 2306988 2282248 2272726 2313504 2477193 2625230 2468508 2641522 2800020 2668495
5416 2668495 2704436 2810693 2811151 2864935 2724428 2627372 2697608 2730269 2675113 2814336 2823321
5405 2823321 2791460 2800345 2799353 2463323 2457631 2731077 2891918 2759852 2644639 2777459 2830545
5394 2830545 2660379 2749332 2651189 2798315 2979204 3002740 2827402 2584853 2849910 3023476
5384 3023476 3072432 2927103 2919094 3102052 3239892 3306386 3168688 3114026 3000569 3092441 2949403
5373 2949403 2998954 3209112 3224976 3041097 3174544 3290049 3344794 3387681 3320239 3375696 3339525
5362 3339525 3384524 3277517 3409447 3321876 3300232 3407468 3370440 3286899 3431817 3429048 3416185
5351C416185J38559J4483Q2925K13880R3556j85524L9476L71828J69672n808j30932
5340D218300J8711J87643J43225m4803o737l1088P7161P3346l3384M6351J66170
5329D814895J07794Q1106J34093K16241K48920K00676N9627L56349M07046M08671
5319G035418k237k96939k90393j30202k1382k04327j78189K77958l0679r2998
5309F066030J0663L2423J17402m1853R6831J61429K48114J73023L7742p3735m8723
5298F779346l5705k6614R8531j26832K44150J88271J90024M6769J22772M48605
5288G929317K43789p4190P2740M50273L15471K89452K98086N22392O58024N90500
5278A1295854L6899m39110m86629m89086n63492o07781l97551k40383p3853j63136
$$ plain form
5351 3416185 3554744 3569227 3652152 3866032 3959588 3774064 3813540 4185368 4355040 4349232 4218300
5340 4218300 4237011 4424654 4567879 4523076 4516339 4485251 4562412 4635758 4602374 4648725 4814895
5329 4814895 4922689 5003795 5137888 5354129 5603049 5803725 5863352 6219701 6626747 7035418
5319 7035418 7033181 6736242 6445849 6315647 6294265 6089938 5911749 6189707 6159028 6066030
5309 6066030 6076693 6109116 6226518 6184665 6281496 6442925 6691039 6864062 6901804 6828069 6779346
5298 6779346 6743641 6717027 6815558 6688726 6932876 7121147 7311171 7357940 7480712 7929317
5288 7929317 8173106 8098916 8171656 8621929 8937400 9226852 9524938 10047330 10705354 11295854
5278 11295854 11332753 10893643 10407014 9917928 9354436 8746655 8349104 8108721 8034868 7871732
5268G871732k65019L8397j22060K03440O0912k05256O2129K93030k67500j21794
5258G548011K97699J24283J81465q5811l9544K40286K18243P993M317m5862j56701
5247H294379R1439M7859k1882j09164Q1873K63267O6004L4684K63236K87564J04453
5236I403712k14723k06263k61548k50038k41195j84853r5725l5475j1686k05768
5226G696438m6616q7181q0701K74951J770q8071P4812J41595r3013l1910L4205
5215G796279K7726j41537j34997J5852N0720q2470j58025j14019l1927q6597q1932
5204G059073R4999N7437k40221j00285n422J61857j16590R3810J03917m0950K4408
5193G092033Q6152K64738O980J11016k20727j80300L55376M72178O0812J43461
$$ plain form
5268 7871732 7606713 7645110 7523050 7726490 7787402 7582146 7644275 7937305 7669805 7548011
5258 7548011 7845710 7969993 8151458 8065647 8026103 8266389 8484632 8492625 8496942 8451080 8294379
5247 8294379 8385818 8433677 8411795 8302631 8384504 8647771 8713775 8748459 9011695 9299259 9403712
5236 9403712 9188989 8982726 8721178 8471140 8229945 8045092 7949367 7913892 7902206 7696438
5226 7696438 7649822 7562641 7481940 7756891 7758661 7670590 7745402 7886997 7793984 7762074 7796279
5215 7796279 7824005 7682468 7547471 7563323 7614043 7531573 7373548 7259529 7227602 7141005 7059073
5204 7059073 7154072 7211509 6971288 6871003 6865581 7027438 6910848 7004658 7108575 7067625 7092033
5193 7092033 7178185 7442923 7449903 7560919 7340192 7159892 7515268 7987446 8048258 8191719
5183H191719J53627L3254P2908O828p5750l4858j35472q9908j12520K39777R8847
5172H348452j4168K9983Q7741N8731K07083q7979j04967P123J27081K21380o3792
5161H816668n0425L02887J89061K41549L19281M88503K03315L15242J48802l07726
5151A0667157l87231l38523j95899k51224p207j12452j20376r2880Q2631J18817
5141I362813j33063j47518p3246r5347J47589O1364o98N23604K69909Q9156L80810
5130A0385373N70703N46046N85673O81971L77220J38014j60881l09259K193n1825
5120A2765228l20257n9232k02401j29930q2008Q1109K51953K47979L1621O6409
5110A2650471m2320M5198j89478l36137j11592j70808o70772j76361R573k42105
$$ plain form
5183 8191719 8345346 8378600 8451508 8458336 8382586 8347728 8212256 8122348 8009828 8249605 8348452
5172 8348452 8334284 8364267 8452008 8510739 8717822 8629843 8524876 8531999 8659080 8880460 8816668
5161 8816668 8766243 9069130 9258191 9499740 9819021 10307524 10510839 10826081 10974883 10667157
5151 10667157 10279926 9941403 9745504 9494280 9487073 9374621 9254245 9161365 9243996 9362813
5141 9362813 9229750 9082232 9008986 8913639 9061228 9122592 9121894 9645498 9915407 10004563 10385373
5130 10385373 10956076 11502122 12087795 12769766 13146986 13285000 13124119 12814860 12817053 12765228
5120 12765228 12444971 12385739 12183338 12053408 11971400 12052509 12304462 12552441 12584062 12650471
5110 12650471 12608151 12653349 12463871 12127734 12016142 11845334 11174562 10998201 11007774 10765669
5100A0765669p1633k01540j09636P5839k6724m4591J04441N9795J99614N3263
5090A0804497K08756J21657K59018J03869Q0417L84725K90752O564k74004l09785
5080A1676466k0935L5606K02547L06124J32014M02253K25777K29790K80953L89832
5070A3860427O67518M81756M07502K42631k05404j63099k80543R5374m3221j12591
5060A4950350j22747k1096j9493J99801N62928L95328N69776J45423j19673k32652
5050A6307945l41493j90875k29679j63198R3068J41631L5702j3261J94666K75096
5040A6109602l17J16651K21277P3549M4762J1049j24931n1857K82754N1446J90951
5029A6924936L9363J87265K63737J81722R9552J56798L12312N72057N06263J94536
$$ plain form
5100 10765669 10694036 10492496 10382860 10458699 10431975 10387384 10491825 10551620 10751234 10804497
5090 10804497 11013253 11134910 11393928 11497797 11578214 11962939 12253691 12260255 11986251 11676466
5080 11676466 11655531 11691137 11893684 12199808 12331822 12734075 12959852 13189642 13470595 13860427
5070 13860427 14527945 15009701 15417203 15659834 15454430 15291331 15010788 15106162 15062941 14950350
5060 14950350 14827603 14806507 14787014 14986815 15549743 15945071 16514847 16660270 16540597 16307945
5050 16307945 15966452 15775577 15545898 15382700 15475768 15617399 15653101 15639840 15834506 16109602
5040 16109602 16109285 16225936 16447213 16520762 16565524 16576573 16451642 16399785 16682539 16733985 16924936
5029 16924936 16964299 17151564 17415301 17597023 17696575 17853373 18165685 18737742 19244005 19438541
5019A9438541K46342N65270O42855M17146L82790O27280O29906J50723J23506
5010B3224359J64183K55198L14203J10517J87186K73119O14964N79094P09243
5001B6432066Q10759P93910R53267J042352R04331R92635J090049J414418J502561
4992C5936348J051260J177891J064619R24901M97046J72776L3582j14418J69303
4983D0913308K50073J97803M34656N14128Q13954R77845J452513J646109J507937
4974D8708326J504408J479420J640431K002508J768288J956064K084907J934359
4966F3078711J630126J347785J300681J398125J697936K068478K530901L594519
4958G8647262M294560M789342O076153O775854P158154P371537O969246N882409
$$ plain form
5019 19438541 19684883 20250153 20893008 21310154 21692944 22320224 22950130 23100853 23224359
5010 23224359 23388542 23643740 23957943 24068460 24255646 24528765 25143729 25722823 26432066
5001 26432066 27242825 28036735 28990002 30032354 30936685 31929320 33019369 34433787 35936348
4992 35936348 36987608 38165499 39230118 40155019 40652065 40824841 40858423 40744005 40913308
4983 40913308 41163381 41361184 41795840 42309968 43123922 44101767 45554280 47200389 48708326
4974 48708326 50212734 51692154 53332585 55335093 57103381 59059445 61144352 63078711
4966 63078711 64708837 66056622 67357303 68755428 70453364 72521842 75052743 78647262
4958 78647262 82941822 87731164 93807317 100583171 107741325 115112862 122082108 127964517
4950A27964517M952093L843278K384703J293459N3428j645800k570219k944760
4942A33330699k318067j431605r26599o94197j043430j868711k393016l287033
4934A19368041m053480m337738m566670m642838m486868l789055l116998k134263
4926H8240131j370251j028081q05200m62513m46902N3886J70765m09033p08154
4917H3234648j359528k609011l504748l906154l940753l565719l176811k909637
4909E8262287k587001k214322j749040j554818j393331j055933n00605j21306
4901D7085931j90452n45232m20311l39978l48798k75171n41055p74242o95499
4892D2955193p08199j207780j234518j269098j087800j025397j146221q63174
$$ plain form
4950 127964517 132916610 136759888 139144591 140438050 140491478 138845678 136275459 133330699
4942 133330699 131012632 129581027 128654428 127960231 126916801 125048090 122655074 119368041
4934 119368041 115314561 110976823 106410153 101767315 97280447 93491392 90374394 88240131
4926 88240131 86869880 85841799 85036599 84574086 84127184 84181070 84351835 83942802 83234648
4917 83234648 81875120 79266109 75761361 71855207 67914454 64348735 61171924 58262287
4909 58262287 55675286 53460964 51711924 50157106 48763775 47707842 47207237 47085931
4901 47085931 46895479 46350247 45929936 45589958 45241160 44965989 44424934 43650692 42955193
4892 42955193 42246994 41039214 39804696 38535598 37447798 36422401 35276180 34413006
4884C4413006o35608j171008j223723r42149r26032q25401q16947q17407n34618
4875B6520113l91707l85901m77890m36219k46902m88471m05268l98995k81199
4866B3007561j50260l85246m02844m69771l07937j70009k44651m32932k28024
4857B0215887j15758k15378o7972k11874j15262r0423k59204n3788j19613m8564
4847A8918051N2281j38672k5852N2959r7648k90071l12333k81954l7878k58847
4837A7580036k02329k28398q0206k5100q0853J5288r8551k9690j0494J27103N5919
4826A7022725k21707j84593j67501j50458j57750k93813j29708p8170n4651j61225
4816A5423149j06927N9280k4003J8760p680k97700J06374j5322J06301J23074
$$ plain form
4884 34413006 33777398 32606390 31382667 30440518 29514486 28689085 27872138 27054731 26520113
4875 26520113 26128406 25742505 25264615 24828396 24581494 24093023 23687755 23288760 23007561
4866 23007561 22857301 22472055 22069211 21599440 21291503 21121494 20876843 20443911 20215887
4857 20215887 20100129 19884751 19816779 19604905 19489643 19399220 19140016 19086228 18966615 18918051
4847 18918051 18970332 18831660 18805808 18858767 18761119 18471048 18158715 17876761 17838883 17580036
4837 17580036 17377707 17149309 17069103 17044003 16963150 16978438 16879887 16850197 16839703 16966806 17022725
4826 17022725 16801018 16616425 16448924 16298466 16140716 15846903 15717195 15639025 15584374 15423149
4816 15423149 15316222 15375502 15351499 15370259 15362579 15064879 15171253 15155931 15262232 15385306
4806A5385306j59504j22591j35236j36939R4321J94799J28146M9340J72802m7183
4796A5423261j01158r8111j33420p5693r8736K00124p314n1434j20979j69246
4786A4767294J01358R2945k94555J4675Q2976J1789j50087j91831J1258J62253
4776A4608075n1104o9506Q0783k4021r1235o5729j91927j81492J4551j81597n2588
4765A3794210m7343p3150P1360R1577Q3522J841k38493m417M0668n3641Q590J06882
4753A3781606j52796r8712N9134M8247P5422k7539m5584o7291L6979N0935K21379
4742A3881780j90637J9154r9842r3121j56112j9505J87841Q7852j09346j95553
4732A3312511j415m1246k9314p5066J13953j04821J37369K30040K8318m661J14370
$$ plain form
4806 15385306 15225802 15103211 14967975 14831036 14925357 15120156 15248302 15297642 15470444 15423261
4796 15423261 15322103 15223992 15090572 15014879 14916143 15116267 15108953 15057519 14936540 14767294
4786 14767294 14868652 14961597 14667042 14681717 14764693 14776482 14626395 14434564 14445822 14608075
4776 14608075 14556971 14487465 14568248 14544227 14452992 14387263 14195336 14013844 14028395 13846798 13794210
4765 13794210 13746867 13673717 13745077 13836654 13920176 13922017 13683524 13679107 13719775 13666134 13674724 13781606
4753 13781606 13628810 13530098 13589232 13637479 13712901 13685362 13639778 13572487 13609466 13660401 13881780
4742 13881780 13691143 13710297 13610455 13517334 13361222 13341717 13529558 13617410 13508064 13312511
4732 13312511 13311096 13269850 13240536 13165470 13279423 13174602 13311971 13542011 13570329 13565668 13680038
4721A3680038K39508J50577N8268L92432J37782k97911q000J07268J48045J98376
4711A4806383J69439J20954n2376K1364O1707J72453p4556J16114K87776J80310
4701A5809568M6539k03723J16916Q2203P1784K48497K86141J49334J25530p9143
4691A6653646K38314J4939j46844P5174J16013K46406J3710J31101K9375O5805
4681A7437639J43048J66400K86114M87298K82679K26647K51961M53034K86267
4672B0021087K48790K88071K50770N11524M10177L72014P09510R53165O50087
4663B4415195Q52945J019491J206218J351082J432388K044688K428328K619198
4655C7369533K621029K057584J135593m68745j386041k175569k051322j489110
$$ plain form
4721 13680038 13919546 14070123 14128391 14520823 14658605 14360694 14352694 14459962 14608007 14806383
4711 14806383 14975822 15096776 15044400 15065764 15127471 15299924 15225368 15341482 15629258 15809568
4701 15809568 15856107 15652384 15769300 15851503 15923287 16171784 16457925 16607259 16732789 16653646
4691 16653646 16891960 16906899 16760055 16835229 16951242 17197648 17211358 17342459 17371834 17437639
4681 17437639 17580687 17747087 18033201 18520499 18803178 19029825 19281786 19734820 20021087
4672 20021087 20269877 20557948 20808718 21320242 21730419 22102433 22811943 23765108 24415195
4663 24415195 25268140 26287631 27493849 28844931 30277319 32322007 34750335 37369533
4655 37369533 39990562 42048146 43183739 42714994 41328953 39153384 37102062 35612952
4647C5612952j044051l34143m812N2992Q98850J369998J784863K286150K181486
4638D2804285J566576L64544j034757k187814k622339k894828k463113k044020
4630C1488534j852477j358154j051309q76262q13970o61905l05019l89017k83329
4621B3897092j56914j96438j84828k89129j81314k29963k41005L3144Q1338K54074
4611B2786057j78753m7027J63378J43416P5270K41716K73268R9102J86595L65896
4601B4108918L47848L88868M38895O67653M56451M80925P75514O37074O04939
4592B8907085P47645Q72834J067525J298461J143588J488836J628865J901870
4584C9056709K456951K687574L312417L878105M265673M630882L912301K485000
$$ plain form
4647 35612952 34568901 34234758 34229946 34282938 35181788 36551786 38336649 40622799 42804285
4638 42804285 44370861 44735405 43700648 41512834 38890495 35995667 33532554 31488534
4630 31488534 29636057 28277903 27226594 26350332 25536362 24874457 24569438 24180421 23897092
4621 23897092 23740178 23543740 23358912 23069783 22888469 22658506 22417501 22450645 22531983 22786057
4611 22786057 22607304 22560277 22723655 22867071 22942341 23184057 23457325 23556427 23743022 24108918
4601 24108918 24456766 24845634 25284529 25952182 26408633 26889558 27665072 28302146 28907085
4592 28907085 29654730 30527564 31595089 32893550 34037138 35525974 37154839 39056709
4584 39056709 41513660 44201234 47513651 51391756 55657429 60288311 64200612 66685612
4576F6685612K18687j858712k898067l106301l116769k448796j341102p01625
4568E1432927j29625J035731J778311K194759K994605L434873K543829J111570
4560F6396980r96012l240562m458870n262218m789817m080905l424271k864116
4552C7280209k280844j869662j432679j240205r76431q93084p25184n62291o14836
4543B6684993m65639l55807p28581o51819l63418m50781n04311l17855l22647
4534B2524135l17427k93100o66798l02253o6394j62591l52125l58396J10574K28354
4524B0343979l4950j84414l90795o8414k08924k3349k6633k21852P9652p103j27158
4513A9130039J04355L47371K23810k36966j14512p7443j2738j27288m68280q9229
$$ plain form
4576 66685612 66904299 65045587 62147520 59041219 55924450 53475654 52134552 51432927
4568 51432927 51303302 52339033 54117344 56312103 59306708 62741581 65285410 66396980
4560 66396980 65400968 62160406 57701536 52439318 47649501 43568596 40144325 37280209
4552 37280209 34999365 33129703 31697024 30456819 29480388 28587304 27862120 27299829 26684993
4543 26684993 26219354 25863547 25134966 24483147 24119729 23668948 23164637 22846782 22524135
4534 22524135 22206708 21913608 21246810 20944557 20878163 20715572 20363447 20005051 20115625 20343979
4524 20343979 20309029 20124615 19733820 19665406 19456482 19433133 19406500 19184648 19264300 19257197 19130039
4513 19130039 19234394 19581765 19805575 19568609 19454097 19376654 19363916 19236628 18768348 18679119
4503A8679119J11771R815j59470l13119j84148j42124J10699O7498J99580K93858
4493A8673479K93494K10488Q8955J36483k24110m34795m16394l65461k72037L681
4483A7693783l05494l07852n1952l293k8519J60423j16199k33370n0763J82460
4473A6939224K37640K06557O6749K69694L02828L17091P1060L4202K87752P1322
4463A8804119J99342M8520J0768J67493K47429J29085K68155L6010p4606l01321
4453A9534994l07747r7952j00853k15158r2473J0322l907m2987J81972K86714
4443A9152925K88106L19663J46975J54233L65750L86129N01185M09815L43605
4434B2068386M16009M44719O72544L91125L13419J99634K35237L56098O05714
$$ plain form
4503 18679119 18790890 18800705 18641235 18328116 18143968 18001844 18112543 18180041 18379621 18673479
4493 18673479 18966973 19177461 19266416 19402899 19178789 18743994 18327600 17962139 17690102 17693783
4483 17693783 17388289 17080437 17028485 17025192 16996673 17157096 17040897 16807527 16756764 16939224
4473 16939224 17176864 17383421 17450170 17719864 18022692 18339783 18410843 18445045 18732797 18804119
4463 18804119 19003461 19051981 19062749 19230242 19477671 19606756 19874911 19910921 19836315 19534994
4453 19534994 19227247 19129295 19028442 18813284 18720811 18731133 18727226 18684239 18866211 19152925
4443 19152925 19441031 19760694 19907669 20061902 20427652 20813781 21314966 21724781 22068386
4434 22068386 22484395 22929114 23601658 23992783 24306202 24505836 24741073 25097171 25702885
4425B5702885L58142R19092J072304P36973M95843N5425M0945p5090k95629k38994
4415B8771896j45640o8043k03867j68754j29201r5294J59234J09093K48699J81716
4405B8659839N837K80431M52720N54089M84723N80528P73080Q36512R85251R79826
4395C4592836J308314J251900J552949K440121K958950L656787M257111L877439
4387E5896407K752868L83328k507598m114250m407879m039845l352965k729229
4379C7880837k318126j986934j241667j252544q27775q26627m29619K84962R2330
4370B9374837M43380O42622P60494R20280R70683J340031J622922J848526K212642
4361D0136417K738163L753195M418325M093576K904790O18852k393378m259493
$$ plain form
4425 25702885 26061027 26980119 28052423 28789396 29285239 29340664 29381609 29306519 29010890 28771896
4415 28771896 28626256 28558213 28354346 28185592 28056391 27961097 28120331 28229424 28478123 28659839
4405 28659839 28665676 28946107 29398827 29952916 30437639 31018167 31791247 32627759 33613010 34592836
4395 34592836 35901150 37153050 38705999 41146120 44105070 47761857 52018968 55896407
4387 55896407 58649275 59032603 56525005 52410755 48002876 43963031 40610066 37880837
4379 37880837 35562711 33575777 32334110 31081566 30253791 29427164 28997545 29282507 29374837
4370 29374837 29818217 30460839 31221333 32141613 33112296 34452327 36075249 37923775 40136417
4361 40136417 42874580 46627775 51046100 55139676 58044466 58663318 56269940 52010447
4353E2010447m907380m756228m209976l357393k567916k071743j743418j697825
4345B6698568j271702j054579q40829p44991o73754m25775n23190m07794l60561
4336B0395393l14806l67134j90454m2010k18815j4614j33980k10804J59738J8003
4326A9080517J7732K05051K92686K78644L46085M51864N29721O89368Q68102J053302
4316B3813072J507013J677039K139059K202483K351238K216328R74586r22629
4308C5958189k226487k666287k437349k252775j699545j391774j084427p82724
4300B1416821q40200m18780k92996j54798j46258R7371J94516K97913L17476L77153
4290B0848218L67986P72118R09555R65704J271558J691306J962907K475609K858497
$$ plain form
4353 52010447 47103067 42346839 38136863 34779470 32211554 30139811 28396393 26698568
4345 26698568 25426866 24372287 23531458 22786467 22112713 21686938 21163748 20755954 20395393
4336 20395393 20080587 19713453 19522999 19480989 19262174 19247560 19113580 18902776 19062514 19080517
4326 19080517 19098249 19303300 19595986 19874630 20220715 20672579 21202300 21891668 22759770 23813072
4316 23813072 25320085 26997124 29136183 31338666 33689904 35906232 36880818 35958189
4308 35958189 33731702 31065415 28628066 26375291 24675746 23283972 22199545 21416821
4300 21416821 20576621 20157841 19864845 19710047 19563789 19661160 19855676 20153589 20471065 20848218
4290 20848218 21216204 21988322 22897877 23863581 25135139 26826445 28789352 31264961 34123458
4281C4123458K428239J202763m67475k259973l004135l006634k438186k204429
4273B4373628j890462j813638j428398j175030q60058q08644j035888n15296m82795
4264A4363419k87629l24352l86374l74989l05603k71978o6931k29833k87577k91427
4254A1536726N1838k68615j08302j1751L5677J01506k1801P1725P2058M5459J04900
4243A1609420l1416M6269P9408J25816K81990J74687J84075R4028K67621l5253
4233A2796645N3421O6297J84173K92834N47310P09091Q57424J133139J614620
4224A8254954J877457J758504L98962j295372k119513k039996j618572j493720
4216A3722704j151709r84891p81145n94444m70234k57032m45161n35994j82710
$$ plain form
4281 34123458 36551697 37754460 37286985 35027012 32022877 29016243 26578057 24373628
4273 24373628 22483166 20669528 19241130 18066100 17206042 16397398 15361510 14846214 14363419
4264 14363419 14075790 13751438 13365064 12990075 12684472 12412494 12345563 12115730 11828153 11536726
4254 11536726 11588564 11319949 11211647 11199896 11235573 11337079 11315278 11387003 11459061 11504520 11609420
4243 11609420 11578004 11624273 11703681 11829497 12111487 12286174 12470249 12564277 12831898 12796645
4233 12796645 12850066 12916363 13100536 13393370 13940680 14649771 15507195 16640334 18254954
4224 18254954 20132411 21890915 22289877 20994505 18874992 16834996 15216424 13722704
4216 13722704 12570995 11586104 10804959 10210515 9740281 9483249 9038088 8502094 8319384
4207H319384j09364j66004j22096P769n2345q1332j21074r4107K3018k91511p4270
4196G238068K9243k5810j31166r9806J49035J469P3757O235J22206n5647n0710
4185G256874o5173K06791m713l9718J53067J28133j6708o6562j91051j99451k6665
4174G134824j07839j96077J86249M3096o5866P7240J00110K01610o2729j34390
4164G176228j01795j55482k44110k96946m6705P7326j70546p5738L2068j21868
4154F072432j32342o4357j07929j07374k59524n2767N4518N6705j09434q7329
4144E262599j57225L1273J8040J73957K9149j66701k648j41181j34162k9251K59087
4133E142937j10296p1406R4888k19871J4942J03718k16j05394L1946k01344q2334
$$ plain form
4207 8319384 8210020 8044016 7921920 7929689 7877344 7796012 7674938 7580831 7603849 7312338 7238068
4196 7238068 7267311 7241501 7110335 7010529 7159564 7161033 7234790 7241025 7363231 7307584 7256874
4185 7256874 7191701 7398492 7393779 7354061 7507128 7635261 7618553 7551991 7360940 7161489 7134824
4174 7134824 7026985 6830908 7017157 7060253 6994387 7071627 7171737 7373347 7310618 7176228
4164 7176228 7074433 6918951 6674841 6377895 6331190 6408516 6237970 6162232 6194300 6072432
4154 6072432 5940090 5875733 5767804 5660430 5400906 5348139 5402657 5459362 5349928 5262599
4144 5262599 5105374 5136647 5154687 5328644 5357793 5191092 5188444 5047263 4913101 4883850 5142937
4133 5142937 5032641 4961235 5056123 4836252 4851194 4954912 4954696 4849302 4881248 4679904 4597570
4122D597570q0680j34254P3791O690p7782k55875J24705r5754l7326J14470r7225
4111D138330J2448q6068j86949j24128O1810J04468l4060j83125j05710q3220
4101C513796Q4341K6497j26996K6674J82234P974P1405N560n2348M161n9013l56688
4089C327597M0241K42979r8979P1510j51397j1235J06339l5867j31628q0920J67079
4078C445719M4300K9845l7670n2789Q5927j39533j87822p2601P1740L6090J39501
4067C362707J83266j56260J33732p7178k83565m5415K13458K2456K3488L24287
4057C700976j06144n6527J43237o3815r6753m2285M0484K23815j10417O4167Q5852
4046C782590J18787K6673K17192J30460j50285Q1520J20603L4896K989J7549p6364
$$ plain form
4122 4597570 4516890 4382636 4456427 4463117 4385335 4129460 4254165 4158411 4121085 4235555 4138330
4111 4138330 4150778 4064710 3877761 3753633 3815443 3919911 3885851 3702726 3597016 3513796
4101 3513796 3598137 3624634 3497638 3524312 3706546 3714520 3785925 3791485 3739137 3743298 3684285 3327597
4089 3327597 3367838 3610817 3511838 3583348 3431951 3420716 3527055 3491188 3359560 3278640 3445719
4078 3445719 3490019 3519864 3482194 3429405 3515332 3375799 3187977 3115376 3187116 3223206 3362707
4067 3362707 3545973 3389713 3523445 3446267 3162702 3117287 3330745 3353201 3376689 3700976
4057 3700976 3594832 3538305 3681542 3617727 3520974 3478689 3519173 3742988 3632571 3696738 3782590
4046 3782590 3901377 3928050 4145242 4275702 4125417 4206937 4327540 4362436 4365425 4382974 4306610
4035D306610O4387R8602j57263J49969J29243J3904p4525J63451J97416l1593
4025D860201J0455J3576J7192J66612J48230k2931k6786O0972J6825J81771j62029
4014E264088r0714J11094M039q4695K8778R2437p71k16677J5567o5230O6689R4511
4002E219116l31433K8957J9543L5016P4030L0720K5404N7815Q3450J00590o2235
3991E280973Q0910m6486R893m5412m7581J36371J18709K1482j40944n4157k6652
3980E287106k52351J95954J08160l9706O217J5630J34236l4153K0141J43934R3368
3969E678536j83848k65480J41935j32418m9027Q0242K63336p8896j57403L9711
3959E336688K7423k3425j37795q4276Q887J95346j11786K6827l7584j1992j39186
$$ plain form
4035 4306610 4370997 4469599 4312336 4462305 4591548 4605452 4530927 4694378 4891794 4860201
4025 4860201 4870656 4884232 4901424 5068036 5216266 5193335 5166549 5227521 5244346 5426117 5264088
4014 5264088 5173374 5284468 5288507 5203812 5232590 5325027 5324256 5107579 5123146 5057916 5124605 5219116
4002 5219116 4887683 4916640 4936183 4971199 5045229 5075949 5101353 5159168 5242618 5343208 5280973
3991 5280973 5361883 5315397 5325290 5279878 5232297 5368668 5487377 5508859 5367915 5313758 5287106
3980 5287106 5034755 5230709 5338869 5299163 5305380 5321010 5455246 5421093 5441234 5585168 5678536
3969 5678536 5494688 5229208 5371143 5238725 5189698 5269940 5533276 5454380 5296977 5336688
3959 5336688 5364111 5340686 5202891 5118615 5127502 5322848 5211062 5237889 5200305 5188313 5049127
3948E049127q2507j02242Q5076m2524o2842J02962K9621j36567R3156L22712j02028
3937E153944o1631j14747P6331k15712L36200J39934p7264j6607l7945j31131
3927E051372j40852j47542K3163k0827k3851l5876K8982j52138j50851J67916
3917D599496N3161Q3806J47747p2124q6957o3438k7808p4539Q7127J0900J5721
3906D673092j6001j40915l18894Q6715J18541o7515m0875j99664K4568Q2470K29628
3895D431150r2729k3180p4864j5582n6005j1057j18384N6643Q9958J35047k620
3884D318377k70116j27702J05604j75545L07193R3667p5945K2373Q7239J38893
3874D424038k4789k54593m1404j48609j09905K06492J17437j09465J85887m73
$$ plain form
3948 5049127 4966620 4864378 4949454 4906930 4844088 4947050 4976671 4840104 4933260 5255972 5153944
3937 5153944 5092313 4977566 5053897 4838185 5174385 5314319 5237055 5220448 5182503 5051372
3927 5051372 4910520 4762978 4786141 4765314 4741463 4705587 4734569 4582431 4431580 4599496
3917 4599496 4652657 4736463 4884210 4812086 4725129 4661691 4633883 4559344 4646471 4657371 4673092
3906 4673092 4657091 4516176 4197282 4283997 4402538 4335023 4294148 4094484 4119052 4201522 4431150
3895 4431150 4338421 4315241 4240377 4224795 4168790 4157733 4039349 4095992 4185950 4320997 4318377
3884 4318377 4048261 3920559 4026163 3850618 4157811 4251478 4175533 4197906 4285145 4424038
3874 4424038 4399249 4144656 4103252 3954643 3844738 4051230 4168667 4059202 4245089 4244616
3864D244616k75440K0302P8513o2409J49013j74137m4702J02923J45068q7468
3854D096279j95710q0346J84873Q9298j25848o3461K23080J01770j07848J0771
3844D132858O6101j26238m4773J65674Q3323k0336N653J15615L245R3861j25396
3833D349587p0217J26743J25450J82702j89816K4758K35101L1579j11596J60269
3823D864560J68425j08457q4037j33791M5001R3705k7944r8834J88769j18704
3813D788693K9703K204k737K91149K71988J6857l393j34422K37171L8558Q8715
3802E624486p3704K15624J53272k30119o071K78939o7850K92787q1260m397J48317
3791F250024J08680Q2452M231K51269N4663K04535K98607J66659j52544o0975
$$ plain form
3864 4244616 3969176 3989478 4067991 4005582 4154595 3980458 3935756 4038679 4183747 4096279
3854 4096279 3900569 3820223 4005096 4094394 3968546 3905085 4128165 4229935 4122087 4132858
3844 4132858 4198959 4072721 4027948 4193622 4276945 4256609 4262262 4377877 4381122 4474983 4349587
3833 4349587 4279370 4406113 4531563 4714265 4524449 4549207 4784308 4815887 4704291 4864560
3823 4864560 5032985 4924528 4840491 4706700 4751701 4845406 4817462 4718628 4907397 4788693
3813 4788693 4818396 4820600 4817863 5109012 5381000 5397857 5394464 5260042 5497213 5535771 5624486
3802 5624486 5550782 5766406 5919678 5689559 5683488 5962427 5894577 6187364 6106104 6101707 6250024
3791 6250024 6358704 6441156 6445387 6696656 6751319 6955854 7254461 7421120 7268576 7207601
3781G207601K23302P9790J97924O5999P0549J82252L07283K90380j6504N5090
3771H663666J65217K35717M57818J57038L34030J99882J49748K67825J96090K62837
3761A1089868L16626K71496K46812M36115M33416M12339M11980N64261O03943
3752A4786856P84006N34701N46001P51469O38270N92816Q15910Q10327J030574
3743B1290930J157951J369280J092730P40215K0094j03086O7772L03958M15497
3734B6355341P70647J310092J608470J628102K095270K325865K098899J566375
3726C9759061R72435R19462P17697K23962n251j68556n35602q61369o77577n2810
3716D0291452N41001J358071J913463K267187K370332J708342J000340J71081
$$ plain form
3781 7207601 7430903 7510693 7708617 7774616 7845165 8027417 8334700 8625080 8608576 8663666
3771 8663666 8828883 9064600 9522418 9679456 10013486 10213368 10363116 10630941 10827031 11089868
3761 11089868 11406494 11677990 11924802 12360917 12794333 13206672 13618652 14182913 14786856
3752 14786856 15570862 16105563 16651564 17403033 18041303 18634119 19450029 20260356 21290930
3743 21290930 22448881 23818161 24910891 25651106 25671200 25568114 25635886 25939844 26355341
3734 26355341 27125988 28436080 30044550 31672652 33767922 36093787 38192686 39759061
3726 39759061 40731496 41650958 42368655 42592617 42587366 42418810 41883208 41021839 40344262 40291452
3716 40291452 40832453 42190524 44103987 46371174 48741506 50449848 51450188 51621269
3708E1621269l69931p82040n06471o84021j534618j277599q18010n20040M22607
3699D5551146Q43686J067278P83722M58971O17100Q81756P19650k56559j042647
3690D9624103k589001k899289k254467j718713r81129k43848K91056P93047O44721
3681D0666480M62364K93138L01296l7208r26749j360887j457181j524825j858608
3672C4557820j968536j650929j335851r43727l98123j32002J61409K23194L59457
3663B8872712L85778k16419r29651j186952j212894j100192q80161q51087q00458
3654B2080676m59984m44752l50221K2136j71184m5387K0348N1877J68891j14056
3644B0758344l4306K83225J92184q5035J09761J54561K0631J77689K86971K10622
$$ plain form
3708 51621269 51251338 50469298 49962827 49278806 47744188 46466589 45648579 45128539 45551146
3699 45551146 46394832 47462110 48245832 48704803 49321903 50203659 50923309 50666750 49624103
3690 49624103 47035102 44135813 41881346 40162633 39181504 38937656 39228712 40021759 40666480
3681 40666480 41128844 41421982 41723278 41686070 40759321 39398434 37941253 36416428 34557820
3672 34557820 32589284 30938355 29602504 28658777 28260654 28128652 28290061 28513255 28872712
3663 28872712 29258490 29042071 28112420 26925468 25712574 24612382 23732221 22881134 22080676
3654 22080676 21620692 21175940 20825719 20847855 20676671 20631284 20651632 20703509 20872400 20758344
3644 20758344 20724038 21007263 21199447 21114412 21224173 21378734 21399365 21577054 21864025 22074647
3634B2074647M96101P22844R29306O91193O72480Q18742R75344R44173O67167
3625B8991997O41561M25298O8008j5888K28600j45942o8330j29574L5822N95842
3615C0627394P48045M36637L73705P91973K55566M3807Q0290m81323n06993n34124
3605C1834977n21854l30237l80863l39528j79350k79835m89828p55196n48525
3596B8009761n43624p05408n27567l29668l15635n17759k45030j66318j44321
3587B4514431j20815j04155O4501J22996M7731O518K94419J47247J07095K74502
3577B5354470j65707k14496j88210n9686p683j71555L32789K41807K07701O34594
3567B5964024N85815N69807O46381M12667P04569Q25492P63695J139040J357440
$$ plain form
3634 22074647 22570748 23293592 24222898 24914091 25586571 26405313 27380657 28324830 28991997
3625 28991997 29633558 30058856 30126864 30110976 30339576 30193634 30125304 29995730 30031552 30627394
3615 30627394 31375439 31812076 32185781 32977754 33233320 33277127 33357417 32876094 32369101 31834977
3605 31834977 31313123 30982886 30602023 30262495 30083145 29803310 29313482 28558286 28009761
3596 28009761 27466137 26760729 26233162 25903494 25587859 25070100 24825070 24658752 24514431
3587 24514431 24393616 24289461 24353962 24476958 24524689 24531207 24825626 24972873 25079968 25354470
3577 25354470 25188763 24974267 24786057 24726371 24718688 24547133 24879922 25121729 25329430 25964024
3567 25964024 26549839 27119646 27766027 28178694 28883263 29708755 30472450 31611490 32968930
3558C2968930J493112J866218J769607J668463J544067J336631J162733Q99386
3550D4709147N38123j15740j94048k05542k46854j36505j23957J09467J95664
3541D4529755K14322L81309N44303J282797J528546J576887K081716K591642K565558
3532E7296835K759908K974175L107306L341784L716132M158045L572200J065692
3524H1992077k902393n680492n890928m749145l394264k523358j596315r40667
3516E4314515k45591O89913R56198J544679J972411K671393L447642M317750N416044
3507G5084954O320860O304178M607175K148136m67594m000392o882797q318650
3499G4795870p509550n691347m532315l453125k494118j738778j254551m74337
$$ plain form
3558 32968930 34462042 36328260 38097867 39766330 41310397 42647028 43809761 44709147
3550 44709147 45247270 45131530 44937482 44731940 44485086 44348581 44224624 44334091 44529755
3541 44529755 44744077 45125386 45669689 46952486 48481032 50057919 52139635 54731277 57296835
3532 57296835 60056743 63030918 66138224 69480008 73196140 77354185 80926385 81992077
3524 81992077 79089684 73409192 67518264 62769119 59374855 56851497 55255182 54314515
3516 54314515 54068924 54758837 55715035 57259714 59232125 61903518 65351160 69668910 75084954
3507 75084954 81405814 87709992 92317167 94465303 93997709 89997317 83114520 74795870
3499 74795870 67286320 61594973 57062658 53609533 51115415 49376637 48122086 47647749
3491D7647749j17882J71563Q55980J110154J777981K518440L301644L597109J780805
3482F2643543j886862n129287n687391m746961l589028l118615k673647j845817
3474C3965935j560800j071167q56314q06495n68318n12325n99838n12009m65011
3465B7013658l54191l11513m86811l68160o56594n00853m85761m68817l81712
3456B2999246l39733k40934l69201k34349l37506k53822j54779k59797l92342
3447B0416783p1421k63550l12743j46678j84494N2519k49773j47734R9224J88437
3437A9380570J87921l0603p4406R2387M3585r4285j40635r4300k15599N0798j09476
3426A8995957n8997J07468N8815J8938j53061j72303m5059O7263P4749K47582
$$ plain form
3491 47647749 47529867 47701430 48557410 49667564 51445545 53963985 57265629 60862738 62643543
3482 62643543 60756681 55627394 49940003 45193042 41604014 38485399 35811752 33965935
3474 33965935 32405135 31333968 30477654 29671159 29102841 28590516 27990678 27478669 27013658
3465 27013658 26659467 26347954 25861143 25492983 24836389 24335536 23849775 23380958 22999246
3456 22999246 22659513 22418579 22049378 21815029 21477523 21223701 21068922 20809125 20416783
3447 20416783 20345362 20081812 19769069 19622391 19437897 19490416 19240643 19092909 19192133 19380570
3437 19380570 19568491 19537888 19463482 19555869 19599454 19505169 19364534 19270234 19054635 19105433 18995957
3426 18995957 18936960 19044428 19103243 19122181 18969120 18796817 18751758 18819021 18893770 19141352
3416A9141352J65338n8944P0951K7589P2041k59412j33726k10395j81152j07036
3406A8526606k52139j53771l9714Q1174q2725r98L96998m2407O75K76144K5997
3395A8735840m2322N6590M20550J56403L90720M23934K91331N94140M24440L57130
3385B1808756N47109N54986N37193Q61228Q34965J082599J099160J124715J121583
3376B9572294J182448P42521O42485K02793j79469n6476k50018N3764L3030L06229
3366C2249601M25910L38574L83780P24604N28339Q56218Q07069N89632K64446
3357C7168173l6360n14789q27401r81779q89075m16792m33821o23966o03741o65704
3347C1174745o81268q74069q38507q93501r23494r52663r26786p56126n97375
$$ plain form
3416 19141352 19306690 19247746 19318697 19346286 19418327 19158915 19025189 18814794 18633642 18526606
3406 18526606 18274467 18120696 18080982 18162156 18079431 18078433 18475431 18433024 18433699 18709843 18735840
3395 18735840 18693518 18750108 19170658 19327061 19717781 20141715 20433046 21027186 21451626 21808756
3385 21808756 22355865 22910851 23448044 24309272 25144237 26226836 27325996 28450711 29572294
3376 29572294 30754742 31497263 32139748 32342541 32163072 32106596 31856578 31910342 31943372 32249601
3366 32249601 32675511 33014085 33397865 34122469 34650808 35507026 36314095 36903727 37168173
3357 37168173 37131813 36617024 35789623 34807844 33918769 33501977 33068156 32444190 31840449 31174745
3347 31174745 30493477 29619408 28780901 27887400 26963906 26011243 25084457 24328331 23730956
3338B3730956m60483l44020l72731k88768n65508l39807k99054l39232k13723
3329B0507630j2351j28464l0186m07416k39046L8925n6762k13895k87977K82608
3319A9453066r8342j1789J72012K62625K16196Q2357J80867J98924M56123N68771
3309B1480810N32639N43257P01447N58778O67496P75727P69892P82167N24247
3300B7336460K56260J22928L8135k8432q5229l9684j01405r0122j17934J1990
3290B7302967k61715k33872J31531K44847L08874K04836L69575N14575P40034
3281B9321652M80066L87260L90035J04845l17473l79433q02302n29549k39384
3272B8415717o32072n59337m14431n14308m10817m99207n82708l78410J48248
$$ plain form
3338 23730956 23270473 22926453 22553722 22264954 21699446 21359639 21060585 20721353 20507630
3329 20507630 20495279 20366815 20336629 19929213 19690167 19729092 19672330 19458435 19170458 19453066
3319 19453066 19354724 19342935 19514947 19777572 19993768 20076125 20256992 20455916 20912039 21480810
3309 21480810 22013449 22556706 23258153 23816931 24484427 25260154 26030046 26812213 27336460
3300 27336460 27592720 27715648 27753783 27725351 27640122 27600438 27499033 27408911 27290977 27302967
3290 27302967 27041252 26807380 26938911 27183758 27492632 27697468 28067043 28581618 29321652
3281 29321652 29801718 30188978 30579013 30683858 30366385 29986952 29184650 28655101 28415717
3272 28415717 27783645 27224308 26809877 26295569 25884752 25385545 24802837 24424427 24572675
3263B4572675j3896j69012j86145k9542K7623O2616k16018l3979j26301P9308
3253B3967329p875J49112L89660P1990O102J56702M42835M66077K66427K14795
3243B6123154L20720O64159M94965N37933N68157N72385M59342O49738Q30563
3234C1221116O36761N93343P42691P12052P83836P67211Q62184P13487P20659
3225C7753340P56829R56745J141342J304984J442849J473690J418512J625411
3217D7873702J986127K103962K348676K505868K924417K992566L379734M147139
3209G0262191N099895N774693O174093N528284K054340j393838k415861k313545
3201H8770252j297769l42334P30209J871699L062045M143957N575972N893184
$$ plain form
3263 24572675 24558779 24389767 24203622 24174080 24201703 24264319 24048301 24014322 23888021 23967329
3253 23967329 23959454 24108566 24498226 24570216 24576318 24733020 25175855 25641932 25908359 26123154
3243 26123154 26443874 27108033 27602998 28140931 28709088 29281473 29740815 30390553 31221116
3234 31221116 31857877 32451220 33193911 33905963 34689799 35457010 36319194 37032681 37753340
3225 37753340 38510169 39466914 40608256 41913240 43356089 44829779 46248291 47873702
3217 47873702 49859829 51963791 54312467 56818335 59742752 62735318 66115052 70262191
3209 70262191 75362086 81136779 87310872 92839156 94893496 93499658 91083797 88770252
3201 88770252 87472483 87130149 87860358 89732057 92794102 96938059 102514031 108407215
3193A08407215L772679M74499j730822j745274o15756N79605K110090L441407
3185A14693643N146901N843939M766218J681054m79732m96850M56477J586326
3177A33197976K970928M068800N389199O845129Q538499J0230069J0994263R324753
3169A91559616P574074Q225115J0989673J4670268K0175616K6385332L3414339
3162C12994033L9079498L7611201K0776550K322059m353720m855822j4536965
3155C89036834l4478846m5416100m3244106l4326867k6386357k1033312j6851904
3148A67299342j3157846j0219264q020876o319040m974433l916555k751797j695393
3140A16244138l98584N49354J076465J659049K292369K862158L768963N065862
$$ plain form
3193 108407215 112179894 112654393 110923571 109178297 108562541 109142146 111252236 114693643
3185 114693643 119840544 125684483 130450701 132131755 131652023 131155173 131611650 133197976
3177 133197976 136168904 140237704 145626903 152472032 161010531 171240600 182234863 191559616
3169 191559616 199133690 207358805 218348478 233018746 253194362 279579694 312994033
3162 312994033 352073531 389684732 410461282 412783341 408429621 403573799 389036834
3155 389036834 354557988 309141888 265897782 231570915 205184558 184151246 167299342
3148 167299342 154141496 143922232 135901356 129582316 124607883 120691328 117939531 116244138
3140 116244138 115845554 116394908 117471373 119130422 121422791 124284949 128053912 133119774
3132A33119774N893803M728824K159129m23174j658411m02094J861116L371563
3124A48650530L128790M14719k307106l781534l551435l223393k564268j812675
3116A34953628l29123J023230K858953L934206L099337j75057m754283q388887
3108A32222004r872318q835299p495903o381078n180158m526203l663970l132079
3100H3134996k632156k216928k074606j821591j313657q71042l85460j08411L42502
3091G2053647M59403R40218J247045J178581P74468o3421p58920j484481j544230
3082G2802310j603039j523216j298756j006145r12749o00660m77917l65003Q328
3073F5023153M66316N00548R87886J571766J966961K383106K355792R70535p89553
$$ plain form
3132 133119774 139013577 143742401 145901530 145478356 143819945 143417851 145278967 148650530
3124 148650530 151779320 152194039 149886933 146105399 142553964 139330571 136766303 134953628
3116 134953628 134624505 135647735 138506688 142440894 145540231 145365174 140610891 132222004
3108 132222004 122349686 113514387 106018484 99637406 94457248 89931045 86267075 83134996
3100 83134996 80502840 78285912 76211306 74389715 73076058 72205016 71819556 71711145 72053647
3091 72053647 72513050 73453268 74700313 75878894 76653362 76589941 75831021 74346540 72802310
3082 72802310 71199271 69676055 68377299 67371154 66458405 65857745 65379828 65014825 65023153
3073 65023153 65489469 65990017 66977903 68549669 70516630 72899736 75255528 76226063 75436510
3064G5436510j365766j558790j158223r86360q85345o34000p73743n68222j53180
3055F7352881M30714M77845N38468R77491J288779J679907K147708K399225K929091
3046H0222109L169681L466635L992807M897451O023088P194518Q548072R816647
3038A27331008J1913195J4505721J8350766K3487648K9395982L3623804L0704732
3031B89312856J2373095j5390738l3810896l7650631l2435212k6273070k1117156
3024A35008248j7305540j3833764j1170977r165910p416680o394423n563287m463092
3016E9694575l667636l119159k671448k389568k139036k104266j862863j451646
3008D0288953j302065j507460j376341j302771j334405j302208j250306j145329
$$ plain form
3064 75436510 74070744 72511954 71353731 70367371 69482026 68848026 68074283 67506061 67352881
3055 67352881 67783595 68261440 68799908 69777399 71066178 72746085 74893793 77293018 80222109
3046 80222109 83391790 86858425 90851232 95748683 101771771 108966289 117514361 127331008
3038 127331008 139244203 153749924 172100690 195588338 224984320 258608124 289312856
3031 289312856 301685951 286295213 252484317 214833686 182398474 156125404 135008248
3024 135008248 117702708 103868944 92697967 83532057 76115377 69720954 64157667 59694575
3016 59694575 56026939 52907780 50236332 47846764 45707728 43603462 41740599 40288953
3008 40288953 38986888 37479428 36103087 34800316 33465911 32163703 30913397 29768068
3000B9768068j023374q30211q58908o91088l55490q80536n24472k64289n59730
2991B3779970o48896n57097l80945m18918n10176k23290o1797l20592j76904n7259
2981B0424096k9754q258N1716l06775l37067j27193K7121m60750l15164o3340
2971A8854632m06024k94287l50727m06618k15684o1919j84097j14207k03971k79956
2961A6337142l11677j61324n6806R8079J60508j8937q7878j4198J04857L595q6846
2950A5966515J72232M41936K26460J47426J35424L05419N06203L31570M55037
2941A8688222j37146l31332k97631j14599r1950k34834k19068k29203j70480j7298
2931A6844681K04608L84529L18673K14869k78829m51401p88012q47304p89104
$$ plain form
3000 29768068 28744694 27914483 27055575 26364487 26008997 25128461 24603989 24339700 23779970
2991 23779970 23131074 22573977 22193032 21774114 21263938 21040648 20978851 20658259 20481355 20424096
2981 20424096 20394342 20386084 20437800 20131025 19793958 19666765 19693886 19233136 18917972 18854632
2971 18854632 18448608 18154321 17803594 17396976 17181292 17119373 16935276 16821069 16617098 16337142
2961 16337142 16025465 15864141 15807335 15905414 16065922 16046985 15959107 15944909 16049766 16053361 15966515
2950 15966515 16138747 16580683 16807143 16954569 17089993 17395412 17901615 18233185 18688222
2941 18688222 18551076 18219744 17922113 17807514 17715564 17480730 17261662 17032459 16861979 16844681
2931 16844681 17049289 17433818 17752491 17967360 17688531 17237130 16449118 15601814 14812710
2922A4812710o86774o37206o82481m01970l93890k63778k49500j33982k62454
2913A1100675p399k23553j95166K2268q1984R8819Q5198O8246R2525j75103j42646
2902A0641880J95979K18830J47478L42474J02691K68945N25221M64021K59374
2893A3166893M10616O87872J97946m3308m96354o71533n51831n55701n49463m06010
2883A1189127k21151j89509k71783j64847K41k03185n9437M4747m9911K13949
2873A0288241j08902j96755M71156L73837N79457N90924O35673M84838K76778
2864A3395247k8317l48441p25700q83514l35232k47508n69283l32914j71053l39661
2854I413624j51080r7634j30121J57793K44570P5343M1969J09825J35282R0367
$$ plain form
2922 14812710 14125936 13488730 12806249 12404279 12010389 11746611 11497111 11363129 11100675
2913 11100675 11093276 10869723 10674557 10696825 10614841 10713660 10798858 10867104 10959629 10784526 10641880
2902 10641880 10837859 11056689 11204167 11546641 11649332 11918277 12443498 12907519 13166893
2893 13166893 13577509 14265381 14463327 14420019 13923665 13252132 12700301 12144600 11595137 11189127
2883 11189127 10967976 10778467 10506684 10341837 10342078 10138893 10079456 10124203 10074292 10288241
2873 10288241 10179339 9982584 10453740 10827577 11407034 11997958 12633631 13118469 13395247
2864 13395247 13366930 13018489 12292789 11409275 11074043 10826535 10257252 9924338 9753285 9413624
2854 9413624 9262544 9164910 9034789 9192582 9437152 9512495 9554464 9664289 9799571 9889938
2844I889938J08525K27147M80129N7985j05188J65940j5687L30643L56999L17914
2834A1814345M56580L3987j40397n01595r74682p39791k16916j93468k01696l02728
2824I033639m99306j73517L29761j68454j55869R6930J6605J37552p2381l04155
2814H240805M72151K99620R4018K39160L09737N16294O31576O94420J221464J554177
2804A4273422J627272J263719l576j544644k089218j607546j316729q15455n92770
2795I194475l97034k24078l81990m60170n41344l07310j8724k97415j40419k48924
2785F177067k34577j98744q0292j85463L3373p7066j40387p4586j10312l3430
2775E075583m9046k4168j09256P9390J46321O9354l08346j32922l02072l72095
$$ plain form
2844 9889938 9998463 10225610 10705739 10763724 10658536 10824476 10808789 11139432 11496431 11814345
2834 11814345 12270925 12304912 12164515 11662920 10688238 9948447 9731531 9538063 9336367 9033639
2824 9033639 8534333 8360816 8690577 8522123 8366254 8463184 8479789 8617341 8544960 8240805
2814 8240805 8712956 9012576 9106594 9345754 9655491 10171785 10803361 11497781 12719245 14273422
2804 14273422 15900694 17164413 17160837 15616193 13526975 11919429 10602700 9787245 9194475
2795 9194475 8797441 8573363 8191373 7731203 7189859 6882549 6863825 6566410 6425991 6177067
2785 6177067 5942490 5743746 5663454 5477991 5511364 5434298 5293911 5219325 5109013 5075583
2775 5075583 5026537 5002369 4893113 4972503 5118824 5188178 4879832 4746910 4444838 4072743
2765D072743o1724l8111P7128O2905P0671l73405j24975L13679J20434O8790j42379
2754D045756O0493J00357J23964Q729M6728M6386j94919p8378k19399j56952R351
2743C792116j29248k21312p4807j62911j6210J51828J01735j06109N53K2719R6894
2732C455248j5431N9741J20532J18081K49668R7858j87868q970J34009J0660m7716
2721C985812j66186j38425j59385j75485l83886l66719j7207j43390j56071r0917
2711B188141j92507j04426j2093J2038J62226j8122k0740r3456k37337K08946
2701A892670J38958k4172m8991J4309L6667j42849j32831J41411j43987K1048
2691A752233J4210l7012K2937p7248r2294o7668N3372j86004O9872J34525J03270
$$ plain form
2765 4072743 4011019 3972908 4050036 4112941 4183612 3810207 3685232 3998911 4119345 4188135 4045756
2754 4045756 4106249 4206606 4330570 4339299 4386027 4432413 4237494 4159116 3939717 3782765 3792116
2743 3792116 3662868 3441556 3366749 3203838 3187628 3339456 3441191 3335082 3335635 3358354 3455248
2732 3455248 3439817 3499558 3620090 3738171 3987839 4085697 3897829 3888859 4022868 4033528 3985812
2721 3985812 3819626 3681201 3521816 3346331 2962445 2595726 2578519 2435129 2279058 2188141
2711 2188141 1995634 1891208 1879115 1891153 2053379 2035257 2014517 1921061 1683724 1892670
2701 1892670 2031628 2007456 1958465 1972774 2009441 1866592 1733761 1875172 1731185 1752233
2691 1752233 1766443 1729431 1752368 1675120 1582826 1515158 1568530 1382526 1452398 1586923 1690193
2680A690193k76388m5750l0984o1151o4285j07471J86878O9674k22990j71918
2670I65808N5135L065N6608O1877k8937p9508N2615M9551j22897j99889K31123
2659A044551k25832l5939Q0701J00805P3241m9018k51587K6132M2630o0821m7323
2648F97540r4301q5172J86947J64359k14132q9907J13675L74455J39591K596j32951
2637A062700k30693j35472R8854J44379o2600R1151Q6599l3223j04592l10721
2627F06382K80418P4846k69321j7736R4370O3789K9836j4301k22807L63359N9496
2616A048331k45241q8253l9079J7613L443j2767J00291O2685N2975J97559m6207
2605A051350q7600J37510K1989k4700J25048p1327j453k4502p6474m0355J35184
$$ plain form
2680 1690193 1413805 1368055 1337071 1275920 1211635 1104164 1291042 1360716 1137726 965808
2670 965808 1020943 1024008 1080616 1142493 1113556 1034048 1086663 1136214 1013317 813428 1044551
2659 1044551 818719 782780 863481 964286 1037527 988509 736922 763054 805684 744863 697540
2648 697540 603239 518067 705014 869373 655241 565334 679009 1053464 1193055 1195651 1062700
2637 1062700 832007 696535 795389 939768 877168 968319 1054918 1021695 917103 606382
2627 606382 886800 961646 692325 674589 768959 832748 862584 848283 625476 988835 1048331
2616 1048331 803090 714837 675758 693371 696814 684047 784338 847023 899998 1097557 1051350
2605 1051350 963750 1101260 1123249 1098549 1223597 1152270 1150817 1126315 1049841 1009486 1144670
2594A144670j25764o0593K5314k22367M7607k16464j38853J76948q7756K38253
2584G80995K35679j57441Q2040J13914m4648O2224K4930R289j03755l2962k5516
2573I44749k9039J00645L6225r0849M9525k47053o6647j33611n2434O0167J57280
2562G28958L69907Q7942j77561j22556r5423J331J92905k33463M1551J57867k45134
2551G06324o5412n8136R676L8293R7763O0740K59621R2794k49661q1801J31850
2540I42051K2293J19343j1833r5357Q3282N3633k00940k4616N0781j49684J76995
2529I65948l717j29968j10730j61707j74317j7322K30607k5507r7500m2862k1290
2518D11635P2898m4015L3016l45J35168R4641j75645j36735J77852J7826j27720
$$ plain form
2594 1144670 1018906 958313 983627 761260 808867 592403 453550 630498 542742 780995
2584 780995 1016674 859233 941273 1055187 1010539 1072763 1097693 1106982 1003227 970265 944749
2573 944749 915710 1016355 1052580 961731 1011256 764203 697556 563945 511511 571678 728958
2562 728958 1098865 1186807 1009246 886690 791267 792598 985503 752040 793591 951458 706324
2551 706324 640912 582776 592452 630745 728508 789248 1048869 1141663 892002 810201 942051
2540 942051 964344 1083687 1071854 976497 1059779 1113412 912472 887856 938637 788953 965948
2529 965948 962231 832263 721533 559826 385509 368187 598794 573287 475787 432925 411635
2518 411635 484533 440518 473534 473189 608357 702998 527353 390618 568470 586296 458576
2507D58576j7802r8302J3282L3365k28796J68215J21413j04724m213J7360k3760
2496C34614q6216j8989J14287o9328J03623O026r4848O5095k6814N4526j18797
2485B63179m5656j61956M0577J72114O3714o429j276J92379m3839M1398J048r0475
2473D24778K4262K7781K0535n57m0823N8469M2100k08627K6557J85842j16343
2462D43974j48265n0411K9228L8324J03659j51642m5112J04695J95076k81352
2452B38174q2646L3556K08443K03702p2111M4216N4369k26720J2794P334J79438
2441F00549n8531r6309O076p502K3589k04707K10035j00203M864l3573N381J2190
2429C61859j3361k4263K19524L2605o3142J06966p4957r9436Q8682j79661j3156
$$ plain form
2507 458576 440774 342472 355754 389119 160323 328538 449951 345227 341014 358374 334614
2496 334614 248398 229409 343696 274368 377991 384017 289169 354264 327450 381976 263179
2485 263179 217523 55567 96144 268258 331972 325543 324267 516646 472807 514205 515253 424778
2473 424778 449040 476821 497356 496799 455976 514445 556545 347918 374475 560317 443974
2462 443974 295709 245298 274526 312850 416509 264867 219755 324450 519526 238174
2452 238174 155528 189084 397527 601229 529118 573334 627703 400983 413777 421111 600549
2441 600549 542018 445709 451785 444283 467872 263165 473200 372997 377861 344288 349669 361859
2429 361859 348498 324235 543759 576364 513222 620188 545231 445795 534477 354816 341660
2418C41660l3990J53590J78969n3997J3148o2033K1102j3121J24706m5569j48466
2407D75999N5056j5451k70690n2180K32565j73027m1906M7051j0988J58663O3645
2396D68737m5296O1504j88156R2514K6079o007o2310l9370J02457J1261n8911
2385C62502J4063J6879j14331m2094m2262K4759l6292J7002M7518J24881l2563
2374C40062k8161o5297j24166R784K70976J3181O6499O1992o7118J07253k35259
2363C49746j60366Q3273J1174K49490Q18j57293p2501k20000j73401L74740L08057
2352E93737j52440j01991j63663O2464J83197o23j25414K4702k0336n8688j1396
2341B29549N0988J36120J17852k17881R0757j43947j81652j6J35549N5576j65528
$$ plain form
2418 341660 307670 461260 640229 586232 599380 537347 558449 545328 670034 624465 475999
2407 475999 531055 515604 244914 192734 425299 252272 210366 257417 246429 405092 468737
2396 468737 423441 484945 296789 389303 415382 409375 347065 307695 410152 421413 362502
2385 362502 376565 393444 279113 237019 194757 219516 183224 200226 247744 372625 340062
2374 340062 311901 246604 122438 132222 403198 416379 482878 544870 477752 585005 349746
2363 349746 189380 272653 283827 533317 534135 376842 304341 84341 -89060 285680 593737
2352 593737 441297 339306 175643 238107 421304 420681 295267 319969 299633 240945 229549
2341 229549 280537 416657 534509 316628 407385 263438 81786 81770 217319 272895 107367
2330A07367m3071o0764K78801P9536N5251L4536p6065K7182P1863j60023J6298
2319C30911K31405M751l2121r032n5726j38314k7826L186J17142q2958j1709R9611
2307D29320j46011N5173p9642J54190K3339J58677j16518k6211n6053P3118M0546
2296E09928j3750R6708M801L4136o8722O7230q3807j75165R1402J41446j49816
2285D54391r6514q5942J40003J33147J5229J80022m6807o7451J11649p6083J7102
2274F78746j60657J69545P2685P8121J48122O4457j01403l9228q5142O6581P9440
2263I71267p2615o2511k24469Q706K2533J67623N161K69907N8094N6589N6025
2252A256310j84637J11925P7939j41341j26431P3803K98354j59896n4857Q8362
$$ plain form
2330 107367 64296 3532 282333 361869 417120 451656 375591 402773 474636 314613 330911
2319 330911 562316 567067 534946 525914 470188 331874 304048 307234 424376 341418 329709 429320
2307 429320 283309 338482 258840 413030 436369 595046 478528 452317 396264 469382 509928
2296 509928 496178 592886 597687 631823 563101 630331 546524 371359 462761 604207 454391
2285 454391 357877 271935 411938 545085 560314 740336 693529 626078 737727 661644 678746
2274 678746 518089 687634 760319 838440 986562 1051019 949616 910388 825246 891827 971267
2263 971267 898652 836141 611672 620378 642911 810534 815695 1085602 1143696 1200285 1256310
2252 1256310 1071673 1183598 1261537 1120196 993765 1067568 1365922 1206026 1151169 1239531
2242A239531l1412K21688P0110r6240M5512n8318n2176J34358j2825J18754l5742
2231A543240L2792K91144r0643j45059J31131j49645K45755P9473R3727M7974
2221B079889M3936J07749P0939J25093J9874R0119j10433J34945M2955j29362
2211B475704L4784k4188j22780R702J01318k2938O4675q2285K31435J65787q4849
2200B746365j7017J55237Q0412l1613O1716N7774J24071N0885L10098J29741R3527
2189C761196P8424J58809L15164K56202l1267J60604J85511J26077m6855J55878
2179E119743K21738J33024K68645M0269J13284L72252L30567K28047L31408L86927
2169G545904M67628O30510M42010N12098O42510N80519P09734O10079M46547J46745
$$ plain form
2242 1239531 1208119 1429807 1499917 1403677 1449189 1390871 1338695 1473053 1460228 1578982 1543240
2231 1543240 1576032 1867176 1776533 1631474 1762605 1612960 1858715 1938188 2031915 2079889
2221 2079889 2123825 2231574 2302513 2427606 2447480 2537599 2427166 2562111 2605066 2475704
2211 2475704 2510488 2486300 2363520 2373222 2474540 2451602 2516277 2433992 2665427 2831214 2746365
2200 2746365 2729348 2884585 2964997 2933384 2995100 3052874 3176945 3227830 3537928 3667669 3761196
2189 3761196 3839620 3998429 4313593 4569795 4538528 4699132 4884643 5010720 4963865 5119743
2179 5119743 5341481 5474505 5743150 5783419 5896703 6268955 6599522 6827569 7158977 7545904
2169 7545904 8013532 8644042 9086052 9598150 10240660 10821179 11530913 12140992 12587539 12734284
2159A2734284m80031p38878p75075j027459p38095q35675p43432l05060k85592
2150F804987m90028k36525j47580m05247l03534k59498j60198k68581Q1115j38027
2140D476884q7220J4612o6492o7188J85811J11756N484J04369K48525M43643J01795
2129E471979l46372n26669k45296k61892j76885j66830j26737j60118j88198j40504
2119C132478k53602j2199J30177j6835j96073L0669J98756N0093m7983j45485
2109B869996K91518O1774L2760j82332Q6808L27483M77165J86951J06120K68581
2099D526824M99545P73823N27506K14236m33974p62528o71200n46969n53809m56311
2089C117143k56659k22160j40283p9948j55298l6225n6572p8395k4501O1378o6035
$$ plain form
2159 12734284 12254253 11515375 10740300 9712841 8974746 8139071 7395639 7090579 6804987
2150 6804987 6314959 6078434 5930854 5525607 5222073 4962575 4802377 4533796 4614911 4476884
2140 4476884 4389664 4404276 4337784 4270596 4456407 4568163 4573647 4678016 4926541 5370184 5471979
2129 5471979 5125607 4598938 4353642 4091750 3914865 3748035 3621298 3461180 3272982 3132478
2119 3132478 2878876 2866677 2996854 2980019 2783946 2814615 3013371 3063464 3015481 2869996
2109 2869996 3161514 3223288 3256048 3073716 3160524 3488007 3965172 4152123 4258243 4526824
2099 4526824 5026369 5800192 6327698 6541934 6107960 5345432 4674232 4127263 3573454 3117143
2089 3117143 2860484 2638324 2498041 2418093 2262795 2226570 2169998 2091603 2067102 2128480 2062445
2078B062445q1829n4071o6464J4387J2043J71097j34879m9559K42281K17377J1176
2067B344004J07098J09762J88271L04778M09224L02708l99323n80634m06417l38803
2057B040668m19559j34614Q6793j88659k5816j22830Q806R550j77941J18037r5215
2046A099220k32315p5026p1688P2188L9538o3849j65655R4546J0959q8704J81803
2035H01017r3583n7536j691j80037J8095J13472j19246N7420j21243o6086J19630
2024D70212j0144j02817J39314j27131J17625J08374Q6091l6197m8834k53712
2014C42781J68471P9907k68189J24907Q7531Q1423r371r7016m7636K273N8309
2003E23390o9594j89343j70169J08697J01506m74J46697K8571l29J1575j50416
$$ plain form
2078 2062445 1980616 1926545 1860081 1874468 1886511 2057608 1922729 1873170 2115451 2332828 2344004
2067 2344004 2451102 2560864 2749135 3053913 3463137 3765845 3366522 2785888 2379471 2040668
2057 2040668 1621109 1486495 1573288 1384629 1358813 1235983 1244789 1254339 1076398 1194435 1099220
2046 1099220 866905 791879 720191 792379 831917 768068 602413 696959 707918 619214 801017
2035 801017 707434 649898 648207 468170 486265 599737 480491 537911 416668 350582 470212
2024 470212 460068 357251 496565 369434 487059 595433 681524 645327 596493 342781
2014 342781 511252 591159 322970 447877 535408 616831 607460 510444 462808 465081 523390
2003 523390 453796 264453 94284 202981 304487 304013 450710 479281 478952 490527 340111
1992C40111j65242K15250J71113K7569k3852k19375j0090r8309l1711L10525q3751
1981D32238j09243l6624p3798j5753l8253q4288J83018R4573m8032q4394k32377
1970a2933N2694n3621K3761q7115J02581J41655J61512O2417p7363j01334j6348
1959A95906l2628l2308Q1818K8290m9857N1618J02378j9542j41073L1491J95581
1948D11674k39929k499J4568p2715o3438L10187j9527r2841k13941p218K26244
1937B50565N7974O4976j73846j4398K5078j42472J45786J07063j29469k31920
1927d0663m6293Q2995O752J72511q234o8810K6985j7002j46668N4506J05637K02048
1915C23764N7405k32538o4852K7066Q4700K5436J4590j89429J24104L0378j65142
$$ plain form
1992 340111 174869 390119 561232 588801 564949 345574 335484 237175 205464 515989 432238
1981 432238 322995 286371 212573 196820 158567 74279 257297 351870 303838 219444 -12933
1970 -12933 39761 -13860 9901 -77214 25367 167022 328534 390951 313588 212254 195906
1959 195906 163278 130970 212788 241078 191221 242839 345217 325675 184602 216093 411674
1948 411674 171745 169246 183814 111099 47661 357848 338321 245480 31539 24321 250565
1937 250565 308539 373515 199669 185271 210349 67877 213663 320726 191257 -40663
1927 -40663 -86956 -3961 2791 175302 167068 98258 125243 108241 -38427 16079 121716 323764
1915 323764 381169 148631 83779 110845 195545 220981 235571 46142 170246 200624 35482
1904C5482j63702K07691J8625k1972K7339o9585j8101m0671M1996J04402J23584
1893B45088J562N3709J6707j34990P6289r5344l8683N0710j05446J07643m1406
1882A35839N425L3658J01341L2948j62715M1820L2273p0159k3989L3350j03168
1871E6623Q1231J74378N8773N5167r8145k34637J63001O291j06435K55858P1023
1860D83128l4967K6893k35275M9400K4766n8306o885O4163J51879R316J85668
1849F59780j85809J23869j43990m6614J57925L5381o4436m1405J74256J1537m1243
1838F39251K9164q6794n9121J40771J18768o685j23771M4469P6691L3738J30080
1827I36561j04857n3778j43820J86831J53229O8559j67548q4133K50501M3080
$$ plain form
1904 35482 -128220 79471 98096 76124 103463 33878 15777 -24894 17102 121504 245088
1893 245088 246650 300359 317066 182076 258365 163021 124338 175048 69602 177245 135839
1882 135839 141264 174922 276263 309211 146496 188316 220589 150430 126441 159791 56623
1871 56623 137854 312232 371005 426172 328027 93390 256391 262682 156247 412105 483128
1860 483128 448161 475054 239779 289179 313945 255639 248754 312917 464796 474112 659780
1849 659780 473971 597840 453850 407236 565161 600542 536106 494701 668957 680494 639251
1838 639251 668415 581621 522500 663271 782039 775354 651583 696052 772743 806481 936561
1827 936561 831704 777926 634106 820937 974166 1042725 875177 791044 1041545 1084625
1817A084625r490k1273j13272J48803j18861p4009K75783M7513k18701l0407l6671
1806I34040J34173o727R0640L1343M918K21148J51243k86055R765J53954k28856
1795A209586K31389k12987j80545J17385j0993q6874J72057j80765j10099J70149
1785A118303o5697l3313q3587m1411L0119K49495j34320K7879J23968j12550j60024
1774I18862q1536R8972J40732K7317m9932K87059j13267j91263q184L3759q2544
1763I79975M3658j31002O414j61046J30200K07805j17875N1675j08015k6655L407
1752H78541l3116o7878J31037j24948K6645J82909k5834J28609j72531l26728
1742E96706N3922R3130O6249J62432k5006j21523K3450K44708j43524r112J23452
$$ plain form
1817 1084625 1075135 1053862 940590 1089393 970532 896523 1172306 1219819 1001118 970711 934040
1806 934040 1068213 1061486 1152126 1183469 1188387 1409535 1560778 1274723 1284488 1438442 1209586
1795 1209586 1440975 1227988 1047443 1164828 1153835 1066961 1239018 1058253 948154 1118303
1785 1118303 1052606 1019293 935706 894295 924414 1173909 1039589 1067468 1191436 1078886 918862
1774 918862 837326 936298 1077030 1104347 1054415 1341474 1228207 1036944 1028760 1062519 979975
1763 979975 1023633 892631 899045 737999 868199 1076004 958129 1009804 901789 875134 878541
1752 878541 845425 777547 908584 783636 810281 993190 967356 1095965 923434 596706
1742 596706 650628 743758 810007 972439 947433 825910 849360 1094068 950544 941432 1064884
1731A064884J32690k17061K60558O5117p4688N8512j25456j4759j10217r5454
1721I44126J90010K8912k36286N0460j14873p6133j84658j16582J26942k8210
1711E83708j66955O9376L1833N4936p3830j59549P0692j29573j50435J69695m82
1700B99416M1838m3414j53534J38171J52663J22421K18879l08120k23422R335
1690B54233O7850J12670J01589m4160j46335J25144K36388n961J56398k7615j11524
1679G18677j75589j04532K49228q9541K6904k02590k38589J31081J56653J41822
1669F13524j93170m10750N9921L3388j23585r4192J25946J36153O5052p3933j85443
1658d7089p4657J98483k09707j38739J82025m6286K2470J9598J22999P1907j9248
$$ plain form
1731 1064884 1197574 980513 1241071 1306188 1231500 1290012 1164556 1149797 1039580 944126
1721 944126 1134136 1163048 926762 977222 862349 786216 601558 484976 611918 583708
1711 583708 416753 486129 517962 572898 499068 339519 410211 280638 130203 299898 299416
1700 299416 341254 297840 144306 282477 435140 557561 776440 468320 244898 254233
1690 254233 322083 434753 536342 492182 345847 470991 707379 701418 857816 830201 718677
1679 718677 543088 438556 687784 598243 625147 422557 183968 315049 471702 613524
1669 613524 420354 9604 69525 102913 -20672 -114864 11082 147235 212287 138354 -47089
1658 -47089 -121746 76737 -132970 -271709 -89684 -135970 -113500 -93902 29097 101004 81756
1647H1756k48432K6709J38888n3751m7989j05811J3921J23142M6219N5828R4189
1636A24669j74058L346r9472J10976o6884r5135P2792M0614n2070n8380k5752
1625b19354j22928O3152Q0737p5658p9703j4825K4752L8345l3945Q5485K35368
1614a8574k939o5794Q4280o4088K11526j16145j85599r5777r7123R3811M3517
1603b12905j66745K4824J53045Q8556n4997n9277j03747L8747j7735q771K7098
1592b91907J1284M4627n5209J51675R2692j18437n7831m9584K30026j88874j50871
1581c82409J83700J74070k22916L289p8231P4869k1002j07864N8297j43153J24582
1570c36768N8734j6458K8049J70080m5836J53338m8740k29490J04111o8590j49712
$$ plain form
1647 81756 -166676 -139967 -1079 -54830 -102819 -208630 -194709 -71567 -25348 30480 124669
1636 124669 -49389 -46043 -145515 -34539 -101423 -196558 -123766 -83152 -135222 -193602 -219354
1625 -219354 -342282 -279130 -198393 -274051 -353754 -368579 -343827 -305482 -339427 -253942 -18574
1614 -18574 -21513 -87307 -3027 -67115 144411 28266 -157333 -253110 -350233 -256422 -212905
1603 -212905 -379650 -354826 -201781 -113225 -168222 -227499 -331246 -292499 -310234 -319005 -291907
1592 -291907 -280623 -235996 -291205 -139530 -46838 -165275 -223106 -272690 -42664 -231538 -382409
1581 -382409 -198709 -24639 -247555 -244266 -322497 -247628 -268630 -376494 -318197 -461350 -336768
1570 -336768 -278034 -294492 -266443 -96363 -142199 11139 -37601 -267091 -162980 -231570 -381282
1559c81282O8880j54380p0868K45850J44588N1400K13939j43569j16999k0416
1549a62857q5868J88535p2545L988p4720j07022J11055J05287n6389q3168L3285
1538b00419o8423M3809j87383J75167J40032J04212j21652l2972Q8776j7525r1403
1527a67781j10508L4411N9543L1391J60533r9783k73300K36093K1781j23601n7497
1516b88718r654M4692q1945j1843p0842m0046J38352O1264l8473n6196O4092Q2695
1504b06622p952m5279l7748J23360j03085p1396J49909M3587k8214K21705K4685
1493F2950l71830j19594J58790j06947J3618j08813j68766M42684n4253K840J32450
1482a16871J62690j39567J58433r8297k39864k9883j4774R7778J3782J175J60646
$$ plain form
1559 -381282 -312402 -466782 -537650 -291800 -147212 -95812 118127 -25442 -142441 -162857
1549 -162857 -248725 -60190 -132735 -128747 -203467 -310489 -199434 -94147 -150536 -233704 -200419
1538 -200419 -268842 -225033 -412416 -237249 -97217 6995 -114657 -147629 -58853 -76378 -167781
1527 -167781 -278289 -243878 -184335 -152944 7589 -92194 -365494 -129401 -107620 -231221 -288718
1516 -288718 -298372 -253680 -335625 -347468 -418310 -458356 -320004 -258740 -297213 -353409 -289317 -206622
1504 -206622 -214574 -259853 -297601 -174241 -277326 -348722 -198813 -155226 -183440 38265 62950
1493 62950 -308880 -428474 -269684 -376631 -363013 -471826 -640592 -197908 -252161 -249321 -116871
1482 -116871 45819 -93748 64685 -33612 -273476 -303359 -318133 -220355 -206573 -205398 -44752
1471d4752J92895k86917j46227q3663J37944K3237r968J49998k02271o9993N1800
1460b87917K0446P9427R0672M5289n305o1022k91285j78999J89517N9256j5948
1449c55869J03282j45010J09107P4869J5150N7271o8113l8254Q5672j32543m6394
1438c40832J6436J6184O496J76969j37587K1457R0650n4824K4454j25137O372
1427b99362J16964r6036O8386K7974k4027J24482j9864l5931M9549j28805k48152
1416d64822L7364K73840N8678O4093N5827k87565J31202J4518k01173n1826J32726
1405b37138J47286m7507K7674j77477j48572J95580M4634j49104Q5475J10363
1395a48786K1949N3297p3644k18663O8417J93970j97233P6793o8736k5246J83410
$$ plain form
1471 -44752 148143 -138774 -285001 -368664 -230720 -207483 -217451 -67453 -269724 -339717 -287917
1460 -287917 -267471 -188044 -97372 -52083 -57388 -118410 -409695 -588694 -399177 -339921 -355869
1449 -355869 -252587 -397597 -288490 -213621 -198471 -141200 -209313 -247567 -161895 -294438 -340832
1438 -340832 -324396 -308212 -301716 -124747 -262334 -240877 -150227 -205051 -180597 -305734 -299362
1427 -299362 -182398 -278434 -210048 -182074 -206101 -81619 -101483 -137414 -87865 -216670 -464822
1416 -464822 -427458 -153618 -94940 -30847 24980 -262585 -131383 -116865 -318038 -369864 -237138
1405 -237138 -89852 -137359 -109685 -287162 -435734 -240154 -195520 -344624 -259149 -148786
1395 -148786 -126837 -73540 -147184 -365847 -297430 -103460 -300693 -223900 -292636 -317882 -134472
1384a34472k5928j69488K56556L7778k19954J02566J22255L964J2550j37413m5972
1373a97558m3382J82979m1376k59636M4032J26706J74857Q9752j59708j19718
1363b03052K2083j14144j9305J49261o7010R2537J38549k21806K2750m1186O3444
1352a77879n1108K63900J2213k72251J01185p8402j1473R1230k1161j5919m034
1341a63699K8584l0077n5779M4876R8640M7877M2927L4631k6427Q9215k41241
1330a30473L2622K9495j11881k17685J83328K27536O6717j58103j83925O3956
1320a98413K29818j25307r4490N034j24240M2179L2718R2715L5341j68983p6502
1309c50130l1997P3423J71850j11680k41072M1489J44641P2162r2362J71326K82267
$$ plain form
1384 -134472 -160400 -329888 -73332 -35554 -255508 -152942 -30687 -26723 -14173 -151586 -197558
1373 -197558 -240940 -57961 -99337 -358973 -314941 -188235 -13378 76374 -83334 -203052
1363 -203052 -180969 -295113 -314418 -165157 -232167 -139630 -1081 -222887 -200137 -241323 -177879
1352 -177879 -228987 34913 47126 -225125 -123940 -202342 -213815 -122585 -143746 -159665 -163699
1341 -163699 -135115 -165192 -220971 -176095 -77455 -29578 13349 47980 21553 110768 -130473
1330 -130473 -97851 -68356 -180237 -397922 -214594 12942 79659 -78444 -262369 -198413
1320 -198413 31405 -93902 -188392 -183358 -307598 -265419 -232701 -139986 -104645 -273628 -350130
1309 -350130 -382127 -308704 -136854 -248534 -489606 -448117 -303476 -231314 -323676 -152350 129917
1298A29917j62977j12254o2701J2577J6717j79317j12646J64635J18032J07362
1288h0655k75791Q5489M1200J15136j15352r0178K6308M2427J65767j29182l0275
1277b45106P5679K7551k7176R6116J17410j53588k3896q4171K7714J01483J843
1266h6141M2722L6202o3204q9939P345o067j25657J19899J5817k195J03778J10062
1254F2622l8784n7432o3620J12961j05477n691L8472j01960o2421O6772O7893
1243h6665j21591k6778R9609K01201J0697J26819N4628j46951J9688M7084k3049
1232A54692K6844L4746o9896j63472J44181p2273j77914J77011n4085r4712m2290
1221a37168q2779j5029J39911K39317p6986r7621l1781Q0401j5080k3393k4877
$$ plain form
1298 129917 -33060 -145314 -208015 -195438 -178721 -358038 -470684 -306049 -188017 -80655
1288 -80655 -356446 -270957 -229757 -114621 -229973 -320151 -293843 -251416 -85649 -214831 -245106
1277 -245106 -169427 -141876 -169052 -72936 44474 -109114 -133010 -217181 -189467 -87984 -86141
1266 -86141 -43419 -7217 -70421 -160360 -153015 -159082 -284739 -164840 -149023 -151218 -47440 62622
1254 62622 23838 -33594 -97214 15747 -89730 -95421 -56949 -158909 -221330 -154558 -86665
1243 -86665 -208256 -235034 -135425 65776 76473 203292 257920 110969 130657 177741 154692
1232 154692 181536 216282 146386 -17086 127095 54822 -123092 53919 -166 -94878 -137168
1221 -137168 -219947 -234976 -95065 144252 67266 -30355 -62136 18265 3185 -20208 -45085
1210d5085R5991p0218k23293j23308J66830J54171j2189R4085o3386N8648J82832
1199B15078m15048k3136N3715p4085K74612j03081J0289J01105N9945r3713q0680
1188g4999k2356J70757J15319Q0469k62049m5193J01824k09121J55882n2821N2493
1177A0205k7638j04146q2810l0727P4613J62606N830n3327K27480J9795j54978
1166D6903J46347k1654l4598m4970n2632Q2188n4418K4814n1561N4316m1766Q7483
1154A40452J92866k24318r4143j10486N7012j1930l7752K19664J62925j37841
1144A56449m5111k4401J06196k4431j92097J4012P5845K8424R6181j76254J60426
1133A75239J46457k3074j70809L07358M880k87832J8819j59083J83213J12289
$$ plain form
1210 -45085 50906 -19312 -242605 -365913 -199083 -44912 -57101 36984 -26402 32246 215078
1199 215078 -199970 -223106 -169391 -243476 31136 -71945 -61656 39449 99394 5681 -74999
1188 -74999 -97355 73402 188721 269190 7141 -38052 63772 -145349 10533 -42288 10205
1177 10205 -17433 -121579 -204389 -235116 -160503 2103 7933 -45394 182086 201881 46903
1166 46903 193250 171596 136998 92028 39396 121584 67166 91980 40419 94735 52969 140452
1154 140452 333318 109000 14857 -95629 -38617 -50547 -88299 131365 294290 156449
1144 156449 111338 86937 193133 168702 -23395 -9383 66462 94886 191067 14813 175239
1133 175239 321696 298622 127813 435171 440051 152219 171038 11955 195168 307457
1123C07457q8226k0827O8841O4145Q0281l17801j08409J38514Q6783q5861J98951
1112C23848R9188l0855M8748k7158j33203K35520K9844j93287j59185J15871O3401
1101C72732q8440r9180Q736J84128J22008o4787l03285l1307L5196k650L19156
1090D52307j3738k46031n7528K15288N4611j5994j5509p5052J60873l6871n8111
1079C64245m7483J31564r0599K42549R5405k876j60204n1996N8307O0225J01961
1068G01098r9533J66365R0961j32052k6823J28603j6829r7980k1198m4380M1471
1057F89703K0792j53837J49133N2474M1731N5230j02260o4220R1347j27349J79171
1046H31915K6763j05690J35665N2550k7199K13148p1758j56077J1363r1602J00339
$$ plain form
1123 307457 219231 198404 267245 331390 411671 93870 -14539 123975 210758 124897 323848
1112 323848 423036 392181 440929 413771 280568 516088 545932 352645 193460 309331 372732
1101 372732 284292 185112 193848 377976 499984 435197 131912 100605 135801 133151 452307
1090 452307 438569 192538 135010 350298 404909 388915 373406 298354 459227 422356 364245
1079 364245 316762 448326 357727 600276 695681 692805 532601 480605 538912 599137 701098
1068 701098 601565 767930 858891 726839 700016 828619 811790 713810 692612 648232 689703
1057 689703 710495 556658 705791 758265 799996 855226 752966 688746 780093 652744 831915
1046 831915 858678 752988 888653 941203 914004 1127152 1055394 899317 910680 819078 919417
1035I19417R9165l5774j43287L60732K35588j38879j81622M8374K27574J52801
1025A544089N5353M7526J78772l4071j08797K903K15087R9448j5286o6900j0142
1014A907982K43837r3512j21153J81688J29456K45040J4618J00196J7635J40287
1004B766074j0233O808j03149P8748J89100J51889M13325J01361n0541j3593L540
993C533329J62672P292J16941R9866o0187L27289L02541N1662O9238K96874K4928
982D932445O1475O04658K79379K71268K39485M80502K16006L21638L92075M14263
972H213194M84897L97683O39766L55142Q04081O89769Q28063J055233J212969
963A4680797J033846P95179N54739Q13359J537470J651530J880613K531629L201853
$$ plain form
1035 919417 1018582 982808 839521 1200253 1435841 1296962 1115340 1163714 1391288 1544089
1025 1544089 1599442 1646968 1825740 1791669 1682872 1685775 1900862 2000310 1985024 1918124 1907982
1014 1907982 2151819 2058307 1937154 2118842 2248298 2493338 2507956 2608152 2625787 2766074
1004 2766074 2755841 2762649 2659500 2738248 2927348 3079237 3492562 3593923 3543382 3529789 3533329
993 3533329 3696001 3703293 3820234 3920100 3859913 4187202 4489743 4541405 4610643 4907517 4932445
982 4932445 4993920 5598578 5877957 6149225 6388710 6869212 7085218 7406856 7798931 8213194
972 8213194 8698091 9095774 9735540 10090682 10894763 11584532 12412595 13467828 14680797
963 14680797 15714643 16509822 17064561 17877920 19415390 21066920 22947533 25479162 28681015
954B8681015L632411M296908N519831P364626J0452924J3325025J1489528k628732
946H2133536j3177798j4246726j0759775p482556n969661m824860l811564k780972
938A9079624k252994j788880j513289j175429r51389l20874o20117o19273p46120
929I091259o39938q32790m73582n51001m00605n44656k53015l6192k81890l07528
919D770062l26034l07525j91291j67642m13766j77158J86922K2444j70451l48091
909B877470k73176l6625K28397j78264m09517k6899N0915L5781k28870K91j45640
898A893863M8267k0622j17648K33972j59982l05125R2911J47067m3282k915o4885
887A701621j72805Q1091j29625r9693R8984j29212q4350K9853l2610j01575j11420
$$ plain form
954 28681015 32313426 36610334 42130165 49494791 59947715 73272740 84762268 82133536
946 82133536 68955738 54709012 43949237 36466681 30497020 25672160 21860596 19079624
938 19079624 16826630 15037750 13524461 12349032 11397643 11076769 10456652 9837379 9091259
929 9091259 8451321 7618531 7144949 6593948 6193343 5648687 5395672 5359480 5077590 4770062
919 4770062 4444028 4136503 3945212 3777570 3363804 3186646 3373568 3396012 3225561 2877470
909 2877470 2604294 2567669 2796066 2617802 2208285 2181386 2232301 2268082 2039212 2039503 1893863
898 1893863 1942130 1921508 1803860 2037832 1877850 1572725 1665636 1812703 1769421 1766506 1701621
887 1701621 1528816 1609907 1480282 1380589 1479573 1350361 1266011 1295864 1263254 1161679 1050259
876A050259P9687P0766j1916J69773j80362r2741J4153r025q5936L7385j1581
865A030462N624j00044O8778k5282K5036p7433k53101J56414J29318j50347k22898
854E86527k50093j7191N2565J8582K9765P7396o4104O0385R5317k54544Q142J88605
842E31352M0347J31577j7807O2069j85077j59252J80423p8869m4344J43926o8994
831E35351r4456q3450j03333k3526J32965r471j2276L7179j2520j2325J3166j33835
819B33469J00406j44786p4946K47382n5533j23565l1584N9126l8767J5964J20208
808C07374j5084n9714P8222J92183j55021j58734J27492j87250j23268p3343k0075
797h7218J58624Q1430k9232j66615J46138P4152j25098M5007r6401J40665j48019
$$ plain form
876 1050259 1129946 1200712 1188796 1358569 1178207 1085466 1099619 1090594 1004658 1042043 1030462
865 1030462 1036086 936042 1004820 979538 1004574 927141 674040 830454 959772 809425 586527
854 586527 336434 319243 371808 390390 420155 497551 433447 493832 589149 334605 342747 531352
842 531352 571699 703276 685469 747538 562461 403209 583632 504763 460419 604345 535351
831 535351 440895 357445 254112 230586 363551 354080 341804 378983 366463 354138 367304 233469
819 233469 333875 189089 114143 361525 305992 182427 150843 209969 171202 187166 307374
808 307374 292290 232576 310798 502981 347960 189226 316718 129468 6200 -67143 -87218
797 -87218 71406 152836 123604 -43011 103127 177279 52181 97188 787 141452 -6567
786f567k5998r8094J3604l4800J31527j5410N2242r6490J4585J63149Q5755n1589
774A31914J3722J2309j65357J884O7072k52314J41012P0978Q5035p8803Q4451
763A11903K53373l43090k12150J63058L35K3128j17749j1430J15120R5173N4324
752A31995l4074O8858p4172j4652L918j56606J35391J56182j33494l8960O1625
741A06011j0584j29869O6106p8041K38768n8204m0480R455j05837j75532K21359
730D3152k95066P3538K63200m2886J40543J05527K334k12907k40460K60430R8515
719A95920O1582j47327j22256j0843j76874j02683K62343n510o9016J52706k0956
708A7086l8289l7283N5252r2386k4902N3878O1388J40684Q3237k05541L9663P6093
$$ plain form
786 -6567 -32565 -130659 -117055 -151855 -20328 -35738 16504 -79986 -65401 97748 183503 131914
774 131914 145636 157945 -7412 -5528 61544 -190770 -49758 21220 106255 27452 111903
763 111903 365276 22186 -189964 -26906 -26571 -3443 -121192 -132622 -17502 77671 131995
752 131995 97921 166779 92607 77955 81873 -74733 60658 216840 83346 44386 106011
741 106011 95427 -34442 31664 -46377 192391 134187 93707 103162 -2675 -178207 43152
730 43152 -251914 -178376 84824 41938 182481 288008 290342 77435 -163025 97405 195920
719 195920 257502 110175 -12081 -22924 -199798 -302481 -40138 -45648 -114664 38042 17086
708 17086 -21203 -58486 -3234 -95620 -120522 -66644 -5256 135428 218665 13124 52787 128880
696A28880p1345l4794m9074M5636J05399l27283m7019L13762l5846J06694o1263
685G3747j14562R544J9692p044J12702L9903j35673K48273k02464j56955M601
674a08236L6063k6649K22252J20795J32993k52816j16826N3318J85857J32540
664C79291q5606j62179Q9019M7590k8051L1214q1285J7508J63308j02754j92962
653G5093j17184J43536J48623q7702k14436L3762K44553p644k19991O2819j7341
642D4088r1142K21888j91112J8484j63869O2919M3897j14288k8322J77596j52101
631a71962L2673M6381j70985O8334L7357q3065L8618j4679j8019P8164N1355P2499
619c3329J22609N8319j97089j7066r6535P2509K10988p1923j21371R4291R0412
$$ plain form
696 128880 57535 22741 -26333 19303 124702 -202581 -249600 64162 28316 135010 73747
685 73747 -40815 -31271 -11579 -18623 94079 133982 -1691 246582 44118 -112837 -108236
674 -108236 -72173 -98822 123430 244225 377218 124402 7576 60894 246751 379291
664 379291 293685 131506 220525 268115 240064 271278 189993 207501 370809 268055 75093
653 75093 -42091 101445 250068 162366 -52070 -18308 226245 218601 -1390 61429 44088
642 44088 -47054 174834 -16278 2206 -161663 -98744 -54847 -169135 -197457 -19861 -171962
631 -171962 -139289 -92908 -263893 -195559 -158202 -241267 -202649 -217328 -235347 -157183 -105828 -33329
619 -33329 89280 147599 -49490 -66556 -163091 -90582 120406 48483 -72888 21403 111815
608A11815P9363o3562j02475N9001q9609l4973r0183Q2262N6096r1469k01525
597b85259J62411P5590J01745m6133j67172J1329J14082o8325O5850q488P9026
586C4656N8481P3969m9119J00950l3455j41970L1596l8391j29995J865j06826
575a98239J06741j7673r2114J21157n4369J36135n3880O1484m5374R5919J9165
564G8952M2723L4945l4405O0971K5457j41180r5158o8548m7486R8124J01545k28309
552a72369M6667K7549k943L9747l6024Q0098L570m0739L4685j62526P7099N8004
540d7182n0579j9191j58991n0765J43863J05933J48769k2311o9426k03833o1228
529b84941j00903K30569O3474k3319j25871J33767J29058r9915M7821r1694j59429
$$ plain form
608 111815 191178 127616 25141 84142 -5467 -40440 -130623 -48361 7735 -83734 -285259
597 -285259 -122848 -47258 54487 8354 -158818 -147489 -33407 -101732 -35882 -44370 34656
586 34656 93137 167106 117987 218937 185482 43512 75108 36717 -93278 -91413 -198239
575 -198239 -91498 -109171 -201285 -80128 -134497 1638 -52242 9242 -36132 59787 78952
564 78952 121675 156620 122215 183186 208643 67463 -27695 -96243 -143729 -45605 55940 -172369
552 -172369 -125702 -98153 -101096 -61349 -97373 -17275 -13705 -54444 -19759 -182285 -105186 -47182
540 -47182 -97761 -116952 -275943 -326708 -182845 -76912 71857 49546 -19880 -223713 -284941
529 -284941 -385844 -155275 -91801 -115120 -240991 -107224 21834 -78081 -30260 -121954 -281383
518b81383M4653K27500j9764J46780j29269m4087J61444o6526K3488l0845q8048
507e6057l210m3276o3018L7054R0170n7648J22689m7209M2234K701r9472n5346
495a30388p6632o0189J02299J18224k8387n261J08140q4796J2463M6135j19689
484a18081J2406r2448J57804O530L1059o7629k8911p1778q1002J99232K6609J28253
472A02044k12877l0424R744P4567k5973N1976K07279j29796O891q5664p050J51665
460A12382O927k16154N1166J53001p9325m4339K0928O0101j64460R4388k9484
449c4869K07514k7667j77771J02702j20815l8980J49395l4657l4339P1861r85
438F1389p7941j58499l0734R3911J37292l8450J4495j01720k69p641n1202j8952
$$ plain form
518 -281383 -236730 -9230 -28994 117786 -11483 -55570 105874 39348 62836 31991 -56057
507 -56057 -59267 -102543 -165561 -128507 -38337 -95985 26704 -20505 21729 24430 -75042 -130388
495 -130388 -207020 -267209 -164910 -46686 -75073 -80334 27806 -56990 -44527 1608 -118081
484 -118081 -105675 -198123 -40319 -33789 -2730 -70359 -99270 -171048 -252050 -52818 -26209 102044
472 102044 -110833 -141257 -131513 -56946 -82919 -30943 176336 46540 53431 -32233 -39283 112382
460 112382 119309 -96845 -45679 107322 27997 -16342 4586 64687 -99773 -5385 -34869
449 -34869 172645 144978 -32793 69909 -50906 -89886 59509 24852 -9487 62374 61389
438 61389 -16552 -175051 -205785 -111874 25418 -13032 1463 -100257 -100526 -108167 -159369 -178321
426a78321L9163J16357L1844R7187L9242m2022o9790j35232J59179J85784k85028
415d1637K9540J35041r8082k3043J12337J31733r2255j95513k15891K27960O739
404b3071K3896j26946j78053P6845p2447P6996J6593q7082L1115J08295K5988
393a27871L8718N3342j8154p3087J08723j87102p6226J56372K60724o9940L4397
382I9896M7999j96575P2214j31241j77949N2461M1472J35958l18j37566J5588
371a78061j47411j42029R1474R2321m094R1040l7173P6716K02871j54033j2589
360a20968L7526j33534r0242K6050J79934J4428J05141L9505j36030j8245J23522
349B7087j61956p3320J73067m4855r1138q4290L8176J559R2166o1151j50300J74741
$$ plain form
426 -178321 -139158 -22801 9043 106230 145472 103450 33660 -101572 57607 243391 -41637
415 -41637 -12097 122944 24862 1819 114156 245889 153634 -41879 -257770 -29810 -23071
404 -23071 825 -126121 -304174 -227329 -299776 -222780 -206187 -293269 -262154 -153859 -127871
393 -127871 -89153 -35811 -53965 -127052 -18329 -205431 -281657 -125285 135439 65499 99896
382 99896 147895 -48680 23534 -107707 -285656 -233195 -191723 -55765 -56083 -193649 -178061
371 -178061 -325472 -467501 -376027 -283706 -287800 -196760 -233933 -157217 45654 -108379 -120968
360 -120968 -83442 -216976 -307218 -281168 -101234 -86806 18335 57840 -78190 -96435 27087
349 27087 -134869 -208189 -35122 -79977 -171115 -255405 -217229 -215670 -123504 -184655 -334955 -160214
337a60214P1596J03455j14157j67696J98766O0088Q6401o1998l2721j96998j22782
326c36260M0848J50621L6737o0823Q68j67639P3657J71988K2074j15795J57249
315b6475J02870n4743p2885j30270m6094J6788j1945J23356j81742j4831J6116
304b79855P4882P084J16580J33404k41612k4424L5276J18100r6127l0011Q0957
293a05746M2110p2758o6537K07746j30812L8167J60523K2851M9076L046k99192
282a51526J11991J66928j71518l3115j31975L577R43O3356M9706J0989k18317
271b98961o3636K90962J5703j36178m0389j06038J78019K42197j96656p4802O7001
260a22778R5995n3194q6086o2010J76091j6777j95058m1911Q5530K2746k571j72793
$$ plain form
337 -160214 -88618 14837 -99320 -267016 -68250 -8162 78239 16241 -16480 -213478 -336260
326 -336260 -295412 -144791 -108054 -168877 -168009 -335648 -261991 -90003 -67929 -183724 -26475
315 -26475 76395 21652 -51233 -181503 -227597 -210809 -222754 -99398 -281140 -295971 -279855
304 -279855 -204973 -197889 -81309 52095 -189517 -213941 -178665 -60565 -156692 -186703 -105746
293 -105746 -63636 -136394 -202931 4815 -125997 -87830 72693 95544 144620 147666 -151526
282 -151526 -39535 127393 -44125 -77240 -209215 -205638 -204695 -141339 -91633 -80644 -298961
271 -298961 -362597 -71635 -55932 -192110 -232499 -338537 -160518 81679 -114977 -189779 -122778
260 -122778 -26783 -79977 -166063 -228073 -51982 -68759 -263817 -305728 -220198 -197452 -200023 -372816
248c72816O4815K4792N2112J69742j51083L6353m4728M8556j5807j50507k1633
237c60204O8361o6320K29214m2057j15529q0741K28232M42088k79229k58612j4662
226b49459R273J91758j33366J837P8107j9591L5062l9950m2678J3826k685J5737
214a42129j8868J6268j77113j20178m5922q022M4946l8648L4240J04515J08383
203b42528M1554q3528J05110N9622n8739p6456j05762P3123K11395M3935n6369
192h8643l974l9702K54364M275j11112n4744l1537p9985Q1081r6262n9536J04907
180a20868m4512m316p8227K7577R4341j81027J5249Q629q5199m6585m0955J87410
168b68483J10618N4537j51588j1748J56113P2380n986j23304L3833P0784m4212
$$ plain form
248 -372816 -308001 -283209 -231097 -61355 -212438 -176085 -220813 -172257 -188064 -338571 -360204
237 -360204 -291843 -358163 -128949 -171006 -286535 -367276 -139044 303044 23815 -234797 -249459
226 -249459 -240186 -48428 -181794 -179957 -101850 -121441 -86379 -126329 -169007 -155181 -157866 -142129
214 -142129 -160997 -144729 -321842 -442020 -487942 -495964 -451018 -489666 -455426 -350911 -242528
203 -242528 -200974 -284502 -179392 -119770 -178509 -254965 -360727 -287604 -76209 -32274 -88643
192 -88643 -92617 -132319 122045 126320 15208 -39536 -71073 -151058 -69977 -166239 -225775 -120868
180 -120868 -165380 -169696 -247923 -220346 -126005 -307032 -291783 -283154 -368353 -414938 -455893 -268483
168 -268483 -157865 -103328 -254916 -266664 -110551 -38171 -44157 -167461 -133628 -62844 -107056
157a07056M2977N2094o7034N4318M9046k59658l6609K06374K1210k60032j8566
146c22936R4593J25417m5073o3613J0661N8606l2012n5207m328j235o3723Q4416
134b14434J6990P5266J69190j81635R058r5814N9568M9596M4884J0272o4151M2463
122g8747M1476j03113q0298l4846M332J26579p8272L8536N7634k8163K4794r8834
$$ plain form
157 -107056 -64079 -11985 -79019 -24701 24345 -235313 -271922 -65548 -44338 -304370 -322936
146 -322936 -228343 -102926 -147999 -211612 -200951 -142345 -174357 -229564 -233892 -235127 -298850 -214434
134 -214434 -197444 -122178 47012 -134623 -125565 -221379 -161811 -112215 -67331 -57059 -121210 -78747
122 -78747 -37271 -140384 -220682 -255528 -251196 -124617 -202889 -164353 -106719 -134882 -110088 -208922
$$ [...]
##END NTUPLES=NMR SPECTRUM
##END=
