##TITLE=1H_CA-8802-22
 CDCl3,8 sc, 
 3.02.2021
##JCAMPDX= 6.0         $$ Bruker NMR JCAMP-DX V2.0
##DATA TYPE= NMR SPECTRUM
##DATA CLASS= NTUPLES
##ORIGIN= UXNMR, Bruker Analytische Messtechnik GmbH
##OWNER= root
$$ XWIN-NMR		Version 3.5
$$ Wed Feb  3 10:31:08 2021 Russian Standard Time (UT+4h)  she@DPX200
##.OBSERVE FREQUENCY= 200.1315066352
##.OBSERVE NUCLEUS= ^1H
##.ACQUISITION MODE= SIMULTANEOUS
##.ACQUISITION SCHEME= undefined
##.AVERAGES= 8
##.DIGITISER RES= 18
##SPECTROMETER/DATA SYSTEM= spect
##.PULSE SEQUENCE= zg30
##.SOLVENT NAME= CDCl3
##.SHIFT REFERENCE= (INTERNAL, CDCl3, 0, 15.9948)
##AUDIT TRAIL= $$ (NUMBER, WHEN, WHO, WHERE, WHAT)
$$ ##TITLE= Audit trail, XWIN-NMR		Version 3.5
$$ ##JCAMPDX= 5.01
$$ ##ORIGIN= Bruker BioSpin GmbH
$$ ##OWNER= she
$$ F:/spectra/data/she/nmr/H-F/1/pdata/1/auditp.txt
$$ ##AUDIT TRAIL=  $$ (NUMBER, WHEN, WHO, WHERE, WHAT)
(   1,<2021-02-03 10:29:56.04 +0400>,<she>,<DPX200>,
      <created by zg, POWCHK disabled, PULCHK disabled
       configuration hash MD5:
       00 E9 B6 7A A2 85 ED C7 34 08 36 98 17 FE 4E 26
       data hash MD5: 16K
       78 74 1A 80 89 90 0E D2 84 C6 6F 36 93 34 C8 CC>)
(   2,<2021-02-03 10:29:58.68 +0400>,<she>,<DPX200>,
      <Start of raw data processing
       efp BC_mod = 2 LB = 0.24 FT_mod = 6 PKNL = 1 PHC0 = -10758.77 PHC1 = 11.20095 SI = 16K 
       data hash MD5: 16K
       29 AF 13 BA A6 ED 04 13 F7 C2 87 C1 6E 5B 76 C2>)
(   3,<2021-02-03 10:30:19.57 +0400>,<she>,<DPX200>,
      <pk PHC0 = 0.5129694 PHC1 = -0.8 
       data hash MD5: 16K
       8D FE 2B CE 5F 85 21 59 AB 0D 0E 8D BD 35 E7 FF>)
(   4,<2021-02-03 10:30:22.65 +0400>,<she>,<DPX200>,
      <abs ABSG = 5 
       data hash MD5: 16K
       0B 4D A3 3C D6 89 EA 52 C3 87 11 48 41 44 3F 98>)
$$ ##END=
$$ 
$$ hash MD5
$$ A2 C6 A6 F9 39 71 1A C9 BC C0 41 18 C1 4F A6 D5
##$RELAX= 
##$RELAX= 
##$RELAX= 
##$RELAX= 
##$RELAX= 
##$RELAX= 
$$ Bruker specific parameters
$$ --------------------------
##$DU= <F:/spectra>
##$EXPNO= 1
##$NAME= <H-F>
##$PROCNO= 1
##$TYPE= <nmr>
##$USER= <she>
##$AMP= (0..31)
100 100 100 100 100 100 100 100 100 100 100 100 100 100 100 100 100 100 
100 100 100 100 100 100 100 100 100 100 100 100 100 100 
##$AQSEQ= 0
##$AQ_mod= 1
##$AUNM= <au_zg>
##$AUTOPOS= <>
##$BF1= 200.13
##$BF2= 200.13
##$BF3= 200.13
##$BF4= 200.13
##$BF5= 200.13
##$BF6= 200.13
##$BF7= 200.13
##$BF8= 200.13
##$BYTORDA= 1
##$CFDGTYP= 0
##$CFRGTYP= 5
##$CHEMSTR= <none>
##$CNST= (0..31)
1 1 145 1 1 1 1 1 1 1 1 1 1 1 1 1 1 1 1 1 1 1 1 1 1 1 1 1 1 1 1 1 
##$CPDPRG= <>
##$CPDPRG1= <>
##$CPDPRG2= <>
##$CPDPRG3= <>
##$CPDPRG4= <mlev>
##$CPDPRG5= <mlev>
##$CPDPRG6= <mlev>
##$CPDPRG7= <mlev>
##$CPDPRG8= <mlev>
##$CPDPRGB= <>
##$CPDPRGT= <>
##$D= (0..31)
0 1.2 0 0 0 0 0 0 0 0.06 0 0.03 0 0 0 0 0.0002 0 0 0 0 0 0 0 0 0 0 0 0 
0 0 0 
##$DATE= 1612333795
##$DBL= (0..7)
120 120 120 120 120 120 120 120 
##$DBP= (0..7)
150 150 150 150 150 150 150 150 
##$DBP07= 0
##$DBPNAM0= <>
##$DBPNAM1= <>
##$DBPNAM2= <>
##$DBPNAM3= <>
##$DBPNAM4= <>
$$ [...]
##$SUBNAM3= <"">
##$SUBNAM4= <"">
##$SUBNAM5= <"">
##$SUBNAM6= <"">
##$SUBNAM7= <"">
##$SUBNAM8= <"">
##$SUBNAM9= <"">
##$SW= 16.9725356469052
##$SWIBOX= (0..15)
0 0 2 0 0 0 0 0 0 0 0 0 0 0 0 0 
##$SW_h= 3396.73913043478
##$TD= 16384
##$TD0= 1
##$TE= 0
##$TE2= 300
##$TE3= 300
##$TEG= 300
##$TL= (0..7)
0 120 120 120 120 120 120 120 
##$TP= (0..7)
150 150 150 150 150 150 150 150 
##$TP07= 0
##$TPNAME0= <>
##$TPNAME1= <>
##$TPNAME2= <>
##$TPNAME3= <>
##$TPNAME4= <>
##$TPNAME5= <>
##$TPNAME6= <>
##$TPNAME7= <>
##$TPOAL= (0..7)
0.5 0.5 0.5 0.5 0.5 0.5 0.5 0.5 
##$TPOFFS= (0..7)
0 0 0 0 0 0 0 0 
##$TUNHIN= 0
##$TUNHOUT= 0
##$TUNXOUT= 0
##$USERA1= <user>
##$USERA2= <user>
##$USERA3= <user>
##$USERA4= <user>
##$USERA5= <user>
##$V9= 5
##$VALIST= <valist>
##$VCLIST= <CCCCCCCCCCCCCCC>
##$VD= 0
##$VDLIST= <DDDDDDDDDDDDDDD>
##$VPLIST= <PPPPPPPPPPPPPPP>
##$VTLIST= <TTTTTTTTTTTTTTT>
##$WBST= 1024
##$WBSW= 4
##$XGAIN= (0..3)
0 0 0 0 
##$XL= 0
##$YL= 0
##$YMAX_a= 565691
##$YMIN_a= -224202
##$ZGOPTNS= <>
##$ZL1= 120
##$ZL2= 120
##$ZL3= 120
##$ZL4= 120
##$ABSF1= 15.98957
##$ABSF2= -0.9830942
##$ABSG= 5
##$ABSL= 3
##$ALPHA= 0
##$AQORDER= 0
##$ASSFAC= 0
##$ASSFACI= 0
##$ASSFACX= 0
##$ASSWID= 0
##$AUNMP= <proc_1d>
##$AZFE= 0.1
##$AZFW= 0.1
##$BCFW= 0
##$BC_mod= 2
##$BYTORDP= 0
##$COROFFS= 0
##$CY= -3
##$DATMOD= 1
##$DC= 0
##$DFILT= <>
##$DTYPP= 0
##$F1P= 0
##$F2P= 0
##$FCOR= 1
##$FTSIZE= 16384
##$FT_mod= 6
##$GAMMA= 0
##$GB= 0
##$INTBC= 1
##$INTSCL= 2.992141e-10
##$ISEN= 128
##$LB= 0.24
##$LEV0= 0
##$LPBIN= 0
##$MAXI= 10000
##$MC2= 0
##$MEAN= 0
##$ME_mod= 0
##$MI= 1.114404
##$NCOEF= 0
##$NC_proc= -6
##$NLEV= 6
##$NOISF1= 3.799351
##$NOISF2= 2.8
##$NSP= 0
##$NTH_PI= 0
##$NZP= 0
##$OFFSET= 15.99475
##$PC= 1
##$PHC0= -10758.26
##$PHC1= 10.40095
##$PH_mod= 1
##$PKNL= yes
##$PPARMOD= 0
##$PSCAL= 0
##$PSIGN= 0
##$REVERSE= no
##$SF= 200.130003976342
##$SI= 16384
##$SIGF1= 3
##$SIGF2= 2
##$SINO= 5.538805
##$SIOLD= 16384
##$SREGLST= <1H.CDCl3>
##$SSB= 0
##$STSI= 16384
##$STSR= 0
##$SW_p= 3396.73913043478
##$SYMM= 0
##$S_DEV= 0
##$TDeff= 16384
##$TDoff= 0
##$TI= <>
##$TILT= no
##$TM1= 0
##$TM2= 0
##$TOPLEV= 0
##$USERP1= <user>
##$USERP2= <user>
##$USERP3= <user>
##$USERP4= <user>
##$USERP5= <user>
##$WDW= 1
##$XDIM= 16384
##$YMAX_p= 280701972
##$YMIN_p= -472896
$$ End of Bruker specific parameters
$$ ---------------------------------
##NTUPLES= NMR SPECTRUM
##VAR_NAME=  FREQUENCY,     SPECTRUM/REAL,   SPECTRUM/IMAG
##SYMBOL=    X,             R,               I
##VAR_TYPE=  INDEPENDENT,   DEPENDENT,       DEPENDENT
##VAR_FORM=  AFFN,          ASDF,            ASDF
##VAR_DIM=   16384,         16384,           16384
##UNITS=     HZ,            ARBITRARY UNITS, ARBITRARY UNITS
##FACTOR=    0.207333158178281, 1,           1
##FIRST=     3201.02938568121, 0,            0
##LAST=      -195.709744753571, 0,           0
##MIN=       -195.709744753571, -472896,     0
##MAX=       3201.02938568121, 280701972,    0
$$ Real data points
##PAGE= N=1
##DATA TABLE= (X++(R..R)), XYDATA
$$ [...]
6027E377690q67k70437M26m4955k92341j51666M4126j62869p5507K4855r4806
6016D353649N839j76795J13000K74571j71072k99970J47640J1478L7962J16478
6006D412780P4831j50436K61713J18224J2223K71577K48498j16801J84430P7581
5996E394620K19094L69645K08700K71165K63690J34918K20549M49499L31317N29767
5986H392964O99992M22391P03494J031015R27507R82556J071070J266111J098341
5977A6595441J042023R63972N97771Q3779k88729n12443o72869j188643j469473
5968A5150829j338174j377985j117178j034924r85904o50123o07689p97921n39989
5959F700942l16371l45839k93627k11358l36007l41704k85443j47945M5898k24482
$$ plain form
6027 5377690 5376823 5106386 5106812 5061857 4769516 4617850 4661976 4499107 4423600 4448455 4353649
6016 4353649 4359488 4182693 4295693 4570264 4399192 4099222 4246862 4258340 4296302 4412780
6006 4412780 4487611 4337175 4598888 4717112 4729335 5000912 5249410 5132609 5317039 5394620
5996 5394620 5613714 5983359 6192059 6463224 6726914 6861832 7082381 7531880 7863197 8392964
5986 8392964 9092956 9515347 10218841 11249856 12177363 13159919 14230989 15497100 16595441
5977 16595441 17637464 18601436 19199207 19282986 18994257 18481814 17808945 16620302 15150829
5968 15150829 13812655 12434670 11317492 10282568 9296664 8646541 8038852 7240931 6700942
5959 6700942 6384571 6038732 5745105 5533747 5197740 4856036 4570593 4422648 4468546 4244064
5949D244064k78722J33777j13476j21840j26262j42154l2489j6852j70471p8878
5939C296697J4068l8596O5001n054M8919j59090o4292O545j00745P7990J53967
5928C295410l3753r7799k35065J02658J37318J21215J10240l8161k39337J13040
5918C235766K13103R7990J46602K15621Q9685M6194K02629K63045J76813K43656
5908D931104L20651L67727J05505M8633J81683J05348J08620j20442k79796l35491
5898E433542k72328j27069l69192k90726j10641l49893k28453K2291k07534j38858
5888C361139j56616j00268m7041j33694N8416L2847k41070m6406j10930k05770
5878B410607o0938N4388j08231j08209j26360J68613q1943k17403K17061N0794
$$ plain form
5949 4244064 3965342 4099119 3985643 3863803 3737541 3595387 3562898 3546046 3375575 3296697
5939 3296697 3310765 3272169 3337170 3332116 3381035 3221945 3157653 3164198 3063453 3141443 3295410
5928 3295410 3261657 3163858 2928793 3031451 3168769 3289984 3400224 3362063 3122726 3235766
5918 3235766 3448869 3546859 3693461 3909082 3998767 4044961 4247590 4510635 4687448 4931104
5908 4931104 5251755 5619482 5724987 5773620 5955303 6060651 6169271 6048829 5769033 5433542
5898 5433542 5161214 5034145 4664953 4374227 4263586 3913693 3685240 3707531 3499997 3361139
5888 3361139 3204523 3104255 3057214 2923520 2981936 3014783 2773713 2727307 2616377 2410607
5878 2410607 2349669 2404057 2295826 2187617 2061257 2229870 2147927 1930524 2147585 2198379
5868B198379o7508J25814p1896j20750K01844j13629j21096k6102M2328m7336
5858B000048r9039P2147J61268j37206j86685J67395Q3786o9052j07983p1588
5848A813091J10041j14442Q3815J6437n9035J38046k4331l7520K00259j95300
5838A931061k49059k2715R1397M9685K50368j67182k6079J9612K1523P7012j19542
5827A856081M7996K35015n3274l15325m3598J17474J99965N936o8806m2319j43426
5816A795719M4975K35700J11301N896p4941n4292J51722m8666J06338K17575p5119
5805B416208o5006j31426N834J85736J77854J10689K2329M6129N1949J12281J40544
5794C073121J00744r1614o6506K55066K4281n8804R0364J69489Q8709j25232K4496
$$ plain form
5868 2198379 2130871 2256685 2184789 2064039 2265883 2152254 2031158 2005056 2047384 2000048
5858 2000048 1901009 1973156 2134424 1997218 1810533 1977928 2061714 1992662 1884679 1813091
5848 1813091 1923132 1808690 1892505 1908942 1849907 1987953 1963622 1926102 2126361 1931061
5838 1931061 1682002 1659287 1750684 1800369 2050737 1883555 1857476 1877088 1898611 1975623 1856081
5827 1856081 1904077 2139092 2085818 1770493 1726895 1844369 2044334 2050270 1981464 1939145 1795719
5816 1795719 1840694 2076394 2187695 2193591 2118650 2064358 2216080 2167414 2273752 2491327 2416208
5805 2416208 2351202 2219776 2225610 2411346 2589200 2699889 2722218 2768347 2820296 2932577 3073121
5794 3073121 3173865 3082251 3015745 3270811 3295092 3236288 3326652 3496141 3584850 3459618 3484114
5783C484114R5249j5745q5371M4076J63152k829K12974J70277J07806k3093j3949
5772D136661J10284J93100J37263j81949R1506J60775j62943J1963K36660J46943
5762D880263k3414O6499j1018J4287Q4407l9221p7306J2026j8551N7958M4147
5751D990077j32679j85062J39114J84142k6266j13447l272K42326n8818k17333
5741D818782K0468J17007o1646l52364r9389N3889Q2340J65119J78677j1474o0340
5730D851069J52483J08927r5559k03645k44571j77096q0358l4900n8508K52418
5720D470260J8227k01372P1267O2409k8209j72044r5887L0273k32092k65043J61111
5709C818900J58059M0513o1338L0702N9246R5042l5271Q3957q4373l83979j45650
$$ plain form
5783 3484114 3579363 3563618 3478247 3522323 3685475 3682646 3895620 4065897 4173703 4150610 4136661
5772 4136661 4246945 4440045 4577308 4395359 4486865 4647640 4484697 4496660 4733320 4880263
5762 4880263 4856849 4923348 4912330 4926617 5011024 4971803 4894497 4906523 4887972 4945930 4990077
5751 4990077 4857398 4672336 4811450 4995592 4969326 4855879 4852607 5094933 5036115 4818782
5741 4818782 4839250 4956257 4894611 4542247 4442858 4496747 4579087 4744206 4922883 4911409 4851069
5730 4851069 5003552 5112479 5016920 4813275 4568704 4391608 4311250 4276350 4217842 4470260
5720 4470260 4488487 4287115 4358382 4420791 4392582 4220538 4124651 4154924 3922832 3657789 3818900
5709 3818900 3976959 4017472 3956134 3986836 4046082 4141124 4105853 4189810 4105437 3721458 3575808
5698C575808O6958n8553k34596j339j49234k27205k7983J07405p3368K8364J11341
5687C117598n6699k9593q2554k3467r351j55516o3957k86047M3021J43667n9667
5676B537435r8698n0058j11161j3955P5937l09711J8839o704M1716j13340o6689
5665A903611O0011N8827j75629p8556J36332o204K0297p1418p3876r2581o2494
5654A618320J85799p71M6941J230k6647j24278j16185o5373O4617K2158k38004
5643A367807M0913J50241K12060q5407k69961J80569J29270j70764P7363l1355
5633A600736p3423j29774n5447L8424j50019k2235J86378K57847k14756j09621
5623A328110R6422J212j06193m5359l0882o1512J28402J21984Q5245j16456n8129
$$ plain form
5698 3575808 3642766 3584213 3349617 3348278 3199044 2971839 2943856 3051261 2977893 3006257 3117598
5687 3117598 3060899 3031306 2948752 2925285 2915934 2760418 2696461 2410414 2453435 2597102 2537435
5676 2537435 2438737 2388679 2277518 2263563 2339500 2029789 2048628 2041924 2083640 1970300 1903611
5665 1903611 1963622 2022449 1846820 1768264 1904596 1898392 1918689 1847271 1773395 1680814 1618320
5654 1618320 1804119 1803348 1850289 1851519 1824872 1700594 1584409 1519036 1583653 1605811 1367807
5643 1367807 1408720 1558961 1771021 1685614 1415653 1596222 1725492 1554728 1632091 1600736
5633 1600736 1527313 1397539 1342092 1380516 1230497 1208262 1394640 1652487 1437731 1328110
5623 1328110 1424532 1425744 1319551 1274192 1243310 1181798 1310200 1432184 1517429 1400973 1342844
5612A342844L595k8710J421n7794J81091J52734k48854j95612k6010M2749J68434
5601A335888O58k0974n957n4202o8294M4424P9987P6864N1655l9562J1916j41833
5589A270570L7891Q5346m9589j67718R6030M6332K3435J2875J7095J52224l0235
5578A494256j13982L5538j4730j19606K45907n9897P7408O9022j55039J04189
5568A563066j81773n8327J27415P3778j24760p9227M8178O6581k7580j5471Q9074
5557A480954j32260L5901R2809J05834J85696j31614m491n2215k52589J06493
5547A434518J56323K2266k15171j35995J34188K2710K5684R224J88682k59973
5537A382456o3873J62517J50321k3004j56982J26186n7738j38130J65663N2078
$$ plain form
5612 1342844 1346439 1317729 1319150 1261356 1442447 1595181 1346327 1150715 1124705 1167454 1335888
5601 1335888 1336546 1315572 1309615 1255413 1187119 1231543 1311530 1388394 1440049 1400487 1412403 1270570
5589 1270570 1308461 1393807 1344218 1176500 1272530 1318862 1342297 1355172 1372267 1524491 1494256
5578 1494256 1380274 1415812 1401082 1281476 1527383 1467486 1544894 1613916 1458877 1563066
5568 1563066 1381293 1322966 1450381 1524159 1399399 1320172 1368350 1434931 1407351 1391880 1480954
5557 1480954 1348694 1384595 1477404 1583238 1768934 1637320 1632829 1580614 1328025 1434518
5547 1434518 1590841 1613107 1397936 1261941 1396129 1418839 1444523 1453747 1642429 1382456
5537 1382456 1318583 1481100 1631421 1608417 1451435 1577621 1519883 1381753 1547416 1599494
5527A599494l8795l6927O3709R8m1301q8062P7744J88509k34187k6591J02845
5516A566536K22052j9991r9014M2340j7840r1245K3310o147Q981J4481m6891J06444
5504A703016Q8128n6053N4456J20531j34519q7653k4629O9218L23864k69369j28544
5493A658446J05608M1934K8976J5186K08043J53361m049q1815P5648J54903j28815
5482B227426N3134P4453k15862o6564J07270J81887p5743q7575p8669J21540J44236
5471B385533q1271P6067j910P979K65958J20741j56764K5992R3064j13066J15917
5460B738240O8291j20330J5936N9319r5363o9863J56912J56062o8250Q0156Q1801
5449C002911N6497J88920p9320M9681o8351k20867N5391J07084k03872J26092
$$ plain form
5527 1599494 1560699 1523772 1587481 1587579 1546278 1458216 1535960 1724469 1490282 1463691 1566536
5516 1566536 1788588 1768597 1669583 1711923 1694083 1602838 1626148 1620001 1628982 1643463 1596572 1703016
5504 1703016 1791144 1735091 1789547 1910078 1775559 1687906 1663277 1732495 2056359 1786990 1658446
5493 1658446 1764054 1805988 1834964 1850150 2058193 2211554 2207505 2125690 2201338 2356241 2227426
5482 2227426 2280560 2355013 2139151 2072587 2179857 2361744 2286001 2198426 2119757 2241297 2385533
5471 2385533 2304262 2380329 2378419 2386398 2652356 2773097 2616333 2642325 2735389 2622323 2738240
5460 2738240 2806531 2686201 2702137 2761456 2666093 2596230 2753142 2909204 2840954 2921110 3002911
5449 3002911 3059408 3248328 3169008 3218689 3150338 2929471 2984862 3091946 2888074 3014166
5439C014166J36554j89542J75813p6297O9749K68055j15531l264J03752J321r889
5428C374887J69080k78159N7497K76898k14339k8265J92645J22322q5216J64557
5418C751907O9388j19792l2297N4059L10329n5462r2930K11255n3049j20645p7709
5407C845054n6924m7596N7196J36295j61473J32485j24059j26141K15751k2924
5397C847664Q7546J69208P5607r2662j01448o2665J99782J278j89606J08942J94734
5386D238380k21165L4304P9420p8737J31119J49768J15294J29850k3083k28571
5376D326579J38837J77114k21886k19016j4493J60218o6790j53732J28261K50976
5366D506068m9068j01674K05723m5318j00517J15820p4443k43782l1691J71504
$$ plain form
5439 3014166 3150720 2961178 3136991 3060694 3130443 3398498 3282967 3279703 3383455 3384776 3374887
5428 3374887 3543967 3265808 3323305 3600203 3385864 3357599 3550244 3672566 3587350 3751907
5418 3751907 3821295 3701503 3669206 3723265 4033594 3978132 3885202 4096457 4043408 3922763 3845054
5407 3845054 3788130 3740534 3797730 3934025 3772552 3905037 3780978 3654837 3870588 3847664
5397 3847664 3935210 4104418 4180025 4087363 3985915 3923250 4123032 4124310 3934704 4043646 4238380
5386 4238380 4017215 4051519 4130939 4052202 4183321 4333089 4448383 4578233 4555150 4326579
5376 4326579 4465416 4642530 4420644 4201628 4187135 4347353 4280563 4126831 4255092 4506068
5366 4506068 4457000 4355326 4561049 4515731 4415214 4531034 4456591 4212809 4181118 4352622
5356D352622j1335l1934l3841O1159M4938q2717J25708M5839j4850J16043j9254
5345D552378j11420J56399K41696r5378M8334R9536O876J10288K46814K85555
5335E541078K49521O4789l3290j78488k98651j71222L8453k79435r5659J24068
5325D961164j23897q1844L5608p4480m2027L3299m1771L6359L8309n1963J20977
5314D809734L3418k9030M15201o4514j64019J09013J20681j21975J17304P3446
5304E299259R5190L40501k73666J19862N10062N1981K54524N87820L96392L89964
5294G771889P70443L06506K10839k67821o59929l32542l43962n41033j65667m0245
5284F708478j18740j83923P9016j01444n7494K14608P4580Q9580P6192P8938k8426
$$ plain form
5356 4352622 4341287 4309353 4275512 4336671 4381609 4298892 4424600 4470439 4455589 4571632 4552378
5345 4552378 4440958 4597357 4839053 4743675 4792009 4891545 4898421 5008709 5255523 5541078
5335 5541078 5790599 5855388 5822098 5643610 5344959 5173737 5212190 4932755 4837096 4961164
5325 4961164 4837267 4755423 4791031 4716551 4674524 4707823 4666052 4702411 4740720 4688757 4809734
5314 4809734 4843152 4814122 5229323 5164809 5000790 5109803 5230484 5108509 5225813 5299259
5304 5299259 5394449 5734950 5461284 5581146 6091208 6143189 6397713 6985533 7381925 7771889
5294 7771889 8542332 8848838 9059677 8791856 8131927 7799385 7455423 6914390 6748723 6708478
5284 6708478 6589738 6405815 6484831 6383387 6325893 6540501 6615081 6704661 6780853 6859791 6831365
5273F831365q173j63656M7017J85153Q9287j483Q9976K63196N05715m9091K55567
5262H044873N88311L01786J8379k7612j65954r4150o2706K04580L79482J75283
5252I362272K74897l836k87874o05849n01177l70275j29004k65237k75385j17622
5242G080910j05146r630Q6224j61589r1328m1377k22822j44455M8740J18976P1954
5231F630457J87814K84118p6564K05817L59240k00722q3424j06513j82945j19419
5221F897859j95483k53613l67709k03303K2736P1424j60744j32645K0836j6394
5211E682964p1678j33255n9618l2579o7653k49787j08151j1536O7906j04737L3880
5200D945756K1201o5844m9281O4635j61171J77716K06495L9615J02214L7411J6713
$$ plain form
5273 6831365 6823192 6659536 6706553 6891706 6980993 6979510 7069486 7332682 7838397 7789306 8044873
5262 8044873 8633184 8934970 8953349 8925737 8759783 8665633 8602927 8807507 9186989 9362272
5252 9362272 9637169 9633333 9345459 8739610 8238433 7868158 7739154 7473917 7198532 7080910
5242 7080910 6975764 6966134 7052358 6890769 6799441 6758064 6535242 6390787 6439527 6558503 6630457
5231 6630457 6818271 7102389 7025825 7231642 7590882 7390160 7306736 7200223 7017278 6897859
5221 6897859 6702376 6448763 6081054 5877751 5900487 5971911 5811167 5678522 5699358 5682964
5211 5682964 5611286 5478031 5418413 5385834 5318181 5068394 4960243 4948707 5016613 4911876 4945756
5200 4945756 4966957 4901113 4851832 4916467 4755296 4933012 5139507 5179122 5281336 5318747 5335460
5189E335460J08704K46678J85772K19949K05560J79501L04441L19628L19681M89337
5179G914711P47236N19778L44679P01328P9032k57366l56351o80239l24092O0149
5169H748865j68594k064K22655n5915K49121L6783l40963j22631m41015m48905
5159G677337k47j18176k04087J32978R2860J08713J46753L41567K64804L66758
5149H809260M87296M39121M24873L23471J07756K23705L50294J63825N25643N60615
5139A2415859j84224o8117J15149k51700l23466n67515o51881n24234o79057n00860
5129H779954j19874k22155r0446J16394J6279J38170L29725M6874j3077Q0663
5119I062507m03895n06272j7486j24841l67825p5711J05589J73864K7543k245
$$ plain form
5189 5335460 5444164 5690842 5876614 6096563 6302123 6481624 6786065 7105693 7425374 7914711
5179 7914711 8661947 9181725 9526404 10227732 10306764 10049398 9693047 9012808 8688716 8748865
5169 8748865 8580271 8578207 8800862 8744947 8994068 9030851 8689888 8567257 8126242 7677337
5159 7677337 7677090 7558914 7354827 7487805 7580665 7689378 7836131 8177698 8442502 8809260
5149 8809260 9296556 9735677 10160550 10484021 10591777 10815482 11165776 11329601 11855244 12415859
5139 12415859 12231635 12163518 12278667 12026967 11703501 11135986 10484105 9959871 9280814 8779954
5129 8779954 8660080 8437925 8347479 8463873 8480152 8618322 8948047 8994921 8981844 9062507
5119 9062507 8658612 8152340 8134854 8010013 7642188 7566477 7672066 7845930 7873473 7871228
5109G871228J50018M47972K63323L29281K10251j02777k7095O8875l35517l26342
5099H549217j68982j06743J88214k43469k00989K6376j39693j68316j67949j67324
5089G400342k00408J9238P5446K04452K86878J08176M38948L01369N2202j30506
5079H556137k05911l00828l65192k17327j0024l7002P123J29706K2704L10223
5069G889609K40861L05378O35113J85630j87264j73862n32319n59854k01553m53230
5059G148509k50702j23927m34875l42748l3372j23859j06463q7240o6675k42790
5049E335858J9715N5704k9884n0344Q597p3344j91502j55655L34218J04338k67895
5038E089806p0526K2641O3219J55177K1538Q5210R1087o1768M2723J62523l9906
$$ plain form
5109 7871228 8021246 8469218 8732541 9061822 9272073 9169296 9142201 9211076 8875559 8549217
5099 8549217 8380235 8273492 8461706 8218237 8017248 8043624 7903931 7735615 7567666 7400342
5089 7400342 7199934 7219172 7294618 7499070 7785948 7894124 8333072 8634441 8686643 8556137
5079 8556137 8350226 8049398 7684206 7466879 7456855 7419853 7426976 7556682 7579386 7889609
5069 7889609 8130470 8435848 9070961 9256591 9069327 8895465 8363146 7803292 7601739 7148509
5059 7148509 6897807 6773880 6339005 5996257 5962885 5839026 5732563 5645323 5578648 5335858
5049 5335858 5355573 5411277 5381393 5331049 5339646 5266302 5074800 4919145 5253363 5357701 5089806
5038 5089806 5019280 5041921 5105140 5260317 5281855 5367065 5458152 5396384 5439107 5601630 5561724
5027E561724N8512L44529j32998j16365J30606m9813q1459J22791K1045J98719
5017F057291R1420l5747J31591J87032N1050J36275l1888J7828L37052K40117
5007G182021j94273K44585K65527r730K92872L95485N054J67417K16016N1016
4997H615990Q4234K43451k3949J37471J8643n4417L19448j9347J51692L62604
4987I835820M2816Q8096M24427J36881M06419O07293J06379J55822L90598M10611
4977A2605162N06980N55152O56206P03227M13967L49424L94552L03561J47487
4968A6635718L18770N14258M91634P18983R21275R90040Q53024J090910J164148
4959B3698760Q60068R38647J022112R68356P51231K08929k05019j40987r3241
$$ plain form
5027 5561724 5620236 5964765 5831767 5715402 5846008 5796195 5714736 5837527 5858572 6057291
5017 6057291 6148711 6112964 6244555 6431587 6482637 6618912 6587024 6604852 6941904 7182021
5007 7182021 6987748 7232333 7497860 7488130 7781002 8176487 8181541 8348958 8564974 8615990
4997 8615990 8700224 8943675 8919726 9057197 9075840 9021423 9340871 9321524 9473216 9835820
4987 9835820 9878636 9966732 10391159 10528040 10934459 11541752 11648131 11803953 12194551 12605162
4977 12605162 13112142 13667294 14323500 15026727 15440694 15790118 16184670 16488231 16635718
4968 16635718 16954488 17468746 17960380 18679363 19600638 20590678 21443702 22534612 23698760
4959 23698760 24558828 25497475 26519587 27487943 28239174 28448103 28243084 28102097 28008856
4950B8008856k84841m89003m10308l48660p55080m58874l77513o39907q43716
4941B3400954p38107q58065r29381j006087o86243n80136q01274p16026o00663
4932A6484972o48511m82935n63923o99702m86227k89192l46579l93578j23616
4923A2450709l20029j38362K8682J83631j1751l60246l22330k09621k82262j66455
4913A0851966J72162j55785k53687o681k68573p9275K36352K88924N4246o5195
4903A0774454l2846J70934J85185j62256k57067k32905j09454j41694k34307j17626
4893I842418k00852M9610j89312k02361O8040R6315L8369J46822J44004j01316
4883I691737j7973j0015K08318K01623J58667K23223M1304p5740k6983M19097
$$ plain form
4950 28008856 27724015 27235012 26824704 26476044 25720964 25262090 24884577 24244670 23400954
4941 23400954 22662847 21804782 20875401 19869314 19183071 18602935 17801661 17085635 16484972
4932 16484972 15836461 15353526 14789603 14089901 13603674 13314482 12967903 12574325 12450709
4923 12450709 12130680 11992318 12021000 12204631 12192880 11832634 11510304 11300683 11018421 10851966
4913 10851966 11024128 10868343 10614656 10607975 10339402 10260127 10496479 10785403 10839649 10774454
4903 10774454 10741608 10912542 11097727 10935471 10678404 10445499 10336045 10194351 9960044 9842418
4893 9842418 9641566 9691176 9501864 9299503 9367543 9463858 9502227 9649049 9793053 9691737
4883 9691737 9673764 9663749 9872067 10073690 10232357 10455580 10496884 10421144 10394161 10813258
4873A0813258L49103K09711N5536K49306L63198K41207L62214K54187K81036K86164
4863A3464920l6530K67073K38724K19836N53467L11039K30108J91057M3444K41889
4853A5725027L34679n6763o7966K25163J25022k38971J93458M18000K56137K06005
4843A7119791M48629K09548Q9471N48380M93763M14703N39303Q0586J38736L05149
4833B0388059k29762n47362l96197p80074k51548m57441n79601l37489j98266
4824A6610319m92421l15536j83534k62065j34499k36004k26969j90001k4303Q2890
4814A4627877M8940j00139l58553J51057L13460k49197J93436K17339l15976J41619
4804A4669863J95564l17683J32883N0850j49054J02264j99744k74469L92808K52360
$$ plain form
4873 10813258 11162361 11372072 11427608 11676914 12040112 12281319 12643533 12897720 13178756 13464920
4863 13464920 13428390 13695463 13934187 14154023 14707490 15018529 15248637 15439694 15483138 15725027
4853 15725027 16059706 16002943 15934977 16160140 16285162 16046191 16239649 16657649 16913786 17119791
4843 17119791 17568420 17777968 17867439 18415819 18909582 19324285 19863588 19944174 20082910 20388059
4833 20388059 20158297 19610935 19214738 18434664 18183116 17725675 17146074 16808585 16610319
4824 16610319 16117898 15802362 15618828 15356763 15222264 14986260 14759291 14569290 14544987 14627877
4814 14627877 14676817 14576678 14218125 14369182 14682642 14433445 14626881 14844220 14528244 14669863
4804 14669863 14865427 14547744 14680627 14731477 14582423 14684687 14484943 14210474 14603282 14855642
4794A4855642k81224m3359P5852J20484O1971J07500Q9510M3674J80184k41652
4784A4968582J13928P2789J56775K29951p5240j11377L39058k9571k19935J26200
4774A5571160k53878k49956K45602M7953k07636m1855R2789P6481k0673n741K1561
4763A5275807L8770J17937J04244q472j29036q8729P0841J49909k54147K35095
4753A5512219M0746j76833K0569O8096J62178K76971J85332J57471J16894P0841
4743A6434484J88593L19489J14226N01542J96196q6406J06264J42659M5921J99741
4733A8162709N7390j95810m85460n22420J5148k81605j18291j55708J9445R6680
4723A6592078o3525j51391M5833l8946l3900K95175J91790L0017J32968j3301
$$ plain form
4794 14855642 14574418 14531059 14606911 14727395 14789366 14896866 14986376 15030050 15210234 14968582
4784 14968582 15082510 15155299 15312074 15542025 15466785 15355408 15694466 15664895 15444960 15571160
4774 15571160 15317282 15067326 15312928 15360881 15153245 15111390 15204179 15280660 15259987 15254246 15275807
4763 15275807 15314577 15432514 15536758 15528286 15399250 15310521 15381362 15531271 15277124 15512219
4753 15512219 15552965 15376132 15396701 15464797 15626975 15903946 16089278 16246749 16363643 16434484
4743 16434484 16623077 16942566 17056792 17558334 17754530 17668124 17774388 17917047 17962968 18162709
4733 18162709 18220099 18024289 17538829 17016409 17031557 16749952 16631661 16475953 16495398 16592078
4723 16592078 16528553 16377162 16422995 16384049 16350149 16645324 16837114 16867131 17000099 16986798
4713A6986798Q4723J46241L96577K73108J81772J70198M66631M48080N66384N23673
4703B0244185M22052N19018J63836k192r0342k34692j84523r6573l49084j30464
4693B0261221J66948m9574p2716P2682k10253o75589k03327q2362k40954k97274
4683A8668802K55325k01931m1521L11864M9451K94080J65454K20577L54152L12024
4673B0388277L92250N72857L74042M09954M83908P06398J062278J231032J022418
4664B6643414J390827J486089J656661J727464J836597J466427O25130k69778
4656C6562831j244810j266901j194261j059083n38162j03164j46328K20756O81449
4647C1912327Q92584J317712J647184J577128J316662R82152m6r47633j315603
$$ plain form
4713 16986798 17071521 17217762 17614339 17887447 18069219 18239417 18706048 19154128 19720512 20244185
4703 20244185 20666237 21185255 21349091 21346899 21256557 21021865 20837342 20740769 20391685 20261221
4693 20261221 20428169 20378595 20305879 20378561 20168308 19492719 19289392 19207030 18966076 18668802
4683 18668802 18924127 18722196 18680675 18992539 19041990 19336070 19501524 19722101 20076253 20388277
4673 20388277 20780527 21353384 21727426 22137380 22621288 23327686 24389964 25620996 26643414
4664 26643414 28034241 29520330 31176991 32904455 34741052 36207479 36832609 36562831
4656 36562831 35318021 34051120 32856859 31797776 31259614 31156450 31010122 31230878 31912327
4647 31912327 32804911 34122623 35769807 37346935 38663597 39645749 39645703 38698070 37382467
4638C7382467j418100j124596p44961l47824N4404n3638J48696M37143O77026
4629C5010617J032892R19390L26047L96941K63492j8505l20932p16838o73756
4620C6219348q63291r13531n31359n72280o20081r2295q9000k74827j61645m3239
4610C2057800J03077M02098M31643L69201L24865O37822O36439N93485M47604
4601C6004034O1516j05983j56925k56386q8091k71461k69006K54385J45687L23947
4591C5641717Q19151R86935J071805J623257J901322K351374K847521K866699
4583E0109781K671519J643436J4319j297212k096638k288757j891364j329289
4575D5535795q87042k90043l175L47657J054339J633879J794399J983691J914422
$$ plain form
4638 37382467 35964367 34839771 34094810 33746986 33801390 33747752 33896448 34333591 35010617
4629 35010617 36043509 36962899 37288946 37685887 37949379 37930874 37609942 36893104 36219348
4620 36219348 35356057 34442526 33911167 33338887 32718806 32626511 32537511 32262684 32101039 32057800
4610 32057800 32160877 32562975 32994618 33363819 33688684 34326506 34962945 35556430 36004034
4601 36004034 36065550 35959567 35802642 35546256 35458165 35186704 34917698 35172083 35317770 35641717
4591 35641717 36460868 37447803 38519608 40142865 42044187 44395561 47243082 50109781
4583 50109781 52781300 54424736 54439055 53141843 51045205 48756448 46865084 45535795
4575 45535795 44648753 44358710 44355535 44703192 45757531 47391410 49185809 51169500 53083922
4566E3083922Q04131o04333j674458k687296l148786k928870k329516j771467
4558C8743327j713596j255436r19758j151261j164874r92984j101357j040225
4550B9403836j066150n99384p18602q47592o17226m72397m31957n94700o22640
4541B3433188o35861k35266l58467m89088j47372J13686l03970l34296j12033
4532B0930521O3849l8326L0463J10432j42197k7851P1609L76921J53602J68986
4522B1698009K92305M77231M29764M01500L59927K27518K67300k2614q0742P0722
4512B4120920K9548k58352J6143k65007m09369k85921p3054J17470k43846k93640
4502B2454892K84510J29274j64456J50121J09138n6350o3559K2090J17166J9248
$$ plain form
4566 53083922 53888053 53283720 51609262 48921966 45773180 42844310 40514794 38743327
4558 38743327 37029731 35774295 34854537 33703276 32538402 31545418 30444061 29403836
4550 29403836 28337686 27738302 27019700 26172108 25554882 25082485 24650528 24055828 23433188
4541 23433188 22797327 22562061 22203594 21714506 21567134 21680820 21376850 21042554 20930521
4532 20930521 20994370 20956044 20986507 21096939 20954742 20926891 20998500 21375421 21529023 21698009
4522 21698009 21990314 22467545 22897309 23298809 23658736 23886254 24153554 24130940 24050198 24120920
4512 24120920 24150468 23892116 23908259 23643252 23233883 22947962 22874908 22992378 22748532 22454892
4502 22454892 22739402 22868676 22704220 22854341 22963479 22907129 22843570 22865660 22982826 23002074
4492B3002074j5750j21067p7167j13911J8836J74335L28947J92088o9759p2341
4482B3246285K82054L24693K55743R3210R7415j87448n76467M0732m972k43991
4472B3327254k11324j56775l39100j77897Q5689L50233J71245l8707L52662K7483
4462B3390763j45977J13271Q9104k66204l57659l92699l46316q3424o4112j42523
4452B1794224k97164j27097K18004j3857n1233R1307o0383Q1727J74766K67871
4442B2078165K03012j44133K45270O7340j79573J10794J17682o2489J3430M7575
4432B2497073o7036L28453M297j7397J51966L2001N9604J19813O8426K69444N0317
4421B3496961K03368K35579K71518J78720M17789M37566L01034K87755N01687
$$ plain form
4492 23002074 22986324 22865257 22788090 22674179 22693015 22867350 23196297 23388385 23318626 23246285
4482 23246285 23528339 23853032 24108775 24201985 24299400 24111952 23535485 23576217 23571245 23327254
4472 23327254 23115930 22959155 22620055 22442158 22527847 22878080 23049325 23010618 23363280 23390763
4462 23390763 23244786 23358057 23447161 23180957 22823298 22430599 22084283 22000859 21936747 21794224
4452 21794224 21497060 21369963 21587967 21574110 21522877 21614184 21553801 21635528 21810294 22078165
4442 22078165 22281177 22137044 22382314 22449654 22270081 22380875 22498557 22436068 22449498 22497073
4432 22497073 22430037 22758490 22762787 22745390 22897356 22929357 22988961 23108774 23177200 23446644 23496961
4421 23496961 23700329 23935908 24207426 24386146 24803935 25241501 25542535 25830290 26331977
4412B6331977N95975L51114M20115P07022L81541M66557L47422M43040O59262
4403C0704025N23580P46615Q46308Q72412J412621J733973K067506K454912K523096
4394D3885048K254544J630845M3057j747769k645436k931961k518793k345299
4386C5624236j850819j251078j350724j319749n90353m40194m80177m93397j67198
4377B7680547O744J99648K77428M64783M43467N74730P47468J047350J417540
4368C2859705J655066K037031K233281K357525K639571J806034K25251j466270
4360D4347194k754442l225544k914486k656202k018039j508154j533836j247143
4352B6489348p96840p87280n61558l86146m14072k19597l18942k5949j5340k17527
$$ plain form
4412 26331977 26927952 27279066 27699181 28406203 28787744 29254301 29601723 30044763 30704025
4403 30704025 31227605 31974220 32820528 33692940 35105561 36839534 38907040 41361952 43885048
4394 43885048 46139592 47770437 47813494 46065725 43420289 40488328 37969535 35624236
4386 35624236 33773417 32522339 31171615 29851866 29261513 28821319 28341142 27847745 27680547
4377 27680547 27687291 27886939 28164367 28629150 29072617 29647347 30394815 31442165 32859705
4368 32859705 34514771 36551802 38785083 41142608 43782179 45588213 45813464 44347194
4360 44347194 41592752 38367208 35452722 32796520 30778481 29270327 27736491 26489348
4352 26489348 25692508 24905228 24343670 23957524 23543452 23323855 23004913 22978964 22963624 22746097
4342B2746097l28470j21728l31882n27614k56530l24980j29580j73884j89911
4333B0361518p0077R3418p6388J36545J70475L37369O05171N54256L28697L15256
4323B2756240N42153P60415J031990J253454J361678J400128J423762K97497q18731
4314C0008586j595919j942743j997801j596808j274701p48253p18794r41878m43747
4305A8747942m76710o15425k62310K06549l472p7288K16252L56060O9533L32157
4295A8493288K47160K16290N53208P12579Q24918J051746J342933J609848J398072
4286B6450042N54097n39991j612584j986753j745957j565638j621012r79858p54772
4277A6197574p79360o82151l83078n57095o12242j76420k52048o01605m90442
$$ plain form
4342 22746097 22417627 22295899 21964017 21436403 21179873 20854893 20725313 20551429 20361518
4333 20361518 20291441 20384859 20308471 20445016 20615491 20952860 21558031 22112287 22440984 22756240
4323 22756240 23298393 24058808 25090798 26344252 27705930 29106058 30529820 30827317 30008586
4314 30008586 28412667 26469924 24472123 22875315 21600614 20852361 20133567 19191689 18747942
4305 18747942 18271232 17655807 17393497 17600046 17596574 17519286 17735538 18091598 18161131 18493288
4295 18493288 18740448 18956738 19509946 20222525 21047443 22099189 23442122 25051970 26450042
4286 26450042 27004139 26464148 24851564 22864811 21118854 19553216 17932204 16952346 16197574
4277 16197574 15418214 14736063 14352985 13795890 13183648 13007228 12755180 12153575 11663133
4268A1663133k79448l09212j70203j33695k60752k47349k14031p7999n6873k62312
4258I651259k2048r2893l76703j48488J65805j1524J45087Q9220k39221j31015
4248I029479P7081J05592o6027J43773K9327N7722q385k9512k1450k33023m9285
4237I035292J85045k96853p7204K52140M2657k51765J4669J42517j73282K97L90487
4226I264000J07538k10629J53704K81302k9270j28574Q7341J14239j85961r0964
4216I362726N3627m56676j10871O0858l57070j53382r9462k54278l56301J7670
4206G706841k40109k1877j49457j24357J30619l24432l65340l0030k29810j28176
4196F223872J51508j95968k58814j08193j6455j44085j97037J9163L3908k45482
$$ plain form
4268 11663133 11383685 11074473 10904270 10770575 10509823 10262474 10048443 9970444 9913571 9651259
4258 9651259 9629211 9536318 9159615 9011127 9176932 9165408 9310495 9399715 9160494 9029479
4248 9029479 9106560 9212152 9146125 9289898 9319225 9376947 9368562 9339050 9317600 9084577 9035292
4237 9035292 9220337 8923484 8846280 9098420 9141077 8889312 8903981 9046498 8873216 8873513 9264000
4226 9264000 9371538 9160909 9314613 9595915 9566645 9438071 9525412 9639651 9453690 9362726
4216 9362726 9416353 8959677 8848806 8909664 8552594 8399212 8299750 8045472 7689171 7706841
4206 7706841 7466732 7444855 7295398 7171041 7301660 6977228 6611888 6581858 6352048 6223872
4196 6223872 6375380 6179412 5920598 5812405 5795950 5651865 5454828 5473991 5507899 5262417
4186E262417j89859J04637L3532k24692j30290M8708N8496o1087M3207Q166K2666
4175D975901n0665k6656j32813O4695k03864l5881Q442j52163r0374R8878n1103
4164D404397j63616r2229l3489N1177K1930n6397K408k19479N0927J18726j88972
4153C895383M1965k4213m4587J62085l1025j0042O8880k35163j60143O0190M974
4142C728304J25520j6346j90039N2628N1258j85021o3261J16688J6087m2978J5642
4131C608482k8818j06777J66291j02328k10232k2016M5312J30427Q1662j68230
4121C393773K1173O0814l12412N3231J90839j30234r7277L3513k6392J51836K872
4110C341736p6766K11526n5271k30742R6744J67971l64m2028J6064R7604k1976
$$ plain form
4186 5262417 5072558 5177195 5210727 4986035 4855745 4904453 4962949 4901862 4945069 4953235 4975901
4175 4975901 4925236 4898580 4765767 4830462 4626598 4590717 4599159 4446996 4356622 4455500 4404397
4164 4404397 4240781 4148552 4115063 4166240 4188170 4131773 4134181 3914702 3965629 4084355 3895383
4153 3895383 3937348 3913135 3868548 4030633 3999608 3989566 4058446 3823283 3663140 3723330 3728304
4142 3728304 3853824 3837478 3647439 3700067 3751325 3566304 3503043 3619731 3635818 3592840 3608482
4131 3608482 3579664 3472887 3639178 3536850 3326618 3304602 3349914 3480341 3562003 3393773
4121 3393773 3414946 3475760 3163348 3216579 3407418 3277184 3179907 3213420 3187028 3338864 3341736
4110 3341736 3264970 3476496 3421225 3190483 3287227 3455198 3454834 3412806 3428870 3526474 3504498
4099C504498J03092N5464M8670P3872o3488K14875J82361N2811K11911J03551
4089D487617k41188p2345J74425j411j5616o9558j37887m9988J2768P6547P2259
4078D235623n9948L0150k35226K0161K19692K36855N2945o9301r4129O8904J77586
4067D583312p29N250j8028j10939L0805m7386j9139N1861m3834P3399J16825k31974
4055D389423j80974K16925K6663K6405l345J03263J87335L2799j10035o2177p148
4044D619134k8701J9262j08222j948J2473N9763R9526l5236j5714m7778R2740
4033D665299J4216p4515J25546J51324k27252K978J42729p3612l1450k10888j21794
4022D362581k2079j46839M5605K17355l8531j76468m0365J86326p7057l7463J24359
$$ plain form
4099 3504498 3607590 3663054 3711724 3785596 3722108 3936983 4119344 4172155 4384066 4487617
4089 4487617 4246429 4174084 4348509 4347098 4331482 4261924 4124037 4074049 4086817 4163364 4235623
4078 4235623 4175675 4205825 3970599 3990760 4210452 4447307 4500252 4430951 4336822 4405726 4583312
4067 4583312 4582583 4587833 4569805 4458866 4489671 4442285 4423146 4475007 4431173 4504572 4621397 4389423
4055 4389423 4208449 4425374 4452037 4478442 4475097 4578360 4765695 4798494 4688459 4626282 4619134
4044 4619134 4590433 4609695 4501473 4499525 4511998 4571761 4671287 4636051 4620337 4572559 4665299
4033 4665299 4679515 4605000 4730546 4881870 4654618 4657596 4800325 4726713 4695263 4484375 4362581
4022 4362581 4340502 4193663 4239268 4456623 4418092 4241624 4201259 4387585 4310528 4273065 4397424
4011D397424p4572j5166l2660k9236N4599J10383k7002P3401K3027k5402J46652
4000D601448J99140k1617l6353n432J41065K2472L2216L7717N6597J1863J42442
3989E181558J01201J58522j26654k1974J24283o0193J49694J40425J59933J67064
3979E973859J52529k6175K34149L58759J97228J58581P0784p0737k058N5179K73219
3968G375317N9134L7072K43159K32970q0898L63579N75473Q0065m18172j71112
3958H296587J97056J05139J10204J91575J0656k22521Q1233n2675j04378R3053
3948H705929K4216M3551j85165L5341L38516L31689K21174k5059j39317l11222
3938I039653k34029l48019k20350O8859j63488j77808j22215J2359j12350m7310
$$ plain form
4011 4397424 4322852 4307686 4275026 4245790 4300389 4410772 4383770 4457171 4480198 4454796 4601448
4000 4601448 4800588 4778971 4742618 4737186 4878251 4900723 4932939 4970656 5027253 5039116 5181558
3989 5181558 5282759 5441281 5314627 5292653 5416936 5356743 5506437 5646862 5806795 5973859
3979 5973859 6126388 6100213 6334362 6693121 6890349 7048930 7119714 7048977 7046919 7102098 7375317
3968 7375317 7434451 7471523 7714682 7947652 7866754 8230333 8805806 8885871 8467699 8296587
3958 8296587 8493643 8598782 8708986 8900561 8911217 8688696 8769929 8717254 8612876 8705929
3948 8705929 8730145 8773696 8588531 8623872 8962388 9294077 9515251 9490192 9350875 9039653
3938 9039653 8805624 8457605 8237255 8306114 8142626 7964818 7842603 7854962 7742612 7695302
3928G695302P0657j28202j81561j43730L5837J4280p336k63474J74850j55881
3918G110742m48039k87105k63185k42840j73781r829m1210K09048j7707k24197
3908E611897m7137J33005k67975j62363O2802k15979k81329J27218k16432j07875
3898D635832N5287j29187k02445r9348L6231p86j14228p5686K29681k67188j36377
3887C931786J59528n2743k8190J02332j64848j94563J88530k5028K9326L7019
3877C983149j52639N0710j90458P0852J25939j15096k57399K11075p0304o9046
3867C586783P7736L350p9245Q968M2861k22711J06526Q2978m4050k2924j80834
3856C359438j62018K48285N1651j34628J40800k8875j10216J20987j22482j732
$$ plain form
3928 7695302 7765959 7637757 7456196 7312466 7348303 7362583 7355247 7091773 7266623 7110742
3918 7110742 6662703 6375598 6112413 5869573 5695792 5685963 5644753 5853801 5836094 5611897
3908 5611897 5564760 5697765 5429790 5267427 5330229 5114250 4832921 4960139 4743707 4635832
3898 4635832 4691119 4561932 4359487 4260139 4296370 4295584 4181356 4105670 4335351 4068163 3931786
3887 3931786 4091314 4038571 4010381 4112713 3947865 3753302 3941832 3916804 3946130 3983149
3877 3983149 3830510 3881220 3690762 3761614 3887553 3772457 3515058 3726133 3655829 3586783
3867 3586783 3664519 3667869 3588624 3597592 3640453 3417742 3524268 3607246 3563196 3540272 3359438
3856 3359438 3197420 3445705 3497356 3362728 3503528 3474653 3364437 3485424 3362942 3361210
3846C361210J49951j40705L521K32886k22222J3370J86715o428j0367Q6997R4588
3835C749516j50387L9592J29522q8859N0360l2348N9383J06578j11359K07086
3825C959084J34579k10104k3872L41469k23084k07119J10543k4125m4967K15084
3815D027488M468O1992K70897l40268j37558K58614Q0468J42918o046j48699J0312
3804D224586J21806j4481K31888J93011k54237J63627J41459j56587R9833K38794
3794D989699o0982K90943J50734k03689J39572L60487j58361K03995L05191J3279
3784F030868J19942K05000J28690J40180J85328K43882M02882l9940M4955N23013
3774G984800J05714l64971M44850K04096q3647J07137J01650p3295K85441K57860
$$ plain form
3846 3361210 3511161 3370456 3373977 3606863 3384641 3398011 3584726 3578298 3567931 3654928 3749516
3835 3749516 3599129 3638721 3768243 3679384 3729744 3697396 3756779 3863357 3751998 3959084
3825 3959084 4093663 3883559 3859687 4201156 3978072 3770953 3881496 3857371 3812404 4027488
3815 4027488 4031956 4093948 4364845 4024577 3887019 4145633 4226101 4369019 4362973 4214274 4224586
3804 4224586 4346392 4331911 4563799 4756810 4502573 4666200 4807659 4651072 4750905 4989699
3794 4989699 4928717 5219660 5370394 5166705 5306277 5666764 5508403 5712398 6017589 6030868
3784 6030868 6150810 6355810 6484500 6624680 6810008 7053890 7456772 7416832 7461787 7984800
3774 7984800 8090514 7725543 8170393 8374489 8290842 8397979 8499629 8426334 8711775 8969635
3764H969635l663L80860L04976L42262M08777J33282K25245O90288M64621O05059
3754A2521342Q84593P76189P66203J067488O22130K09475Q4232j25635j06226
3745A6699791k5919R636K74242M95522P73400J064212J099050J054933J281605
3736B2726472R12914O15957O21374L17995L93275L10254J72099j87022l79715
3727B5503603j56163K48078M62907P30472J216228J437892J424074J079814M80139
3718C2427044J18326j78462m96219m18801m51613p63267q25125n34248N003L42154
3708B9224792P66365O01132N56798O23706N48763O69085L79268L4555n13786j337056
3698C1553622j439704j402910j191974o77166K1044L66920L03909L10412N16779
$$ plain form
3764 8969635 8965972 9346832 9651808 9994070 10402847 10536129 10761374 11451662 11916283 12521342
3754 12521342 13405935 14182124 14948327 16015815 16637945 16847420 16931652 16806017 16699791
3745 16699791 16673872 16683508 16957750 17453272 18226672 19290884 20389934 21444867 22726472
3736 22726472 23639386 24255343 24876717 25194712 25587987 25898241 26070340 25883318 25503603
3727 25503603 25347440 25595518 26058425 26788897 28005125 29443017 30867091 31946905 32427044
3718 32427044 32545370 32366908 31870689 31451888 31000275 30237008 29411883 28877635 28882638 29224792
3708 29224792 29991157 30592289 31149087 31772793 32321556 32990641 33369909 33404464 32890678 31553622
3698 31553622 30113918 28711008 27519034 26841868 26862912 27229832 27533741 27844153 28360932
3689B8360932J66961J49916r9042l73520n37802q07122q01845j120713j169277
3680B3768488r00720m61909n61337m56777r0478J45547K74099K11759q6747M2748
3670B1884673m74094q23267p18585o39615m28750m80789m38488j81835j65934
3661A7533316k85395m6847K4208j65422m2719J13591M44376J41587k1191K63313
3651A7958817M44885K08986J18168K50554M7517j30093j36232p8282J30705J06264
3641A8921289O6719K58790L48606L20222M12132O89168M31496K31647N01168M68159
3631B2649396j49891l56823n03024l29058l28935m33465j96301K1081j54643j4257
3621B0204080M4338j45178k59794q813K07344K01356L55831N13257O05760R64406
$$ plain form
3689 28360932 28527893 28677809 28578767 28205247 27667445 26860323 26058478 24937765 23768488
3680 23768488 22867768 22405859 21844522 21387745 21297267 21442814 21716913 21928672 21841925 21884673
3670 21884673 21410579 20587312 19868727 19229112 18800362 18319573 17881085 17699250 17533316
3661 17533316 17247921 17201074 17225282 17059860 17017141 17130732 17575108 17716695 17695504 17958817
3651 17958817 18403702 18612688 18730856 18981410 19028927 18898834 18762602 18684320 18815025 18921289
3641 18921289 18988008 19246798 19595404 19915626 20327758 21016926 21448422 21680069 22181237 22649396
3631 22649396 22499505 22142682 21639658 21310600 20981665 20548200 20351899 20372980 20218337 20204080
3621 20204080 20248418 20103240 19843446 19834633 20041977 20243333 20599164 21112421 21718181 22682587
3611B2682587O57456L07828M48740J38982l33020p83475j227721r03030r08525
3602B0079822j064559n56422l79002l66688l31208j68139J965L6848p0966L14074
3592A7495725M11509K26292M70547O92241M40320N1831j94672l96070m95886k24208
3582A8477629j04705k02774j13681j25793m9608J82157j42036j13378J88201m2893
3572A7953119M1082O5543l3209M74704L97544J21753M11697N18428L43554M73927
3562B0768142N55416P01902N90061L26029R84445P07567L77471M85791M57852
3553B5954676n8718k77496k19586m7507L5528J54157O30573N10268O68512R83133
3543B8333540J295798J283424R17665O52567Q11062O35231Q56650J702548K313602
$$ plain form
3611 22682587 23340043 23647871 24096611 24235593 23902573 23119098 21891377 20988347 20079822
3602 20079822 19015263 18458841 18079839 17713151 17381943 17213804 17215769 17252617 17181651 17495725
3592 17495725 17907234 18133526 18604073 19296314 19736634 19788465 19593793 19197723 18701837 18477629
3582 18477629 18372924 18170150 18056469 17930676 17881068 18063225 17921189 17807811 17996012 17953119
3572 17953119 17994201 18059744 18026535 18501239 18898783 19020536 19432233 19950661 20294215 20768142
3562 20768142 21323558 22025460 22615521 22941550 23925995 24633562 25011033 25496824 25954676
3553 25954676 25895958 25618462 25398876 25351369 25386897 25541054 26171627 26681895 27350407 28333540
3543 28333540 29629338 30912762 31830427 32482994 33294056 33929287 34785937 36488485 38802087
3534C8802087K636690K928919K843468J378457j442112l097672k740551k449421
3526C8859865j919135r65861p02560k36935K53258O01680Q20475J359195J778938
3517C9848920K178355K258486K821230L813013M052985L889144K728274J315442
3509F2905849l59651k618132m518062n045107m364185l391579k910598k083039
3501C7615496j558867j050483q43996o93198j205N03944L72761Q23260J603719
3492C6771431J515353K282284K596441Q03008j572362l090372l444706k680514
3484C3180563k367594j969685j243605j407036j561514p02280o57821r58756o15541
3475B1696731n95790o77759p53122n00605l23660m59248k36253k50156j59134
$$ plain form
3534 38802087 41438777 44367696 47211164 48589621 47147509 44049837 41309286 38859865
3526 38859865 36940730 35974869 35272309 35035374 35288632 35890312 36710787 38069982 39848920
3517 39848920 42027275 44285761 47106991 50920004 54972989 58862133 61590407 62905849
3509 62905849 62546198 59928066 55410004 50364897 46000712 42609133 39698535 37615496
3501 37615496 36056629 35006146 34162150 33468952 33467747 33971691 34344452 35167712 36771431
3492 36771431 38286784 40569068 43165509 43968517 42396155 39305783 35861077 33180563
3484 33180563 30812969 28843284 27599679 26192643 24631129 23928849 23271028 22312272 21696731
3475 21696731 21100941 20423182 19670060 19169455 18845795 18386547 18150294 17900138 17741004
3466A7741004l45174l36216j42918k47124l20113j83844l53237m314o7298n80097
3456A5160669j55671K1600m24336j61065K01905k43379j93796r5829j25581r1406
3446A3893111j37555l05172J09910l5533k95712r6552q7788j6923l305l23560
3436A2700921M8626j2266k32832k25084k9200j05773j90411j8106o915k9543K0395
3425A1919812k69549n1339o497j42669R0226O8560l49079j24376R8074J3346J03248
3414A1349757k21969j43423Q1554k4630M732J7126j1077j75310r9226O0817J94483
3403A1032834J40889j11846J90241K04659J09156R6216M24322K80234L5958J83489
3393A2586152J78037J40324J78112M7898Q4691j09212j80167j08322j1747R5863
$$ plain form
3466 17741004 17395830 17059614 16916696 16669572 16349459 16165615 15812378 15808064 15740766 15160669
3456 15160669 15004998 15026598 14602262 14441197 14643102 14399723 14205927 14110098 13984517 13893111
3446 13893111 13755556 13450384 13560294 13524761 13229049 13132497 13044709 13027786 13024481 12700921
3436 12700921 12749547 12737281 12504449 12279365 12250165 12144392 11953981 11935875 11928960 11899417 11919812
3425 11919812 11650263 11598924 11592427 11449758 11539984 11608544 11259465 11135089 11233163 11246509 11349757
3414 11349757 11127788 10984365 11065919 11041289 11046021 11063147 11052070 10876760 10777534 10838351 11032834
3403 11032834 11173723 11061877 11252118 11456777 11565933 11662149 12086471 12366705 12402663 12586152
3393 12586152 12764189 12904513 13082625 13130523 13215214 13106002 12925835 12817513 12805766 12901629
3383A2901629J74645J37073Q1064R0102K7537J16818J60087l7820j18078R833
3373A3542890L3175o7905J5469n5382k57393k16438n0692m106l18238l32087j35473
3362A2153820m9104l06606k50648l9384k74813k01923k21154k75972l3658L6623
3352A0537181k5045j80686J290N0317Q6177j11448j07921J93113o3399j91097
3342A0188482J34277N5797m0914J17070J7639j05841j3836J57886J53089j75367
3332A0488282j62379K21996J6733Q4598K21882o907r293K29256R4488L2817J27759
3321A1339232J41998J04863K19179K951J86291J93146L6767j8933O97p2850J49047
3310A2282388J61550N0595q3129Q3898J79298J4348k2288J71148L28870N4731
$$ plain form
3383 12901629 13076274 13213347 13294411 13384513 13412050 13528868 13688955 13651135 13533057 13542890
3373 13542890 13576065 13508160 13523629 13468247 13210854 12994416 12943724 12939618 12621380 12289293 12153820
3362 12153820 12104716 11798110 11547462 11508078 11233265 11031342 10810188 10534216 10500558 10537181
3352 10537181 10512136 10331450 10332740 10383057 10469234 10357786 10249865 10442978 10379579 10188482
3342 10188482 10322759 10378556 10337642 10454712 10472351 10366510 10352674 10510560 10663649 10488282
3332 10488282 10325903 10547899 10564632 10649230 10871112 10864205 10854912 11084168 11178656 11211473 11339232
3321 11339232 11481230 11586093 11805272 11808223 11994514 12187660 12224427 12205494 12206191 12133341 12282388
3310 12282388 12443938 12494533 12411404 12495302 12674600 12688948 12666660 12837808 13166678 13221409
3300A3221409m2039J47515J33272q2327J68206J39645j7021O7550J32851L8399
3290A3907460o7443j28895K4197O6532J27249m582n413P3797j45686j24020K43430
3279A3966626l439M4943J03355N6462k4300J57234K00815J5993J65570P5688K17006
3268A4975953J9963J41358L71027J45561N988L38333P6948J99738N91617R3002
3258A6959488J4887J50147K08316K39203M62045K97236K61337L67600K54487L79185
3248A9593931N23784L79298K82906N33672K65640L48944N61853L32578O59298
3239B3481904N98425L36822M47487P43549N87403M88940L48764N63287Q26179
3230B8422760N20984N43830R28648J006455P95159J166554J379508J226748J645058
$$ plain form
3300 13221409 13179370 13326885 13460157 13377830 13546036 13685681 13668660 13736210 13869061 13907460
3290 13907460 13840017 13711122 13735319 13801851 13929100 13924518 13919105 13992902 13847216 13723196 13966626
3279 13966626 13963187 14008130 14111485 14167947 14143647 14300881 14501696 14517689 14683259 14758947 14975953
3268 14975953 14995916 15137274 15508301 15653862 15659850 15998183 16075131 16274869 16866486 16959488
3258 16959488 16974375 17124522 17332838 17572041 18034086 18331322 18592659 18960259 19214746 19593931
3248 19593931 20117715 20497013 20779919 21313591 21579231 21928175 22490028 22822606 23481904
3239 23481904 24080329 24417151 24864638 25608187 26195590 26684530 27033294 27596581 28422760
3230 28422760 28943744 29487574 30416222 31422677 32217836 33384390 34763898 35990646 37635704
3221C7635704J867937J929135K116738K276549L031973L555757L602962M147490
3213F0164245L676459J309118n29650j188327j197021k77455P21166J102135K023970
3204F5804640K622207L000575L966816M046011K716611O86268j35230J7584O69864
3195H3395346J857217K906344L877516N033919N329694N038359L765113K559967
3187A13763475L039231L505500L557645M035515M229298M346450M983855O335308
3179A47796277Q014408R692788R853696J0609027J3198771J7189117K1974481
3172B38328565K3755446J5190578K653019k066212j245937m483900j6377147k4279632
3164B31474780k4656676k0748262j5989914j2144041r200559p164015o090131
$$ plain form
3221 37635704 39503641 41432776 43549514 45826063 48858036 52413793 56016755 60164245
3213 60164245 63840704 65149822 64620172 63431845 62234824 61957369 62678535 63780670 65804640
3204 65804640 68426847 71427422 75394238 79440249 82156860 82843128 82707898 82725482 83395346
3195 83395346 85252563 88158907 92036423 97070342 102400036 107438395 111203508 113763475
3187 113763475 116802706 120308206 123865851 127901366 132130664 136477114 141460969 147796277
3179 147796277 155810685 165503473 175357169 185966196 199164967 216354084 238328565
3172 238328565 262084011 277274589 279927608 277861396 276615459 272131559 255754412 231474780
3164 231474780 206818104 186069842 170079928 157935887 148735328 141571313 135481182
3157A35481182m903116l984564l811774l392726k797103k709768k912688l076643
3149A07892800k600338j613169r62405j53522Q04568J124582J568960K370064
3141A08431540K648258K238692J174947M93396l30520p55741j244416j362375
3133A11293781r15889l75480l87362j490806l172479m937918n322661m500931
3125I0190255l570278k663811j972622j080379o36293k79114J63588P13913R83046
3116H1848305J561216J785909R91845p13930k184111l140835l290033l259177
3108G3599189k642370k089603k025270j720336j725335j663830j072027r54162
3100E9706256r27792l86509j05744J90825M72334Q84212J285584J645778J809351
$$ plain form
3157 135481182 130578066 126593502 122781728 119389002 116591899 113882131 110969443 107892800
3149 107892800 105292462 103679293 102716888 102563366 103367934 104492516 106061476 108431540
3141 108431540 111079798 113318490 114493437 114986833 114656313 113900572 112656156 111293781
3133 111293781 110377892 110002412 109615050 108124244 104951765 100013847 94691186 90190255
3125 90190255 86619977 83956166 81983544 80903165 80266872 79987758 80151346 80865259 81848305
3116 81848305 83409521 85195430 86187275 85473345 83289234 80148399 76858366 73599189
3108 73599189 70956819 68867216 66841946 65121610 63396275 61732445 60660418 59706256
3100 59706256 58778464 58391955 58286211 58477036 58949370 59833582 61119166 62764944 64574295
3091F4574295K437466K892972L512603M345612M931994N139101M796594K910463
3083I5541100r1165l430111n408789n886748n705246n216809m408327l591208
3075F1802697l237223k978048k111173j984546j879070j463794j392007j280323
3067D5476513j092385j140067j065442r31163p55447p37495p42475m74226k84268
3058C8253545m38796o21906k34031K18762r0670k30133K98822O02302O03937N42594
3048C8904426R61103J154382J325019J726986K313768K606467K960023L751416
3040E5703590M693908N147571N533578N602207M791864Q30576m062520o898457
3032G1342317p167301n922864m747726m294916l949838l686246l283694k601639
$$ plain form
3091 64574295 67011761 69904733 73417336 77762948 82694942 87834043 92630637 95541100
3083 95541100 95449935 92019824 86611035 80724287 75019041 69802232 65393905 61802697
3075 61802697 58565474 55587426 53476253 51491707 49612637 48148843 46756836 45476513
3067 45476513 44384128 43244061 42178619 41247456 40492009 39754514 39012039 38537813 38253545
3058 38253545 37814749 37192843 36958812 37177574 37086904 36856771 37155593 37757895 38361832 38904426
3048 38904426 39865529 41019911 42344930 44071916 46385684 48992151 51952174 55703590
3040 55703590 60397498 65545069 71078647 76680854 81472718 82303294 78240774 71342317
3032 71342317 64175016 58252152 53504426 49209510 45259672 41573426 38289732 35688093
3024C5688093k130376j805857j715880j463195j028827r51277j019488q38897
3016B4734296q84161q07426p75661m75711n05514o38764n03545j27968m32633
3007A9582913m10663n48563k69004j76837l01208j95396j36998k56305k40335
2998A7047604n5967j96009j11857j31173j45555q01q0346k63988J98548j7122
2988A6243334j79254j39025j99230q9792k03159l78441j43239q2108j14355l67650
2978A4347081o15159j57272K4393k38816k00715j55454j29204l22996k31080j02216
2968A2218562l81713k13211L7428l15970j36776j47242Q6723J44602m0488r5057
2958A1156858L38842K4431j45668j22588l69932l05115j43789p1957j69826j78416
$$ plain form
3024 35688093 33557717 31751860 30035980 28572785 27543958 26592681 25573193 24734296
3016 24734296 23850135 23042709 22267048 21791337 21285823 20647059 20143514 20015546 19582913
3007 19582913 19172250 18623687 18354683 18177846 17876638 17681242 17544244 17287939 17047604
2998 17047604 16991637 16795628 16683771 16552598 16407043 16406242 16325896 16061908 16260456 16243334
2988 16243334 16064080 15925055 15725825 15636033 15432874 15054433 14911194 14829086 14714731 14347081
2978 14347081 13731922 13574650 13599043 13360227 13159512 13004058 12874854 12551858 12320778 12218562
2968 12218562 11836849 11623638 11661066 11345096 11208320 11061078 11147801 11292403 11251915 11156858
2958 11156858 11495700 11520131 11374463 11251875 10881943 10576828 10433039 10361082 10191256 10012840
2948A0012840l2206K35317J11709q0522n2756o0716k058k1865k51906o928r0053
2937I760856j89222k10297j94065L2587k21752l51727K01041j30982n84230p1773
2927H040436J7660l50390j02600j47391J86709K5948l78178j09770K63053K8206
2917G473683j26476j05278K46320J43184q2188j5885m5104k22496J81386J66654
2907G613800j36375l7226k64758K9134r8737j60060J40026J24267J08109J25759
2897G443939k46065j04677J48630m3422q9060j53910q6445k4983Q0957J30491
2887G055455q467k29199K01039J68311j32384L8002P2554k1565j61102k52734
2877F729910R3924J18046k1867K80324P9646r4167J08063K48424J3165k08593
$$ plain form
2948 10012840 9980634 10215951 10327660 10247138 10194382 10133666 10131608 10109743 9857837 9850909 9760856
2937 9760856 9571634 9361337 9167272 9199859 8978107 8626380 8827421 8696439 8112209 8040436
2927 8040436 8058096 7707706 7605106 7457715 7644424 7670372 7292194 7182424 7445477 7473683
2917 7473683 7347207 7241929 7488249 7631433 7549245 7533360 7488256 7265760 7447146 7613800
2907 7613800 7477425 7440199 7175441 7204575 7105838 6945778 7085804 7210071 7318180 7443939
2897 7443939 7197874 7093197 7241827 7198405 7109345 6955435 6868990 6844007 6924964 7055455
2887 7055455 7046988 6817789 7018828 7187139 7054755 7092757 7165311 7143746 6982644 6729910
2877 6729910 6823834 6941880 6920013 7200337 7279983 7185816 7293879 7542303 7555468 7346875
2867G346875k22202p4384j29867j39310J12673J53368O6314k8764N137N8307j63538
2856F984609P5223J54486k33629k88729j8305l6201l3650n089l23898p5422j06815
2845F092580j60918K16010p703r3109J47755m2934j93489J08018q1413j0959k25688
2834E748150m49707p6358r0070j64533K5440L5501j05028j35006j07959J44439
2824D824869j82367M5668K02150j95450n3817K04049K9750r242J02191j4644Q4595
2813E037752j21828j32843m3903L7146j96865j06084N1437R209m9072o6447j6701
2802D401801j08636m2880j42638q533J44998j4310n1650J69097k21773j73049
2792C952427M02640l4824j7738K16871Q4399Q3022k5740j55556J63580j27931
$$ plain form
2867 7346875 7124673 7050289 6920422 6781112 6893785 7047153 7113467 7084703 7089840 7148147 6984609
2856 6984609 7059832 7214318 6980689 6691960 6673655 6637454 6603804 6598715 6274817 6199395 6092580
2845 6092580 5931662 6147672 6139969 6046860 6194615 6151681 5958192 6066210 5984797 5973838 5748150
2834 5748150 5298443 5222085 5132015 4967482 4992922 5028423 4923395 4788389 4680430 4824869
2824 4824869 4642502 4688170 4890320 4694870 4641053 4845102 4874852 4865610 4967801 4953157 5037752
2813 5037752 4915924 4783081 4739178 4776324 4579459 4473375 4524812 4534021 4484949 4418502 4401801
2802 4401801 4293165 4250285 4107647 4099114 4244112 4229802 4178152 4347249 4125476 3952427
2792 3952427 4355067 4320243 4302505 4519376 4603775 4686797 4661057 4505501 4669081 4541150
2782D541150m83891R3912N4446l02032n8310K40085n2102l29609P3160k5625p1970
2771C679214L8674j23115k34234o4811o9359J6409J21133j84975j36418n5528
2761B986990j89785J34411J84064j88584L8509j40731l59026K52525L11705k93100
2751B736978J68175J53185k09778j18889P8374l4364j61450J25210q2736L615
2741B658320N2361j57179K17827L5570k47243Q2255k7738o6554J98776J23568
2731B869963k4363L5404j20874j13176K12305K15715j15669m2377q6329r1333
2721B739266J75605r0104j25382M0505k63931j27328Q3625j01908Q1842J90471
2711B602661j64944j87202J15684p8722j49035j9026j78591q4317O6638r5772
$$ plain form
2782 4541150 4057259 4151171 4205617 3903585 3845275 4085360 4033258 3703649 3776809 3751184 3679214
2771 3679214 3717888 3594773 3360539 3295728 3226369 3242778 3363911 3178936 3042518 2986990
2761 2986990 2797205 2931616 3115680 2927096 2965605 2824874 2465848 2718373 3030078 2736978
2751 2736978 2905153 3058338 2848560 2729671 2808045 2773681 2612231 2737441 2654705 2658320
2741 2658320 2710681 2553502 2771329 2806899 2559656 2641911 2614173 2547619 2746395 2869963
2731 2869963 2845600 2881004 2760130 2646954 2859259 3074974 2959305 2916928 2830599 2739266
2721 2739266 2914871 2824767 2699385 2739890 2475959 2348631 2432256 2330348 2412190 2602661
2711 2602661 2437717 2250515 2366199 2287477 2138442 2119416 1940825 1856508 1923146 1827374
2701A827374J63786K08766k55834j4795P2731j77337J27801J54650j2849j1321
2691B082972n9669k4543J46503K9213j13035K38542p9382l03483J69259p2311
2681B014066k04680o3476Q0555q994k040J86862J35835o1403j19900J40230J80463
2670B277518k8576J08074j1542k67689n4231M9271j14695L890J49545j96733j82499
2659A732333K5484k32040m1995J21580m8060l904j06358j86418J04460L9702j40546
2648A264238O7921Q6700l43090J46873O1589p5625n4227J03818J60319j85898
2638A232618j35646q119K01932j33678l5381K06758k4314q0730k8480m5887m3801
2627A105272M1955J95982K8824j48518j06249J38351o5094n1646k4063J15393
$$ plain form
2701 1827374 1991160 2199926 1944092 1929297 2002028 1824691 1952492 2107142 2094293 2082972
2691 2082972 2023303 1998760 2145263 2174476 2061441 2299983 2220601 1917118 2086377 2014066
2681 2014066 1809386 1745910 1826465 1817471 1815431 2002293 2138128 2076725 1956825 2097055 2277518
2670 2277518 2248942 2357016 2345474 2077785 2023554 2072825 1958130 1962020 2111565 1914832 1732333
2659 1732333 1757817 1525777 1483782 1605362 1557302 1553398 1447040 1260622 1365082 1404784 1264238
2648 1264238 1332159 1418859 1075769 1222642 1284231 1208606 1154379 1258197 1418516 1232618
2638 1232618 1096972 1088853 1290785 1157107 1121726 1328484 1304170 1223440 1194960 1149073 1105272
2627 1105272 1147227 1343209 1372033 1223515 1117266 1255617 1190523 1138877 1114814 1230207
2617A230207o7200O9018o485n9602l8976k01242J23457r314j8316m0752k7630
2606I53165n1869p303J18450N3173n7497P4326m7069j15287J04732q6446K7537
2595I65912O7775K6077n0749N6429m2094M3099L0411r6336M4728j49770M02K89506
2583A185390p7718k66641Q357J40615m8344m9133K3537J9883J02844k72601k9736
2572G36453J62041L068k2222q6238m5894J415M0123R0549J9440J858j04394j35871
2560F60328N3911R6700J34809P1196j56648l08499J14725O6799M6157J32848L4757
2549I47083k67555k83077J29146L69475O1769k12381M710J9788r4000p4596p932
2538E92430J17413n7573j48069O4913o4014J1509K52276p7799j16934J30274j5387
$$ plain form
2617 1230207 1163007 1232025 1225540 1165938 1126962 925720 1049177 1039863 1021547 980795 953165
2606 953165 901296 893993 1012443 1065616 1008119 1082445 1035376 920089 1024821 938375 965912
2595 965912 1033687 1059764 1009015 1065444 1023350 1066449 1096860 1000524 1045252 895482 895884 1185390
2583 1185390 1107672 841031 849388 990003 941659 892526 916063 935946 1038790 766189 736453
2572 736453 898494 901562 879340 793102 747208 748623 788746 879295 898735 900593 796199 660328
2560 660328 714239 810939 945748 1016944 860296 551797 666522 733321 779478 912326 947083
2549 947083 679528 396451 525597 895072 956841 744460 749170 768958 674958 600362 592430
2538 592430 709843 652270 504201 569114 505100 516609 768885 691086 574152 704426 689039
2527F89039L8008O8346q1388j41745L8242k3281q119J41161L6161p2528j26314
2516E57582M9800J2599M5914O8479j77667k7919j67028k009K69704q1914r3385
2505D54156O6944j9556J88084j38040m2202L3248P1961J10353J13011j06943L533
2494G34549J39395j21349r3266m3736K41719K989k11974j47715O819K28739J25392
2483H61562j5353n6079k27135o2712P0983j7400p0390K12207P4054j18968j02314
2472E48455k89007K35811K24584K3916J3008j15520j39159m9076L5823m4093J10844
2461E55586R8480q36R296o7434M5087k01021P9047J28259j36688l4254N9425j377
2449E33570j69163J85082N726j39019N0727n8169n5470j82536N7192L86592K7472
$$ plain form
2527 689039 727047 795393 714005 572260 610502 587221 579102 720263 756424 683896 557582
2516 557582 607382 619981 665895 734374 556707 528788 361760 359751 629455 547541 454156
2505 454156 521100 501544 689628 551588 509386 542634 614595 724948 837959 731016 734549
2494 734549 873944 752595 659329 615593 857312 860301 648327 500612 507431 736170 861562
2483 861562 846209 790130 562995 500283 571266 553866 483476 695683 769737 650769 548455
2472 548455 259448 495259 719843 743759 756767 641247 502088 453012 488835 444742 555586
2461 555586 654066 653230 662526 595092 640179 439158 518205 646464 509776 475522 534947 533570
2449 533570 364407 549489 555215 416196 466923 408754 353284 170748 227940 614532 642004
2438F42004k33557j71617M6773L1665q493N2104J16787O1096N177o3984M8212
2427E26167p6004j48120O5253J10171m3767n5960L0799J4406p298r6563n3515
2416B65569j2316Q6424P6224L9610m4506q7140J53784M6272o4578n2152m4994
2405C62197l3453j52155N4289J90165K1697L7858j16530q4362N4235K56635j26106
2394D64470j5787J68586k06528j23186n2322P9694J03233L5475n6819K9753P8986
2383E05555m5293l8066j92832K3197K19198K6815j40320n9145n2544l6084J11287
2372C21768J22020K2899M9741j01953j06406J10041k18330P8287J85421j01864
2362C61624o9532Q0637r4440j36988L42958k11978o3959K81434k16429j39148
$$ plain form
2438 642004 408447 236830 283603 315268 306775 358879 475666 536762 541939 477955 526167
2427 526167 450163 302043 367296 477467 433700 377740 408539 422945 415647 319084 265569
2416 265569 253253 339677 415901 455511 411005 323865 477649 523921 459343 407191 362197
2405 362197 328744 176589 230878 421043 442740 480598 364068 279706 333941 590576 464470
2394 464470 448683 617269 410741 287555 235233 314927 418160 453635 396816 426569 505555
2383 505555 460262 422196 229364 252561 471759 498574 358254 299109 246565 210481 321768
2372 321768 443788 466687 516428 414475 308069 418110 199780 278067 463488 361624
2362 361624 292092 372729 278289 141301 484259 272281 208322 489756 273327 134179
2352A34179m5885K9856J51914J11801j64097J39558J05641k5969Q9304j1026n4526
2341D60750J7733K3212N5337m6210j35967M424M3724L2616R0304N9299j29396
2330D75826j15993q3580q2898J63302L98592j49638l47753o2584J1821K06856
2320D13951R4602o488J8571n474j78014J51350l9142k06065J55566K7942m6158
2309C80641n0966j29199m0016K72363Q0326l5939J17244j35904r7837J77725j39962
2298C98476L8952K04429q7369l5173j11170j03567K01112J35579j36855K7964
2288E32378J03067j41004q3378p1539j5261L40375J78559k61184R0466m9327l27071
2277B96081K35749K69771j73684k9984M8181k04704r6597J01938J64119K15775
$$ plain form
2352 134179 88294 118150 270064 381865 217768 357326 462967 436998 526302 515276 460750
2341 460750 478483 501695 557032 510822 374855 379279 423003 455619 545923 605222 475826
2330 475826 359833 276253 193355 356657 755249 605611 257858 195274 207095 413951
2320 413951 508553 502065 520636 515162 337148 488498 449356 243291 398857 426799 380641
2309 380641 329675 200476 160460 432823 513149 477210 594454 458550 360713 538438 398476
2298 398476 437428 641857 554488 519315 408145 304578 505690 641269 504414 532378
2288 532378 635445 494441 411063 339524 324263 664638 843197 582013 672479 623152 296081
2277 296081 531830 801601 627917 597933 646114 441410 344813 446751 610870 826645
2267H26645k01434l94411J38411J25641J72341J547j6339J44134j30762p9979
2257E85794P0311l2066q9598k33812K88600J06908k43787M82956J129l84733P7355
2246F29057J22467n0711J38723O206j87884K9660o2171j39994K44530K09386J2751
2235I52020j77037l0694P8468r1110J1699J67215K58970l47393n5585R7648N8563
2224I22764o3467L6349J92482k27696j15301j21066J59544K30100k87986j0652
2214G15071L33042j65138J014K07632l4259j03607J84066n5138k6613J46293r9937
2203A102426O2394m0584j04832J73409R3265q4727k92654m7759J61410O386j36806
2192H91928J76864K10385k75916j15660J96807J94632P6757J73270J51127k03103
$$ plain form
2267 826645 625211 230800 369211 494852 667193 668740 652401 796535 665773 585794
2257 585794 656105 624039 534441 300629 589229 696137 452350 935306 936435 551702 629057
2246 629057 751524 700813 839536 845742 657858 687518 625347 485353 729883 939269 952020
2235 952020 774983 744289 822757 731647 743346 910561 1169531 822138 766553 864201 922764
2224 922764 859297 895646 1088128 860432 745131 624065 783609 1013709 725723 715071
2214 715071 1048113 882975 883989 1091621 1057362 953755 1137821 1082683 1056070 1202363 1102426
2203 1102426 1164820 1124236 1019404 1192813 1286078 1201351 908697 860938 1022348 1028734 891928
2192 891928 1068792 1279177 1003261 887601 1084408 1279040 1355797 1529067 1680194 1477091
2182A477091j94842J26650N2816J33460M3506j02070M1349O9988r2143N8234J27763
2171A741802R7243o0531j19423K64042J95741k27567K13135K31248k18628J04080
2161B221142K04789P9769O0877j6749J23233J79268n8986j22268l6468j76154
2151B458453j08846n1067p132m2360R5942j56388k29291r6796j5188R8714J11741
2140B057782l9940j32958P3797K8992P7439K94221J26966J13132L81841N4405
2130C035677M42346N25675l1149k30515l68977n61862j09613k59915k10087j01061
2120B130519q2647j26724o0641j18899p1241r751l9199n0337J46917M1595j15783
2109A643809J47578J37597j77850R3330M46017Q7271j10257L17856J93547M46041
$$ plain form
2182 1477091 1282249 1408899 1461715 1595175 1638681 1536611 1577960 1647948 1555805 1614039 1741802
2171 1741802 1839045 1778514 1659091 1923133 2118874 1891307 2104442 2335690 2117062 2221142
2161 2221142 2425931 2505700 2566577 2549828 2673061 2852329 2793343 2671075 2634607 2458453
2151 2458453 2349607 2298540 2291408 2249048 2344990 2188602 1959311 1862515 1847327 1946041 2057782
2140 2057782 2017842 1884884 1958681 1987673 2065112 2359333 2486299 2599431 2981272 3035677
2130 3035677 3478023 4003698 3972549 3742034 3373057 2811195 2701582 2441667 2231580 2130519
2120 2130519 2047872 1921148 1860507 1741608 1670367 1660616 1621417 1571080 1717997 1759592 1643809
2109 1643809 1791387 1928984 1751134 1844464 2290481 2377752 2267495 2585351 2778898 3224939
2099C224939M66431K53436P45558O71021R08277J41678r06740q30157n29024n11132
2089C634287l04570m73977m21344j30328k92422k75032P3155l2673J8193j58396
2079A636893k05261J8694J08440M5511l3134k05616n7950M1521R0340J33073l4192
2068A538319L5932L59655K65487L4626K73437K37009K64236L96799j46473k48663
2058C010364n61856n25652j92817k40794j33667j05311j393n4697k18587J37922
2048A113512P2792m43536n3756N8617k17669N6626M6112j38712J33650j53950
2038D73686j2686K43362o8791j04159L4045N762K0704n2818j39520r3464J14703
2027D20824l5940n5373J45716n2095J1683K53127j78097j96632m7196R8848J86916
$$ plain form
2099 3224939 3691370 3944806 4690364 5361385 6269662 6411340 5504600 4674443 4145419 3634287
2089 3634287 3329717 2855740 2434396 2304068 2011646 1736614 1809769 1777096 1795289 1636893
2079 1636893 1431632 1450326 1558766 1604277 1571143 1365527 1307577 1349098 1439438 1572511 1538319
2068 1538319 1574251 1933906 2199393 2234019 2507456 2744465 3008701 3405500 3259027 3010364
2058 3010364 2448508 1922856 1730039 1489245 1355578 1250267 1248874 1194177 975590 1113512
2048 1113512 1186304 742768 689012 747629 529960 586586 632698 493986 627636 473686
2038 473686 461000 704362 635571 531412 565457 571219 591923 539105 399585 306121 420824
2027 420824 384884 329511 475227 423132 434815 687942 509845 313213 266017 364865 551781
2016E51781k539l20426l7393J87179j98062o570J7651L6845j577M7765R6985m9598
2004C22041k62283r450J91312o1413j2155J74840k54006r0577L3763J34944J37242
1993C04258m5077k3829N9445p4566k7119R6449l2661M6199P1986j03792L5811
1982C07104M2478k09923O6074J04945p2621j69312P9256R4593P3224n2841j67010
1971I5967j3646k6814j40333K99219J78243m08396M2624K49564l69646O7985K41058
1960B15825j36820O9309R946j25077K88104Q18l4704J36628k84057k68904K07960
1949G9028J60163o7239K8557j74064r7906J96022j5345J8717J09849M487n8415
1938A83854o9082k9831O1369K5785j00455p9405P0100R2018Q0099N3230j78761
$$ plain form
2016 551781 549242 228816 191423 378602 180540 173970 191621 228466 226889 274654 371639 322041
2004 322041 59758 50308 241620 180207 168052 342892 88886 -1691 32072 167016 304258
1993 304258 259181 235352 294797 220231 193112 289561 256900 303099 375085 271293 307104
1982 307104 349582 139659 205733 310678 238057 68745 148001 242594 315818 262977 95967
1971 95967 82321 55507 -84826 214393 392636 -15760 26864 276428 -93218 -25233 215825
1960 215825 79005 148314 158260 33183 321287 322105 287401 424029 139972 -128932 79028
1949 79028 239191 171952 200509 26445 -71461 124561 109216 127933 237782 242269 183854
1938 183854 114772 84941 146310 172095 71640 -7765 62335 154353 234452 287682 108921
1927A08921j15020J0813m4976J91751J82654k09897j2193M5667j11156o4736R1219
1916G3047R5537j34368k76673m5716K35184O0988o924N0294j24371p0180J74606
1905C1424O1548r606J68690j27908j48299M1424o2825J2424K10812M4659j32900
1894H9443p8317J38535k0037m2765k9963J48441k2844j27653J13283J77849k30222
1883A15750p4451J80602j65986j47359L14948J90021k13975n2647m9496J54579
1873B51986J787k09750j9266q582l9817J74973j053j96997N1290P3749n1140J9329
1861D6509q459k5146J45280J96925l62206k2992J88599J24543K4334k43612L6209
1850I9984K28144j97332l4073Q8152j19208k5945J48477O4457r037J22092l1511
$$ plain form
1927 108921 -6099 4714 -40262 151489 334143 124246 112053 157720 46564 -18172 73047
1916 73047 168584 34216 -242457 -288173 -52989 7999 1075 51369 -73002 -143182 31424
1905 31424 92972 83366 252056 124148 -24151 17273 -45552 -33128 177684 222343 89443
1894 89443 11126 149661 129624 86859 56896 205337 182493 54840 168123 345972 115750
1883 115750 41299 221901 55915 -91444 223504 413525 199550 146903 97407 251986
1873 251986 253773 44023 24757 16175 -23642 151331 150278 -46719 4571 78320 27180 46509
1861 46509 38050 12904 158184 355109 -7097 -30089 158510 283053 307387 63775 99984
1850 99984 328128 130796 96723 184875 65667 39722 188199 252656 243619 365711 334200
1839C34200n4554j45949j40257R4866J28082n9953m6910P4108k526O7032q6737
1828A61402p0777K21271J1337r0366n3298k397N1257J08434q6672j47199O3570
1817A66562J51955R497j2705r9218q2318P1763J01600R9529R7898j49n6225k8083
1805D20106m1016j5731J48446j52823L4007Q5119p1129j38114K5386J76249K2207
1794D92707p3241N0715J03458M3020l1028j4180q318j30410M912J54455n7328
1783E34762j20717K5080j30581n1119J02361M885Q1660P1395o7242j61800j9273
1772B69411R7106J66948j45256N3658J5582k26967N7810k6911Q5291m8571O7534
1761C65635j8152m4425r8342J89568J11205o0909j76061r9420l6057m281J36216
$$ plain form
1839 334200 279646 133697 -6560 88306 216388 156435 109525 183633 181107 248139 161402
1828 161402 90625 311896 323233 232867 179569 177172 228429 336863 250191 102992 166562
1817 166562 318517 328014 315309 216091 133773 205536 307136 406665 504563 504414 448189 420106
1805 420106 379090 363359 511805 358982 392989 478108 406979 268865 294251 470500 492707
1794 492707 419466 470181 573639 616659 585631 571451 563133 432723 437635 592090 534762
1783 534762 414045 439125 308544 257425 359786 364671 446331 517726 450484 288684 269411
1772 269411 366517 533465 388209 441867 457449 230482 288292 261381 346672 298101 365635
1761 365635 347483 303058 204716 394284 505489 444580 268519 169099 133042 128761 264977
1750B64977J29762j08235k86016J30735K4738K7130l8511j20841J49394j00570
1740G2563j05413L6645J39335L4003k20680j2659J57791M7717J32026J9553k37732
1729F3149j29925Q9106J00969J00338j17586n6032P9415j15576j35303K17373
1719I5928Q5562k52281m9023j16406l9239O9929K11060J42569m8365k17085r5577
1708b12928K55720M1561k01409J72232R5166m7922J81453j28857j33108J15910
1698A37818q1785l06967L69557J24929k18992O6223r0301l9070J21616q95n2525
1687B9608n873j6061P7123l0446j23324J85531P2936k26114r3871L6281J07851
1676A3641q2286J37678J33158j81413m1672l3034M849J41364J7076k46416q328
$$ plain form
1750 264977 394739 286504 488 131223 155961 183091 144580 23739 173133 72563
1740 72563 -32850 3795 143130 177133 -43547 -56206 101585 149302 281328 300881 63149
1729 63149 -66776 22330 123299 223637 106051 50019 129434 13858 -121445 95928
1719 95928 181490 -70791 -119814 -236220 -275459 -205530 5530 148099 99734 -117351 -212928
1708 -212928 42792 84353 -117056 55176 150342 102420 283873 155016 21908 137818
1698 137818 56033 -250934 118623 243552 24560 90783 482 -38588 83028 82133 29608
1687 29608 23735 7674 84797 54351 -68973 116558 189494 -36620 -130491 -94210 13641
1676 13641 -68645 69033 202191 20778 -20894 -53928 -49079 92285 109361 -137055 -145383
1665a45383P3616k38181R1668Q9349j2365J70582M9568r7532K1417O0026p9921
1654a7156l9523J32502k26994J69163L4933k60524O3013N0636p5405K54603o9251
1643A5997k56697J28320m0609J1464J74657q4980r2153J34054k00063Q8371R0512
1632c1127k23257N9404K34990k93440N0004J35814m7832J85128K1937j10261l79
1621a9019K2765K516M1786k7491j73075n9937K30247O2389j1370j74490p074p8404
1609a91157q349m213Q9473R619q4928J00809j06202K0978N8830P5488j0529l3936
1597h4117M4630J35846p1007N779q7003m7626k4582Q7620p1025k1489J18969j58432
1585a72437J33501M9595j79527j05052J72541L6858J11694K9604K6293k949j18499
$$ plain form
1665 -145383 -71767 -309948 -218280 -128931 -141296 29286 78854 -18678 2739 62765 -17156
1654 -17156 -56679 75823 -151171 17992 52925 -207599 -144586 -93950 -169355 85248 15997
1643 15997 -240700 -112380 -152989 -141525 33132 -51848 -144001 -9947 -210010 -121639 -31127
1632 -31127 -254384 -194980 40010 -253430 -203426 -67612 -115444 69684 91621 -18640 -19019
1621 -19019 3746 6262 48048 20557 -152518 -212455 17792 80181 68811 -105679 -112753 -191157
1609 -191157 -199506 -203719 -114246 -104627 -189555 -88746 -194948 -173970 -115140 -39652 -50181 -84117
1597 -84117 -39487 96359 25352 31131 -55872 -103498 -128080 -40460 -111485 -132974 -14005 -172437
1585 -172437 -38936 10659 -168868 -273920 -101379 -64521 47173 76777 103070 100121 -18378
1574a8378k01339R0185n8894K424j8220M9878J27536j5172p3977k49279J53252
1563b11984K02655Q2994o9989k02744J12862J43186j276K9482j02674o0580L366
1552g4702M1309j65415L4178K22792l8270p7638m2881J11817Q1410j02307J64332
1541A54625J395k22614r5270j3309j09191K20332J749j26137J57785O3637P154
1530D0156m1121j05627o593j03819m1244N4621L3452R516k2679k5109j9503j8391
1518b46341J05650K4595k8043J16642n6801r6062m6171J68621R6623j0125j58245
1507a29657M4496n3270m6085J36386J25382R2279j59751j34999L1498J60413j15622
1496d8930p1325Q3712j79139K0244M5568L8006J51888M365j20260r3599J65616
$$ plain form
1574 -18378 -219717 -129532 -188426 -186002 -204222 -154344 -26808 -41980 -115957 -365236 -211984
1563 -211984 -9329 73665 3676 -199068 -86206 56980 55704 85186 -17488 -78068 -74702
1552 -74702 -33393 -198808 -164630 58162 19892 -57746 -100627 11190 92600 -9707 154625
1541 154625 156020 -66594 -161864 -175173 -284364 -64032 -62283 -188420 -30635 33002 40156
1530 40156 -965 -106592 -113185 -217004 -258248 -203627 -170175 -160659 -183338 -208447 -227950 -246341
1518 -246341 -140691 -116096 -144139 -27497 -84298 -180360 -226531 -57910 38713 28588 -129657
1507 -129657 -85161 -138431 -184516 -48130 77252 169531 9780 -125219 -93721 66692 -48930
1496 -48930 -120255 -36543 -215682 -195438 -149870 -111864 40024 44389 -75871 -169470 -3854
1485c854r6530k052N2782n0503J20635L3920k85835o1286L4312j82470k3685J07911
1473c56655p8238J99633J08162J0063J40766q1167k1385K09034R3521j25974m9963
1462D7797m679M4502J61753j30295j43175p4229n0718K9229J0005J19298j12217
1451a02729J55650O8020k51225r7600J79477k0278p1428J00940j40426l2841q911
1440b21351k184P1041n5151K4612m0414N9529l0424N3958r5835o4767J36610J06299
1428e8077l2221J12370n9065j5311Q3729j81335O2519K16651j1438j73514Q6734
1417C1042n1993j87380K22453J04253j28097k7115q0396p588j30292P4941J09934
1406g0238K9819r0843L4511K9942L6062K1078m0631J48615k15023k47002K22319
$$ plain form
1485 -3854 -100384 -102436 -49654 -100157 20478 54398 -231437 -292723 -258411 -440881 -464566 -356655
1473 -356655 -434893 -235260 -127098 -117035 23731 -57436 -78821 130213 223734 97760 47797
1462 47797 43118 87620 249373 119078 -24097 -98326 -149044 -119815 -109810 9488 -102729
1451 -102729 52921 120941 -130284 -227884 -48407 -68685 -140113 -39173 -179599 -212440 -221351
1440 -221351 -223535 -152494 -207645 -183033 -223447 -163918 -194342 -140384 -236219 -300986 -164376 -58077
1428 -58077 -90298 22072 -36993 -52304 31425 -149910 -87391 129260 117822 -55692 31042
1417 31042 -20951 -208331 14122 118375 -9722 -36837 -117233 -124821 -255113 -180172 -70238
1406 -70238 -40419 -131262 -96751 -66809 -30747 -9669 -50300 98315 -116708 -363710 -141391
1395a41391K03622N9742L2422k85424M0445L0037j25553J23372J28438l2129j79439
1384a45858n0841J41001J0599j41488J32649K20686j81734j30244K32864L0402
1374A18036k46306j08530J78298m8933j67903J84290K9852k1683j70269Q6454
1364a66694J82636j15847N4113R5278O6810l8288k72622j12227J71827r4998j35475
1353c65487K24913K05002k09901p288J49267K7014l0506j59480J37529K7015m04605
1342d06527k3887L06716n4437o8327R078J61126O5743k79519k1830L44542j07900
1331g5222j24633K58557j05273k03805P5757J67178n5456k36902l5099K78396
1321e6502Q5582j68438n4877J55779l1129l42560J90993J43004j05076J0719M3151
$$ plain form
1395 -141391 62231 121973 154395 -131029 -90584 -60547 -186100 -62728 65710 33581 -145858
1384 -145858 -196699 -55698 -45099 -186587 -53938 166748 -14986 -145230 87634 118036
1374 118036 -128270 -236800 -58502 -107435 -275338 -91048 -61196 -82879 -253148 -166694
1364 -166694 15942 -99905 -45792 49486 116296 78008 -194614 -306841 -135014 -230012 -365487
1353 -365487 -140574 64428 -145473 -152761 -3494 23520 -6986 -166466 -28937 -1922 -406527
1342 -406527 -430414 -123698 -178135 -246462 -237384 -76258 -10515 -290034 -311864 32678 -75222
1331 -75222 -199855 58702 -46571 -250376 -174619 -7441 -62897 -299799 -334898 -56502
1321 -56502 29080 -139358 -194235 -38456 -69585 -412145 -221152 -78148 -183224 -172505 -129354
1310a29354K1942J3247k5149N4328K70517k03040k32003J21872K6377r774J38376
1299D7339p6460J27947j81905p2592J66880M7590r9082M5673R704J7511P1237
1288A03842K0629K25028k16819k01069Q9526N184r9367j38237J16691J21099k69476
1277b42969O9667J81089l8101M9377j72668O3180R003k4746K481J79692P8102
1266A54107j67402o2626k729J72491k4717j83332Q0588p5228M458J58829j1529
1255D2910P2026M8627k74174O8891J84988k17832O2936N8790j847o3131L5306
1244A7490j0963j6147J09150J01934r082j59639M9263J22183j53845j1903R4017
1233A32458j1135l2913J17396O4332j45823k1040k4019j0931P2181j03682m7327
$$ plain form
1310 -129354 -107412 -94165 -119314 -64986 205531 2491 -229512 -107640 -81263 -91037 47339
1299 47339 -29121 98826 -83079 -155671 11209 58799 -40283 5390 15094 32605 103842
1288 103842 124471 349499 132680 -68389 21137 26321 -73046 -211283 -94592 26507 -242969
1277 -242969 -173302 7787 -30314 19063 -153605 -90425 -81422 -106168 -103687 76005 154107
1266 154107 -13295 -75921 -78650 93841 69124 -114208 -33620 -108848 -104390 54439 42910
1255 42910 114936 163563 -110611 -41720 143268 -74564 -11628 47162 45315 -17816 17490
1244 17490 6527 -9620 99530 201464 192382 32743 82006 204189 50344 38441 132458
1233 132458 121323 88410 205806 270138 124315 103275 79256 68325 140506 36824 -10503
1222a0503R5504j15370p2204K5915R0187J77390j53362l98630J61857K74051r051
1211F5784J14945q6310m5927j16602q9363L9454K35778p8896p1257m3889O8102
1200h181o2429K41865K48899j94819k25275j87778j30373J51567K09572q0792
1190c7744R3103j10004j29176j0306L339J04599L30510k69601j33744J86178o3816
1179c6662J69629J86384k88382l0409K43783j56929P4285o74k24896m1671K75465
1168A69923p7578j28952N2210M9358M3733o2791j66864o074J81336o8984K0855
1157F172J80704j71063Q472J14856j36426K25887j3535j81190J54935l6916k25461
1146g3565R0340J75001j41569J7979l1381N6101K4048j81843J90166Q7399j65092
$$ plain form
1222 -10503 85001 -30369 -102573 -76658 13529 190919 37557 -361073 -199216 74835 65784
1211 65784 180729 94419 48492 -68110 -157473 -118019 117759 38863 -32394 -76283 -8181
1200 -8181 -70610 171255 420154 225335 60 -187718 -318091 -166524 43048 -37744
1190 -37744 55359 -54645 -183821 -194127 -190788 -86189 244321 -25280 -159024 27154 -36662
1179 -36662 132967 319351 30969 560 244343 87414 161699 161025 -63871 -105542 169923
1168 169923 92345 -36607 15603 64961 108694 45903 -120961 -127035 54301 -14683 6172
1157 6172 186876 15813 24285 139141 2715 228602 215067 33877 188812 151896 -73565
1146 -73565 16775 191776 50207 68186 36805 92906 116954 -64889 125277 212676 47584
1135D7584m3684j0293o760n6405J43073j2562k78238J70802J64730q4698n2359
1124a8810J54187R6855K9072r4177N2106j08426j75696J59604J12443k40719Q61
1113c2700J28076j19929K78531J48148k59061M8906l9503O522O5923j09331J97361
1102C12943o8685j47601k709R9268l7381M2527Q3007k47861m0459K71679J08411
1091C73139j72884M0521J24374j41541j7768N0497j75658J68862m2749n5617o8030
1080H3146q5378K86270K98659l20893j10880R1518n2725J3847J8755o4266J62653
1069C20706q7235j24738J16144J01856Q2716R3942J89625k76058j6295J25347
1059E26010J12063m3889k70209K2850J64101L2980m1672J00005j28407j52821
$$ plain form
1135 47584 3900 -6393 -13153 -69558 73515 60953 -217285 -46483 118247 33549 -18810
1124 -18810 135377 232232 261304 167127 219233 110807 -64889 94715 207158 -33561 -32700
1113 -32700 95376 -24553 253978 402126 143065 191971 152468 158990 224913 115582 312943
1102 312943 244258 96657 93948 193216 155835 198362 281369 33508 -6951 264728 373139
1091 373139 200255 240776 365150 223609 205841 256338 80680 249542 206793 151176 83146
1080 83146 -2232 284038 582697 261804 150924 242442 189717 203564 222319 158053 320706
1069 320706 233471 108733 224877 326733 409449 503391 693016 416958 400663 526010
1059 526010 638073 594184 323975 346825 510926 543906 502234 602239 473832 321011
1049C21011J30611P7901m1243J60572R0510l4408j82690k05198K05600L26051
1039H48717j90581j77851R6216N7280K3288j1360M6311J04117j3328q8298K35454
1028I29965p8203j66224L34508M3002j73580P2066O860J19752K1095n5810P2500
1017A125931P5000J6518J32313K408k82193L6351K85890l5774j06156q1861Q1330
1006A249757l853J05279N1756J40759J24821j71206J18488P2669q8426N2381P1145
995A723570K38759j35885r8647P7924L14412Q0316q7582L5308J55173J0426K3975
984B337749J0455K33200l1381l7769J93392J78921K78933K61065J69177l4381
974C559361L35611J72014J3633L32875K69763J08831L50753L90888K24744O35607
$$ plain form
1049 321011 451622 529523 488280 648852 739362 704954 522264 317066 522666 848717
1039 848717 658136 480285 576501 633781 657069 645709 692020 796137 782809 694511 929965
1028 929965 851762 685538 1020046 1063048 889468 961534 968394 1088146 1109241 1053431 1125931
1017 1125931 1200931 1217449 1349762 1352170 1069977 1106328 1392218 1356444 1250288 1168427 1249757
1006 1249757 1245904 1351183 1402939 1543698 1668519 1497313 1615801 1688470 1600044 1652425 1723570
995 1723570 1962329 1826444 1727797 1805721 2120133 2200449 2112867 2148175 2303348 2313774 2337749
984 2337749 2348204 2581404 2550023 2512254 2705646 2884567 3163500 3424565 3593742 3559361
974 3559361 3894972 4066986 4080619 4413494 4683257 4792088 5142841 5533729 5758473 6394080
964F394080M65289K44752O81141P30854O64155P33960K81358M37553R26019J169006
954A2728167J130362J358478J661461K204126L093554L222347M342436N189967
946C4930898O299973Q744885P690190k032189q524633r011626p234286m798503
938B6064709l669891k873872k411011k320290j936229j302107r87516q50050q63280
929H850463m61012l65018m94452m77158o70079m95604l98701m57783k10734l23429
919D496493k86620k42141j14888k74810j17814k13068k12008J5770j86356M997
909B869555M6801j48345l09222O6900r1430l36875q3151K3268N0657j72755r5466
898A819937j17394L5983Q7398j81583j0978j26976k22664l8055K748M0888l1192
$$ plain form
964 6394080 6859369 7104121 7785262 8516116 9180271 9914231 10195589 10633142 11559161 12728167
954 12728167 13858529 15217007 16878468 19082594 22176148 25398495 29740931 34930898
946 34930898 41230871 49975756 57665946 55633757 47109124 38097498 30863212 26064709
938 26064709 22394818 19520946 17109935 14789645 12853416 11551309 10563793 9713743 8850463
929 8850463 8389451 8024433 7529981 7052823 6382744 5887140 5488439 5030656 4819922 4496493
919 4496493 4209873 3967732 3852844 3578034 3460220 3247152 3035144 3050914 2864558 2869555
909 2869555 2916356 2768011 2458789 2525689 2434259 2097384 2014233 2037501 2088158 1915403 1819937
898 1819937 1702543 1738526 1825924 1644341 1633363 1506387 1283723 1245668 1248416 1289304 1258112
887A258112p8765k04420K35817j15418q8772J91673j05133j17255l10n9454k979
876I13096o5674n2760m3375J59971j39131n1818J93354o1805p4678K318n8680
865G20818k58576J20342Q3370q5983m8742p4979j7574J86800k4805j81872O8070
854D86869R1787j56770r8012r3243Q1438J41304j16331N393J08279q164m4760
843C97790N0751M4047k28136J46147o8063J5400J22903l43699J15525J35197k19566
832A68296J32422K38099j15162j07477O999j62063J12958M0318M6448J75232j18606
821D17464r8091r2025q851J3807J26830j9708k94722J31879P3812q7262J90081
810C53214r3002k82669J91901Q3464k55068K43522j7760p0369Q3137l29350J37165
$$ plain form
887 1258112 1179347 974927 1210744 1095326 1006554 1198227 1093094 975839 975529 916075 913096
876 913096 847422 794662 751287 911258 772127 720309 913663 851858 777180 779498 720818
865 720818 462242 582584 665954 579971 531229 456250 438676 625476 600671 418799 486869
854 486869 578656 421886 323874 230631 312069 453373 337042 342435 450714 442550 397790
843 397790 448541 492588 264452 410599 342536 357936 480839 137140 252665 387862 168296
832 168296 300718 538817 423655 316178 323177 161114 274072 314390 360838 536070 417464
821 417464 319373 227348 218497 232304 359134 339426 44704 176583 250395 163133 353214
810 353214 260212 -22457 169444 252908 -2160 241362 223602 153233 236370 -92980 44185
799D4185L56859l70464l6843K00510k65630J01229K37457k35956J13028P4886
789B19261j71929o772N50m5612N4696N8305j75214n2012J18823N5779R2492m7342
777A01025k48986L31930q0260l02766L84083Q3365k56145M033J06111j22323K16435
766B16502n9549L1463j2550m78321J12309K14054J4234o9526O2407j38630M9597
755e8010M4098j72966L78846L6637k63495j5545R6911j12820N5580Q9326j16556
744c7994M0783P2373j40504J66290j67923j76612K72931J9344q5721M9511l6718
733b4240j00756M1124k12353J39347L54979j76112k3780J49708k86774M769K95602
722A61514M8024r860r1645l04235K14736q8027j71200L07640R6686j07226j37838
$$ plain form
799 44185 401044 30580 -6263 194247 -71383 29846 267303 31347 144375 219261
789 219261 47332 40560 41110 -4502 50194 108499 -66715 -118727 96 55875 148367 101025
777 101025 -147961 183969 103709 -199057 185026 268391 12246 16279 122390 67 216502
766 216502 156953 188416 175866 -302455 -190146 23908 38142 -31384 31023 -107607 -58010
755 -58010 -13912 -186878 191968 228605 -34890 -50435 46476 -66344 -10764 78562 -37994
744 -37994 2789 75162 -65342 100948 -66975 -243587 29344 48688 -37033 12478 -24240
733 -24240 -124996 -83872 -296225 -156878 198101 21989 -1791 147917 -138857 -134088 161514
722 161514 209538 199678 108033 -196202 18534 -69493 -240693 66947 163633 56407 -81431
711h1431N9820l47J04664L9162j97168q5623Q5587O0831J51721o2150k57306J21124
699f1116O056j32860O8861J43235n4798J6861q4147o8378J44751Q9617J66223
688B34305L3585k23204n564J04071m5210p0936p270k63317K4999K94181q2898
677g258o1756q802L6391l0260o4940j5492L15703P1579k94294M625k3485n95J70986
664I2402n2599l0246m3896l2201O1523K64306m5585l1239J39440j42555j07255
653G2095k2816p2253J06761K5627j98752P1242R3783j19081L9407J32720j1607
642A17126m9833m406l6954n9799J18878m0133R937k21427L1240J68525j03723
631g0569q1035K45419j48595m5542K70216k22018j36516K30022o3383l4292J93597
$$ plain form
711 -81431 -21611 -21958 82706 121868 -75300 -160923 -75336 -14505 137216 75066 -182240 -61116
699 -61116 -55060 -187920 -119059 24176 -30622 -13761 -97908 -166286 -21535 68082 234305
688 234305 267890 44686 39122 143193 97983 27047 19777 -243540 -218541 75640 -7258
677 -7258 -69014 -77816 -41425 -71685 -136625 -152117 163586 235165 -59129 -54504 -77989 -78584 92402
664 92402 39803 9557 -34339 -66540 -5017 259289 213704 182465 321905 179350 72095
653 72095 49279 -22974 83787 109414 -89338 -18096 75687 -43394 -3987 128733 117126
642 117126 67293 62887 25933 -33866 85012 44879 54816 -166611 -135371 33154 -70569
631 -70569 -151604 93815 -54780 -100322 169894 -52124 -188640 41382 -22001 -56293 137304
620A37304l03865n5067n756P783J39463n6439m4735j48386J95124J82042K3775
609G1243j20416j82488R7462j3936O7016K27062k5785j57690j9900j52350K6048
598a83734Q0533Q8450p6622n5357J0932J23931K4843k06087P0995P5346M5176
587a594r3789M8795j33176R9406J6524o9387j8382j54740K7276K34205L5174k29115
575b38803M5844J04406J1933J08724j99150j45985K91024K2613l13231L0584L88605
564A06564o6862q3659j74023r3094J80980M0785o5136J25598k7190L357K43935
553A91255j79269l66800K23034R1125r8243J43148k13377P6787J51792j93500
543a74048J22701J19286k58832j17192J76863j26434J06466J15107k9068J13129
$$ plain form
620 137304 -166561 -221628 -227384 -219601 -80138 -136577 -181312 -329698 -134574 47468 71243
609 71243 -49173 -231661 -134199 -148135 -81119 145943 120158 -37532 -57432 -209782 -183734
598 -183734 -103201 -14751 -91373 -146730 -135798 -11867 12976 -193111 -122116 -46770 -1594
587 -1594 -95383 -46588 -179764 -80358 -63834 -133221 -151603 -306343 -279067 -44862 -9688 -238803
575 -238803 -192959 -88553 -76620 32104 -167046 -313031 -22007 606 -312625 -282041 106564
564 106564 39702 -43957 -217980 -311074 -130094 -89309 -154445 -28847 -56037 -52680 191255
553 191255 11986 -354814 -131780 -40655 -138898 4250 -209127 -132340 19452 -174048
543 -174048 -51347 67939 -190893 -308085 -131222 -257656 -151190 -36083 -65151 47978
533D7978k2511k53716J07264K07384M9715j71745Q4710j06106p6760R5940R257
522b8590N3198O4886k96367K0796J57945j67643J40525K69892j59608j63927q3203
511a92096j50315K64928R7999K2017q0232L6j45814J58439J11259k21942J47627
500A1906R704j52862p1250P397R8636N1052j99672q3843K07959J17203j18391
489a22161J73294J66028j93696K9277n9054J5742L0370o675q2355k0323M355L0074
477c5124j79077J16067J36614j21278j91751J54285Q4412k335r1701O5406p388
466g1870k07246J13114K32135k0087j13567J68596M2266k38832q3035P2428k7848
455a33946j7868P2091Q8854j57598j85148J36578K54160O2146j75908j60307R6148
$$ plain form
533 47978 25467 -228249 -120985 86399 136114 -35631 49079 -57027 -133787 -37847 -28590
522 -28590 24608 89494 -206873 -186077 -28132 -195775 -55250 214642 55034 -108893 -192096
511 -192096 -342411 -77483 20516 42533 -37699 -37663 -183477 -25038 86221 -135721 11906
500 11906 21610 -131252 -202502 -195105 -96469 -45417 -245089 -328932 -120973 -3770 -122161
489 -122161 51133 217161 23465 52742 -6312 9430 39800 33125 -49230 -69553 -65198 -35124
477 -35124 -214201 -98134 38480 -82798 -274549 -120264 -35852 -38187 -129888 -64482 -71870
466 -71870 -279116 -166002 66133 46046 -67521 101075 143341 -95491 -178526 -106098 -133946
455 -133946 -151814 -79723 9131 -148467 -333615 -197037 57123 119269 -56639 -216946 -120798
444a20798l595m9470l1886K00343J12511k13140m8106J42187n1529k11894K14736
433f0641R1963j59684r2520l4655J32321J18591k51169K67734K14794m49907j31585
422c54758J43959Q3167J475J16249o6064m4721p8917m4765J86672k1353j18751
411a97807R1208J87888l20762j54339J84285j0267J89434r3858j94061J10628
401b07651L22080j62561R3422Q5275k97636O0916K37883k54534m176j85264J00276
390b11970L14558k44088L1132K41397J084l32676M6315J68572N5893K410m517
379F8110j6471j85210o1717Q4640k3412J24923p2135N3078m2385r5928J24114
368d2393K9465j0412j62700p8205O718K95851K2318r3370m6448K361p8612L0996
$$ plain form
444 -120798 -124393 -173863 -205749 -5406 107105 -106035 -154141 -11954 -63483 -275377 -60641
433 -60641 31322 -128362 -220882 -255537 -123216 -4625 -255794 11940 226734 -223173 -354758
422 -354758 -210799 -127632 -126157 -9908 -75972 -120693 -199610 -244375 -57703 -79056 -197807
411 -197807 -106599 81289 -239473 -393812 -209527 -219794 -30360 -124218 -318279 -207651
401 -207651 114429 -48132 45290 130565 -167071 -106155 131728 -122806 -126982 -312246 -211970
390 -211970 102588 -141500 -110368 131029 132113 -200563 -154248 14324 70217 72627 68110
379 68110 51639 -133571 -195288 -110648 -134060 -9137 -81272 -28194 -70579 -166507 -42393
368 -42393 -12928 -23340 -186040 -264245 -257527 38324 60642 -32728 -79176 -76815 -155427 -124431
356a24431J94663O848k16805p4671j05909J27330R2840R7480J22227j05113k2686
345h227j61556q608J54547J3610j17867j31350N1219K01376O1017m4593j49731
334a40163m9027r2191P3454J31749N9409p9724O2848j07910N1M5367k2996R1508
322b7625o6793j14781J24437o972O8627q3559j60734J30744J51104j10621o8560
311a64733J02277n6603k36500O3930P8184m6127L3502R6501j09629r0605J09295
300b20508J71778o3431o5529q4305R0140P0882m9264J2085k2334q0460L5962M8764
288a56220M8220K27759k63554J39076P0018k49440N5106m437M1900Q1742k33101
277b42931J3039J19013j5823l3484K43577q4028j88670j74092L0064J62644Q9290
$$ plain form
356 -124431 70232 77080 -139725 -214396 -320305 -192975 -100135 -2655 119572 14459 -8227
345 -8227 -169783 -178391 -23844 -10234 -128101 -259451 -208232 -6856 54161 9568 -140163
334 -140163 -189190 -281381 -207927 -76178 -16769 -96493 -33645 -141555 -141504 -96137 -119133 -27625
322 -27625 -94418 -209199 -84762 -91734 -23107 -106666 -267400 -136656 14448 -96173 -164733
311 -164733 -62456 -119059 -355559 -291629 -213445 -259572 -226070 -129569 -239198 -329803 -220508
300 -220508 -48730 -112161 -177690 -261995 -171855 -100973 -150237 -138152 -160486 -240946 -204984 -156220
288 -156220 -108000 119759 -143795 -4719 65299 -184141 -129035 -133472 -91572 -9830 -242931
277 -242931 -229892 -110879 -126702 -160186 83391 -637 -189307 -363399 -333335 -170691 -81401
266h1401r3236O8390k965j36193J78589J21140n0123j793K5669j80440o829J40872
254a8320l2343J8024j2767j30453J08163R0014k52053J2100J75922n9363n8794
243a59870l2749l5170N3722k2036K8840J63661j72577k47831L26134N225J958
232i0693M7789j89397n5884P3734Q7626l1279J38608k14914q7268K11055J3809
221i6814k6746J73190m8497j30163q1426j44559m5917J81183J51435j9853M0649
210d7518r216k56844J578J52014k637J15919j14684N0790r336j13151J83166j2702
198f2621j3466m6596q1209N2190R0434j02244J6966j89797R388J62636K0430J4709
186a29180N4637j87961j62971K25844Q7948K3686K2520k05032K6823O5634J3819
$$ plain form
266 -81401 -174637 -106247 -109212 -245405 -66816 54324 4201 2408 28077 -152363 -159192 -18320
254 -18320 -50663 -32639 -45406 -175859 -67696 22318 -229735 -217635 -41713 -101076 -159870
243 -159870 -192619 -227789 -174067 -196103 -167263 -3602 -176179 -424010 -97876 -92651 -90693
232 -90693 -42904 -232301 -288185 -214451 -126825 -158104 -19496 -234410 -321678 -110623 -96814
221 -96814 -123560 49630 1133 -129030 -210456 -355015 -400932 -219749 -68314 -88167 -47518
210 -47518 -56734 -313578 -312000 -159986 -162623 -46704 -161388 -110598 -119934 -233085 -49919 -62621
198 -62621 -76087 -122683 -203892 -151702 -61268 -163512 -146546 -336343 -326955 -164319 -143889 -129180
186 -129180 -74543 -262504 -425475 -199631 -111683 -87997 -65477 -270509 -243686 -178052 -164233
175a64233k8807N7432n8472o7176r3929O0098K11463r356j13765r6184J9301M2652
163b40976K26838m8247j31244O1152K7758k54375p622K70627M4045j18618j3608
152a84270o4818L7167R3920P1107j5207l9545J911K3784J0572k23j03474P922
140a61154J2522L4451N3081j11017o9123R6710o954j36000J31989J13306n8138
129a00327L5127j07545j45094J04826J83305J7275j04178j03084N8845J19386
119d1464j48915o1094J52418L8135j71617J94661o2854k38570J31948J85762j13626
$$ plain form
175 -164233 -193040 -135608 -194080 -261256 -355185 -295087 -83624 -92980 -206745 -302929 -283628 -240976
163 -240976 -14138 -62385 -193629 -132477 -104719 -359094 -366716 -96089 -52044 -170662 -184270
152 -184270 -249088 -211921 -118001 -46894 -62101 -101646 -99735 -75951 -65379 -65602 -169076 -161154
140 -161154 -148632 -114181 -61100 -172117 -241240 -144530 -151484 -287484 -155495 -42189 -100327
129 -100327 -65200 -172745 -317839 -213013 -29708 -12433 -116611 -219695 -160850 -41464
119 -41464 -190379 -251473 -99055 -60920 -232537 -37876 -100730 -339300 -207352 -21590 -135216
$$ [...]
##END NTUPLES=NMR SPECTRUM
##END=
