##TITLE=1H_CA-8802-21
 CDCl3,8 sc, 
 3.02.2021
##JCAMPDX= 6.0         $$ Bruker NMR JCAMP-DX V2.0
##DATA TYPE= NMR SPECTRUM
##DATA CLASS= NTUPLES
##ORIGIN= UXNMR, Bruker Analytische Messtechnik GmbH
##OWNER= root
$$ XWIN-NMR		Version 3.5
$$ Wed Feb  3 10:25:01 2021 Russian Standard Time (UT+4h)  she@DPX200
##.OBSERVE FREQUENCY= 200.1315066352
##.OBSERVE NUCLEUS= ^1H
##.ACQUISITION MODE= SIMULTANEOUS
##.ACQUISITION SCHEME= undefined
##.AVERAGES= 8
##.DIGITISER RES= 18
##SPECTROMETER/DATA SYSTEM= spect
##.PULSE SEQUENCE= zg30
##.SOLVENT NAME= CDCl3
##.SHIFT REFERENCE= (INTERNAL, CDCl3, 0, 15.9896)
##AUDIT TRAIL= $$ (NUMBER, WHEN, WHO, WHERE, WHAT)
$$ ##TITLE= Audit trail, XWIN-NMR		Version 3.5
$$ ##JCAMPDX= 5.01
$$ ##ORIGIN= Bruker BioSpin GmbH
$$ ##OWNER= she
$$ F:/spectra/data/she/nmr/H-F/1/pdata/1/auditp.txt
$$ ##AUDIT TRAIL=  $$ (NUMBER, WHEN, WHO, WHERE, WHAT)
(   1,<2021-02-03 10:23:51.15 +0400>,<she>,<DPX200>,
      <created by zg, POWCHK disabled, PULCHK disabled
       configuration hash MD5:
       00 E9 B6 7A A2 85 ED C7 34 08 36 98 17 FE 4E 26
       data hash MD5: 16K
       F2 BC 68 6D 5C 19 37 C5 B8 18 D5 A5 76 02 4A 76>)
(   2,<2021-02-03 10:23:53.28 +0400>,<she>,<DPX200>,
      <Start of raw data processing
       efp BC_mod = 2 LB = 0.24 FT_mod = 6 PKNL = 1 PHC0 = -10760.33 PHC1 = 16.00095 SI = 16K 
       data hash MD5: 16K
       BB EC 71 CF 03 98 16 45 03 3C DF 81 DB C2 73 E1>)
(   3,<2021-02-03 10:24:08.00 +0400>,<she>,<DPX200>,
      <pk PHC0 = 1.557867 PHC1 = -4.800001 
       data hash MD5: 16K
       EC 1E 58 5C 02 6F 0D 18 24 86 14 95 DE F9 0D 36>)
(   4,<2021-02-03 10:24:10.96 +0400>,<she>,<DPX200>,
      <abs ABSG = 5 
       data hash MD5: 16K
       E6 F1 61 58 4F 53 7A EE 89 61 28 AD 33 0D 26 71>)
$$ ##END=
$$ 
$$ hash MD5
$$ B1 41 55 39 36 D0 C2 4D 16 38 89 0F F7 67 06 FA
##$RELAX= 
##$RELAX= 
##$RELAX= 
##$RELAX= 
##$RELAX= 
##$RELAX= 
$$ Bruker specific parameters
$$ --------------------------
##$DU= <F:/spectra>
##$EXPNO= 1
##$NAME= <H-F>
##$PROCNO= 1
##$TYPE= <nmr>
##$USER= <she>
##$AMP= (0..31)
100 100 100 100 100 100 100 100 100 100 100 100 100 100 100 100 100 100 
100 100 100 100 100 100 100 100 100 100 100 100 100 100 
##$AQSEQ= 0
##$AQ_mod= 1
##$AUNM= <au_zg>
##$AUTOPOS= <>
##$BF1= 200.13
##$BF2= 200.13
##$BF3= 200.13
##$BF4= 200.13
##$BF5= 200.13
##$BF6= 200.13
##$BF7= 200.13
##$BF8= 200.13
##$BYTORDA= 1
##$CFDGTYP= 0
##$CFRGTYP= 5
##$CHEMSTR= <none>
##$CNST= (0..31)
1 1 145 1 1 1 1 1 1 1 1 1 1 1 1 1 1 1 1 1 1 1 1 1 1 1 1 1 1 1 1 1 
##$CPDPRG= <>
##$CPDPRG1= <>
##$CPDPRG2= <>
##$CPDPRG3= <>
##$CPDPRG4= <mlev>
##$CPDPRG5= <mlev>
##$CPDPRG6= <mlev>
##$CPDPRG7= <mlev>
##$CPDPRG8= <mlev>
##$CPDPRGB= <>
##$CPDPRGT= <>
##$D= (0..31)
0 1.2 0 0 0 0 0 0 0 0.06 0 0.03 0 0 0 0 0.0002 0 0 0 0 0 0 0 0 0 0 0 0 
0 0 0 
##$DATE= 1612333430
##$DBL= (0..7)
120 120 120 120 120 120 120 120 
##$DBP= (0..7)
150 150 150 150 150 150 150 150 
##$DBP07= 0
##$DBPNAM0= <>
##$DBPNAM1= <>
##$DBPNAM2= <>
##$DBPNAM3= <>
##$DBPNAM4= <>
$$ [...]
##$SUBNAM3= <"">
##$SUBNAM4= <"">
##$SUBNAM5= <"">
##$SUBNAM6= <"">
##$SUBNAM7= <"">
##$SUBNAM8= <"">
##$SUBNAM9= <"">
##$SW= 16.9725356469052
##$SWIBOX= (0..15)
0 0 2 0 0 0 0 0 0 0 0 0 0 0 0 0 
##$SW_h= 3396.73913043478
##$TD= 16384
##$TD0= 1
##$TE= 0
##$TE2= 300
##$TE3= 300
##$TEG= 300
##$TL= (0..7)
0 120 120 120 120 120 120 120 
##$TP= (0..7)
150 150 150 150 150 150 150 150 
##$TP07= 0
##$TPNAME0= <>
##$TPNAME1= <>
##$TPNAME2= <>
##$TPNAME3= <>
##$TPNAME4= <>
##$TPNAME5= <>
##$TPNAME6= <>
##$TPNAME7= <>
##$TPOAL= (0..7)
0.5 0.5 0.5 0.5 0.5 0.5 0.5 0.5 
##$TPOFFS= (0..7)
0 0 0 0 0 0 0 0 
##$TUNHIN= 0
##$TUNHOUT= 0
##$TUNXOUT= 0
##$USERA1= <user>
##$USERA2= <user>
##$USERA3= <user>
##$USERA4= <user>
##$USERA5= <user>
##$V9= 5
##$VALIST= <valist>
##$VCLIST= <CCCCCCCCCCCCCCC>
##$VD= 0
##$VDLIST= <DDDDDDDDDDDDDDD>
##$VPLIST= <PPPPPPPPPPPPPPP>
##$VTLIST= <TTTTTTTTTTTTTTT>
##$WBST= 1024
##$WBSW= 4
##$XGAIN= (0..3)
0 0 0 0 
##$XL= 0
##$YL= 0
##$YMAX_a= 824127
##$YMIN_a= -306039
##$ZGOPTNS= <>
##$ZL1= 120
##$ZL2= 120
##$ZL3= 120
##$ZL4= 120
##$ABSF1= 15.98438
##$ABSF2= -0.9882822
##$ABSG= 5
##$ABSL= 3
##$ALPHA= 0
##$AQORDER= 0
##$ASSFAC= 0
##$ASSFACI= 0
##$ASSFACX= 0
##$ASSWID= 0
##$AUNMP= <proc_1d>
##$AZFE= 0.1
##$AZFW= 0.1
##$BCFW= 0
##$BC_mod= 2
##$BYTORDP= 0
##$COROFFS= 0
##$CY= -3
##$DATMOD= 1
##$DC= 0
##$DFILT= <>
##$DTYPP= 0
##$F1P= 0
##$F2P= 0
##$FCOR= 1
##$FTSIZE= 16384
##$FT_mod= 6
##$GAMMA= 0
##$GB= 0
##$INTBC= 1
##$INTSCL= 2.992141e-10
##$ISEN= 128
##$LB= 0.24
##$LEV0= 0
##$LPBIN= 0
##$MAXI= 10000
##$MC2= 0
##$MEAN= 0
##$ME_mod= 0
##$MI= 1.114404
##$NCOEF= 0
##$NC_proc= -5
##$NLEV= 6
##$NOISF1= 3.799351
##$NOISF2= 2.8
##$NSP= 0
##$NTH_PI= 0
##$NZP= 0
##$OFFSET= 15.98957
##$PC= 1
##$PHC0= -10758.77
##$PHC1= 11.20095
##$PH_mod= 1
##$PKNL= yes
##$PPARMOD= 0
##$PSCAL= 0
##$PSIGN= 0
##$REVERSE= no
##$SF= 200.13000501226
##$SI= 16384
##$SIGF1= 3
##$SIGF2= 2
##$SINO= 5.538805
##$SIOLD= 16384
##$SREGLST= <1H.CDCl3>
##$SSB= 0
##$STSI= 16384
##$STSR= 0
##$SW_p= 3396.73913043478
##$SYMM= 0
##$S_DEV= 0
##$TDeff= 16384
##$TDoff= 0
##$TI= <>
##$TILT= no
##$TM1= 0
##$TM2= 0
##$TOPLEV= 0
##$USERP1= <user>
##$USERP2= <user>
##$USERP3= <user>
##$USERP4= <user>
##$USERP5= <user>
##$WDW= 1
##$XDIM= 16384
##$YMAX_p= 391958477
##$YMIN_p= -339726
$$ End of Bruker specific parameters
$$ ---------------------------------
##NTUPLES= NMR SPECTRUM
##VAR_NAME=  FREQUENCY,     SPECTRUM/REAL,   SPECTRUM/IMAG
##SYMBOL=    X,             R,               I
##VAR_TYPE=  INDEPENDENT,   DEPENDENT,       DEPENDENT
##VAR_FORM=  AFFN,          ASDF,            ASDF
##VAR_DIM=   16384,         16384,           16384
##UNITS=     HZ,            ARBITRARY UNITS, ARBITRARY UNITS
##FACTOR=    0.207333158178281, 1,           1
##FIRST=     3199.99265700049, 0,            0
##LAST=      -196.746473434286, 0,           0
##MIN=       -196.746473434286, -339726,     0
##MAX=       3199.99265700049, 391958477,    0
$$ Real data points
##PAGE= N=1
##DATA TABLE= (X++(R..R)), XYDATA
$$ [...]
8193 9446223 8920186 11528821 12813137 11662878 11738913 11570082 11815946 11972310 12473251
8184 12473251 12751788 13170375 13423528 13763405 14101799 14574115 14843087 15289053 15571674
8175 15571674 15873580 15842564 15912141 15892805 15946410 16080412 16369886 16674019 16970972 17365209
8165 17365209 17796787 17975223 18157998 18406962 18816408 19198858 19688286 20184937 20844753
8156 20844753 21422031 22013895 22688467 23380794 24256075 25173568 26198369 27332094 28529670
8147 28529670 29819448 31248293 32615928 33912354 35052336 36155141 37338441 39052087
8139 39052087 40871757 42719448 44278576 46073986 48212019 50204383 51891830 53469214
8131 53469214 55264320 57784869 60967677 63709190 64953318 66124569 67660614 68495746
8123 68495746 67150710 63529521 59638125 56650303 55065447 54505352 54713711 55298248 56074247
8114 56074247 56253352 55415145 54601192 54316168 54812985 55761672 57120290 59250780 62037412
8105 62037412 65059935 67983548 70780796 73657036 76493473 79015892 81106415 83690211
8097 83690211 86778351 90842210 95655682 100568935 105696248 110936062 114631512 117214329
8089 117214329 118852053 117263275 112879732 106110091 99190489 93833778 90295008 88439621
8081 88439621 86714607 82799318 77499704 73093683 69864932 67832762 66352554 65203619
8073 65203619 64510191 64332179 64295865 64831257 65827485 67102195 68522831 70026647 71714501
8064 71714501 73765951 76411474 79804889 83550671 87036208 90030215 91770536 91119919
8056 91119919 88797751 87162808 86863333 87919730 89462848 90511933 90427196 87417774 83034254
8047 83034254 77777434 71352068 65710934 61480093 58330557 55983129 54293423 53071884
8039 53071884 51810849 50480249 48706735 46950529 45733282 44949706 44455828 44157214 43852068
8030 43852068 43654758 43685144 43755279 43938942 44214172 44476783 44628757 44833485 44813616 44524871
8020 44524871 43957168 43087897 42091504 40657863 38932532 37183229 35789203 34730945 33863884
8011 33863884 33271917 32846262 32528331 32330539 31948792 31535576 31381806 31521589 31749597
8002 31749597 31994206 32175893 32233884 32136768 31961533 31946027 31915801 32142432 32469123 32930910
7992 32930910 33349399 33661525 34216947 34891729 35934629 37379090 38885944 40603926 42602593
7983 42602593 44983644 47568883 50425077 53506052 57335089 62209104 68855962 77712156
7975 77712156 88666077 102931799 117183317 110932896 92265277 78440762 69958590
7968 69958590 65266092 62510723 61137505 60203098 58641728 56661769 55772223 55823454 56882108
7959 56882108 57780968 56548974 53044788 49830055 47435128 46173702 45313979 43540576
7951 43540576 40602992 38307593 36461039 35219150 34224877 33504655 32870278 32503892 32368824
7942 32368824 32539001 32749787 33242526 33753675 34333842 35234391 36585869 38118905 39772121
7933 39772121 40873457 41104944 41155995 41768498 43290467 45855745 48865806 52025216 54478540
7924 54478540 55367080 54733777 52363085 48361578 43639541 39442763 36402275 34502937
7916 34502937 33141199 32260471 31800288 31452703 30458572 29301812 28483374 27618867 27124574
7907 27124574 26761589 26527472 26333278 26456593 26738741 26899838 26727573 26632366 26709136 26721211
7897 26721211 26646713 26798157 26731822 26762468 26354312 25731853 25321444 25424247 26001734 26295423
7887 26295423 25498035 23893134 22542091 21520937 20841435 20530676 19737595 18583690 17726333
7878 17726333 17112289 16600186 16191018 15906769 15633338 15617929 15621129 15818299 16170504 16387904
7868 16387904 16551059 16454363 15990916 15214046 14443406 13471082 12529934 11995153 11347393 10784349
7858 10784349 10237075 9812105 9386786 8879628 8438907 8044217 7711711 7327292 7099275
7849 7099275 6992025 6747962 6707354 6491971 6345963 6173840 6221250 6281310 6217079 6176421
7839 6176421 6278889 6369640 6417449 6414096 6478587 6365015 6232427 6215275 6275126 6077810 5783469
7828 5783469 5528916 5278078 5028703 4796436 4558882 4260203 3994054 3912638 3725294 3509492
7818 3509492 3259219 3197165 3129377 2965659 2921433 2905492 2883047 2706834 2617175 2633545 2450154
7807 2450154 2350068 2385837 2364382 2310106 2139676 2070018 2059873 2023164 1969383 1934024 1786234
7796 1786234 1761046 1778767 1777335 1843463 1792496 1680730 1560120 1347278 1433632 1620096 1674841
7785 1674841 1640904 1544581 1479926 1357403 1322736 1381695 1374834 1294674 1261008 1171105 1132683
7774 1132683 1197255 1260518 1293874 1210412 1140612 1113260 1039211 1046747 993387 1069557 1023401 985920
7762 985920 1010900 1051965 1045299 923169 971915 905368 874417 885375 982696 1008056 952503 964310
7750 964310 963332 887308 933308 983761 1013585 936342 905104 860684 881504 853188 860150 904082
7738 904082 852818 912237 1007015 963240 917329 950178 995931 951640 940162 932932 896877 812101
7726 812101 841532 832170 705349 684084 614643 653796 780323 838413 802608 798864 721360 681344
7714 681344 778118 816246 848483 842866 752813 672959 768119 852731 836294 839368 745006 789253
7702 789253 769222 842755 886204 1013965 1001526 1022180 933278 879663 894480 847731 730330
7691 730330 757231 782680 761707 797406 795839 813616 747896 688558 681056 766253 676513 714482
7679 714482 712062 678577 659855 704330 651628 626805 584524 653223 653344 640355 692748 839796
7667 839796 746075 730337 743076 678754 683140 711767 649037 579697 616124 555727 581266 579620
7655 579620 564864 617456 605432 481646 396924 481544 509495 529938 512664 397690 376611
7644 376611 351541 379185 416367 374613 313839 283033 304051 286968 333876 322450 266560 323033
7632 323033 370304 282568 249692 194458 245910 209982 130349 200965 284531 163634 75080
7621 75080 119917 129950 173627 142287 88131 -16965 -73462 -104592 51075 114835 113203 104083
7609 104083 36677 41270 71810 119185 141986 94199 30036 -36052 -80368 -25393 127794 108017
7597 108017 -817 23840 -53581 -60532 75741 191236 147295 53344 2726 64379 133428
7586 133428 133348 198344 86964 -1201 3582 122908 147489 200982 111654 53685 102467 154278
7574 154278 165771 252335 193178 121323 69438 70804 105592 163736 145532 146443 86274 127323
7562 127323 190328 114061 161350 90490 -33589 -40853 -25819 -9331 55755 98403 64549 103860
7550 103860 98208 6345 89772 146994 38548 -12557 49279 147542 264384 227857 130005
7539 130005 191069 174155 202310 279960 117893 116131 230389 147982 88538 196453 179294
7528 179294 134707 56756 55285 136951 113650 43559 78065 81220 80459 139139 186177 165446
7516 165446 175065 176424 40567 14557 133971 167483 111818 7641 72690 280268 222815
7505 222815 100687 61587 108773 164149 218201 143233 149221 97382 -19243 12206 37411
7494 37411 93645 182080 116459 67980 130524 84841 141872 179908 158667 60309 31580 -64969
7482 -64969 5092 75658 92850 45773 22679 23955 97857 89194 166282 165358 99183 106574 182343
7469 182343 287136 358362 397874 344734 359840 345345 320465 286173 272708 145815 82745
7458 82745 31155 -33467 62945 82801 42409 3053 -19401 -72400 -37554 25581 -21792 -2833
7446 -2833 -6238 41800 -14336 -90555 -17689 10366 -41246 -65883 -53649 -114180 -120937 -139866
7434 -139866 -88680 -49350 3864 -8821 -85926 -109210 -92966 -144033 -117901 -11188 51057
7423 51057 38206 -72386 -114427 -82005 -53496 -165175 -112255 -64361 -85732 -84141 -102217 8367
7411 8367 83041 -3974 -97313 -164356 -162716 -82789 -105579 -144230 -145459 -30141 -14092 -128841
7399 -128841 -114037 -33675 10403 -60680 -90388 -113150 -58160 -184134 -146252 -95694 -1116
7388 -1116 15189 2072 -82220 -98022 -104858 -169169 -181825 -171195 -30281 23006 -72816 -2484
7376 -2484 24711 -60891 -127016 -150986 -90007 -44232 56085 61385 -59681 -131199 -55260 35577
7364 35577 -2936 30017 25172 -22438 -127066 -72203 32443 42026 -753 -32826 48288 52049
7352 52049 49452 28967 15548 -132621 -54815 -32263 -64533 3785 139563 105283 16460 -66944
7340 -66944 -146232 -10268 17 58238 124031 110816 54159 -38236 -81111 16731 7034 -46020
7328 -46020 -78534 -116577 -133096 -133644 -137152 -79102 11212 31428 81533 -72867 -131319 -92900
7316 -92900 -16525 -15913 21002 35050 41636 -112826 -124601 -59885 -87566 -141551 -132129 -220049
7304 -220049 -198967 -83129 4193 81190 -15675 23634 -69732 -101189 -94422 20187 77995
7293 77995 5449 -31310 -689 17062 -133253 2058 80124 125365 21706 -27934 -70602
7282 -70602 -48308 -76191 62561 57749 -30874 -21956 -50982 -166390 -137170 -93500 -127350 -119037
7270 -119037 -125755 -72823 -64088 -152175 -125304 -51067 -80449 18873 2800 -6855 -101363 -118540
7258 -118540 -137202 -108760 -216106 -135602 -55692 -134159 -187998 -75976 -140652 -190694 -153976
7247 -153976 -137899 -159964 -153986 -38293 -45553 -103075 -188114 -229722 -193410 -145107 -135653 -74359
7235 -74359 -97917 -180227 -62201 -54568 -72182 -137967 -150977 -122123 -119348 -224357 -179645 -212011
7223 -212011 -239446 -180759 -149133 -169592 -186235 -190482 -137062 -184126 -169583 -147252 -196776 -253595
7211 -253595 -261627 -166409 -155604 -122740 -115172 -39521 -60774 -103544 -132124 -146024 -112746 -100249
7199 -100249 -142092 -190285 -159449 -94874 -37065 -75287 -116002 -197435 -164842 -163699 12459 -54417
7187 -54417 -177103 -202732 -172410 -154760 -92241 -32798 -76577 -138038 -211527 -149251 -64303 -107749
7175 -107749 -115845 -121564 -156998 -142115 -66843 7024 -77081 -45156 -71563 -53803 -146112 -33515
7163 -33515 1 -46393 -145682 -160821 -113146 -127979 -147905 -57036 -69294 -134690 -152006 -84528
7151 -84528 -106147 -109541 -21996 20937 -95226 -156189 -126133 -89959 -32726 21621 38246 37028
7139 37028 -71314 -6324 -36033 -32050 -2378 11470 21964 -44517 -20172 13330 -45237 -112882
7127 -112882 -164184 -61603 -181814 -113405 10670 -6775 -55803 -123434 -145194 -157874 -168871
7116 -168871 -64425 -28083 -94379 -115132 -77852 -97406 -211808 -106214 -88808 -156814 -128774
7105 -128774 -78383 -88557 -132400 -191848 -161066 -202335 -250048 -182309 -77581 -122236 -274340
7094 -274340 -339726 -310203 -288479 -251426 -199547 -225039 -226816 -273134 -260617 -308731 -229809 -180223
7082 -180223 -254433 -291225 -247195 -168195 -193369 -155653 -154540 -135417 -162964 -176774 -111151 -68751
7070 -68751 -137162 -205709 -235485 -230571 -288150 -132755 -147000 -128636 -113279 -163616 -187881 -251044
7058 -251044 -208275 -67017 8842 -60980 -90516 -72998 -148138 -131398 -98126 -59748 -157898
7047 -157898 -131213 -52509 -39797 -63767 -130940 -92827 -55215 -34278 63235 -22036 14843 -102972
7035 -102972 -143322 -188187 -123233 -56286 -9208 -78009 -92001 -8036 -26446 -139026 -41568
7024 -41568 6824 -49742 -125644 -39889 -31130 -90124 -56462 -74874 -22173 -148774 -189052 -73823
7012 -73823 -108299 -158783 -103500 -26604 -102207 -125511 -29261 -117122 -216833 -155666 -81312 -153407
7000 -153407 -170451 -76900 -43988 -36555 -106260 -75887 -139312 -149776 -77377 -139774 -148170 -155683
6988 -155683 -89522 -87166 -8736 41263 51898 -45273 -91827 14503 83562 6313 80350 46054
6976 46054 -32867 -115267 -20183 61685 143889 139776 117887 12358 10506 21159 65270 41977
6964 41977 66345 -49325 -53888 -65678 -43034 53225 64202 36126 -33664 25150 -9031 40367
6952 40367 173278 180990 10003 -44989 11743 -67047 -41969 -68608 -33022 106160 11959
6941 11959 -62897 -18730 -104733 -54837 -50894 -7809 -86802 -125535 -136247 -64321 -87327 -49899
6929 -49899 -3723 -81162 -225250 -139585 -8426 -80581 -110494 -32850 -107955 -124205 -89957
6918 -89957 -71035 -36062 -155699 -92196 -87907 -100215 -152134 -74150 -144447 -179183 -154939 -151291
6906 -151291 -236707 -139578 -91614 -40623 -156616 -183911 -33547 -47957 -105506 -145491 -125864
6895 -125864 -163579 -87729 -74773 -9121 -93705 -102318 -161354 -144235 -140461 -32045 -95928 -180608
6883 -180608 -191664 -131546 -122169 -85778 -59442 -130111 -77212 -120445 -64318 -64338 -12064 -71659
6871 -71659 -14561 -125298 -68255 -36433 -60015 -66112 48089 32018 79244 18495 33759 96976
6859 96976 -10408 -86259 -85147 82839 92442 114536 71835 17545 79608 80378 102408 89234
6847 89234 95404 141200 122469 156143 202380 112776 47698 21560 155840 147812 172608 146317
6835 146317 70729 86828 188426 152010 89042 115103 178468 109886 55743 159808 174776
6824 174776 41659 27516 93549 41894 90189 179545 86571 67087 12997 -46446 31326
6813 31326 86431 218225 201661 52592 36459 76161 39231 -57419 -62170 31046 60150 21992
6801 21992 -15103 -47684 13698 -22347 -3962 -33222 -6938 52486 -5957 56527 159005 102857
6789 102857 5968 23730 20411 47571 -2339 -19190 19641 32677 -34691 -28083 -38389 -16858
6777 -16858 84084 -24766 -35817 9769 47217 71960 65854 173388 147707 34051 -21186
6766 -21186 38876 31050 -5338 6782 87774 119560 113330 34354 35688 82614 140687 108446
6754 108446 52815 170792 270409 156946 -20581 -8898 105485 164955 156140 206637 261872
6743 261872 198309 139603 114502 183320 199158 211351 166745 102262 78556 147106 60835 33484
6731 33484 73156 200244 162682 142701 149905 286223 210361 103874 59444 104866 97312 133569
6719 133569 174572 223869 186424 117641 98811 158341 257924 274321 298249 224906 216488 212762
6707 212762 270010 290699 321670 358262 295106 323636 369062 471098 466798 385473 491304
6696 491304 605800 583469 584701 729529 647407 590127 566114 457673 402977 403199 442707 355814
6684 355814 245592 200478 201011 169201 211592 229304 208044 188575 137000 153031 173281 123796
6672 123796 121625 89809 55336 192840 147067 197262 126417 106957 138136 127347 147353 149412
6660 149412 129901 127309 91806 -14187 -3923 43889 89800 147525 116427 75195 127022 109952
6648 109952 70326 125696 79511 182055 204931 159802 121311 136972 103552 94565 186447 221514
6636 221514 198583 94909 94343 161479 150999 222879 275213 345840 264713 293520 292149 310657
6624 310657 381173 354894 299237 314960 415106 421728 343159 345686 371156 283790 166264 167679
6612 167679 256405 271671 182458 186601 174741 143315 213989 196251 114840 89431 166678 296431
6600 296431 164667 196868 200533 146856 241884 447282 488551 349251 277214 195665 165091
6589 165091 275437 327181 362810 286950 225633 176158 207768 225509 276734 292138 160691
6578 160691 177772 262545 259227 299693 342823 322292 283180 65823 18743 161331 184950
6567 184950 82333 152983 195015 258205 318679 318438 307487 285792 310960 379217 388562 397822
6555 397822 482304 544719 481206 493057 572257 633485 623806 626073 511336 434103 415573 495350
6543 495350 565388 503555 460081 399669 348070 348930 412037 466264 433237 456339 410653 430857
6531 430857 409281 472196 521974 554873 485491 545932 587532 519193 562243 606850 542065 469649
6519 469649 408297 403298 377443 420246 420839 427542 317687 256450 391561 363046 376715 385385
6507 385385 399545 460219 419789 343027 330350 374183 275975 299071 364375 371777 422938 358203
6495 358203 309061 321172 369012 344885 395387 451919 389705 417908 281821 354511 465594
6484 465594 454084 419234 314232 385008 496870 455378 452888 544290 621038 591224 576080
6473 576080 666451 690492 580088 568850 652543 601951 508113 540705 430942 459656 579351
6462 579351 551466 515213 502674 598712 664292 668964 661791 815265 778409 517579 512894 600908
6450 600908 756340 770250 683768 662421 558105 528930 562337 650855 604927 618606 532383
6439 532383 476035 523381 617325 609718 637658 632053 666538 648639 574338 638227 847824 767377
6427 767377 595113 683302 671394 772502 781811 735214 812976 799988 690517 649300 683177
6416 683177 726927 835580 836267 752111 785560 877536 949139 963926 847070 892211 966367 872661
6404 872661 877845 1063940 1088385 1062000 1103853 1087213 1007083 1170986 1227794 1183924 1036678
6393 1036678 1033638 1141757 1232886 1159016 1269537 1298069 1148023 1135339 1167429 1262493 1369347
6382 1369347 1433735 1428127 1418801 1474618 1657008 1740057 1645194 1755314 1767205 1683407 1678135 1709581
6370 1709581 1758430 1841179 1796641 1800791 1973091 1907325 1867587 1941583 2003452 2078370 2133240
6359 2133240 2160184 2216167 2298108 2241407 2306790 2396642 2380548 2464971 2445567 2437123 2595043
6348 2595043 2773692 2787098 2803827 2899112 2975157 3057192 3119829 3266247 3349099 3327413 3386563
6337 3386563 3525058 3693699 3871387 3870464 3975167 4006882 4025238 4122880 4222123 4245950 4401958
6326 4401958 4516344 4463409 4579257 4759426 4814205 4780580 4829370 4927668 5084551 5147440 5361666
6315 5361666 5536879 5602669 5644103 5949245 6195686 6352568 6587239 6815054 6991639 7220362
6305 7220362 7523510 7739390 8009756 8384414 8739199 9176958 9601713 10150471 10657245 11183303
6295 11183303 11783826 12540007 13280395 14020299 14717206 15564532 16425015 17318303 18438902
6286 18438902 19665720 20799693 22297105 23922098 25955200 28214588 31118118 34188092
6278 34188092 37908554 42432371 48063306 54956606 63539885 73537882 85119945 96711342
6270 96711342 106372346 110426786 107533699 98237960 84430777 70841422 58966009 49984642
6262 49984642 43270081 38175795 34025719 30479067 27456350 25046702 22957193 21222656
6254 21222656 19891824 18660564 17577467 16759427 15986368 15397072 15064026 14843523 14711432
6245 14711432 14545657 14429212 14256391 13896680 13188909 12424866 11752274 10922248 10433843
6236 10433843 10040867 9768431 9395805 8983476 8554101 8321259 8165753 8119647 8016128 7999005
6226 7999005 7846315 7825125 7692006 7660224 7793270 7822164 7773522 7795707 7742683 7833773 7956788
6215 7956788 8092430 8368446 8666587 8866915 9121955 9496913 9798409 10216388 10486063 10795833
6205 10795833 11320530 11797683 12463593 13306363 14159084 14877794 15610282 16005010 16189832
6196 16189832 16107648 15880140 15490248 14848332 13879298 12702609 11555954 10324435 9437038
6187 9437038 8605130 7690066 7004632 6517936 6141657 5701535 5343224 5034926 4814825 4504876
6177 4504876 4270191 4204215 4024195 3903592 3835049 3679232 3658630 3636271 3513145 3449970
6167 3449970 3441000 3358838 3255007 3091547 3055617 3229495 3353424 3287011 3335724 3281439 3283691
6156 3283691 3174890 3177335 3396508 3565176 3643809 3628367 3784221 3972200 4054391 4299663
6146 4299663 4655352 4953065 5258421 5595133 6184619 6851368 7701062 8618552 9623399
6137 9623399 10534364 11317805 11613604 11235565 10390120 9174796 7948125 6872430 5953591
6128 5953591 5401804 4914947 4471641 4067425 3801047 3425790 3162546 2974552 2880069 2645732
6118 2645732 2497840 2369602 2296083 2141805 1991358 1919264 1780311 1775814 1760196 1645348
6108 1645348 1598197 1544147 1639470 1501553 1368970 1394093 1502411 1349036 1206060 1212552 1195387
6097 1195387 1108324 1104416 1146859 1125491 996502 951127 868572 875502 946239 956836 831633
6086 831633 746483 847708 840755 755588 738169 854446 749694 665539 700876 751998 732228
6075 732228 661517 643365 661410 567745 538377 526559 518077 545329 588415 571203 476960 433359
6063 433359 471110 508628 523652 567027 555558 502397 389751 389311 363867 424735 435204 465488
6051 465488 533582 481119 464418 455633 440764 411007 354367 426886 507474 499271 415767 360095
6039 360095 385880 379520 460801 492527 575510 445377 350379 370280 464350 459572 471122 465697
6027 465697 415938 360728 421770 462348 574072 516106 437029 360975 304193 395774 516506
6016 516506 553699 503738 487368 418099 371997 392694 465829 544690 521574 467453 417332 449562
6004 449562 388202 345857 348963 376781 360719 269874 283581 272455 249856 351064 350973 273444
5992 273444 221945 312751 283051 173306 175586 296015 215867 161137 270015 329972 237068
5981 237068 159622 200889 250108 154663 158874 119778 74268 168023 186167 190629 132535 172451
5969 172451 138284 56703 104821 190356 209838 76217 80829 199773 142096 110829 195218
5958 195218 197606 172464 203781 146924 257246 302087 294807 267147 208462 188556 234316 250785
5946 250785 194080 250310 266064 203009 286007 320247 377719 276679 246641 256619 229023 208645
5934 208645 258785 309553 242522 234422 182627 121218 255715 338779 224883 207195 209715 231779
5922 231779 227413 180428 251360 298376 117537 141493 240457 269007 210840 121810 130280 135224
5910 135224 157397 217762 318112 252093 214754 185101 184950 201246 264179 183765 85228 154279
5898 154279 286977 327591 209105 198132 189513 72793 91526 159883 274831 283404 186856
5887 186856 147410 117153 176647 283301 291794 282644 193050 153890 167369 217959 305728 298548
5875 298548 325346 174371 175477 308340 309744 291134 420955 388432 317166 272941 257688
5864 257688 380630 353066 308505 253319 196284 273845 304474 315636 336759 290945 262412
5853 262412 330762 420312 408721 498727 477140 494503 461148 614550 663130 671591 770247 729173
5841 729173 551828 580052 588154 532703 396877 432267 379725 342592 342921 393536 407732 283850
5829 283850 325621 261020 259139 247399 341056 319512 268590 236923 169651 207170 213913 345075
5817 345075 385207 300307 183933 182075 302252 175573 253477 331309 327431 252832 262515 316697
5805 316697 362574 331393 292795 293550 289952 344491 362201 228917 309471 319196 254881 280799
5793 280799 330712 280642 298395 225277 156996 168815 317283 274202 272226 338870 316195 289117
5781 289117 205400 221241 369168 346908 173989 257817 298051 318733 334485 302616 261507
5770 261507 306373 342124 375843 357461 261220 286442 347411 239057 331337 449804 337166
5759 337166 324898 372239 332631 401614 380089 283460 391976 381027 399426 485905 445126
5748 445126 416611 370133 268028 414933 592973 472415 432708 316089 273827 407161
5738 407161 534863 591338 602766 570257 449226 545133 565063 592455 684539 682390 533185
5727 533185 473496 582052 677164 779811 784447 690662 719823 795081 935841 982857 982517 1030642
5715 1030642 980444 857986 872714 937278 965610 1020076 1006668 1034978 980664 961841 1140078
5704 1140078 1182311 1222450 1277051 1258198 1215534 1113080 1210330 1195943 1253757 1393632 1497199
5693 1497199 1460253 1368806 1453958 1486773 1494902 1404754 1370779 1429755 1443698 1501626 1574365 1651478
5681 1651478 1608078 1615003 1638124 1725365 1788836 1894250 1830368 1752521 1737015 1690461 1617480
5670 1617480 1598075 1643178 1678878 1604474 1557895 1573924 1606264 1642923 1705247 1714044 1664119 1699639
5658 1699639 1736646 1620913 1585473 1571199 1539296 1527323 1585463 1717795 1653480 1549604 1640268
5647 1640268 1595667 1507100 1599276 1489012 1351972 1256747 1276195 1334956 1341758 1258403 1293481
5636 1293481 1338281 1342695 1463830 1382521 1283284 1228631 1216713 1130047 1156028 1153245 1117207 937609
5624 937609 817469 788919 791154 937719 1000313 956784 880062 835281 816985 894241 870856
5613 870856 902375 812187 807091 761746 777230 784845 762834 685304 639334 534894 542373 673024
5601 673024 715376 700916 589043 629658 596058 584947 693072 724743 727980 727535 629128 573918
5589 573918 680791 734151 704387 724764 642920 623958 686820 644710 679041 661158 591552
5578 591552 570486 649206 597178 689509 608649 495295 500977 565667 595032 547071 560673 517450
5566 517450 403661 439562 505305 579608 561366 521872 502045 397443 528594 577062 533817
5555 533817 513900 498905 478305 553608 502842 504648 535423 547834 571890 554776 509617 624407
5543 624407 634148 549999 571656 553117 428298 449879 453893 381332 446502 419726 333024 298817
5531 298817 290613 318935 438406 436746 393582 401178 451640 508785 485971 422177 442032 466532
5519 466532 518228 533873 574448 553209 527016 470517 394186 421270 432222 479045 485547 540511
5507 540511 547419 482209 490907 540607 559620 591416 533376 438365 529168 479887 548073 579452
5495 579452 492984 508825 456079 404316 413971 450081 440822 481802 410445 463738 480959 439001
5483 439001 448619 519632 413488 413460 443406 565361 609502 535995 517231 536960 582561 565481
5471 565481 635516 574057 595071 604597 543529 573122 641763 656493 691234 655357 692153 740066
5459 740066 718739 732555 737946 689919 752586 800384 808280 840905 817485 839136 758360 912420
5447 912420 940874 993970 948572 848514 808847 758724 886786 954032 953240 932501 886716 848993
5435 848993 909679 932513 1063028 1045813 1012843 1010377 1061563 1075099 1162873 1279060 1259817
5424 1259817 1152297 1146538 1173452 1208114 1292515 1282026 1290606 1259205 1325392 1334024 1433974 1372929
5412 1372929 1454249 1467180 1338091 1399451 1469456 1504467 1474126 1530338 1567211 1528883 1479510
5401 1479510 1588698 1603290 1671910 1618517 1697561 1743205 1639830 1588948 1699144 1656533 1666668
5390 1666668 1749458 1791033 1764937 1719987 1830114 1821944 1808751 1897751 2045532 1978910 1909930
5379 1909930 1956023 2039182 2012568 1917314 1884967 1892097 1814522 1749812 1792797 1767613 1738534 1645485
5367 1645485 1716821 1664420 1727769 1807661 1723196 1678279 1745799 1872946 1873330 1923490 1911234 1859175
5355 1859175 1833780 1902169 1950733 1965357 1860981 1759034 1787954 1776813 1761477 1812618 1693090
5344 1693090 1563080 1462553 1455120 1488338 1499397 1482631 1572920 1400893 1422632 1465818 1505306
5333 1505306 1502156 1515841 1516860 1485523 1400219 1450537 1489450 1478497 1502806 1533024 1546292 1515248
5321 1515248 1564455 1502152 1524665 1540784 1657883 1718743 1760726 1841307 1912207 1884800 1864665
5310 1864665 1840419 1817477 1778810 1756491 1759835 1846117 1840536 1841402 1834721 1933620 1928237 2052770
5298 2052770 2183032 2203763 2431188 2549265 2508118 2659942 2770715 2822343 2811027 2743518
5288 2743518 2766652 2788337 2588150 2619285 2667603 2634015 2745541 2764863 2792258 2873325 2894492
5277 2894492 2926901 3040055 3148150 3311432 3357875 3375439 3476566 3504909 3392938 3249469
5267 3249469 3217566 3203132 3083885 3071019 3182838 3254917 3267180 3425053 3548165 3670503
5257 3670503 3886326 4051388 4162595 4364911 4569924 4781800 4805248 4901664 4964932 4833934
5247 4833934 4606946 4397445 4301577 4259203 4065473 3954450 3919922 3982838 4003827 3998530 4088318
5236 4088318 4222587 4221298 4306548 4316504 4254150 4519033 4560621 4540990 4486263 4451404 4416354
5225 4416354 4422126 4460470 4534011 4562647 4492892 4519625 4583439 4661025 4816814 5031289 5107009
5214 5107009 5177691 5277127 5465778 5606585 5630117 5705653 5771159 5785877 5762083 5776090 5743589
5203 5743589 5826859 5823819 5860791 5894184 6030897 6201319 6288706 6313092 6403284 6588409 6661965
5192 6661965 6820726 7068941 7339677 7542588 7749797 8040922 8293477 8702212 9176847 9550066
5182 9550066 10002284 10386018 10965867 11493728 12271740 13100512 14083685 15157516 16337049
5173 16337049 17809806 19579124 21795438 24402225 27347292 30535594 33577568 34972212
5165 34972212 34230716 31754556 29069639 27072952 26111302 25788697 26263177 27256130 28820737
5156 28820737 30783693 33111357 35016470 35068630 32963831 29408808 25845938 22958999
5148 22958999 20726008 18980024 17691965 16589903 15696760 15127500 14570530 14111078 13797757
5139 13797757 13582193 13514566 13456486 13551786 13717145 13768035 13775881 13826142 13996252 14161625 14363570
5128 14363570 14483140 14812341 15275993 15868880 16752272 17657082 18652712 19906556 21309138
5119 21309138 22739712 24801251 27196868 30176405 33473323 37295621 41459325 44996865
5111 44996865 46157405 44651671 41312341 37942936 35621495 34460014 34055859 34517256
5103 34517256 35685745 37540832 40067339 42828213 44867793 44349305 40894005 35747871
5095 35747871 30971824 26969323 23785256 21487458 19626306 17873347 16475795 15250523
5087 15250523 14254135 13388156 12622150 12051560 11706055 11320010 10920079 10571902 10134058
5078 10134058 9808401 9552544 9191167 8774160 8530717 8283571 8018809 7795387 7691026
5069 7691026 7565498 7474760 7477796 7539504 7392327 7244888 7141219 6856881 6667135 6723038
5059 6723038 6745187 6560510 6510641 6451150 6394233 6279998 6244037 6309672 6220334 6102688 6168989
5048 6168989 6157533 6190084 6380179 6491670 6458948 6506060 6644913 6610812 6493988 6436494 6435454
5037 6435454 6327464 6212256 6231478 6329970 6446603 6590952 6613145 6715730 6759149 6907370
5027 6907370 7026029 6979203 6893215 6822153 6637549 6342279 6316046 6216573 5983696 5784628
5017 5784628 5878665 5903354 5888735 5898166 5987983 5970518 5982547 5952344 6060479 6095736 6211092
5006 6211092 6412598 6417602 6435139 6500612 6550816 6573855 6651462 6792766 6894090 6799824 6773893
4995 6773893 6901039 7047173 7212198 7365016 7467776 7543784 7605754 7689351 7785627 7843865
4985 7843865 8009019 8162079 8214882 8208269 8377892 8489306 8754393 8932810 9113721 9246344
4975 9246344 9323469 9508920 9590698 9783711 9947878 10100847 10197055 10325071 10596121 10955475
4965 10955475 11261139 11456931 11588930 11723816 11755114 11763736 11762857 11770298 11782847 11630964 11534551
4954 11534551 11594625 11689111 11878341 12022405 12242692 12509893 12792521 13146353 13517848 13874493
4944 13874493 14331554 14741571 15149888 15413610 15907393 16326390 16749409 17255911 17903651
4935 17903651 18641305 19360426 20164400 21057965 22000260 23274305 24758461 26428348 28065515
4926 28065515 29675025 31068485 32208103 33045745 33452412 33404587 32850319 32111682 31144430
4917 31144430 30175771 29322347 28732435 28308281 27982586 27786000 27833282 27735919 27419061 26940546
4907 26940546 26183259 25288785 24529012 23767684 22908693 22119240 21429696 20838452 20255879
4898 20255879 19903853 19898532 19893272 19703417 19690675 19724992 19888013 20212529 20757735 21176610
4888 21176610 21474066 21598157 21730383 21697940 21291546 20696150 19893420 18920162 18069555 17471699
4878 17471699 16894977 16396462 16070654 15757415 15342672 15263775 15366392 15563750 15551840 15517920
4868 15517920 15623731 15729398 15700513 15810201 15848724 15649015 15504212 15406785 15192563 15061743
4858 15061743 14844111 14492984 14178357 13729993 13448426 13250584 12855853 12480078 12263225
4849 12263225 11889286 11598848 11502839 11415374 11300856 11026632 10929725 10881535 10907974 10778541
4839 10778541 10918888 10967381 10910399 11113738 11286375 11325278 11425741 11506058 11726350 11892706
4829 11892706 12174820 12526059 12896344 13270480 13772919 14406903 15065762 15888621 16825624
4820 16825624 17911037 19184791 20901550 22868767 25293363 27912873 30943451 34359890
4812 34359890 37509190 39592305 39481939 36874892 33100217 29396395 26396149 24272614
4804 24272614 22677645 21526018 20615712 19951193 19388881 18974956 18673643 18661405 18729805
4795 18729805 18989108 19499073 20155809 21051658 22155865 23534558 25231176 27427744 30040854
4786 30040854 33086132 36609041 40133203 42969272 44066578 42234899 38529945 34413640
4778 34413640 30826537 27935848 25790380 24077062 22894727 21865785 21103220 20554190
4770 20554190 20076638 19823306 19792656 19966450 20213716 20672470 21225854 22175492 23465838
4761 23465838 25094834 26981414 29099847 31403522 33563506 34664007 33998388 31747879
4753 31747879 28801748 26076138 23779970 22160701 21062048 20016200 19140940 18695060
4745 18695060 18295611 17926112 17703910 17751386 17773364 18030467 18234349 18607340 19210592 20054970
4735 20054970 20958414 22106722 23553901 25358575 27484707 29699812 31941490 33706071
4727 33706071 33915395 31859310 28435128 24999251 22044639 19631471 17855626 16513417
4719 16513417 15499325 14449440 13684102 12835596 12241509 11724344 11224661 10778726 10325534
4710 10325534 9968944 9585373 9223413 8887275 8761575 8480342 8037677 7912951 7711735
4701 7711735 7517393 7341776 7201626 7036517 6723152 6518933 6366609 6274320 6052509 5892153
4691 5892153 5808537 5570848 5544589 5410051 5315165 5196543 5056962 4994234 4950083 4813422
4681 4813422 4718536 4709881 4734512 4745449 4620963 4491869 4415161 4354259 4375020 4395473 4375257
4670 4375257 4234612 4175438 4118795 4167336 4301908 4236992 4259795 4227487 4199001 4194438 4292319
4659 4292319 4308829 4406169 4454700 4373507 4492594 4581682 4674892 4795558 4771055 4780819 4830268
4648 4830268 4892654 5114375 5312730 5351550 5401220 5428781 5647598 5979060 6301659 6533461
4638 6533461 6800533 7045277 7219326 7240151 7198209 6973980 6630500 6267071 5983250 5846289
4628 5846289 5943505 6118137 6259074 6441490 6620963 6879271 7217665 7579601 7961940 8048246
4618 8048246 7743853 7247082 6745831 6369553 5995718 5678503 5391646 5192320 4854013 4699232
4608 4699232 4602523 4534771 4465864 4377509 4188494 4110544 4121091 4212866 4289401 4257517 4220244
4597 4220244 4250674 4235407 4237492 4348527 4392219 4386273 4357617 4353823 4343793 4319988 4325312 4348892
4585 4348892 4434879 4507400 4606029 4646771 4673672 4634747 4649359 4721164 4922115 5106180 5180640
4574 5180640 5211999 5244221 5463653 5755274 6045463 6276277 6622766 6848547 7156854 7634846
4564 7634846 8282131 8845224 9434692 9866368 10176911 10340804 10275387 9915620 9358198 8815762
4554 8815762 8331832 7911091 7748753 7848448 7941707 8201517 8402820 8814762 9261329 9669236
4544 9669236 9976556 9969564 9700861 9109543 8276431 7478745 6895415 6330908 5795931 5440632
4534 5440632 5140719 4954394 4840981 4563059 4414442 4223279 4127262 4102059 4045360 3866243
4524 3866243 3841943 3771132 3675447 3671565 3723865 3773368 3880038 3934154 4072661 4179275 4232179
4513 4232179 4256978 4187469 4043769 3894093 3756506 3552440 3425437 3418678 3393639 3460758 3490849
4502 3490849 3501089 3581466 3563696 3525029 3499697 3674552 3766275 3745965 3836639 4014767 4231353
4491 4231353 4378505 4625175 4891598 4891866 4937183 4941918 4868020 4647558 4399162 4266128 4098703
4480 4098703 3962742 3988736 3982731 3929727 3957502 3986507 3938481 3989104 3986042 4148637 4181865
4469 4181865 4162640 4263513 4337815 4403487 4342952 4195761 4122449 4064852 4056580 4088003 4186035
4458 4186035 4156989 4252659 4233558 4172675 4250916 4301693 4399585 4498976 4620173 4775647 4709651
4447 4709651 4552883 4409602 4331721 4210948 4320578 4383835 4341732 4416207 4492889 4524235 4582559
4436 4582559 4663115 4665827 4809708 4987231 5195733 5388026 5593539 5763495 5998625 6235686
4426 6235686 6605237 6955719 7204381 7107628 6931600 6895731 6885336 6848964 6747221 6664656
4416 6664656 6559016 6563836 6505337 6504117 6708902 6926587 6998371 7076306 7371238 7739527 7967036
4405 7967036 8212288 8490406 8815628 9152676 9784050 10549829 11315708 12289330 13146099 14254494
4395 14254494 15605501 17086197 18437021 18659367 17780903 16462327 15194570 14344157 14064202
4386 14064202 14203401 14309099 14624965 15112768 15963112 16895668 17999003 19212612 20109535
4377 20109535 20619674 20592712 20450064 20277672 20507974 21226287 22049404 23107391 24118543
4368 24118543 24317776 23140059 20961613 18694547 16870195 15515969 14577427 13904034 13599546
4359 13599546 13533862 13598423 13795246 14140612 14574528 15398751 16300330 17232586 17769400 17558175
4349 17558175 16760496 15626761 14437874 13555322 12957771 12609640 12510327 12519994 12543199 12661827
4339 12661827 12288801 11477165 10692642 9821149 9114374 8509374 8176935 7748148 7461244
4330 7461244 7182950 6875045 6723600 6663151 6735982 6669746 6584890 6533257 6460547 6494209 6433280
4319 6433280 6290055 6107049 5754975 5484729 5377895 5409476 5233284 5149402 4959065 4785110
4309 4785110 4823342 4796739 4885536 4922841 5094818 5042993 5122679 5315102 5514906 5851210 6079962
4298 6079962 6375186 6814960 7268237 7657126 7820597 7751127 7421772 6961584 6386502 5861715
4288 5861715 5511296 5284269 5135311 5082187 4977781 4825024 4739709 4796521 4844232 4795303
4278 4795303 4810577 4808085 4784374 4796871 4850573 4971349 4989931 5068567 5288036 5507732 5666360
4267 5666360 5929020 6225873 6556491 6702020 6721595 6508838 6176095 5718160 5450020 5224356
4257 5224356 4948005 4858214 4699430 4480618 4397576 4383246 4357735 4423250 4408346 4445130 4461024
4246 4461024 4419240 4339978 4326135 4298271 4281918 4257605 4252823 4310998 4327086 4309627 4364791 4423031
4234 4423031 4407435 4403477 4475204 4520393 4639569 4508013 4448168 4488997 4691382 4833879 4847764
4223 4847764 4767620 4786904 4968586 4960840 5032450 5279572 5373496 5387637 5440951 5422374 5604033
4212 5604033 5654879 5750471 5882762 5967698 6060793 6282347 6503984 6638075 6854133 7032286
4202 7032286 7172685 7344324 7690660 8109598 8460520 8809601 9266531 9806906 10235001 10873043
4192 10873043 11714557 12630890 13634130 14650197 15716827 16617646 17016025 16956881 16876126
4183 16876126 16829514 17048070 17589663 18404949 19507171 20986868 22746985 24640062 26536362
4174 26536362 27883766 27956702 27183353 26571496 26316863 26585185 27370601 28348871 29086635
4165 29086635 29317674 29644293 30459601 31517662 32564213 33170168 33753412 34480091 34649453
4156 34649453 34993855 35655716 36046422 35367660 33751956 32621374 31940749 31827630 32445075
4147 32445075 33503195 34617475 35123302 34616790 33987653 33544741 33359357 32813936 31949387
4138 31949387 31214408 29975139 28643369 27748287 27258909 27026819 26760729 26100533 25777019
4129 25777019 25690454 26037009 26563677 27032791 26770536 25077453 22686707 20703205 19125853
4120 19125853 17966093 17273361 16898520 16722309 16739207 16895099 17037462 17103155 16747510 15713055
4110 15713055 14510707 13361297 12488048 11968777 11479476 11197663 10943983 10860248 10695325
4101 10695325 10467837 10364961 10377685 10131123 9965413 9926066 9889962 9918780 9927974 10012989 10059073
4090 10059073 10083629 9965192 9830731 9767713 9843958 9865682 9848909 9929052 10209665 10702733
4080 10702733 11289756 11856892 12431985 12821535 13174650 13655279 13935717 14297196 14550544
4071 14550544 14825187 14781895 14593026 14476617 14351491 14215207 14218610 14313468 14355789 14372288
4061 14372288 14502708 14858977 15263333 15390593 15372926 15623669 16082491 16458975 16719122 16828436
4051 16828436 16899585 16842965 16962755 17417449 18345348 19235773 19930003 20157106 19342173 18518615
4041 18518615 18056219 17867237 18150965 18301227 17964253 17220690 16186815 15182103 14407736
4032 14407736 13680036 13007858 12586939 12297802 12143191 12211120 11973955 11579193 11220523 10722094
4022 10722094 10476247 10453773 10592874 10418079 10266855 10086000 9863774 9522288 9268021 9052180
4012 9052180 9007893 8991330 9045276 8966014 8764764 8436196 7883282 7415235 7091676 7018537
4002 7018537 6986492 6944212 6830467 6825701 6727340 6436590 6155599 6030880 5795080 5575080
3992 5575080 5443515 5417023 5447928 5476090 5459525 5380812 5265191 5138726 5174249 5125553 4991027
3981 4991027 5048440 5014680 4819243 4788289 4780655 4855854 4808448 4796531 4847221 4890719 4754811
3970 4754811 4795304 4825063 4722878 4742612 4768443 4743067 4677351 4627679 4524532 4422545 4342303
3959 4342303 4534120 4594434 4559571 4437083 4553731 4538843 4452962 4563026 4687268 4621379
3949 4621379 4560676 4658678 4784251 4832229 4954350 4990774 5034719 5050129 5221322 5619588 5846754
3938 5846754 6217218 6635553 6985633 7169723 7599963 7954204 7870933 7405855 6570602 5896684
3928 5896684 5376207 5009813 4863986 4727975 4504113 4298165 4198300 4150060 4114735 4128373
3918 4128373 3984688 3877017 3930751 4041543 4070098 4008184 4052019 4028203 4090682 4190712 4280675
3907 4280675 4385772 4470607 4589089 4684579 4838236 5027868 5085603 5259159 5297724 5426516
3897 5426516 5751269 6083131 6540718 7100018 7593604 8268374 8857687 8708982 7977675 7228027
3887 7228027 6481378 6082933 6005531 5916745 5992485 5984591 5990364 6089184 6222677 6498286 7021935
3876 7021935 7552023 7991454 7822199 7068073 6224139 5590842 5160576 4740919 4492847 4328586
3866 4328586 4248977 4142222 4079747 3906072 3725497 3588398 3512155 3509751 3520698 3409474 3295417
3855 3295417 3163564 3175259 3225655 3237288 3124140 3084686 3130381 3143472 3196014 3351390 3402028
3844 3402028 3400771 3406630 3420499 3541399 3639293 3773799 3853042 3949433 4076815 4306357 4582753
3833 4582753 4815263 4894276 4745725 4539611 4321981 4252436 4351170 4446399 4512909 4549133 4564599
3822 4564599 4592315 4789385 5040331 5349804 5524384 5733245 6035703 6496333 6960951 7376012
3812 7376012 7755672 7742112 7658670 7680818 7870062 8211348 8154913 8041545 7766089 7614089
3802 7614089 7620928 7815035 7978558 8284595 8655525 8972819 9390377 9794537 10166786 10473622
3792 10473622 10723849 11171436 11663719 11918630 11737964 11221386 10956949 10773564 10689029 10550619
3782 10550619 10449867 10388346 10199985 9994716 9960641 10075843 10304985 10538242 10648849 10773726
3772 10773726 10968445 11112788 11225545 11370891 11411619 11449498 11313922 11076181 10914747 10710140
3762 10710140 10472652 10529416 10548352 10570062 10879773 11137964 11433322 11664355 11859432 12231196
3752 12231196 12529904 12911049 13396784 13841123 14295892 14899631 15469045 16227693 17209233
3743 17209233 18316961 19502627 20926450 22611235 24813532 27411461 30361125 33826806
3735 33826806 37933099 42227785 45716255 47221449 45092087 41587445 38194928 35191852
3727 35191852 33329807 32337175 31857075 31945745 32539433 33711684 35154883 37002376 39386889
3718 39386889 42428631 46264841 50904121 56316073 62401180 68455689 73126250 75397095
3710 75397095 75600317 74248041 69471632 62463584 55929909 50314316 46106337 42994789
3702 42994789 40676984 38797085 37459437 36782146 36374134 36480135 36973421 38033804 39897710
3693 39897710 42287320 45489121 49341695 52776098 54270931 52094023 46838246 41371914
3685 41371914 36727309 33011764 30093358 27579575 25418324 23638872 22230381 21115373
3677 21115373 20135244 19243743 18522618 18085794 17630129 17100035 16646419 16245142 15690632
3668 15690632 15171451 14834847 14456422 13975854 13464865 13072309 12866557 12631486 12396240
3659 12396240 12196949 12015418 11864506 11749469 11645303 11498171 11410615 11078524 10802221 10671788
3649 10671788 10563108 10437251 10256977 10118494 10049403 9864144 9727385 9715620 9716743 9698085
3639 9698085 9683989 9704787 9646564 9621985 9666659 9751568 9697263 9709828 9854938 9946541 10161638
3628 10161638 10292688 10365416 10405760 10466143 10530956 10573946 10706071 10789299 10868759 11090829 11270240
3617 11270240 11394110 11488767 11529126 11537300 11657928 11817001 11983803 12210013 12489398 12867729
3607 12867729 13168300 13462653 13856430 14097957 14360023 14579506 14722974 14832456 15012565
3598 15012565 15283522 15418301 15630566 15778629 16046280 16231483 16375985 16564401 16674197
3589 16674197 16822690 17076074 17438086 17816091 18052472 18262026 18583166 19000698 19352233
3580 19352233 19846353 20338047 20881236 21495308 22011775 22777700 23618239 24634399 25750753
3571 25750753 26950961 28474200 30526781 33069655 35960531 39419347 43338504 47546051
3563 47546051 51446646 53526792 52884798 50039381 46799599 44223767 42752886 42446738
3555 42446738 43337421 44977602 47312656 50267296 53557180 55994560 56468266 54470743
3547 54470743 51210511 48085068 46094863 45348252 45638219 47098657 49177641 51456514
3539 51456514 53108273 52956695 51139466 48711083 46857212 46078415 46203923 46973720 48048265
3530 48048265 49155812 50224290 51524825 52445933 52254013 50210909 46760623 43257288
3522 43257288 40570222 38746177 37501445 36377170 35068751 33704536 32773236 32034438
3514 32034438 31647531 31783170 32071376 32365897 32366074 31897694 31209271 30250650 28860678 27482261
3504 27482261 26469582 25685008 25250300 25009115 24861101 24985794 25135066 25410394 25605779
3495 25605779 25654891 25375211 25163990 24952868 24913910 24686208 24132427 23408203 22309558 20981301
3485 20981301 19724788 18742977 17862616 17253767 16777442 16399851 16285186 16261587 16158851
3476 16158851 15995634 15893618 16072285 16267804 16507062 16976824 17638212 18274393 18586731
3467 18586731 18613513 18518838 18364267 18031344 17304881 16441580 15722654 15464674 15222991 15165977
3457 15165977 15077865 15232168 15484514 15653351 15341221 14413739 13425421 12757468 12322287 12277367
3447 12277367 12258068 12397724 12532088 12787081 13112070 13449298 13725641 13568421 13290259 13149969
3437 13149969 12960639 12911935 13083279 13396979 13556008 13572363 13268824 12767142 11976819 11234696
3427 11234696 10719522 10218855 9811883 9473717 9175999 8867099 8604804 8428027 8337724 8311989
3417 8311989 8369441 8329275 8301818 8313847 8398321 8464559 8438617 8443286 8511034 8548386 8472798 8525293
3405 8525293 8600940 8656136 8695096 8697796 8577812 8364182 8279817 8196477 8282786 8327484 8261103
3394 8261103 8165087 8154606 7976608 7995103 7893570 7884698 7769837 7696265 7555864 7414927 7339924
3383 7339924 7200749 7120836 7043974 7029028 6985938 6826694 6811557 6894615 6932270 6914086 6899055
3372 6899055 6886212 6815630 6823330 6967343 7113162 7136420 7062042 6993008 6893645 6875506 7008106
3361 7008106 7232032 7174454 7233257 7280027 7402658 7591622 7900674 8156696 8391912 8567895
3351 8567895 8956732 9266140 9408854 9382639 9457929 9374999 9351896 9275145 9311269 9407754 9410104
3340 9410104 9412066 9436427 9515842 9509444 9566634 9559024 9576157 9709050 9739872 9753056 9856892 9844850
3328 9844850 9798310 9696054 9571227 9450778 9359758 8988114 8833127 8698882 8461536 8246787
3318 8246787 7953218 7768585 7587615 7335386 7068241 6878074 6705462 6584798 6665323 6778456
3308 6778456 6641611 6655775 6540129 6363980 6297104 6263226 6298287 6323493 6284873 6265211 6213322
3297 6213322 6060267 6175695 6164880 6055638 6004739 6076423 6090677 6175890 6261681 6487291 6631530
3286 6631530 6721900 6869792 7053120 7226315 7358865 7557405 7723181 7804951 8063591 8134835
3276 8134835 8233704 8299337 8309600 8311099 8244145 8068030 8080954 8109744 8136160 8151978 8311668
3265 8311668 8297356 8374205 8450172 8658038 8792991 8982908 9104768 9224839 9367111 9616160
3255 9616160 9748936 9775268 9774253 9854309 9888249 9923098 9995375 10057853 9978210 9785684 9640723
3244 9640723 9606008 9564252 9445786 9415609 9280192 9094946 8995732 8962752 9097889 9287724
3234 9287724 9430550 9493135 9457152 9587605 9863409 10011112 10215513 10394355 10579299 10729689
3224 10729689 10942098 11358542 11738909 12072169 12405071 12752675 13075207 13326653 13669447
3215 13669447 13937810 14106425 14345291 14651051 15038278 15392368 15757198 16253058 16804443
3206 16804443 17263610 17670279 18001134 18352164 18655699 19133910 19804017 20577840 21397329
3197 21397329 22329904 23198615 24147137 25190076 26252004 27014666 27328483 27345130 27456132
3188 27456132 27537844 27852144 28427463 29039128 29604715 30282914 31058014 31887297 32674817 33224249
3178 33224249 33328952 33559559 34106380 34915650 35716665 36777896 37971766 39144040 40217860
3169 40217860 41361274 42162315 43000025 43857657 44989584 46365749 47975028 49845035 52214310
3160 52214310 54920009 58022647 61439813 65106266 68902937 73177231 78065182 83789514
3152 83789514 90314273 97824473 105693683 112902011 117337614 119590070 121478388 123077779
3144 123077779 123844421 122869814 122081793 123242792 126256723 131738795 139354211 149371888
3136 149371888 161678516 177602063 197411467 222777452 253127454 289836744 330941489
3129 330941489 371530972 391958477 382227852 345911217 294627765 250461792 215762143
3122 215762143 190187788 170489745 155146341 142505238 132303124 123849911 117223612
3115 117223612 112014730 108678689 106354660 103871541 99369523 93070705 85479920 78395039
3107 78395039 72439498 67651796 63809189 60551177 57743771 55192610 52885148 50803190
3099 50803190 48987630 47278449 45530314 43735969 42137293 40665301 39287731 38171263
3091 38171263 37159159 36310699 35442045 34672977 33968396 33279261 32447783 31583704 30718562
3082 30718562 29786640 28939824 28054730 27167907 26269077 25465986 24791553 24081730 23499221
3073 23499221 23072026 22533074 21870254 21277046 20883238 20547943 20270792 19962445 19738832
3064 19738832 19398090 19116455 18825069 18723525 18703072 18714303 18605781 18742735 18704114 18823783
3054 18823783 18931979 19068514 19184569 19335450 19477542 19645519 19693441 19879869 20072077 20285790
3044 20285790 20620806 21072977 21589366 22030512 22446714 22828777 23284819 23813178 24537846
3035 24537846 25789980 27214440 28994654 31207524 33813190 37110510 41245186 46107525
3027 46107525 51697781 58026333 64498778 69595810 70511568 65484764 57199165 48825065
3019 48825065 41725004 36375001 32425318 29426500 26760574 24292684 22225619 20298594
3011 20298594 18637829 17386449 16336192 15317606 14324315 13504392 12691347 11964850 11448055
3002 11448055 11055368 10641188 10224168 10004550 9890761 9644153 9460136 9197928 8897555
2993 8897555 8707915 8626029 8513440 8292426 8059628 7760733 7524205 7249516 7180718 7185159
2983 7185159 7014430 6829378 6664410 6615029 6646223 6561073 6483296 6374066 6170273 6054858
2973 6054858 6069702 6006192 5933680 5839897 5480263 5370937 5439929 5586544 5495322 5390430 5325860
2962 5325860 5148889 4919842 4857230 4873613 4849826 4816447 4690533 4498888 4371106 4300590
2952 4300590 4265888 4144106 4072920 4086668 3987738 3831432 3620368 3582261 3569497 3613092 3738118
2941 3738118 3732492 3599514 3554340 3500944 3512503 3398047 3512622 3445647 3413386 3304376 3351569
2930 3351569 3507128 3471069 3519669 3515971 3471630 3404765 3527826 3594041 3626912 3651166 3653373
2919 3653373 3690634 3630045 3550355 3610159 3494294 3416684 3235131 3232989 3115486 3066180 3096282
2908 3096282 2944369 2947950 2856967 2778427 2778388 2721714 2679432 2659463 2508905 2488379 2489937 2477243
2896 2477243 2458263 2506133 2444904 2380866 2358265 2486092 2709686 2740097 2838253 2910688 2905503
2885 2905503 2923838 2989084 3176230 3278149 3150353 3136306 2964791 2903074 2824141 2812246 2715309
2874 2715309 2599898 2459367 2547164 2603837 2540930 2527695 2455836 2329805 2268555 2482462 2606075
2863 2606075 2532059 2471395 2556636 2478743 2343058 2365585 2429763 2301515 2171697 2068979 2113838
2852 2113838 2092052 2138037 2233678 2043507 2010297 2073670 2115643 2010658 2061454 2147530 2027231
2841 2027231 1930580 2044218 2260513 2258937 2264131 2440708 2484857 2576391 2800615 3085638 3297772
2830 3297772 3351709 3497395 3596492 3680832 3569685 3502400 3281945 3194392 3306492 3505098
2820 3505098 3632246 3606184 3574860 3291082 2849424 2418093 2351844 2323577 2176869 2052011
2810 2052011 1895225 1709197 1647745 1724229 1742820 1692080 1684673 1563321 1508656 1453482 1527846
2799 1527846 1501081 1475154 1430550 1401632 1346769 1331270 1379462 1316363 1359801 1294051 1283900
2788 1283900 1360887 1519907 1509055 1573294 1473767 1509670 1643242 1782181 1821686 1809942 1676884
2777 1676884 1505317 1417651 1428123 1376590 1290367 1145545 1103796 1149651 1092787 1128221 1120516
2766 1120516 1100680 1094426 1098674 1132150 1229095 1094215 967534 948708 968102 970063 936602 924338
2754 924338 902030 833492 863431 883273 879687 859131 804550 755025 836091 920478 875836 844291
2742 844291 725840 679114 756492 712131 750797 732905 676882 538224 451945 554985 665955
2731 665955 779801 723653 614914 540487 621736 760471 829931 806916 762399 713287 731173
2720 731173 752264 911762 919683 859040 774990 853611 868523 792495 833426 843070 804499 757371
2708 757371 682163 663737 768431 758601 632331 541359 556103 609601 757278 612676 651595
2697 651595 562744 638931 676852 723801 800975 859637 769858 605172 636471 736750 762178
2686 762178 752009 634899 552202 585297 560990 626811 713855 712461 644422 598791 592190 696248
2674 696248 703818 718660 649115 696036 591702 520515 458699 585550 641992 629305 598143
2663 598143 592241 474010 477438 564394 529767 542970 535755 578779 564469 567921 552026 534206
2651 534206 430259 359069 423883 442654 416704 378914 429584 393543 324267 351744 377176
2640 377176 314715 339773 410880 415302 347911 312975 377742 306057 285334 254108 302117 320733
2628 320733 326757 260806 288201 243812 263933 353151 346270 281075 296225 309727 268476 199090
2616 199090 252330 333927 318121 273055 306157 313844 260028 294628 253414 216445 233417 361167
2604 361167 363820 387325 473192 476197 393033 338646 402095 524684 419412 295604 317748
2593 317748 342533 418302 453878 535695 583278 491862 340282 355566 316279 377383 468538
2582 468538 495126 431489 459617 437414 297723 367493 451189 381933 337078 377153 427260
2571 427260 535771 460212 486479 429595 450591 480586 392267 455456 481939 569275 492106
2560 492106 481488 402085 448600 461072 391819 380081 462465 523090 457418 377371 385566 490619
2548 490619 440588 433907 461616 423668 377969 347921 296921 486320 453081 444241 310723 325322
2536 325322 372187 378550 243655 308970 416800 382512 286617 301148 334019 349192 357367 399086
2524 399086 406819 407468 351581 249934 273755 302496 381110 265295 235997 262886 359068 340027
2512 340027 284241 298202 363088 382938 261562 262716 390433 441422 422963 436916 405088
2501 405088 391643 367550 342798 394578 433006 433077 410710 450711 430385 448727 381476 403349
2489 403349 410742 442160 365964 357558 326727 398714 350213 338674 380781 421013 420267 396946
2477 396946 355225 341643 397462 414329 373803 435570 426089 339410 338416 306783 356758 356545 374970
2464 374970 305874 342587 341229 317413 353617 496011 498659 452248 459445 359281 415772 340695
2452 340695 372664 429353 471142 459986 384315 360231 440983 374073 456033 478791 436662 405935
2440 405935 372033 396751 342588 432940 383298 449786 436320 428591 430310 408662 403662 344118
2428 344118 319079 274244 302780 495009 422427 406316 359409 372553 449808 429609 352842
2417 352842 412634 390573 367848 406117 483008 434246 269998 191407 218312 288599 349351
2406 349351 305275 289300 272770 156788 208154 250829 290903 368386 302719 181558 120098
2395 120098 237101 379821 351247 346270 273878 226123 227791 248764 315591 279804 232153 214926
2383 214926 275246 264346 341860 416045 277758 141598 154711 207135 216592 246071 319862
2372 319862 248212 229984 330321 447190 399149 301933 257427 283478 329152 331416 311739
2361 311739 324662 265870 261136 267597 335078 338434 364485 382133 322209 338861 432548 477152
2349 477152 493293 541888 563862 476573 418865 448792 385813 381532 326295 408040 429668 415217
2337 415217 332844 373334 306685 438785 393218 292915 257880 352521 411239 407368 369425
2326 369425 473180 513979 426717 389383 466930 436787 508918 603457 682936 751810 750642 764780
2314 764780 762304 710005 727140 710597 597518 549027 594094 571805 576054 628714 646495 618134
2302 618134 519377 531083 485711 526125 589563 657189 645607 529133 616161 616426 640204 670116
2290 670116 752800 715046 636349 661337 657151 732993 778929 825621 798790 746232 799929 760468
2278 760468 631016 643677 796503 840284 784482 791337 799700 773765 701075 654049 622426 715625
2266 715625 740927 776649 695827 697513 707869 667664 706544 751194 873709 888282 828733 899426
2254 899426 822744 878783 840406 959048 1046077 1020943 966553 917894 900732 882612 894119
2243 894119 940081 942052 978559 1021937 985128 867539 980792 1030691 1013777 967491 972301 996134
2231 996134 931560 946657 1055866 1105063 1112747 1083578 1081666 1094483 1253348 1282331 1287416 1340004
2219 1340004 1337784 1392420 1429752 1525615 1656015 1710412 1685390 1572497 1512448 1482721 1495573
2208 1495573 1468792 1442781 1378065 1305081 1270839 1256743 1338215 1384985 1381582 1422519 1488864 1483503
2196 1483503 1475794 1511173 1530447 1530175 1622183 1719055 1743118 1721665 1797613 1893028 1996808 1994050
2184 1994050 2082253 2181994 2325648 2349067 2370993 2320598 2349097 2302560 2212371 2229035 2283700
2173 2283700 2321633 2268503 2154919 2199745 2300591 2228915 2189364 2336609 2340459 2282467 2325452
2162 2325452 2218344 2242986 2216990 2093939 2053503 2081551 2111564 1935429 1849397 1730003 1768562
2151 1768562 1664005 1614332 1615060 1697373 1647303 1494841 1403822 1335254 1349074 1341104 1239264
2140 1239264 1235326 1226235 1148064 1089845 1062215 1104307 1125378 1023738 901767 1018777 1040291
2129 1040291 988542 1073593 1080795 1011964 921792 1039892 1125746 1174650 1205451 1199634 1154915 1112752
2117 1112752 1024354 1084128 1053574 1007809 999866 953998 867945 852242 931969 870664 864040 916780
2105 916780 945158 791790 701062 821103 876335 779161 789008 747306 741468 764686 873066
2094 873066 911359 930715 823084 884691 992552 1076088 1192230 1252782 1135294 1205524 1327432
2083 1327432 1312790 1165540 1018785 945616 799726 534771 600487 701102 615872 588500
2073 588500 693302 616509 491499 444863 488725 620248 578112 539176 464975 386998 495752
2062 495752 602800 535042 482904 485095 548958 438243 432748 591081 598612 551547 569039 698620
2050 698620 685007 553985 537572 567224 524938 473354 373630 364173 308307 369437 393421 311671
2038 311671 210391 268733 326875 223417 197655 321864 361268 310225 355915 377936 327226
2027 327226 268310 242966 178445 155617 232253 319655 297196 260728 292759 333821 298159 230365
2015 230365 218639 287563 288246 212257 278508 265993 263590 262456 242551 228347 217159 289804
2003 289804 361034 286596 318568 337380 245208 174999 211401 286482 262491 239227 193838 248404
1991 248404 209769 174935 158302 291647 165717 191042 304874 352647 297423 220298 146341
1980 146341 102257 162369 292991 252260 303329 193572 167453 89075 67370 301737 354709
1969 354709 196854 111155 179775 171303 236546 214642 188444 154292 103293 120350 145360 211614
1957 211614 262407 153904 63697 59329 114554 174331 153981 199082 200244 77253 -120325
1946 -120325 35197 141990 217390 140856 116483 64901 40752 13405 34629 137027 119062
1935 119062 102267 38685 26385 71088 115817 85125 181972 170791 169746 113403 183096 146249
1923 146249 70139 35829 92620 86126 141609 158990 155036 123927 77801 123408 147406 236981
1911 236981 221484 241357 193494 120469 86489 190360 198938 174895 243532 226264 209728 137223
1899 137223 240669 234183 178983 124918 187170 171876 201487 196385 275202 236148 227206 204813
1887 204813 243540 253361 359829 380267 292182 220785 235420 237138 190829 256644 310518 261968
1875 261968 289363 298756 282525 296778 225980 252110 297039 340690 226558 221179 202846 207902
1863 207902 269107 235402 336982 309294 242132 280192 325619 242557 267982 246434 271627
1852 271627 360466 432115 386857 370880 408696 480332 466842 373904 425574 495662 495887 531389
1840 531389 615786 559254 639665 636695 680432 688007 750669 658628 752492 677661 668565 756122
1828 756122 752908 728279 827425 870032 867830 806333 715543 749892 821917 781972 863027 991377
1816 991377 866257 838304 827727 823679 884132 973053 984565 961248 851790 793958 967931
1805 967931 1008168 1050771 1121575 1158071 1154466 1283923 1328608 1323918 1288167 1246300 1167522 1130370
1793 1130370 1094064 1110305 1011340 960839 977001 1019448 944089 915221 949300 935532 949145
1782 949145 982095 986508 951514 994467 905075 956921 1006061 993446 1071825 1050315 999242 1079960
1770 1079960 980672 975135 1130710 1077421 1068673 1022194 900978 847974 852859 772300 771941 755970
1758 755970 763382 756178 741022 701053 751465 760221 722359 738969 681475 720168 634625 691921
1746 691921 641714 555465 487025 472361 415306 447217 497916 588806 451842 382824 421326
1735 421326 453152 374936 474503 494268 445118 464296 386973 317754 396010 345946 322872 247458
1723 247458 160953 197834 224081 167360 190215 283782 240400 257436 272561 320500 363894 252915
1711 252915 182217 278796 313071 260746 225580 247870 256358 206554 188074 155822 163263 196777
1699 196777 270358 159041 147090 212393 275047 267170 252410 191881 115919 113297 58228 95942
1687 95942 216938 212940 197280 245233 132864 94288 127207 132945 141120 258254 207646 58110
1675 58110 61394 129667 232238 191761 128108 121063 98027 19279 69381 238099 208451 223294
1663 223294 140039 229976 245844 183512 169719 124023 55720 -44440 47265 122924 172418
1652 172418 219756 43672 -64586 -101116 -28778 -481 144544 98085 54742 -59229 -38579
1641 -38579 85517 83031 59681 33534 -22046 -26070 36680 18513 -276 -42483 -71054 1637
1629 1637 -28680 50557 116828 89786 28468 24972 46885 -29743 101861 109227 170317 38765
1617 38765 44473 56489 22066 42824 57586 151548 127852 -4013 84600 29323 60225 114269
1605 114269 111554 134266 88441 37006 -30372 48848 -8945 144532 42442 65436 127151
1594 127151 139586 135553 74038 85513 151814 89377 60583 143796 198964 180930 183243 112140
1582 112140 -23060 9828 -1768 25728 28090 120793 87404 13755 34901 56121 92846 65936
1570 65936 107271 56289 -41328 -99938 -76885 -27372 31243 100771 38958 -83519 -91733 -143885
1558 -143885 -154822 -119606 -47113 2645 -106264 -127299 20907 62251 -109411 -95213 -155980
1547 -155980 -134885 -110991 -75942 -63926 -91196 -185827 -126311 -66470 -39731 -23247 -100697 -107149
1535 -107149 -155472 -202252 -137696 -70161 -109678 -87309 -152792 -95595 -23388 -62874 -180801
1524 -180801 -115601 -114178 -129551 -53630 26139 -8867 -34304 -62354 -76285 -29162 -27098 3222
1512 3222 -14549 -41933 -45708 14058 -41342 -101421 -35087 -20113 -63028 34341 22340 51007
1500 51007 -16258 38633 88630 107906 33635 95241 69460 -70872 -86686 -35391 14365 39392
1488 39392 -16700 55817 -20485 -8122 -31177 -22090 -83023 -17843 179134 137178 82794 -17446
1476 -17446 -43486 -77138 -177379 -75900 34417 68089 58113 58932 -17231 -86029 8197 68113
1464 68113 106069 75794 32911 18986 37037 19046 64173 -38607 -152782 -138516 -67359
1453 -67359 -17521 63300 54808 24919 -98351 -119943 -14914 66903 3992 -40323 -29459 -65981
1441 -65981 -55569 82188 127582 47819 -75014 -140917 -76952 -51928 11214 -52019 -20065
1430 -20065 29475 -59202 -110425 -6247 91552 41672 -50889 -90925 10617 108498 159200
1419 159200 149607 12055 -81406 -71200 -24962 30806 79299 124253 -3141 -14210 -23615 -27434
1407 -27434 17118 18239 31392 20890 -15836 9240 28281 106685 3530 44563 -55603 -45507
1395 -45507 73069 13657 -44868 -77996 -57401 1151 -46244 -35317 -58644 -44879 -191396
1384 -191396 -74684 -52452 -126753 -97704 -208661 -206009 -195457 -125725 -47440 -56769 -107378 -186456
1372 -186456 -198438 -204863 -125990 -132686 -133375 -107929 -149768 -154881 -229589 -122152 -10676 -21781
1360 -21781 -97453 -247601 -197086 -136062 -180452 -161621 -63991 -115350 -159470 -125949 -90815 -91406
1348 -91406 -166837 -166447 -84402 -72425 -59131 116 -35437 -48771 -132498 -150890 -122677 -24948
1336 -24948 -29203 -96714 -163975 -146859 -26266 47033 57110 57991 72704 -21736 -59491 -90604
1324 -90604 -36679 13925 -67201 -90730 -85341 8616 102709 145606 -56200 -94052 -88286 -62647
1312 -62647 -98886 -46989 -2470 20729 -27042 -56010 32121 115110 -75745 -35208 -55448 3991
1300 3991 -86596 -7424 105344 69371 -19623 19452 35531 -1748 -33051 -39326 -45483 3101
1288 3101 -7157 -52209 -4979 89111 118409 10375 -62845 -61832 523 -17560 -10554 13157
1276 13157 83172 89207 1811 -12564 -17262 6713 8443 44656 -21053 -125960 -35651 18463
1264 18463 29129 112264 67199 -72860 -121009 -33249 91486 105836 19917 -25755 -14277
1253 -14277 -49208 -31867 28428 74109 -80277 -123042 -184494 43882 97922 104678 44368 -32947
1241 -32947 -72075 27547 66376 6914 158977 63379 -44584 11836 132145 252115 168668
1230 168668 86881 75082 49265 -4501 39584 160469 100454 46569 -29105 4551 -10049
1219 -10049 58180 140289 43828 -44092 -68944 -1658 -146400 -81384 34409 63074 -8001
1208 -8001 30066 -58473 -41685 -44950 45951 103510 137362 32324 -15522 -16125 12169 98606
1196 98606 19929 -73072 -77972 -77444 479 98197 177204 44768 -84947 -106861 -41541 -8157
1184 -8157 35617 50530 -26356 -104257 -207018 -10778 111757 117599 2180 -42274 -37716 -116614
1172 -116614 -66580 83364 126110 6997 -121645 -44061 -62089 -124345 -54956 -102565 -155987
1161 -155987 -141101 -73980 -81884 -66782 -21622 -25692 -43346 -57950 51727 57982 19239 -53597
1149 -53597 -21646 -22972 -46818 32506 -5415 -46046 -136110 -111785 -61224 32036 20524 -11291
1137 -11291 -77190 -100444 -35401 33704 -3935 -12643 17226 -17718 -49218 -75493 92090 158570
1125 158570 30133 66900 80038 56165 142955 176622 198277 224919 171213 32589 152125
1114 152125 128360 238563 215649 175748 70569 140099 212255 256893 183330 227309 214341
1103 214341 226417 192409 269742 313715 259404 301822 299255 263025 215549 235562 208862 239452
1091 239452 261674 302087 360815 198601 197453 311033 223329 212959 332246 419912 220622
1080 220622 289588 336720 435934 374023 401773 433152 173154 229280 221834 237993 186661 209734
1068 209734 272357 210264 212181 351398 445730 358061 260849 320543 267714 325004 218394
1057 218394 296989 269695 212515 303814 278567 131303 225490 315165 246553 318146 355309
1046 355309 412607 349913 308293 357948 355758 310581 374021 425767 493813 482859 517024 515883
1034 515883 436622 473172 543003 514400 553042 635988 626364 466585 454462 540472 588953 600438
1022 600438 515307 542319 554385 618885 677051 601713 599416 603108 650296 647894 744090 786073
1010 786073 826887 723298 714998 769964 764746 736868 844431 837356 828911 652305 744774 832583
998 832583 852309 814737 888493 1023058 1018538 1062716 1091187 1073760 1126222 1232429 1340463
987 1340463 1339320 1442496 1362347 1310946 1335660 1431071 1701944 1755046 1830635 1997513 2103305
976 2103305 2183941 2376855 2487473 2541204 2825564 3055504 3183426 3448739 3659699 3999969
966 3999969 4195272 4440360 4846358 5178482 5385273 5687409 6207448 6617711 7259715 8043354
956 8043354 9054275 10255933 11784921 13688726 16122170 18921148 22356314 26801741
948 26801741 30681945 28054651 21873597 17126402 13713694 11785960 10171220 8907585
940 8907585 7640546 6763360 6010179 5483960 4957575 4646971 4308631 4048053 3869806 3519151
930 3519151 3168437 3056432 2899698 2633563 2281066 2108891 2173043 2138338 2026855 2054877
920 2054877 1989265 1713618 1574314 1633962 1652753 1631966 1532935 1488777 1314853 1204816 1160122
909 1160122 1256681 1186101 1203769 1063443 1003025 920972 1021802 1039226 995610 910599 842655
898 842655 750665 727812 817846 838946 823606 701524 664526 687400 645933 710818 678464 651052
886 651052 582908 567497 609542 595397 590301 567662 558529 452471 426185 512730 559829 534666
874 534666 486519 414386 397233 325460 329323 399133 401405 241631 216920 198472 219193 340647
862 340647 311094 268042 284849 233633 156980 241726 314077 289804 253345 153113 195830 252163
850 252163 204014 74618 172866 130987 105140 128893 163568 254354 264075 136223 169324 166850
838 166850 70832 82939 124508 22324 36348 67140 47278 39678 99955 165672 177296 74385
826 74385 44703 46307 16826 -35047 33943 12108 20767 70425 102096 92846 48608 -44663 -3221
813 -3221 47873 -11782 100778 94605 47980 101486 7368 -22124 34467 -28096 -14025 -2514
801 -2514 -56830 55033 60813 -25005 -30037 -48766 -145584 -132478 -120854 -72318 -38212 -63529
789 -63529 -46979 -72154 -83947 -14005 20773 -62632 -83346 -36378 -27324 3837 33415 -33283
777 -33283 -30017 -93034 -72165 -33685 44273 -4452 14432 -65471 -126530 -21056 6591 4837
765 4837 8348 -3636 -48267 -70011 -150319 -113528 50646 102993 54911 -31196 -65552 42640
753 42640 -13077 55997 231259 159684 50533 -4373 17987 53930 188608 140958 107847
742 107847 18659 -58591 24053 69060 109850 70430 -123 -29114 -53692 77556 278255
731 278255 313334 218601 60383 -87401 -98485 467 64671 119484 123089 27957 -58149 -134086
719 -134086 -48553 69035 81024 67359 -57509 -51315 4363 -53842 -74087 -22117 -7449 -63205
707 -63205 -70676 -123256 -7086 -18433 -37382 -3975 11517 2700 76399 29253 62085 118386
695 118386 56135 -74497 -107038 6492 82954 88018 -28386 18443 43216 -51775 1269
684 1269 88174 51071 -56691 -169017 -77685 2712 68373 146485 120202 -3166 -51870 51944
672 51944 58456 91793 117587 67527 82 -53459 148356 208212 139449 57771 97958 58219
660 58219 87713 184347 142723 40367 -61377 -139557 -163169 -98263 -5579 -71476 -175959
649 -175959 -134238 -127521 -132028 -130821 -72454 14196 -88833 -245311 -148026 -47837 -83596 -181489
637 -181489 -202155 -216085 -222023 -74914 -44093 -63814 -132550 -135901 -161672 -154996 -55196 24662
625 24662 -30332 -199001 -233143 -141588 -162845 -88999 -36353 -80636 -169821 -128280 -89674 -68933
613 -68933 -60177 -63253 -112649 -114812 -118745 -108642 -65372 -82734 -79652 -26863 -42027 -41517 -91988
600 -91988 -55089 2334 -51751 -19905 -1279 44163 -6760 36895 17813 -7323 -40503 -62408
588 -62408 -91430 -60163 -28693 -70267 -16317 30298 18102 19130 -38265 -43214 -27178 -51012
576 -51012 -98950 -12039 -22919 -12828 -53514 -53910 -31445 76300 22336 -26810 -41774 -90062
564 -90062 -117126 -132806 -45407 66801 95025 9854 -69001 -137354 -126436 -77342 -106418 -104280
552 -104280 7906 -100088 -156769 -60607 3125 3859 -36697 -68451 -23570 -29667 -145918 -76505
540 -76505 -57215 -55875 -111388 -206896 -149986 -2238 31173 -5710 -102641 -230098 -196156 -29476
528 -29476 -29757 -15973 -35482 -171503 -234784 -129953 -13979 -11671 37211 -90079 -63198 -141519
516 -141519 -134382 -49872 -99577 -186801 -228462 -275077 -188807 -50622 -34665 -130428 -173278 -163356
504 -163356 -182291 -137857 -89488 -25815 -132137 -213859 -267322 -206806 -151037 -99898 16055
493 16055 -97799 -177600 -162368 -86405 -120103 -99386 -101481 -119305 -152315 -140962 -39911 -60517
481 -60517 -109472 -18668 35315 -27659 -100593 -150590 -105585 -79883 -49580 -14678 -60205 -79584
469 -79584 -20530 -2962 -41071 7176 -8690 -125895 -105634 -8763 -409 -80172 -60949 -92315
457 -92315 -100641 -26991 28210 68022 -23587 -73077 -84760 -79198 -95514 -50051 -78773 -65439
445 -65439 -149546 -120524 -75529 -67607 -114461 -59470 -90515 -144882 -138243 -65124 -7725 -6236 -42084
432 -42084 -127187 -101333 -94639 -4646 -61268 -82487 -75321 -64660 -75580 -81073 -128055 -121583 -129294
419 -129294 -72686 -122339 -41385 -133818 -202038 -136081 -96887 -13680 9098 -6219 -42919 -8433
407 -8433 -79791 -105760 -46060 -110992 -99081 -158105 -133128 -63128 -81478 -78480 -100231 -93412 -137659
394 -137659 -47840 -48697 -50732 50888 -86202 -68459 -30886 -13509 45647 26962 2693 34409
382 34409 -38449 -74947 -10459 -1811 -52314 -92999 -136541 -103416 -157877 -108462 -26828 -86680
370 -86680 -48921 -127613 -121228 -99938 -91376 -101317 -23285 -96730 -149865 -86196 -91252 -82208 -105755
357 -105755 9510 25068 -66786 -48358 -27750 5279 -53098 -129323 -154356 -123160 -62439 3395
345 3395 3297 -77227 -76303 -118218 -108735 -86166 18791 45224 -112322 -121104 -82186 -89963 -119075
332 -119075 -18729 -4368 -19966 -35497 -80246 -77256 -83445 -51207 -17309 25300 -7880 -40370
320 -40370 3687 -45118 -52180 -656 -19130 -63006 -157005 -157397 -155613 -150006 -116452 -114611 -145285
307 -145285 -140397 -61764 -3061 63791 -22868 -186722 -215331 -247562 -167287 -42946 -41999 -145921
295 -145921 -173803 -187955 -244733 -146492 -75431 4923 -87231 -184569 -64076 -67720 -93474 -131302
283 -131302 -76629 -98840 -117590 -169656 -77956 -66565 -154361 -152074 -216062 -200929 -145295 -66047
271 -66047 -122846 -141553 -134833 -157624 -217708 -146486 -93475 -74303 -135367 -92875 -78068 -183551
259 -183551 -263253 -76885 -87371 -49698 -11327 -55631 -86262 -96007 -144962 -169039 -171373 -84858
247 -84858 54289 -86729 -154818 -71212 -152210 -190946 -177394 -219948 -99036 -45610 -35627 -79206
235 -79206 -78776 -117560 -111059 -123195 -46985 76443 -55205 -125492 -131334 -88489 -122495 -77523
223 -77523 -33782 -6148 -4284 -101151 -112165 -94930 -23881 39863 22277 -40048 -26383 -26932 -28167
210 -28167 -74688 -24925 -124715 -128364 -179994 -88623 -53795 -99692 -69526 -119933 -198174 -189252
198 -189252 -56853 -42512 33823 36162 -100156 -225218 -226641 -130648 -122744 -205696 -158742 -137239
186 -137239 -173074 -212832 -167780 -186213 -213880 -181921 -94595 -33694 -43191 -43983 -135500 -153638
174 -153638 -212768 -137554 -148071 -117162 -75150 -90581 -134150 -221091 -181229 -28639 -85161 -64435
162 -64435 -22826 -142433 -227478 -263369 -147597 -137849 -159598 -183797 -98142 -117527 -202150 -179925
150 -179925 -75774 -91839 -139868 -162511 -154802 -119619 -129568 -75351 -112360 -123488 -129329 -184229
138 -184229 -193940 -71368 -14683 -29243 -89014 -126631 -154646 -167150 -113936 -15537 -6488 -58119
126 -58119 -188045 -134853 -156225 -131918 -59882 -83774 -64605 -129116 -182384 -282787 -191128 -139327
114 -139327 -86865 -92701 -165867 -103396 -174553 -212639 -147493 -127113 -90886 -137328 -153026 -141361
102 -141361 -93337 -103276 -171169 -178249 -228162 -196863 -212479 -223944 -138875 -204189 -227802 -236454
90 -236454 -190931 -215679 -156101 -181252 -160171 -144298 -215045 -216579 -142036 -76862 -95405 -177824
78 -177824 -167189 -167153 -143369 -125561 -144448 -226992 -258217 -194399 -206620 -108223 -39590 -69813 -271263
65 -271263 -291659 -223175 -175819 -114319 -59014 -104974 -235001 -272822 -167070 -108612 -80425 -29679
53 -29679 -118895 -161398 -199707 -192132 -182100 -37875 -61696 -143200 -176446 -248094 -165523 -81894
41 -81894 -57327 -95024 -47914 -97144 -195024 -185999 -98465 -51623 -74824 -115836 -161566 -254331
29 -254331 -201635 -131643 -147393 -170611 -145413 -175569 -207009 -170221 -144932 -119197 -129637 -125837
17 -125837 -132724 -201453 -236507 -228825 -188229 -162765 -204493 -176132 -178242 -169880 -153312 -179777 -168821
4 -168821 -147499 -171604 -211856 -234421
0 -234421
$$ Imaginary data points
##PAGE= N=2
##DATA TABLE= (X++(I..I)), XYDATA
16383 -1343586 -1371427 -1306935 -1209384 -1245832 -1289749 -1264113 -1169486 -1129557 -1091272 -1007817 -1018067
16372 -1018067 -997773 -1074757 -1046278 -1003401 -952091 -902215 -929146 -924183 -846007 -838565 -805262 -766827
16360 -766827 -744241 -707432 -730607 -711597 -683007 -649215 -701918 -639604 -643401 -626636 -566002 -542220
16348 -542220 -501935 -503323 -449457 -447082 -481371 -462581 -387365 -311454 -324899 -279708 -227716 -239838
16336 -239838 -292890 -268683 -260018 -227932 -158905 -108542 -92711 -116483 -152558 -159172 -145126 -115697
16324 -115697 -24032 5762 1021 33103 55845 38607 31698 85559 122499 134701 171665 175111
16312 175111 208510 217645 310441 331204 284793 193200 197458 284449 359248 430970 437165 374213
16300 374213 330085 381706 483793 506439 565086 613974 560586 463600 475589 637936 678592
16289 678592 633504 572040 559024 562889 670726 782982 799151 785839 796762 774627 778875
16278 778875 791148 804552 760781 706420 768886 870016 926284 957251 913427 912916 899939 878143
16266 878143 1008013 1067843 1121738 1022777 1022749 1041744 1153195 1151235 1252906 1171698 1086097 1162017
16254 1162017 1197503 1163690 1168074 1236785 1237483 1207587 1275205 1397467 1455533 1378796 1302137 1368359
16242 1368359 1327282 1385977 1398938 1491806 1541914 1518602 1441346 1426255 1503599 1526680 1486125
16231 1486125 1506088 1537269 1593594 1565467 1493927 1418454 1510036 1565681 1585676 1600739 1589533
16220 1589533 1574424 1546224 1602006 1631682 1697751 1700773 1645183 1588048 1530873 1585825 1626434
16209 1626434 1696054 1654492 1673359 1720503 1663365 1612866 1708643 1767673 1664654 1699531 1797462
16198 1797462 1714909 1748363 1726605 1760011 1752054 1729381 1770536 1811807 1760002 1842039 1844746 1812779
16186 1812779 1792223 1764987 1806365 1857178 1851181 1920994 1956296 1936310 1871097 1853382 1896497
16175 1896497 1963924 2032107 1951873 1901147 1836755 1926128 1940999 1968979 1966911 2005652 2050653
16164 2050653 2030787 2068168 2023634 1949554 2007993 2025520 2066454 2085389 2064350 2044773 2051553
16153 2051553 2062561 2069846 2093681 2137313 2149810 2213402 2172418 2173088 2173539 2199578 2153925 2132926
16141 2132926 2136719 2174334 2103690 2173791 2169891 2139927 2134568 2146987 2134165 2151299 2337053 2260586
16129 2260586 2183223 2157371 2187818 2166102 2158635 2227025 2269246 2220695 2191848 2160409 2196071
16118 2196071 2201438 2232124 2244188 2227844 2099536 2141076 2156455 2110942 2183751 2258520 2260742
16107 2260742 2218593 2274905 2258496 2273658 2137435 2125436 2162976 2128843 2130751 2242506 2205249
16096 2205249 2181376 2179810 2251043 2244721 2185895 2150517 2181477 2133216 2222079 2326685 2192964
16085 2192964 2111156 2234433 2231116 2191771 2204833 2305013 2226228 2113896 2165216 2173750 2178610
16074 2178610 2237472 2335558 2369917 2217575 2072859 2115044 2142400 2141222 2214862 2236096 2198919
16063 2198919 2155403 2235708 2222679 2199939 2224954 2276372 2259083 2273985 2362275 2291358 2291511 2227727
16051 2227727 2244129 2350243 2339220 2340715 2391591 2268873 2191072 2260846 2312646 2205005 2289753
16040 2289753 2347005 2362247 2385742 2416330 2416917 2416805 2296091 2296030 2393832 2359740 2423393 2498088
16028 2498088 2309637 2214192 2250334 2339714 2317316 2381914 2387485 2375284 2310248 2281573 2342509
16017 2342509 2373320 2421208 2379694 2327982 2313565 2355922 2317574 2269448 2287747 2238630 2348549
16006 2348549 2385487 2405204 2409619 2309255 2289327 2331470 2336635 2345882 2415935 2487980 2328840
15995 2328840 2354237 2274958 2251221 2332249 2331739 2204155 2177945 2250561 2258134 2268876 2240401 2187486
15983 2187486 2199931 2210204 2306282 2305546 2244693 2209067 2172358 2259323 2173901 2215729 2264924 2203967
15971 2203967 2151148 2136847 2214493 2318146 2306197 2270456 2284693 2224840 2153699 2273416 2342132
15960 2342132 2360717 2297884 2223518 2243915 2242779 2360134 2453829 2372908 2218335 2247576 2311956
15949 2311956 2333534 2489285 2496166 2411174 2249347 2264472 2272076 2308009 2375977 2407569 2392495
15938 2392495 2345208 2366471 2358368 2380266 2450655 2419813 2328433 2372016 2442526 2464409 2409533
15927 2409533 2318150 2303846 2340667 2376166 2351263 2406670 2322208 2313787 2274094 2241632 2358440
15916 2358440 2322081 2294556 2281656 2325434 2409662 2383220 2347661 2328264 2290598 2169406 2306145
15905 2306145 2377057 2367198 2344581 2240293 2118958 2160572 2184783 2271484 2304183 2317432 2245317
15894 2245317 2270213 2194193 2280642 2372021 2312822 2215437 2174042 2258709 2253080 2185168 2167555
15883 2167555 2208375 2158043 2205684 2385041 2376412 2344656 2229609 2191392 2246536 2312936 2302948
15872 2302948 2290784 2302808 2244494 2272979 2281043 2208647 2264102 2288896 2289057 2315473 2407341 2439896
15860 2439896 2389060 2394066 2413858 2325840 2312510 2362007 2401504 2436682 2364724 2401263 2435664
15849 2435664 2395049 2488296 2529329 2510435 2515470 2429280 2371436 2362479 2402124 2388228 2553280
15838 2553280 2448710 2547103 2573923 2402875 2372696 2388931 2386249 2408778 2381290 2371614 2398791
15827 2398791 2428607 2414247 2496089 2442705 2468611 2358226 2338318 2449348 2376809 2333246 2447293
15816 2447293 2425802 2366785 2383298 2374216 2306189 2349513 2319741 2256529 2228680 2203899 2228135
15805 2228135 2399802 2336104 2369645 2381194 2335847 2203620 2276660 2410917 2356164 2277470 2296443
15794 2296443 2252703 2265388 2227900 2231223 2253455 2154705 2134787 2248223 2301531 2298060 2346936
15783 2346936 2304501 2197541 2231240 2293753 2424241 2399287 2406035 2369671 2290056 2218206 2376104
15772 2376104 2392645 2308754 2314489 2299542 2317184 2312602 2311033 2263436 2239713 2151513 2215507 2258072
15760 2258072 2225960 2207515 2358615 2255608 2237001 2177406 2283855 2272095 2328931 2353073 2358237
15749 2358237 2304217 2292759 2342453 2336410 2230143 2217176 2258272 2228899 2185356 2219487 2287047
15738 2287047 2225749 2274343 2344291 2327461 2336709 2389800 2324993 2288961 2390811 2351737 2370791
15727 2370791 2344010 2453388 2386797 2300085 2306274 2366288 2286017 2286563 2320088 2429468 2402316
15716 2402316 2325622 2336158 2387423 2304846 2398846 2375590 2266622 2332900 2422319 2323613 2358880
15705 2358880 2420942 2424864 2433399 2420479 2480985 2535964 2376893 2346380 2305380 2327588 2370564
15694 2370564 2429609 2415042 2380329 2305323 2285185 2320403 2386626 2509200 2500965 2408834 2366192
15683 2366192 2427847 2419551 2393852 2345722 2381074 2284640 2351144 2423011 2480158 2453390 2368151
15672 2368151 2322258 2383900 2363243 2431229 2562627 2582657 2461817 2510145 2352132 2379501 2527059
15661 2527059 2486070 2525779 2439462 2339237 2421948 2352550 2321536 2457741 2501039 2349445 2368874
15650 2368874 2386485 2411170 2357823 2339235 2375901 2382754 2402434 2464241 2436037 2357548 2363468 2458194
15638 2458194 2306286 2236784 2303919 2368944 2333692 2250984 2365643 2438242 2251698 2260824 2420057
15627 2420057 2456393 2353833 2388502 2306339 2287052 2318454 2375908 2309302 2292946 2346301 2389758
15616 2389758 2317972 2187736 2361078 2412643 2223855 2291385 2320452 2351682 2261506 2281470 2378100
15605 2378100 2210395 2119222 2230871 2305661 2236765 2376175 2378422 2224432 2162811 2216019 2296637
15594 2296637 2283736 2274666 2361304 2330796 2340137 2309223 2193347 2140202 2152891 2250114 2320774
15583 2320774 2282482 2258235 2174457 2099086 2144657 2291822 2328786 2362987 2308797 2289101 2216626
15572 2216626 2166313 2186501 2272983 2335606 2408874 2293296 2284726 2258012 2291371 2304908 2246714
15561 2246714 2315342 2370229 2322446 2331696 2473773 2416942 2361274 2387499 2291352 2308543 2311829
15550 2311829 2408642 2436282 2403061 2420215 2415847 2301711 2247153 2423764 2470726 2405705 2408909
15539 2408909 2355872 2284196 2291743 2503308 2529009 2498132 2463170 2473575 2474158 2386277 2391113 2486658
15527 2486658 2439526 2382719 2459454 2518480 2382970 2429275 2410809 2412653 2398925 2330163 2432562
15516 2432562 2433095 2436594 2416747 2426458 2378118 2513432 2575530 2472775 2470336 2432802 2397054 2351679
15504 2351679 2300340 2415002 2385214 2397683 2393525 2426795 2450612 2357398 2382492 2369977 2316156
15493 2316156 2383781 2405071 2389242 2280772 2313234 2352914 2348205 2363511 2373299 2379914 2421570 2407234
15481 2407234 2548615 2504887 2364611 2455913 2470591 2387939 2403933 2471577 2405127 2414004 2385318
15470 2385318 2402786 2350508 2322190 2374226 2419943 2372981 2329075 2398424 2376441 2397262 2461575
15459 2461575 2479893 2393911 2404514 2442885 2400297 2332234 2313804 2373682 2417709 2332636 2457740
15448 2457740 2410742 2321466 2347687 2355948 2375387 2401814 2427003 2378039 2348643 2359748 2320371
15437 2320371 2332826 2339523 2317702 2452691 2431739 2338555 2346112 2381892 2318181 2409374 2416413 2373091
15425 2373091 2347081 2292981 2372277 2433661 2402906 2312769 2281311 2219067 2326167 2444568 2464764
15414 2464764 2405115 2322306 2287116 2370991 2366846 2389865 2421387 2491301 2471359 2430717 2362234
15403 2362234 2306819 2344940 2327523 2382410 2348604 2366206 2388580 2444092 2314588 2315831 2456370
15392 2456370 2462595 2405584 2393478 2374070 2404121 2407896 2481844 2546148 2486895 2393984 2414362 2394024
15380 2394024 2424645 2563097 2442197 2386864 2421613 2533389 2544821 2619207 2630370 2569576 2580919
15369 2580919 2504272 2575444 2539224 2408922 2411685 2420265 2404492 2475170 2428790 2461871 2450972
15358 2450972 2423047 2382952 2448927 2473662 2530567 2479788 2384365 2398529 2378549 2369636 2432902
15347 2432902 2414368 2307587 2370517 2360310 2351272 2426565 2393323 2286520 2291247 2363624 2475651
15336 2475651 2365004 2239244 2274861 2306763 2276338 2284227 2360829 2333721 2354322 2361234 2372306
15325 2372306 2380904 2338544 2369687 2352150 2290232 2379097 2468984 2409871 2304131 2357296 2324393
15314 2324393 2351912 2399209 2490797 2507264 2379701 2384976 2438935 2421184 2483384 2487052 2361194
15303 2361194 2356147 2418013 2499591 2514792 2511626 2447547 2464389 2345191 2468866 2618544 2541826
15292 2541826 2519061 2556026 2530780 2486035 2472441 2497972 2533480 2537282 2438932 2530877 2509414
15281 2509414 2445251 2445501 2448303 2481786 2510524 2533418 2519311 2577688 2578622 2487771 2533283 2463034
15269 2463034 2554625 2639588 2489608 2474604 2576317 2550073 2482450 2540478 2569308 2539118 2473651
15258 2473651 2349781 2365143 2377975 2381617 2473533 2553849 2549866 2523411 2376714 2436039 2522787
15247 2522787 2456951 2383910 2369590 2385777 2400388 2411002 2387960 2447518 2383113 2339522 2276883
15236 2276883 2317498 2325805 2365936 2236144 2221331 2312436 2459198 2421156 2414932 2414438 2439275 2405184
15224 2405184 2391644 2408893 2360726 2399275 2388148 2427489 2338579 2321241 2345861 2245112 2260883
15213 2260883 2320319 2356020 2382996 2444264 2452702 2455266 2454584 2362320 2444985 2467972 2384818 2465447
15201 2465447 2404456 2398494 2323683 2337314 2490596 2604105 2602263 2527698 2526018 2526590 2448356 2437377
15189 2437377 2474154 2487138 2442382 2466525 2487893 2501064 2569319 2480916 2486604 2499054 2445529
15178 2445529 2499840 2570022 2616103 2702195 2613851 2456735 2470077 2498864 2470006 2521558 2495541
15167 2495541 2563526 2430776 2300778 2384262 2573310 2598144 2522828 2544170 2513290 2496523 2478814
15156 2478814 2556929 2618641 2531388 2426280 2392463 2450643 2545575 2608861 2544727 2495231 2493471
15145 2493471 2379023 2402773 2536451 2621303 2638437 2555805 2509921 2625510 2681055 2590450 2534328
15134 2534328 2527347 2518555 2436533 2437745 2506208 2654368 2636214 2666609 2624094 2525541 2578585 2553296
15122 2553296 2514251 2567259 2554858 2537295 2540602 2466185 2570513 2579603 2480412 2398959 2298398
15111 2298398 2297099 2379782 2388435 2501708 2527298 2536673 2507255 2467444 2501738 2494533 2498885 2492270
15099 2492270 2485879 2371330 2404172 2440180 2497426 2519078 2478158 2436337 2418329 2494215 2503220
15088 2503220 2498959 2434569 2444410 2537861 2563998 2587782 2565012 2540348 2454432 2445665 2471076 2478678
15076 2478678 2439939 2420388 2523263 2530067 2510695 2500387 2469249 2431370 2418440 2462540 2473747
15065 2473747 2528167 2502852 2417865 2426211 2463142 2518056 2562716 2494646 2425505 2437628 2377171
15054 2377171 2381564 2388114 2418860 2416481 2401979 2390806 2514179 2486971 2402390 2432738 2435318 2379833
15042 2379833 2386017 2473804 2513056 2359067 2457964 2495292 2299422 2240190 2388948 2516492 2452463
15031 2452463 2470865 2574354 2596730 2504285 2566322 2553385 2549357 2586586 2611015 2563432 2461303
15020 2461303 2495951 2629275 2521402 2561598 2608546 2629218 2539296 2504482 2591642 2656248 2619813
15009 2619813 2613809 2712804 2695069 2693253 2715332 2692637 2620360 2578851 2601637 2613495 2587535 2721785
14997 2721785 2806608 2729273 2680723 2628901 2567277 2581573 2594739 2673543 2668936 2540191 2570638
14986 2570638 2610322 2588464 2541228 2560709 2575547 2520621 2539800 2578963 2628309 2578458 2543971
14975 2543971 2543302 2496494 2539717 2639033 2611651 2533428 2465604 2507304 2546202 2490099 2623637
14964 2623637 2673565 2537549 2467354 2405615 2454659 2504066 2508958 2571234 2571557 2453690 2529868
14953 2529868 2564821 2609776 2564276 2574700 2601050 2508858 2451163 2571716 2619590 2594086 2573418
14942 2573418 2514732 2467227 2497725 2599554 2690646 2658339 2538346 2558470 2514889 2486627 2552258
14931 2552258 2546024 2552024 2638276 2586364 2591346 2606796 2576847 2688488 2712911 2557049 2594360
14920 2594360 2665670 2657913 2658141 2676909 2590613 2587930 2552631 2603602 2739892 2708913 2605755 2608559
14908 2608559 2567682 2475496 2548012 2665033 2766815 2713084 2594521 2579905 2599651 2643845 2706219
14897 2706219 2588249 2523238 2524794 2527340 2538668 2696032 2721279 2632885 2604130 2565321 2553779
14886 2553779 2607099 2532445 2546125 2566064 2525288 2537556 2559219 2536748 2580130 2594999 2516532
14875 2516532 2508577 2493378 2587322 2574444 2584753 2566477 2602836 2545816 2534302 2661914 2614113
14864 2614113 2473400 2482979 2482118 2625442 2586547 2661939 2672436 2596432 2623835 2606280 2649444
14853 2649444 2565484 2612320 2611760 2541795 2539281 2640761 2671733 2602551 2621146 2576523 2529789 2495704
14841 2495704 2463185 2552025 2452224 2533775 2519769 2548467 2593307 2566154 2620044 2589472 2637091
14830 2637091 2533517 2546216 2561383 2547075 2487961 2533962 2585433 2603133 2634815 2609178 2486048
14819 2486048 2457016 2452026 2498485 2571081 2612306 2584583 2598868 2516928 2486994 2568106 2506362
14808 2506362 2539161 2493798 2411750 2407426 2510153 2601190 2593010 2583360 2518420 2499127 2478222 2554737
14796 2554737 2592286 2522843 2554411 2515742 2529439 2622856 2522971 2583937 2590011 2444908 2431130
14785 2431130 2510870 2591933 2625535 2705727 2632424 2645744 2637610 2661920 2593978 2611409 2556027
14774 2556027 2557869 2498720 2562122 2677795 2674771 2546000 2598788 2614517 2575333 2611579 2648228
14763 2648228 2664683 2579329 2575512 2517552 2628655 2732846 2753464 2742735 2661326 2621733 2642707
14752 2642707 2533820 2632371 2619224 2696642 2728167 2630963 2631447 2549616 2577996 2543397 2585499
14741 2585499 2537697 2566495 2608205 2581744 2664521 2665220 2693873 2581594 2587511 2543593 2504848 2635946
14729 2635946 2639299 2651085 2694326 2668128 2735415 2724101 2669082 2703876 2719171 2612938 2539858
14718 2539858 2594344 2640874 2685348 2634022 2725971 2761314 2729313 2674698 2600729 2505212 2542409
14707 2542409 2693463 2788599 2754659 2789505 2630104 2680709 2570091 2605446 2821566 2774698
14697 2774698 2631499 2675712 2725117 2729187 2747594 2651252 2680955 2660629 2622586 2643661 2566572
14686 2566572 2559980 2641282 2503575 2521254 2607427 2779274 2652332 2598559 2604197 2614973 2554451
14675 2554451 2564629 2737557 2763935 2709593 2682359 2726300 2755456 2735134 2664006 2499030 2523398
14664 2523398 2668200 2758958 2784565 2611582 2599748 2620761 2657098 2647620 2747122 2743380 2651171
14653 2651171 2625589 2623859 2669008 2728426 2659846 2523526 2574600 2593675 2607976 2665352 2728294
14642 2728294 2685633 2623535 2605134 2753000 2816735 2801396 2733946 2672843 2654629 2749006 2825059
14631 2825059 2774192 2711422 2689556 2599160 2615773 2642056 2811335 2852912 2756867 2669188 2730644
14620 2730644 2808772 2811933 2808035 2810391 2705324 2679917 2648866 2798657 2820682 2778523 2737287
14609 2737287 2584093 2612785 2758986 2835311 2821970 2798024 2759451 2668926 2627260 2696111 2800579
14598 2800579 2734541 2649475 2618377 2713845 2756002 2674553 2777551 2747520 2782326 2711588 2763934
14587 2763934 2769558 2802518 2738772 2735264 2690651 2712128 2767539 2733952 2685830 2695409 2664669 2614978
14575 2614978 2632521 2729590 2776766 2734705 2601461 2591951 2664792 2654353 2617499 2565845 2600917
14564 2600917 2589869 2672650 2692775 2762567 2793803 2649947 2602102 2625963 2567404 2673486 2626937
14553 2626937 2520655 2638085 2666805 2690383 2715669 2690346 2682668 2687207 2517876 2665986 2815536
14542 2815536 2860083 2705218 2681766 2644994 2664313 2651316 2780904 2791012 2660508 2627452 2650573
14531 2650573 2659382 2653917 2773832 2698375 2575880 2648037 2768381 2766701 2728809 2699279 2765076
14520 2765076 2631515 2629352 2807649 2867990 2743641 2546442 2644143 2669163 2673046 2766708 2749249
14509 2749249 2772258 2575804 2689039 2723009 2604811 2588738 2665858 2680541 2695722 2758361 2750187
14498 2750187 2704263 2691905 2782378 2805013 2712250 2694007 2793325 2740286 2686479 2739905 2804683
14487 2804683 2740505 2754383 2815045 2795871 2719257 2696846 2729633 2674529 2734150 2747888 2813228
14476 2813228 2880934 2844710 2816181 2725106 2709810 2757338 2735344 2659081 2684570 2738453 2734600
14465 2734600 2685664 2661512 2696945 2744840 2746038 2691485 2663915 2677272 2763599 2715716 2726140
14454 2726140 2716600 2612610 2613776 2636715 2727275 2786226 2668004 2621271 2655280 2629341 2656635
14443 2656635 2759938 2816054 2808572 2716210 2721000 2605982 2587834 2678265 2706517 2705605 2653393 2615365
14431 2615365 2591307 2634975 2607567 2759303 2673475 2491696 2541952 2654277 2618663 2639029 2717281
14420 2717281 2773176 2783408 2757562 2759383 2715670 2707361 2731809 2726379 2633406 2707575 2779820 2850805
14408 2850805 2803086 2820717 2878831 2745451 2586050 2757691 2806202 2776928 2786976 2909574
14398 2909574 2952459 2829759 2786164 2820502 2775815 2740996 2808796 2823428 2780075 2717033 2812594
14387 2812594 2792322 2840032 2889993 2782631 2718148 2717550 2880128 2879825 2846968 2743713 2682981
14376 2682981 2643440 2689831 2732976 2822664 2830127 2743659 2669387 2709400 2748759 2772342 2792562
14365 2792562 2746049 2746364 2768485 2833343 2759824 2775832 2782287 2771134 2667011 2701672 2810066
14354 2810066 2844890 2722633 2721189 2822364 2873847 2836405 2876781 2898457 2842089 2735909 2757725
14343 2757725 2782099 2922947 2894795 2865745 2851346 2848140 2929852 2920900 2917146 2803311 2832750
14332 2832750 2858631 2809041 2855517 2888526 2898095 2722789 2672232 2715363 2825312 2870242 2846392
14321 2846392 2840576 2910099 2863374 2867659 2884483 2906864 2844625 2753383 2710205 2793310 2864963 2897982
14309 2897982 2865603 2836104 2808439 2740152 2720651 2732919 2807304 2818784 2836616 2672314 2679535
14298 2679535 2795797 2806677 2780924 2731595 2811931 2729403 2658979 2755781 2837375 2859626 2755826
14287 2755826 2827942 2773701 2771627 2912451 2988961 2903055 2793754 2905129 2784853 2817902 2930636
14276 2930636 2944287 2886464 2706635 2760014 2822973 2891945 2839057 2874670 2824150 2784360 2835796
14265 2835796 2794016 2877342 2969985 2942178 2924825 2783968 2825269 2930376 2992170 2801181 2797513
14254 2797513 2894305 2754338 2713904 2832022 2943494 2888719 2780737 2809761 2799181 2794725 2819087
14243 2819087 2874539 2874484 2801089 2763975 2745351 2744509 2893667 2901583 2801052 2734525 2668510 2657194
14231 2657194 2707723 2739642 2840222 2836260 2744345 2686456 2704609 2771514 2844352 2833421 2795997
14220 2795997 2665523 2603584 2645421 2762239 2857207 2796971 2748062 2626853 2653538 2783676
14210 2783676 2864855 2861669 2791140 2758791 2732148 2733722 2801136 2845210 2831787 2783473 2723864 2695725
14198 2695725 2787957 2756537 2770982 2782316 2796027 2803441 2807803 2885254 2939036 2817320 2826521 2810968
14186 2810968 2740709 2794613 2869373 2838720 2775665 2763695 2730722 2766196 2885787 2970361 2909826
14175 2909826 2769526 2765269 2790259 2831299 2822793 2856026 2858173 2829353 2791360 2810834 2833519 2824069
14163 2824069 2776074 2738471 2725341 2706313 2799062 2831549 2743170 2735972 2704844 2755547 2804179
14152 2804179 2822929 2867399 2780539 2761017 2767978 2722487 2704312 2716404 2781311 2809446 2806025 2767337
14140 2767337 2782421 2742139 2723262 2729456 2729736 2878340 2860307 2885641 2905748 2821568 2807632 2833725
14128 2833725 2852791 2823915 2853843 2791491 2851888 2802533 2798336 2822619 2764014 2767861 2833716 2849678
14116 2849678 2809155 2865964 2870740 2868280 2909896 2927799 2975394 3012360 2911414 2884789 2818182
14105 2818182 2832985 2822194 2870329 2926331 2939532 2826821 2835131 2835918 2917419 3006573 2951564 2875544
14093 2875544 2905025 2979251 2942629 2961267 2976140 2939495 2895722 2858104 2893427 3008242 3055287
14082 3055287 2935226 2878100 2843787 2793196 2850648 2920712 2949168 2982651 2961035 2845403 2792124
14071 2792124 2788408 2870309 2991523 2981075 2947760 2899968 2810768 2829357 2872930 3057677 3004237
14060 3004237 3012746 2869683 2876960 2870992 2845094 2948020 2928535 2892927 2899751 2835132 2865749 2999231
14048 2999231 3012197 2974153 2907259 2826584 2753732 2919427 2893217 2875531 2871785 2837906 2753068
$$ [...]
##END NTUPLES=NMR SPECTRUM
##END=
