##TITLE=1H_CA-8802-21-2
 CDCl3,8 sc, 
 4.02.2021
##JCAMPDX= 6.0         $$ Bruker NMR JCAMP-DX V2.0
##DATA TYPE= NMR SPECTRUM
##DATA CLASS= NTUPLES
##ORIGIN= UXNMR, Bruker Analytische Messtechnik GmbH
##OWNER= root
$$ XWIN-NMR		Version 3.5
$$ Thu Feb  4 10:05:43 2021 Russian Standard Time (UT+4h)  she@DPX200
##.OBSERVE FREQUENCY= 200.1315066352
##.OBSERVE NUCLEUS= ^1H
##.ACQUISITION MODE= SIMULTANEOUS
##.ACQUISITION SCHEME= undefined
##.AVERAGES= 8
##.DIGITISER RES= 18
##SPECTROMETER/DATA SYSTEM= spect
##.PULSE SEQUENCE= zg30
##.SOLVENT NAME= D2O
##.SHIFT REFERENCE= (INTERNAL, D2O, 0, 15.9823)
##AUDIT TRAIL= $$ (NUMBER, WHEN, WHO, WHERE, WHAT)
$$ ##TITLE= Audit trail, XWIN-NMR		Version 3.5
$$ ##JCAMPDX= 5.01
$$ ##ORIGIN= Bruker BioSpin GmbH
$$ ##OWNER= she
$$ F:/spectra/data/she/nmr/H-F/1/pdata/1/auditp.txt
$$ ##AUDIT TRAIL=  $$ (NUMBER, WHEN, WHO, WHERE, WHAT)
(   1,<2021-02-04 10:04:35.57 +0400>,<she>,<DPX200>,
      <created by zg, POWCHK disabled, PULCHK disabled
       configuration hash MD5:
       00 E9 B6 7A A2 85 ED C7 34 08 36 98 17 FE 4E 26
       data hash MD5: 16K
       7B BD C2 4D 67 61 E1 36 C6 E4 B7 52 26 F7 EB 3E>)
(   2,<2021-02-04 10:04:37.98 +0400>,<she>,<DPX200>,
      <Start of raw data processing
       efp BC_mod = 2 LB = 0.24 FT_mod = 6 PKNL = 1 PHC0 = -10392.01 PHC1 = 3.600952 SI = 16K 
       data hash MD5: 16K
       D2 04 E7 97 3A A8 F9 1D 79 A5 62 52 B0 91 FF E4>)
(   3,<2021-02-04 10:04:53.84 +0400>,<she>,<DPX200>,
      <pk PHC0 = -4.483485 PHC1 = 6 
       data hash MD5: 16K
       AC 31 8A 9E 57 55 F4 36 4A BD F3 AB 8F AD AB F2>)
(   4,<2021-02-04 10:04:56.84 +0400>,<she>,<DPX200>,
      <abs ABSG = 5 
       data hash MD5: 16K
       C0 05 03 20 0F D9 77 6F A3 3D F2 EA C8 6E DA 07>)
$$ ##END=
$$ 
$$ hash MD5
$$ C3 36 A7 89 FB 4B 56 3D 84 EF 49 39 04 1E B7 60
##$RELAX= 
##$RELAX= 
##$RELAX= 
##$RELAX= 
##$RELAX= 
##$RELAX= 
$$ Bruker specific parameters
$$ --------------------------
##$DU= <F:/spectra>
##$EXPNO= 1
##$NAME= <H-F>
##$PROCNO= 1
##$TYPE= <nmr>
##$USER= <she>
##$AMP= (0..31)
100 100 100 100 100 100 100 100 100 100 100 100 100 100 100 100 100 100 
100 100 100 100 100 100 100 100 100 100 100 100 100 100 
##$AQSEQ= 0
##$AQ_mod= 1
##$AUNM= <au_zg>
##$AUTOPOS= <>
##$BF1= 200.13
##$BF2= 200.13
##$BF3= 200.13
##$BF4= 200.13
##$BF5= 200.13
##$BF6= 200.13
##$BF7= 200.13
##$BF8= 200.13
##$BYTORDA= 1
##$CFDGTYP= 0
##$CFRGTYP= 5
##$CHEMSTR= <none>
##$CNST= (0..31)
1 1 145 1 1 1 1 1 1 1 1 1 1 1 1 1 1 1 1 1 1 1 1 1 1 1 1 1 1 1 1 1 
##$CPDPRG= <>
##$CPDPRG1= <>
##$CPDPRG2= <>
##$CPDPRG3= <>
##$CPDPRG4= <mlev>
##$CPDPRG5= <mlev>
##$CPDPRG6= <mlev>
##$CPDPRG7= <mlev>
##$CPDPRG8= <mlev>
##$CPDPRGB= <>
##$CPDPRGT= <>
##$D= (0..31)
0 1.2 0 0 0 0 0 0 0 0.06 0 0.03 0 0 0 0 0.0002 0 0 0 0 0 0 0 0 0 0 0 0 
0 0 0 
##$DATE= 1612418675
##$DBL= (0..7)
120 120 120 120 120 120 120 120 
##$DBP= (0..7)
150 150 150 150 150 150 150 150 
##$DBP07= 0
##$DBPNAM0= <>
##$DBPNAM1= <>
##$DBPNAM2= <>
##$DBPNAM3= <>
##$DBPNAM4= <>
$$ [...]
##$SUBNAM3= <"">
##$SUBNAM4= <"">
##$SUBNAM5= <"">
##$SUBNAM6= <"">
##$SUBNAM7= <"">
##$SUBNAM8= <"">
##$SUBNAM9= <"">
##$SW= 16.9725356469052
##$SWIBOX= (0..15)
0 0 2 0 0 0 0 0 0 0 0 0 0 0 0 0 
##$SW_h= 3396.73913043478
##$TD= 16384
##$TD0= 1
##$TE= 0
##$TE2= 300
##$TE3= 300
##$TEG= 300
##$TL= (0..7)
0 120 120 120 120 120 120 120 
##$TP= (0..7)
150 150 150 150 150 150 150 150 
##$TP07= 0
##$TPNAME0= <>
##$TPNAME1= <>
##$TPNAME2= <>
##$TPNAME3= <>
##$TPNAME4= <>
##$TPNAME5= <>
##$TPNAME6= <>
##$TPNAME7= <>
##$TPOAL= (0..7)
0.5 0.5 0.5 0.5 0.5 0.5 0.5 0.5 
##$TPOFFS= (0..7)
0 0 0 0 0 0 0 0 
##$TUNHIN= 0
##$TUNHOUT= 0
##$TUNXOUT= 0
##$USERA1= <user>
##$USERA2= <user>
##$USERA3= <user>
##$USERA4= <user>
##$USERA5= <user>
##$V9= 5
##$VALIST= <valist>
##$VCLIST= <CCCCCCCCCCCCCCC>
##$VD= 0
##$VDLIST= <DDDDDDDDDDDDDDD>
##$VPLIST= <PPPPPPPPPPPPPPP>
##$VTLIST= <TTTTTTTTTTTTTTT>
##$WBST= 1024
##$WBSW= 4
##$XGAIN= (0..3)
0 0 0 0 
##$XL= 0
##$YL= 0
##$YMAX_a= 507774
##$YMIN_a= -232718
##$ZGOPTNS= <>
##$ZL1= 120
##$ZL2= 120
##$ZL3= 120
##$ZL4= 120
##$ABSF1= 16.02582
##$ABSF2= -0.9468441
##$ABSG= 5
##$ABSL= 3
##$ALPHA= 0
##$AQORDER= 0
##$ASSFAC= 0
##$ASSFACI= 0
##$ASSFACX= 0
##$ASSWID= 0
##$AUNMP= <proc_1d>
##$AZFE= 0.1
##$AZFW= 0.1
##$BCFW= 0
##$BC_mod= 2
##$BYTORDP= 0
##$COROFFS= 0
##$CY= -3
##$DATMOD= 1
##$DC= 0
##$DFILT= <>
##$DTYPP= 0
##$F1P= 0
##$F2P= 0
##$FCOR= 1
##$FTSIZE= 16384
##$FT_mod= 6
##$GAMMA= 0
##$GB= 0
##$INTBC= 1
##$INTSCL= 2.992141e-10
##$ISEN= 128
##$LB= 0.24
##$LEV0= 0
##$LPBIN= 0
##$MAXI= 10000
##$MC2= 0
##$MEAN= 0
##$ME_mod= 0
##$MI= 1.114404
##$NCOEF= 0
##$NC_proc= -5
##$NLEV= 6
##$NOISF1= 3.799351
##$NOISF2= 2.8
##$NSP= 0
##$NTH_PI= 0
##$NZP= 0
##$OFFSET= 15.98232
##$PC= 1
##$PHC0= -10396.49
##$PHC1= 9.600952
##$PH_mod= 1
##$PKNL= yes
##$PPARMOD= 0
##$PSCAL= 0
##$PSIGN= 0
##$REVERSE= no
##$SF= 200.13000646376
##$SI= 16384
##$SIGF1= 3
##$SIGF2= 2
##$SINO= 5.538805
##$SIOLD= 16384
##$SREGLST= <1H.CDCl3>
##$SSB= 0
##$STSI= 16384
##$STSR= 0
##$SW_p= 3396.73913043478
##$SYMM= 0
##$S_DEV= 0
##$TDeff= 16384
##$TDoff= 0
##$TI= <>
##$TILT= no
##$TM1= 0
##$TM2= 0
##$TOPLEV= 0
##$USERP1= <user>
##$USERP2= <user>
##$USERP3= <user>
##$USERP4= <user>
##$USERP5= <user>
##$WDW= 1
##$XDIM= 16384
##$YMAX_p= 391723889
##$YMIN_p= -179803
$$ End of Bruker specific parameters
$$ ---------------------------------
##NTUPLES= NMR SPECTRUM
##VAR_NAME=  FREQUENCY,     SPECTRUM/REAL,   SPECTRUM/IMAG
##SYMBOL=    X,             R,               I
##VAR_TYPE=  INDEPENDENT,   DEPENDENT,       DEPENDENT
##VAR_FORM=  AFFN,          ASDF,            ASDF
##VAR_DIM=   16384,         16384,           16384
##UNITS=     HZ,            ARBITRARY UNITS, ARBITRARY UNITS
##FACTOR=    0.207333158178281, 1,           1
##FIRST=     3198.54177125365, 0,            0
##LAST=      -198.197359181131, 0,           0
##MIN=       -198.197359181131, -179803,     0
##MAX=       3198.54177125365, 391723889,    0
$$ Real data points
##PAGE= N=1
##DATA TABLE= (X++(R..R)), XYDATA
$$ [...]
6201B251359K924J3546R94m5989j9216o9936j13476n3096J7443l7560l7958n406
6189A903629r411q9335k0975J4147o7120r0631p145m1542p018l5845m3642o7387
6177A437725o0561L2567l134k8792q9183l7828r793n314M4033k2461q6971l5091
6165A135197n6063J5839l9772M7408L5253J5473L2051L8601q619j5342K1015o608
6153A214433L3070L3057N4590J06236J02546J81290J77703J41190K07218J17449
6143B368782p1597k14349k94169k62660j84804j66310p3410q6965j06363k4321
6133H83834n7176m8222n4314n4473R383L723m5200J1600J5015l8259M1271K955
6121F70137l0154L787k5440k8107j1205r2162J6585n7502O200L1477n7439K0914
$$ y = [2251359, 2254283, 2267829, 2268823, 2222834, 2203618, 2133682, 2020206, 1967110, 1984553, 1946993, 1909035, 1903629, 1894218, 1804883, 1783908, 1798055, 1730935, 1640304, 1633159, 1591617, 1584599, 1548754, 1505112, 1437725, 1377164, 1409731, 1406597, 1377805, 1288622, 1250794, 1241001, 1235687, 1279720, 1257259, 1170288, 1135197, 1079134, 1094973, 1055201, 1102609, 1137862, 1153335, 1185386, 1223987, 1215368, 1200026, 1221041, 1214433, 1247503, 1280560, 1335150, 1441386, 1543932, 1725222, 1902925, 2044115, 2251333, 2368782, 2297185, 2082836, 1788667, 1526007, 1341203, 1174893, 1101483, 1014518, 908155, 883834, 826658, 778436, 724122, 669649, 679032, 682755, 637555, 649155, 664170, 625911, 667182, 670137, 639983, 643770, 618330, 590223, 579018, 486856, 503441, 445939, 452139, 483616, 426177, 447091]
6109D47091k7035J5616O21p347J7267K6957k8534n4094R457l3121n6943j7302
6097B92633N7731L0861m9243l9063l805n9809M3886K0081j320J0753J7793N489
6085C25987m3883K9266j1000j0433k7823l3721L1324K1567O674L4275m7335J8037
6073B92935J2417r4276O580K5345J3391M765L2200L2874l8051K1371j4946m147
6061B90458l710j55l8572J5864k6545k6767K9156l3181o21M5304N1331j6188l7249
6048B49125M256k903n3571l1736L6880j0349p5859m2952K3088J5705L5848K0101
6036A67633m5019J5661j1230J8825O844j5939l7729K0183O2422J0039m7494l54
6024A43842O3763k8358O3021L0572l5147K5762j5481j0854q0543k8523R557K6101
$$ y = [447091, 420056, 435672, 436293, 428946, 446213, 473170, 444636, 390542, 399999, 366878, 309935, 292633, 350364, 381225, 331982, 292919, 289114, 229305, 273191, 293272, 291952, 302705, 320498, 325987, 282104, 311370, 300370, 289937, 262114, 228393, 259717, 281284, 287958, 322233, 274898, 292935, 305352, 211076, 217656, 243001, 256392, 261157, 293357, 326231, 288180, 309551, 294605, 290458, 286748, 286593, 248021, 263885, 237340, 210573, 239729, 206548, 205927, 251231, 302562, 286374, 249125, 253381, 250478, 196907, 165171, 202051, 191702, 115843, 72891, 95979, 111684, 147532, 167633, 122614, 138275, 127045, 145870, 152714, 136775, 99046, 119229, 181651, 191690, 144196, 143842, 207605, 179247, 242268, 272840, 237693, 263455, 247974, 237120, 156577, 128054, 137611, 163712]
6012A63712j7471L222j8014P855l0995j941m2493P7925N1040m349k3052n4722
6000A10717L1923m3722k616L3254J2680J5194J2637j5614q4965J3274M9860M5307
5988A77929K132o2076l3621J4585M9836o8343j730L1889N8837m1348k7426m2734
5976E7930j8813P7734l7944J3679M4752m4013o265J2172N5310K3223r937m6569
5964A21259k1621p936N1425K0310j2437o4329k0904L8981j976j0064p019J3042
5952I8731l8668P983P947k287N9092N183J55l3287J7473l3119J474l5192O6814
5939A22299J3776j7746l9661M0972K7929p8436P190K9337Q618N1589m7803m4831
5927G3233q408j0704K9885R8923o3730r1169O5157j6599K5209J6601J631l685
$$ y = [163712, 146241, 149463, 131449, 139304, 108309, 106368, 63875, 141800, 192840, 188491, 165439, 110717, 142640, 98918, 96302, 129556, 142236, 157430, 170067, 154453, 69488, 82762, 132622, 177929, 180061, 117985, 84364, 98949, 148785, 80442, 78712, 110601, 169438, 128090, 100664, 57930, 39117, 116851, 78907, 92586, 137338, 93325, 87060, 99232, 154542, 177765, 167828, 121259, 99638, 91702, 143127, 163437, 151000, 86671, 65767, 104748, 102772, 92708, 85689, 98731, 60063, 68046, 75993, 73706, 132798, 137981, 138136, 104849, 122322, 89203, 90677, 55485, 122299, 136075, 118329, 78668, 119640, 147569, 69133, 76323, 105660, 114278, 165867, 118064, 73233, 64825, 54121, 84006, 182929, 119199, 28030, 93187, 76588, 101797, 118398, 120029, 116344]
5915A16344M5711L8253J1102j9920k6941P402k8974l1404K8849l4557J1579k5307
5903I2137K723M1755J0867n6741j544J6652Q294o000j4501j3615K1893q197J6387
5890A10110L1839p2343k0228L5058N9962M2082k9122k2862R584K9396j7880L487
5878A59083J2649L9189l1324K8561n3598k6731L813L2696K4701L0200j2669l490
5866B03080p722k7284O6536n96O2414J1674K0451M2822N1430N6911O3220P4758
5854F17694k352L3064m6413M9683m5324p5357j3181j41161n5649k3594q3879J7574
5842B31105j85Q63j8158n0265k120K471M5190P512r6516K734O044K2005O469m0431
5828A16718M7487k9208o9555J9930R965M276M3310o7247k3733K8008Q197j5568
$$ y = [116344, 162055, 200308, 211410, 191490, 164549, 171951, 142977, 111573, 140422, 105865, 117444, 92137, 94860, 136615, 147482, 90741, 89197, 105849, 114143, 108143, 93642, 80027, 101920, 93723, 110110, 141949, 69606, 49378, 84436, 144398, 186480, 157358, 134496, 144080, 173476, 155596, 159083, 171732, 210921, 179597, 208158, 154560, 127829, 131642, 164338, 189039, 219239, 206570, 203080, 195358, 168074, 234610, 234014, 296428, 308102, 328553, 371375, 422805, 479716, 542936, 617694, 615342, 648406, 601993, 651676, 606352, 530995, 517814, 376653, 321004, 297410, 213531, 231105, 230920, 231783, 213625, 163360, 161240, 163711, 208901, 216413, 119897, 122631, 128675, 150680, 157149, 116718, 164205, 134997, 65442, 85372, 95337, 99613, 142923, 75676, 51943, 79951, 88148, 72580]
5816G2580M235J630M5336J4777j0331o0506k9589L7765o4620l770O7924K531j8107
5803E9855J4270M0087n936L877n2505j1143J6973l2715q689P4249K7335l1707
5791I3951l9416K0982k0539M4209K7461n2219K4300N0184J8042k811n1162j2343
5779A00639K5439J9233l1965l1148K4558l8176O4028K4948m9608L1278j7414r608
5767A12204j126j6470n459M2151p599k7773k9418J1314L3321K2218j9Q294n9000
5754H2638K8021L1605j4577m220K5281l334l7884K3473q164J7567L6725l176K3370
5741A97325k5605m9044M3623l2428j8044L5959L2769L6785n180k8881K651J7162
5729B07092J3513P480j100M9673K0736o4093K3667N0605o6164L9247R565j2578
$$ y = [72580, 76815, 78445, 123781, 138558, 128227, 67721, 38132, 75897, 11277, 7507, 75431, 77962, 59855, 74125, 114212, 108276, 112153, 59648, 48505, 65478, 32763, 24074, 98323, 125658, 93951, 54535, 75517, 54978, 99187, 126648, 74429, 98729, 148913, 166955, 164144, 112982, 100639, 126078, 145311, 113346, 82198, 106756, 68580, 132608, 157556, 107948, 139226, 121812, 112204, 111078, 94608, 89149, 131300, 123701, 95928, 66510, 77824, 111145, 133363, 133344, 141638, 82638, 110659, 142264, 127687, 123467, 148748, 145414, 107530, 131003, 122839, 140406, 177131, 173955, 197325, 171720, 122676, 166299, 133871, 115827, 151786, 184555, 221340, 216160, 187279, 189930, 207092, 220605, 228085, 226985, 276658, 297394, 233301, 256968, 307573, 241409, 280656, 290221, 277643]
5717B77643L0164J0562J4650O055M042j9324j4930k4348q455m388L7298K5628
5705C34597j01j9863L2023j2983o6191K157K0418R6017K4853J5948Q8419p132
5693E08162r590M399J771J3872L1465L82p868K9071r613j00434k8435J9971j3225
5680D39928n4856O8377K8671J3173N9939N575l4318K0426m7144M6165N1426Q6909
5668F84271O890J2931m0894l5083K6534l3498k201n1744K4142O2053k6771k8971
5656E97659k3239K0768M8910j790q1155K9370M0263L9803o186L029n9518n3452
5644E54462m8453j9567N0560L808N456m6041m5989k8206k1144m9736J2327N4638
5632D22115K9820P1781O3068Q9775o875m9895K1940q2641n7407m5375j2565k2431
$$ y = [277643, 307807, 318369, 333019, 339074, 343116, 323792, 308862, 284514, 276059, 271671, 308969, 334597, 334496, 314633, 346656, 333673, 267482, 269639, 290057, 386074, 410927, 426875, 515294, 508162, 498572, 502971, 504742, 518614, 550079, 550461, 542593, 571664, 562051, 461617, 433182, 453153, 439928, 385072, 453449, 482120, 495293, 555232, 560807, 526489, 546915, 499771, 545936, 597362, 684271, 691161, 704092, 663198, 628115, 654649, 621151, 618950, 567206, 591348, 653401, 626630, 597659, 574420, 595188, 644098, 642308, 561153, 590523, 630786, 670589, 664403, 667432, 607914, 554462, 506009, 486442, 537002, 540810, 546266, 500225, 454236, 426030, 404886, 355150, 367477, 422115, 451935, 523716, 586784, 676559, 669684, 619789, 641729, 559088, 501681, 456306, 443741, 421310]
5620D21310n281q3004k1004M0268l6934o0545n24r455L3759L8802m7379m3801
5608B26212M6546m714L7017l3353J00660j7333k9699L873K8740o358o3316l2984
5596B55291q6648n909n5662o560L5591p905L0367j9761L0070l152J3751l4733
5584A44740K665R4211k0180l2944n953j6728N159j9607L247n6382Q434Q0925J7124
5571B04711K4122k4780m1678j4939L637j3542j2855M3363k2303k4626M0538J4597
5559A76245n7690K719j0737L211L6762k1243J2499l7807N7638r247J4143N4669
5547B21162j6178N738R783j1321l7016j3325N5809l0729j5285L5584J1195k1376
5535A94041N4541l8683n509M2660J7064p75R872k8778m532O2534r207K254k2222
$$ y = [421310, 416029, 333025, 312021, 352289, 315355, 254810, 254286, 244831, 278590, 317392, 270013, 226212, 272758, 268044, 305061, 271708, 372368, 355035, 325336, 329209, 357949, 351591, 288275, 255291, 168643, 162734, 107072, 100512, 136103, 128198, 158565, 138804, 168874, 165722, 179473, 144740, 147405, 241616, 221436, 188492, 182539, 165811, 170970, 151363, 154610, 98228, 106662, 187587, 204711, 228833, 204053, 162375, 147436, 151073, 137531, 124676, 168039, 145736, 121110, 161648, 176245, 118555, 121274, 110537, 113748, 150510, 129267, 141766, 103959, 161597, 152350, 166493, 221162, 204984, 210722, 220505, 209184, 172168, 158843, 214652, 183923, 168638, 204222, 215417, 194041, 248582, 209899, 204390, 247050, 264114, 263339, 273211, 244433, 239901, 302435, 293228, 295482, 273260]
5522B73260M194J5894j783k0254J8649L856k4251J1876O0895J8327L2172l6619
5510C56216j1800L4791m9764m8775o3061j7912J4132Q8083n2964l5524K4777k239
5498B35960p2263m4001J3052K415N1748N0403p655K2763m0239k5831K7835N4675
5486B68862Q705k4770j964M053J0120j3285J3241l1923j9938L2946J7077N757
5474B68881k5937N6564K9878J3389M9985J9649M0800m1982j08458p468K9455n2264
5462B72492M1020Q2374K5811K9732k7735j8834k1350j11719M4321K6600j3384
5451C29328j8180n7096k7727k3816M8030m291K1919J103K3810k8459l553j5154
5439B45914m1359n794K2418J7846n2427O0871J6244j5206L1298j5332m7045L3119
$$ y = [273260, 277454, 293348, 291565, 271311, 289960, 293816, 269565, 281441, 342336, 360663, 392835, 356216, 344416, 379207, 329443, 280668, 217607, 199695, 213827, 301910, 248946, 213422, 238199, 235960, 163697, 119696, 132748, 135163, 186911, 237314, 229659, 252422, 212183, 186352, 214187, 268862, 277567, 252797, 250833, 254886, 265006, 251721, 264962, 233039, 213101, 246047, 263124, 268881, 242944, 299508, 329386, 342775, 392760, 412409, 453209, 411227, 302769, 295301, 324756, 272492, 313512, 395886, 421697, 451429, 423694, 404860, 383510, 271791, 316112, 342712, 329328, 311148, 254052, 226325, 202509, 250539, 246248, 268167, 269270, 293080, 264621, 261068, 245914, 204555, 198761, 221179, 239025, 186598, 247469, 263713, 248507, 279805, 264473, 217428, 250547]
5427B50547J703J2706K7415P411m5162O4835j4222J5365O884k2817M2027j761
5415C44931O753p733j4512K9409m3993K2990r349k9347l1895q844N8271j8793
5403B97888J621j3499N3661J0603n9507k812N3562K4903N193l594P953K7391q190
5390C95173k4930K571K9186K5432m3576K310K6267k2840q432M0195n345k8577
5378C87434J1387j8381R5331J7719j626n2883J0931M4183j1821l2767K5674Q3086
5366E58267J9599q23k1244L6086M2625P2969o434n0265N983j6935k8640J5351
5354F26539k9013K7778J4518O2348k6061l2250q855l8064M8853J11640O0501n511
5342H12423M4944L0204k2889L882N3011J11288J44533L2381o4283p6921q3509
$$ y = [250547, 252250, 264956, 292371, 299782, 254620, 319455, 305233, 320598, 327482, 304665, 346692, 344931, 351684, 343951, 329439, 358848, 314855, 337845, 328496, 299149, 267254, 258410, 316681, 297888, 299509, 286010, 339671, 350274, 290767, 287955, 341517, 366420, 371613, 368019, 375972, 403363, 395173, 370243, 372814, 402000, 427432, 383856, 386166, 412433, 389593, 381161, 421356, 416011, 387434, 398821, 380440, 475771, 493490, 491864, 438981, 449912, 494095, 482274, 449507, 475181, 558267, 577866, 577043, 555799, 591885, 634510, 707479, 701045, 650780, 656763, 639828, 611188, 626539, 597526, 625304, 639822, 702170, 676109, 643859, 635004, 596940, 645793, 757433, 817934, 812423, 857367, 887571, 864682, 868564, 921575, 1032863, 1177396, 1209777, 1145494, 1068573, 985064]
5331I85064p4277n5914K2990M430k8272l0078J5442j0614m5094N0206m778m4680
5319G84425P3010P7311q246N4091R9476q632o4028k6089k3073O4420O7184k973
5307A086876Q286K5520M6804J1295J17892N2487M0489J18819Q407J48230J70036
5296A835141R2785N3967R4236L3576q2617k03566j88414j06479k9817p0846o0058
5285A367908p4173j890k4948K3259L0822K1284J4156p7594N0986Q2847J17799
5274A530456J9423j2391J18K090J0020m466k5563N084N2476J0101j1427O1759
5262A637680M5569M3173K163R7905J06694Q7904Q8484J44234J66589P0232j14385
5251B376242j28822j12301n5626M903M719J4606l4485O121j4394O154M7754R2069
$$ y = [985064, 910787, 854873, 877863, 882293, 854021, 823943, 839385, 828771, 783677, 833883, 829105, 784425, 857435, 934746, 926500, 980591, 1080067, 1071435, 1007407, 981318, 958245, 1022665, 1089849, 1086876, 1095162, 1120682, 1167486, 1178781, 1296673, 1349160, 1389649, 1508468, 1516875, 1665105, 1835141, 1927926, 1981893, 2076129, 2109705, 2027088, 1823522, 1635108, 1528629, 1498812, 1427966, 1367908, 1293735, 1291845, 1266897, 1290156, 1320978, 1342262, 1356418, 1278824, 1329810, 1412657, 1530456, 1549879, 1537488, 1537606, 1539696, 1549716, 1545250, 1519687, 1524771, 1577247, 1587348, 1575921, 1637680, 1683249, 1726422, 1728585, 1826490, 1933184, 2021088, 2109572, 2253806, 2420395, 2490627, 2376242, 2247420, 2135119, 2079493, 2084396, 2089115, 2103721, 2069236, 2075357, 2060963, 2067117, 2114871, 2206940]
5239B206940L4395J9360L8877J4678J02673L6416J4669K9949M420M9185L514j9899
5227B535177L1976L6012O9929J3091p881M7375J09220K0705K6434J1351M0223
5216B933612M6424Q6782N8828J46690J42044P6253N8468O3344J43894P6702R3328
5205C926369J17801J37744J46234J88871J67389K66334K58843K19621K55219K77033
5195E961458K81312L38591L35723L99495L59423M76831N04205M92752O81929P88419
5185A0620138Q52891J051975J131947J275362J582589K062220K593644L242301
5177B4413067M079315M297588K856479n6918k912818l835693l038730j795502
5169B4006788r38858k09180N15549J320376K211128L059044L462181K127760q38267
$$ y = [2206940, 2241335, 2260695, 2299572, 2314250, 2416923, 2453339, 2468008, 2497957, 2502377, 2551562, 2555076, 2535177, 2567153, 2603165, 2673094, 2686185, 2678304, 2725679, 2834899, 2855604, 2882038, 2893389, 2933612, 2980036, 3066818, 3125646, 3272336, 3414380, 3490633, 3549101, 3612445, 3756339, 3833041, 3926369, 4044170, 4181914, 4328148, 4517019, 4684408, 4950742, 5209585, 5429206, 5684425, 5961458, 6242770, 6581361, 6917084, 7316579, 7676002, 8152833, 8657038, 9149790, 9831719, 10620138, 11473029, 12525004, 13656951, 14932313, 16514902, 18577122, 21170766, 24413067, 28492382, 32789970, 35646449, 35589531, 32676713, 28841020, 25802290, 24006788, 23067930, 22858750, 23374299, 24694675, 26905803, 29964847, 33427028, 35554788, 34716521]
5160C4716521l768275m978872m213874k942812k125065j510736j182494r93596
5152A3000797p61888n77693m50209l50566k10552j08825o543J12721K21545P6077
5142A0944864l59p983M1515J57181J91477K98004M10681M94299O37407P08315
5132A3875401P90916R87582J115873J302190J447346J688364K098631K726219
5124B6032522L445670M537000N499785N341037K834415j449379m722362n272556
5116C6246132l797430k109730r92953n4987R44691K013705L232087M201063M148366
5107D3830944J891795k327179n875890o713258n362163l657690k657791k144189
5099A6984579j743033j531343j239209r97012q37590p73802o02383n10206l98738
$$ y = [34716521, 30948246, 25969374, 21755500, 18812688, 16687623, 15176887, 13994393, 13000797, 12238909, 11661216, 11211007, 10860441, 10649889, 10541064, 10534521, 10647242, 10868787, 10944864, 10944505, 10936522, 10978037, 11135218, 11326695, 11624699, 12035380, 12529679, 13167086, 13875401, 14666317, 15653899, 16769772, 18071962, 19519308, 21207672, 23306303, 26032522, 29478192, 34015192, 39514977, 44856014, 47690429, 46241050, 41518688, 36246132, 32448702, 30338972, 29346019, 29291032, 30235723, 32249428, 35481515, 39682578, 43830944, 45722739, 43395560, 37519670, 30806412, 25444249, 21786559, 19128768, 16984579, 15241546, 13710203, 12470994, 11473982, 10636392, 9862590, 9260207, 8750001, 8351263]
5090H351263m10083m16616l63157k64510k33126k27164k10619k13784k13236j86521
5080E612447j79431j39910j08185j25325j34145j73726j02882o9131r2810j27479
5070D359423p1249l6919q5666p9339O207p120j11788q4920j9637j30587j20096
5059C618309p1177p7788p0958l6561m5116m9035r6663j5039J188l3881R130N6455
5047C188864J7503r5211j7110m763m8045k8200n7740j7807L5780m5157m5684o996
5035B875434p7791m4828r927o8520r9206j5464o4200p2387j0394k276L897j4397
5023B399941o2508k9728m9961l7805R68p7735r6059K3857L8620m0780J2738j1304
5011B070244l749m6171P703K0503j0299L6615k1491l6080m2130k8831P0285J2798
$$ y = [8351263, 7941180, 7524564, 7161407, 6896897, 6663771, 6436607, 6225988, 6012204, 5798968, 5612447, 5433016, 5293106, 5184921, 5059596, 4925451, 4751725, 4648843, 4579712, 4486902, 4359423, 4288174, 4251255, 4165589, 4086250, 4092457, 4085337, 3973549, 3888629, 3868992, 3738405, 3618309, 3547132, 3469344, 3398386, 3361825, 3316709, 3267674, 3171011, 3155972, 3157160, 3123279, 3132409, 3188864, 3206367, 3111156, 3094046, 3089283, 3041238, 3013038, 2955298, 2937491, 2973271, 2928114, 2882430, 2875434, 2797643, 2752815, 2742888, 2674368, 2575162, 2559698, 2495498, 2423111, 2412717, 2410441, 2414338, 2399941, 2337433, 2307705, 2257744, 2219939, 2220907, 2143172, 2047113, 2070970, 2109590, 2068810, 2081548, 2070244, 2066495, 2020324, 2028027, 2048530, 2038231, 2074846, 2053355, 2017275, 1975145, 1946314, 2016599, 2029397]
4999B029397O016l6778m5584J3121p801j5899R357P575l2382L2958O993j2581
4987A954392N7693K6975j1967j0456N2944j2789N3307O01m5183N549m1985M4729
4975B073810M4168K0500L2475k1511j9432j3435k236N1242K6922Q1029l3210L7277
4963B277599j6155K3804l0059m9736J1378N0689j5043J8062M1292J0697M5449
4952B367977p575M9411K2997q777N3190J40046R2445R5385k0425M873k3054j4910
4940B751583k6045j9789J2011m1236M4794j0121m805J0567J3310P4179J53564
4929B958012P1576Q2445N0680M2477J7168m3577l9726N7792R2132Q2541Q6840
4918C458360N4261O3311J8843O4868J25302J40565Q0032M9895J05918M6812Q7389
$$ y = [2029397, 2035413, 1998635, 1953051, 1966172, 1958371, 1942472, 1951829, 1959404, 1927022, 1959980, 1966973, 1954392, 2012085, 2039060, 2027093, 2016637, 2069581, 2056792, 2110099, 2110700, 2065517, 2071066, 2029081, 2073810, 2117978, 2138478, 2170953, 2149442, 2130010, 2116575, 2114339, 2165581, 2192503, 2273532, 2240322, 2277599, 2261444, 2285248, 2255189, 2205453, 2216831, 2267520, 2252477, 2270539, 2311831, 2322528, 2367977, 2360402, 2409813, 2432810, 2424033, 2477223, 2617269, 2709714, 2805099, 2784674, 2789547, 2766493, 2751583, 2725538, 2705749, 2717760, 2676524, 2721318, 2711197, 2706392, 2716959, 2730269, 2804448, 2958012, 3029588, 3112033, 3162713, 3205190, 3222358, 3178781, 3139055, 3196847, 3288979, 3371520, 3458360, 3512621, 3575932, 3594775, 3659643, 3784945, 3925510, 4005542, 4055437, 4161355, 4208167, 4295556]
4907D295556J57590J79189K42862K05080R0752P9457R5851Q5480J07091R4684
4897E633592P0701L3605K7917J7563p1521q4636p6818j24580r6937j38034n1406
4886E139446k9775l6773j01467L4160K2279m9072M5641K1732k1045L2806k3380
4875E034552j8668O2818j8224n9160n356j3016Q460j1157N4410Q3579M4401k2013
4863E140626K8017J4214Q5243J59573J32404J11612Q9807J77106J93192J52984
4853F284778J90325J17297J73923K28766J86838K42279K91684L79855L78873M08196
4843H882814M80883O34824O80446O69774Q08440R68319J052204J248619J496407
4834A6922730J878781K424252L195133M085290M962315N130125L042442j220777
$$ y = [4295556, 4453146, 4632335, 4875197, 5080277, 5171029, 5250486, 5346337, 5431817, 5538908, 5633592, 5704293, 5737898, 5765815, 5783378, 5711857, 5627221, 5550403, 5425823, 5328886, 5190852, 5139446, 5109671, 5072898, 4971431, 5005591, 5027870, 4978798, 5024439, 5046171, 5025126, 5057932, 5034552, 5015884, 5078702, 5060478, 5001318, 4995962, 4982946, 4991406, 4980249, 5034659, 5118238, 5162639, 5140626, 5168643, 5182857, 5268100, 5427673, 5560077, 5671689, 5761496, 5938602, 6131794, 6284778, 6475103, 6592400, 6766323, 6995089, 7181927, 7424206, 7715890, 8095745, 8474618, 8882814, 9363697, 9998521, 10678967, 11348741, 12157181, 13125500, 14177704, 15426323, 16922730, 18801511, 21225763, 24420896, 28506186, 33468501, 38598626, 41641068, 40420291]
4826D0420291n015669n853358m652995l207199k224702j597630j223193j005204
4818A5640341n84753m22760k54451j00563J09460K91386L51110N27377P09398
4809A6266545Q17726J096323J334253J610635K186062K848655L711447M767340
4801C4638986N401224M220291L72675m257915o462564n852535m205796k870430
4793B0983936k100781j642196j240906q72550n42867l85627k22863j37593N6555
4784A3895108K12430L42620M58082O17742R06562J188716J656731K179260K957877
4775B4415128L575669L379411J411471j843361m240574m368435l254051k198545
4767A6876713j612005j152669q66260p09894n61139l39146j73168m9376K2598
$$ y = [40420291, 35404622, 29551264, 24898269, 21691070, 19466368, 17868738, 16645545, 15640341, 15055588, 14632828, 14378377, 14277814, 14387274, 14678660, 15029770, 15557147, 16266545, 17084271, 18180594, 19514847, 21125482, 23311544, 26160199, 29871646, 34638986, 40040210, 44260501, 44633176, 40375261, 33912697, 28060162, 23854366, 20983936, 18883155, 17240959, 16000053, 15127503, 14584636, 14199009, 13976146, 13838553, 13895108, 14107538, 14450158, 14908240, 15525982, 16432544, 17621260, 19277991, 21457251, 24415128, 27990797, 31370208, 32781679, 30938318, 26697744, 22329309, 19075258, 16876713, 15264708, 14112039, 13245779, 12535885, 11974746, 11635600, 11462432, 11413056, 11435654]
4758A1435654J15274L19853L06089M50304N89763P04913R47201J236409J583486
4749A7688946K234046K890148L650195L961091K594174o97557m072219n200018
4741B3048806m316684l054442k169322j578732j286906j069222q29543o27840
4733H116115n75988n21006m79827l44572l22073k92393k04991j83233k32757j91865
4723D767410j82663j62956j79804j18343j45151j66684j25188j22574j62264r0722
4713C311061m4728o8502r1119j27532j9885r0091o6231k7040m6350j7919j7667
4702B693997q7224k3506j19284m0741j1499p3043m1003j3109l4121p1132q5349
4691B093986o4286o474J1537r396n3322m2857m2491k9544k8985p9660n528N9238
$$ y = [11435654, 11550928, 11870781, 12176870, 12627174, 13216937, 13921850, 14869051, 16105460, 17688946, 19922992, 22813140, 26463335, 30424426, 33018600, 32321043, 28248824, 23048806, 18732122, 15677680, 13508358, 11929626, 10642720, 9573498, 8743955, 8116115, 7540127, 7019121, 6539294, 6194722, 5872649, 5580256, 5375265, 5192032, 4959275, 4767410, 4584747, 4421791, 4241987, 4123644, 3978493, 3811809, 3686621, 3564047, 3401783, 3311061, 3266333, 3197831, 3106712, 2979180, 2959295, 2869204, 2802973, 2775933, 2729583, 2711664, 2693997, 2606773, 2583267, 2463983, 2423242, 2411743, 2338700, 2297697, 2284588, 2250467, 2179335, 2093986, 2029700, 2023226, 2034763, 2025367, 1972045, 1929188, 1886697, 1857153, 1828168, 1748508, 1742980, 1802218]
4679A802218m7464p2280N2697j6299k8737J5031N1941O728p713L7655O3883J3777
4667A871437L5285Q5245M5521M6819J0603k5948o0743n5682p9738m6811r0330
4656A735658j06481l997J981o8491o081j5941J2795o144M2417l7772K215N7773
4644A607932J8098p001N5886R3963n043J6359j7818j0652K0017K3666j4660k971
4632A777776l0820k9378l2248O076n9061n0132j14349j2879m5872j1972j3318
4621A383823m1291j6202O126N983o8545O8828Q9645O6933K0877O5716K1752j1100
4609A592545j2888k8587O2734n3603j05096q7027m5579k7716k022q4063p3079
4598A135619j7472P6022K1338k768N5213p431k1319n2607J7353L8563L9571J08149
$$ y = [1802218, 1754754, 1682474, 1735171, 1718872, 1690135, 1705166, 1757107, 1763835, 1756122, 1793777, 1857660, 1871437, 1906722, 1991967, 2037488, 2084307, 2094910, 2068962, 2008219, 1952537, 1872799, 1825988, 1735658, 1629177, 1625180, 1627161, 1558670, 1552589, 1536648, 1549443, 1543299, 1585716, 1547944, 1550159, 1607932, 1626030, 1619029, 1674915, 1768878, 1763835, 1780194, 1762376, 1751724, 1771741, 1795407, 1780747, 1777776, 1746956, 1717578, 1685330, 1691406, 1632345, 1582213, 1467864, 1454985, 1409113, 1397141, 1383823, 1342532, 1326330, 1332456, 1338439, 1269894, 1338722, 1428367, 1495300, 1516177, 1581893, 1603645, 1592545, 1579657, 1551070, 1613804, 1560201, 1455105, 1368078, 1322499, 1294783, 1292761, 1208698, 1135619, 1118147, 1194169, 1215507, 1212739, 1267952, 1260521, 1239202, 1186595, 1203948, 1242511, 1282082, 1390231]
4586A390231K5425O3828n221n8314K1250o2297o222P1978l1697m6505l1004r0263
4574A241189Q9n692q9842n9359o608J4118M7060n0441K7458m2670l1746J5032
4562A058588K022K5588K7540r486J1971j2987o168o8539j4728p1244J8409L2061
4550I93027K9485k5359k8504J8736K1911k6884P660L4519j540Q930L6113K7047
4538A095141Q21O3403O4205L5699M7344P3138L9712J15538J69468J60419K19117
4527B084005J93806K635k83015k31361j27261j14188l6842J5680L6315n8076Q315
4516A490013J8783K0623N3919N454M4914J41955J51151J57931J72535K32814K00344
4505B690436Q4633o7915p6660K3689R156j07282k06354k27907j51401j19267l8831
$$ y = [1390231, 1415656, 1479484, 1474263, 1415949, 1437199, 1374902, 1368680, 1440658, 1408961, 1362456, 1331452, 1241189, 1241278, 1235586, 1145744, 1086385, 1079777, 1093895, 1140955, 1090514, 1117972, 1075302, 1043556, 1058588, 1060610, 1086198, 1113738, 1104252, 1116223, 1103236, 1097068, 1028529, 1013801, 942557, 960966, 993027, 1022512, 997153, 968649, 987385, 1009296, 982412, 990072, 1024591, 1023051, 1031981, 1068094, 1095141, 1095962, 1159365, 1223570, 1259269, 1306613, 1379751, 1419463, 1535001, 1704469, 1864888, 2084005, 2277811, 2280446, 1997431, 1766070, 1638809, 1524621, 1487779, 1503459, 1539774, 1481698, 1490013, 1508796, 1529419, 1583338, 1588792, 1633706, 1775661, 1926812, 2084743, 2257278, 2490092, 2690436, 2775069, 2707154, 2630494, 2654183, 2663339, 2556057, 2349703, 2121796, 1970395, 1851128, 1812297]
4494A812297j4961k0202k0341J02861K2489J67964J72550J08065J27179q9382
4484B368519k22157k51287j28855j34763m7796m4876k0736m3991K4159q114r727
4473A480376p029n2934M2153p5536m3592L372N6108j084l372j6381j6132O050
4461A371999N472K7101J02257L5786J5516j3151K4755p353k191K1872Q5678P2002
4449A739743J4747L0440M7874N9789O2799L0263M9533R0385p166Q3091J30362
4438B331860J84585K43191J73989Q9345o427p6725j35234j28343o4479j46926
4428B464836p3819k2807k2626K2107R6367R9593M7414R9961J50512M7916O4351
4417B973805J44729J05916R5914J91374K71534J83493J49618J32261Q2425P3280
$$ y = [1812297, 1797336, 1777134, 1756793, 1859654, 1882143, 2050107, 2222657, 2330722, 2457901, 2368519, 2146362, 1895075, 1766220, 1631457, 1583661, 1538785, 1518049, 1474058, 1498217, 1490103, 1480376, 1473347, 1420413, 1462566, 1387030, 1343438, 1346810, 1402918, 1401834, 1398462, 1382081, 1365949, 1371999, 1377471, 1404572, 1506829, 1542615, 1558131, 1544980, 1569735, 1562382, 1560191, 1582063, 1667741, 1739743, 1754490, 1784930, 1832804, 1892593, 1955392, 1985655, 2035188, 2125573, 2118407, 2201498, 2331860, 2516445, 2759636, 2933625, 3022970, 3016543, 2939818, 2804584, 2676241, 2611762, 2464836, 2391017, 2368210, 2345584, 2367691, 2464058, 2563651, 2611065, 2711026, 2861538, 2909454, 2973805, 3118534, 3224450, 3320364, 3511738, 3783272, 3966765, 4116383, 4248644, 4331069, 4404349]
4407D404349J1317R3684J21971J71636L77882M94143M48545J41290k17779k70760
4397E776278j84526P114J68922J68285L6673j50426m00212n19865l95120k59291
4387D247832j83873r4795q5055k8313j2543L2307O4240J76808L00207L34750N00613
4376E252178M91917J42017k56802m61422l39165j04590j6326J59623K27849P2527
4366E167806j57127l61274o14818n23763l99879k81152k19056k12543j19730j28362
4356B150102p9806o0008l3264j6490j21928K2700M761q2190m5692n3823k3780
4345A660582l6321k5141o2386J4321L3455k4897j3240j0135L0971j1478k9618
4334A526113J408p4949J6615q161k1000L5621r751o6371L0405j1721k0362N8762
$$ y = [4404349, 4415666, 4509350, 4631321, 4802957, 5180839, 5674982, 6123527, 6264817, 6047038, 5776278, 5591752, 5598866, 5767788, 5936073, 5972746, 5822320, 5422108, 4902243, 4507123, 4247832, 4063959, 3969164, 3884109, 3855796, 3843253, 3875560, 3939800, 4116608, 4416815, 4751565, 5252178, 5744095, 5886112, 5629310, 5167888, 4828723, 4724133, 4707807, 4867430, 5095279, 5167806, 5010679, 4649405, 4034587, 3510824, 3110945, 2829793, 2610737, 2398194, 2278464, 2150102, 2070296, 2010288, 1977024, 1960534, 1838606, 1861306, 1866067, 1783877, 1738185, 1684362, 1660582, 1624261, 1599120, 1536734, 1551055, 1584510, 1559613, 1546373, 1536238, 1567209, 1555731, 1526113, 1527521, 1452572, 1469187, 1461026, 1440026, 1475647, 1465896, 1399525, 1429930, 1418209, 1397847, 1456609]
4322A456609m9135m5891q884K4573j4424r552O4884J2466k0163p030L2923K6155
4310A462531J9603k918m030J3688k6925j5403l9043m4178k7063J9542K3584l9649
4298A339739O4927J6175j4057l7425J2758M5087L3185j6154r144m517m3795Q9050
4286A475829J3742J315J9925K459K2643M0979O0483k3689J5553K6949M0432L8868
4274A735488l4900N688O327P4574L6652k2928M1213L2068L6287o676J6250N0400
4262A970443K0338O8067M9600o65L8864P8575L014m260L2260N4540O140O0158
4250B377074Q0316K3609Q0223M2188L7393P5224J7413M5361N0536M1083L9361
4239B909781O9665J14940M0339J3772L8414N0086Q6563R0859O6513R1695J25380
$$ y = [1456609, 1407474, 1361583, 1352699, 1377272, 1362848, 1353296, 1418180, 1430646, 1410483, 1403453, 1436376, 1462531, 1482134, 1479216, 1475186, 1488874, 1461949, 1446546, 1407503, 1363325, 1336262, 1355804, 1379388, 1339739, 1404666, 1420841, 1406784, 1369359, 1382117, 1427204, 1460389, 1444235, 1435091, 1430574, 1386779, 1475829, 1489571, 1490886, 1510811, 1513270, 1535913, 1576892, 1637375, 1613686, 1629239, 1656188, 1696620, 1735488, 1700588, 1706276, 1712603, 1787177, 1823829, 1800901, 1842114, 1874182, 1910469, 1903793, 1920043, 1970443, 1990781, 2058848, 2108448, 2107783, 2146647, 2225222, 2228236, 2223976, 2256236, 2310776, 2316916, 2377074, 2457390, 2480999, 2561222, 2603410, 2640803, 2716027, 2733440, 2778801, 2829337, 2870420, 2909781, 2979446, 3094386, 3134725, 3148497, 3186911, 3236997, 3323560, 3414419, 3480932, 3572627, 3698007]
4228C698007O1175P5135J04703P4453J51998J52887J19800J53202J65455K02125
4218D958940J52794J71591K57543J75238K13938L39801L08449L04506M10105M74346
4208G767251M75195N01832O34010Q32130R91688J223499J472828J432502R03196
4199A6234131j25806p34125n53238j10681K89123N45725R23290J264529J729903
4190A9462851K197740K638282K588367J248291q63605j680903r96577j30289O88426
4181B5152583J233939J032867J97258k61099L57499J246120J678474J316168P45664
4172C2699473M02499J51658K18760Q13964J360473M38672j531246k601484j916243
4163C0036526o31349M44080J358034J912863J372991j30301j239416p32822J42639
$$ y = [3698007, 3759182, 3834317, 3939020, 4013473, 4165471, 4318358, 4438158, 4591360, 4756815, 4958940, 5111734, 5283325, 5540868, 5716106, 5930044, 6269845, 6578294, 6882800, 7292905, 7767251, 8242446, 8744278, 9378288, 10210418, 11202106, 12425605, 13898433, 15330935, 16234131, 16108325, 15374200, 14820962, 14710281, 14999404, 15545129, 16468419, 17732948, 19462851, 21660591, 24298873, 26887240, 28135531, 27271926, 25591023, 24594446, 24464157, 25152583, 26386522, 27419389, 27616647, 27355548, 27713047, 28959167, 30637641, 31953809, 32699473, 33101972, 33253630, 33472390, 34286354, 35646827, 36085499, 34554253, 31952769, 30036526, 29405177, 29849257, 31207291, 33120154, 34493145, 34362844, 33123428, 32390606, 32533245]
4154C2533245J81751m62794j045564j444642j892251j630458o51204L3786p5020
4145B5546849o85982r29824m16213M12416J139592J512497Q78809j170332k968624
4136B3319188l032193k204294j534613r71682o63110k84289n0960K81834N58145
4127A5418026N82643K01503p18462j483407j428385j083595p24646n45609n02486
4118I715582m91051l55619j90664k94634l51907l57577k70876k75292j01555q3687
4108F942720j35885n4632R646n901J7376O040N887l3294J7780N0732J47769K13573
4096G181811K94556M63572N01983L52108R6171p0381q2689k2967r9556k77543
4086H337065k65891j28413J5466j5067O5625q508j19206n4277P1662J94748K28021
$$ y = [32533245, 32714996, 32252202, 31206638, 29761996, 27869745, 26239287, 25588083, 25621869, 25546849, 24860867, 23931043, 23514830, 23927246, 25066838, 26579335, 27458144, 26287812, 23319188, 20286995, 18082701, 16548088, 15576406, 14913296, 14629007, 14578047, 14859881, 15418026, 16000669, 16202172, 15483710, 14000303, 12571918, 11488323, 10763677, 10218068, 9715582, 9224531, 8868912, 8678248, 8383614, 8031707, 7674130, 7403254, 7127962, 7026407, 6942720, 6806835, 6752203, 6761849, 6755948, 6773324, 6779364, 6785251, 6751957, 6769737, 6820469, 6968238, 7181811, 7476367, 7939939, 8441922, 8794030, 8890201, 8819820, 8737131, 8714164, 8614608, 8337065, 8071174, 7942761, 7958227, 7943160, 8008785, 8000277, 7881071, 7826794, 7898456, 8093204, 8321225]
4075H321225K01467L17701L86100K57231j2986J21378L88694N99562N75836K36167
4065A1392375O1900J79127M07491L68916K3586r0628n6459j37815j31596j19812
4055A1897085l70444m92299m36610m82069n33610n07883n42913n00953l51524
4046G678780m06496l02126j81471j02217R3155J51928R8444O5547k15245l02973
4036F577326k17180j04798j50903k11774j77888o9478l5081m8429k65681k90158
4026E005956m9647Qk0863K592j33440k37039k44138j59333j71593j07683J3807
4015C898627q266L2266Q1205L4769k8830l40191k77711k10210j63670q2317l2589
4004B903083k1572m9511L3j7518L8923m254L293r9625j17755qr8136k4823m0925
$$ y = [8321225, 8522692, 8840393, 9226493, 9483724, 9470738, 9592116, 9980810, 10580372, 11156208, 11392375, 11454275, 11633402, 12040893, 12409809, 12433395, 12342767, 12286308, 12148493, 12016897, 11897085, 11526641, 11034342, 10597732, 10115663, 9582053, 9074170, 8531257, 8030304, 7678780, 7272284, 6970158, 6788687, 6686470, 6779625, 6931553, 7029997, 7095544, 6880299, 6577326, 6360146, 6255348, 6104445, 5892671, 5714783, 5645305, 5610224, 5561795, 5296114, 5005956, 4956309, 4956317, 4935454, 4938046, 4804606, 4567567, 4323429, 4164096, 3992503, 3884820, 3898627, 3890361, 3922627, 4003832, 4038601, 4009771, 3669580, 3391869, 3181659, 3017989, 2935672, 2903083, 2881511, 2832000, 2832033, 2814515, 2853438, 2849184, 2852477, 2752852, 2635097, 2635089, 2536953, 2512130, 2471205]
3991B471205k4503k2141J7260N1040k9727j4805K8748J8125N8501N845L656L3307
3979B596511n1163q537r5155N0196m5923j0830K0206J6641K1214k2359j0602K165
3967B462364k2068J0830Q2464k789j043L6449N1751L7281m2539l5925O0972k1691
3955B616056p929J05857J15015J4770L3966J37059R6663J50433K09604K50645
3945C722139L07363L03782J71235J68230L58681L00927j0557k66905n02511n19763
3935D032621l82107l18862k33895j60744j24864q5135j05872j00646j0359J5167
3925B525304k4353o5881K7598L5823M1337K5242J2322j3450J6111O4631J14650
3914B759334J82977J52039J83225N5417n74o1600n1860J03159J34282J69246K47942
$$ y = [2471205, 2446702, 2424561, 2441821, 2492861, 2463134, 2448329, 2477077, 2495202, 2553703, 2559548, 2563204, 2596511, 2545348, 2536811, 2441656, 2491852, 2445929, 2435099, 2455305, 2471946, 2493160, 2470801, 2460199, 2462364, 2440296, 2451126, 2533590, 2530801, 2529758, 2566207, 2617958, 2655239, 2612700, 2576775, 2637747, 2616056, 2608127, 2713984, 2828999, 2843769, 2877735, 3014794, 3111457, 3261890, 3471494, 3722139, 4029502, 4333284, 4504519, 4672749, 5031430, 5332357, 5321800, 5054895, 4552384, 4032621, 3650514, 3331652, 3097757, 2937013, 2812149, 2727014, 2621142, 2520496, 2510137, 2525304, 2500951, 2435070, 2462668, 2498491, 2539828, 2565070, 2577392, 2563942, 2580053, 2644684, 2759334, 2942311, 3094350, 3277575, 3332992, 3332418, 3270818, 3218958, 3322117, 3456399, 3625645, 3873587]
3903C873587K56699L25611K33968J83427M15234N52834M51807l097o47803o84403
3893D957864l80276k64874j72498q0100p2782k4141M864J80492K60400L26959
3883D735908M40706M78444L03618k21268o27083o03511l79918k40562j87174j84238
3873C514922j84691p5579j14144j00406l6163m4661m3068m5162j12784q4018l3079
3862B641167m6115n80m2044J8917J9757j3135o0867P1937M6412k3488j7319N2616
3850B647258o57J2571P8900L9623O1909J03688P9851J47746K06750J25104K38988
3839C741731K14384Q2849n8280k6812k6378K7820K2966K6130J67567J65093J95655
3828D532725L50691M03219M71483K87324o0326j28869n6032J48043J58379J3867
$$ y = [3873587, 4130286, 4455897, 4689865, 4873292, 5288526, 5841360, 6293167, 6290070, 5642267, 4957864, 4577588, 4312714, 4140216, 4060116, 3987334, 3963193, 3968057, 4148549, 4408949, 4735908, 5176614, 5655058, 5958676, 5737408, 5110325, 4506814, 4126896, 3886334, 3699160, 3514922, 3330231, 3254652, 3140508, 3040102, 3003939, 2959278, 2916210, 2871048, 2758264, 2674246, 2641167, 2595052, 2594472, 2552428, 2571345, 2591102, 2577967, 2517100, 2589037, 2635449, 2611961, 2594642, 2647258, 2646601, 2659172, 2738072, 2777695, 2839604, 2943292, 3023143, 3170889, 3377639, 3502743, 3741731, 3956115, 4038964, 3980684, 3953872, 3927494, 3955314, 3978280, 4004410, 4171977, 4337070, 4532725, 4883416, 5286635, 5758118, 6045442, 5985116, 5856247, 5800215, 5948258, 6106637, 6120504]
3818F120504j42933k34738j16293m8795N9674R2874J79667L05191L75440K81155
3808F871746K37041K51868K35719K38766M21364P04509L07093l29327o83608l96570
3798G858601k26096o0505k4884q5824j01688l289n0763p0226j2881N5557J37797
3787G415799j3639m7945J50454J99572J29704P1893J04010J11439P7685k87717
3777G911255l88825k05894r2425p4799M3686R8737M5129J64146K16060J99416
3767G916486K20154K09450K38840L55216L93404M66874M61636N87368N45033O21433
3757A2015894P31345Q99293R26172J140243J385071J687705K212514K813317L593558
3748B7405112M513740N272752M404707M81970m141291n501213m156076k593554
$$ y = [6120504, 5977571, 5742833, 5626540, 5577745, 5637419, 5730293, 5909960, 6215151, 6590591, 6871746, 7108787, 7360655, 7596374, 7835140, 8256504, 8961013, 9268106, 8938779, 8255171, 7858601, 7632505, 7572000, 7547116, 7461292, 7359604, 7356315, 7305552, 7235326, 7222445, 7278002, 7415799, 7402160, 7354215, 7504669, 7704241, 7833945, 7905838, 8009848, 8121287, 8198972, 7911255, 7522430, 7316536, 7224111, 7149312, 7192998, 7291735, 7336864, 7501010, 7717070, 7916486, 8136640, 8346090, 8584930, 8940146, 9333550, 9800424, 10262060, 10849428, 11394461, 12015894, 12747239, 13646532, 14572704, 15712947, 17098018, 18785723, 20998237, 23811554, 27405112, 31918852, 37191604, 41596311, 42078281, 37936990, 32435777, 28279701, 25686147]
3740B5686147j546728q07392k82490k3870M34881P86040J127304J541417K058588
3731B8973897K671347L450658M532208N872633P193366P332328N168933K115625
3723F7310995M27240k055218o714146r447896q172775n744417l952168k820244
3715B8831371k098197j478542q97624m39652q9246L68031P67400J307409K134169
3706B8405119L060346M062389M999595N056784K002408l766825p477812o910819
3698B9431185m881906l381575k642672k002323j565754j288658j031238p84510
3690A1852549p25110o44542m76872l76069l27666l24821k79481k77542k66865
3681H153581k94419j81986j69205k20215k17350k22866j88309j17254j44279p5131
$$ y = [25686147, 24139419, 23332027, 23049537, 23025667, 23460548, 24246588, 25373892, 26915309, 28973897, 31645244, 35095902, 39628110, 45500743, 52694109, 60026437, 65195370, 67310995, 67738235, 65683017, 58968871, 49520975, 41348200, 35603783, 31651615, 28831371, 26733174, 25254632, 24357008, 23917356, 23828110, 24196141, 24963541, 26270950, 28405119, 31465465, 35527854, 40527449, 45584233, 47586641, 43819816, 36342004, 29431185, 24549279, 21167704, 18525032, 16522709, 14956955, 13668297, 12637059, 11852549, 11127439, 10482897, 10006025, 9629956, 9302290, 8977469, 8697988, 8420446, 8153581, 7859162, 7677176, 7507971, 7287756, 7070406, 6847540, 6659231, 6541977, 6397698, 6322567]
3671F322567r6531q1633j73082p2312k3113j04297q4025M8954M9306j3197j3567
3660E759070L176k1209q3044j21219q6681q7017o3111j863K1660o085P2077M505
3648E390259o4186L0794J03319J4127N2349J44856N7915K7947P4191M5076M7613
3637E924260M2589j2903N7029k383L8259K8252N9350k2274k2370k5027r5127j0600
3625E959055j5332j4693R9553J16290O6460J27522J44088J53505J08052N6858
3615F801358Q8270Q5576J31062R7506J60099J38545J83181J64262J54573J22198
3605H126630N7173J14295J40574J52928K31454L03919L26439K72609L02535L36136
3595A0364692L12510L53772L47925M70185N76319O43640P70613R20959R44281
$$ y = [6322567, 6226036, 6144403, 5971321, 5899009, 5875896, 5771599, 5687574, 5736528, 5785834, 5772637, 5759070, 5762246, 5741037, 5657993, 5536774, 5450093, 5363076, 5299965, 5298102, 5319762, 5313677, 5385754, 5390259, 5326073, 5356867, 5460186, 5474313, 5526662, 5671518, 5729433, 5757380, 5831571, 5876647, 5924260, 5966849, 5953946, 6010975, 6008592, 6046851, 6075103, 6134453, 6112179, 6089809, 6064782, 5969655, 5959055, 5943723, 5929030, 6028583, 6144873, 6211333, 6338855, 6482943, 6636448, 6744500, 6801358, 6889628, 6975204, 7106266, 7203772, 7363871, 7502416, 7685597, 7849859, 8004432, 8126630, 8183803, 8298098, 8438672, 8591600, 8823054, 9126973, 9453412, 9726021, 10028556, 10364692, 10677202, 11030974, 11378899, 11849084, 12425403, 13069043, 13839656, 14760615, 15704896]
3586A5704896J045146J197992J277584J533894J913039K438908L119415L950663
3578C2181537M985677N883235N743280L372013r08994m489880n178596l831540
3570C7756732k142127o87551L99020J540618K777050L977792M800785M167972
3562E2590291J200852k784479n248415m934101l098292j230839J97408J512205
3554C8204630K618387L221533K403883l18682l424136m654679l830327k483445
3546C1737164j229878k93672M03013J196401J883368K493064K542981J002039
3538C9734480j962760m545591m984770m053336k795155j920238j494563j290112
3530A6687955j290190j278494j063167q12685o16734m83113l67002k35464j46730
$$ y = [15704896, 16750042, 17948034, 19225618, 20759512, 22672551, 25111459, 28230874, 32181537, 37167214, 43050449, 48793729, 52165742, 51256748, 46766868, 41588272, 37756732, 35614605, 34927054, 35326074, 36866692, 39643742, 43621534, 48422319, 52590291, 53791143, 51006664, 45758249, 40824148, 37725856, 36495017, 36692425, 38204630, 40823017, 44044550, 46448433, 46129751, 42705615, 38050936, 34220609, 31737164, 30507286, 30213614, 30616627, 31813028, 33696396, 36189460, 38732441, 39734480, 37771720, 33226129, 28241359, 24188023, 21392868, 19472630, 17978067, 16687955, 15397765, 14119271, 13056104, 12243419, 11626685, 11143572, 10776570, 10541106, 10394376]
3521A0394376j58068k68556l48221m68066m24603l87980k71003j84648j55909
3512G727322j14860m0579L4244k6183q4098j64676k97165m08555l44646k51902
3502F028902j50969j30705j17722j49712n2787r7597m8982m8791p7911k8828o2506
3491E062392M7688K428K652Q8938j80P8728K3450R4474K09530K48050K49417L02520
3479F410087L91956N86085O38424M47593J39864l31690n68315m91882k26470j3025
3469F982627J26199K76817N10421O25110J96041n04694q40955o28138l84906k16230
3459F142292l0435P7526J55841J98704M24814M74000L82968J83647j2121n1396
3449G945840M0626J11096O7882N4282M37n2247o8095j44697m96323p37132o81427
$$ y = [10394376, 10236308, 9967752, 9619531, 9151465, 8726862, 8338882, 8067879, 7883231, 7727322, 7612462, 7571883, 7606127, 7579944, 7495846, 7331170, 7034005, 6625450, 6280804, 6028902, 5877933, 5747228, 5629506, 5479794, 5427007, 5329410, 5280428, 5231637, 5153726, 5124898, 5062392, 5110080, 5112508, 5115160, 5204098, 5203918, 5282646, 5306096, 5400570, 5610100, 5858150, 6107567, 6410087, 6802043, 7388128, 8026552, 8474145, 8614009, 8282319, 7714004, 7222122, 6995652, 6982627, 7108826, 7385643, 7896064, 8521174, 8717215, 8212521, 7371566, 6743428, 6358522, 6142292, 6111857, 6189383, 6345224, 6543928, 6968742, 7442742, 7825710, 8009357, 7997236, 7945840, 7986466, 8097562, 8165444, 8219726, 8220163, 8167916, 8099821, 7955124, 7458801, 6721669, 6040242]
3438F040242n29688l91424l51737k90117k45092k33541j10741n5359p1417j3693
3428C747433l7861M0487o239k3998q4203j09835j12481J489M2111R9680N6241
3417C612824J32077J34717J01755O8826q6686j14357j03424j32687j41837j0195
3407C461013M2458N6961N4415j5526m5134O477j53248j53774j21893j29612r3477
3396B908660r7421n9005r704j4733O0819K8414l6388j07837j05965r3501j0157
3385B463182j0488m1215l8623N0283R4869L5415O1563O782o0376m5860q1203r6469
3373B337860q8886m9663O9273L1656m4864N621O182p6474l0259k241K3533K5260
3361B206998k6070r618l8006L1946O1276L1310K4813L07j3063l0266J6344m43
$$ y = [6040242, 5510554, 5119130, 4767393, 4477276, 4232184, 3998643, 3887902, 3832543, 3761126, 3747433, 3709572, 3750059, 3743820, 3719822, 3635619, 3525784, 3413303, 3414792, 3456903, 3556583, 3612824, 3744901, 3879618, 3981373, 4050199, 3963513, 3849156, 3745732, 3613045, 3471208, 3461013, 3503471, 3560432, 3614847, 3599321, 3554187, 3560664, 3407416, 3253642, 3131749, 3002137, 2908660, 2811239, 2752234, 2742530, 2727797, 2788616, 2817030, 2780642, 2672805, 2566840, 2473339, 2463182, 2452694, 2411479, 2372856, 2423139, 2518008, 2553423, 2614986, 2621768, 2561392, 2515532, 2434329, 2337860, 2248974, 2199311, 2268584, 2300240, 2255376, 2260997, 2267179, 2190705, 2160446, 2158205, 2181738, 2206998, 2180928, 2171310, 2133304, 2165250, 2226526, 2257836, 2282649, 2282956, 2269893, 2239627, 2255971, 2255528]
3349B255528Q039o9680l7543k162j7899M1726p0999J8940N4749l8326K5422N7795
3337B225590L0410N441L7575L1633j3848J0970N9110m9585J8039N3494K9936K9668
3325B468433L4619J4660K0503n541N2159R197k5597l640j9045l0252k855L3232
3313B545873m3940l4802L8803k500Q6460K9095J066K0941k5073N740L3332n5141
3301B599854L581L6781P1637J02497P9175M7354O2307Q4626Q9836O3533j3143
3290C228038k2454q5054N3970J3670J6213r099L907N4852k0460p2458k3452O9112
3278C206785N4444m7769P670L4489n603K7913J16440J07776k802m0381K178j3532
3266C447608K3424k127N3967N7215P5377P2837Q5922M9651L9224O8653N9029M9205
$$ y = [2255528, 2263567, 2193887, 2156344, 2154182, 2136283, 2178009, 2107010, 2125950, 2180699, 2142373, 2167795, 2225590, 2256000, 2261441, 2299016, 2330649, 2316801, 2327771, 2386881, 2337296, 2355335, 2408829, 2438765, 2468433, 2503052, 2517712, 2538215, 2532674, 2584833, 2594030, 2568433, 2564793, 2545748, 2515496, 2512641, 2545873, 2501933, 2467131, 2505934, 2503434, 2589894, 2618989, 2620055, 2640996, 2615923, 2621663, 2654995, 2599854, 2603435, 2640216, 2711853, 2814350, 2893525, 2940879, 3003186, 3087812, 3177648, 3241181, 3228038, 3205584, 3120530, 3174500, 3188170, 3204383, 3195284, 3199191, 3254043, 3233583, 3161125, 3137673, 3206785, 3261229, 3213460, 3221130, 3255619, 3250016, 3277929, 3394369, 3502145, 3499343, 3458962, 3461140, 3447608, 3471032, 3468905, 3522872, 3580087, 3655464, 3728301, 3814223, 3863874, 3903098, 3971751, 4030780, 4079985]
3254D079985k2185P9042N4278K3641J00386J13792M8019L7999R2606P4882J29320
3243D811765J21451J51852J33188J55450J23339J45503J87609J61910J65574K81097
3233F438738L08388L63222L55812J00624o1049m6941o0533O1310Q5164J61372
3223G706107J93932J62175K57588L44848L62563L45203L06862J29178J7667K7607
3213I853730R8777M7791J28029P5529O0524J13400J31148R8656Q4960J41035O0379
3202A0893958J72071J30165J48844J81692J84630K46808K14637K13855K57701
3193A2644361K25437J50593K75233J96187K04925L37226L70221L58803L72117
3184A5135103M32547N70894N59557O09446Q05297Q42687Q35458P75052P56484
$$ y = [4079985, 4057800, 4136842, 4191120, 4214761, 4315147, 4428939, 4476958, 4514957, 4607563, 4682445, 4811765, 4933216, 5085068, 5218256, 5373706, 5497045, 5642548, 5830157, 5992067, 6157641, 6438738, 6747126, 7110348, 7466160, 7566784, 7505735, 7458794, 7398261, 7459571, 7544735, 7706107, 7900039, 8062214, 8319802, 8664650, 9027213, 9372416, 9679278, 9808456, 9826123, 9853730, 9952507, 10000298, 10128327, 10203856, 10264380, 10377780, 10508928, 10607584, 10692544, 10833579, 10893958, 11066029, 11196194, 11345038, 11526730, 11711360, 11958168, 12172805, 12386660, 12644361, 12869798, 13020391, 13295624, 13491811, 13696736, 14033962, 14404183, 14762986, 15135103, 15567650, 16138544, 16698101, 17307547, 18112844, 18955531, 19790989, 20566041, 21322525]
3175B1322525Q27970Q97293R50858J082349J200104J310494J406567J551174J741605
3166C2290939J987001K215576K334306K534710K657134K832183L082497L443116
3158E3377462M029218M559398M937802N582396O061473O874386P982871R485733
3150A02890739J1174897J3146464J5940219K0036567K6133158L4351125M3735915
3143B67409084N2530907M8891612K2892286j6143558m8705307o1453341n2361970
3136B13059713l7599406k7924929k1050157j6396165j2813320j0215059q152909
3129G8907768o634981n254270m306862l697229l541289l683670l713337l460746
3121D4615384l120469k606159k273081j970878j872041j559456j436141j376067
$$ y = [21322525, 22150495, 23047788, 23998646, 25080995, 26281099, 27591593, 28998160, 30549334, 32290939, 34277940, 36493516, 38827822, 41362532, 44019666, 46851849, 49934346, 53377462, 57406680, 61966078, 66903880, 72486276, 78547749, 85422135, 93405006, 102890739, 114065636, 127212100, 143152319, 163188886, 189322044, 223673169, 267409084, 319939991, 368831603, 391723889, 375580331, 326875024, 265421683, 213059713, 175460307, 147535378, 126485221, 110089056, 97275736, 87060677, 78907768, 72272787, 67018517, 62711655, 59014426, 55473137, 51789467, 48076130, 44615384, 41494915, 38888756, 36615675, 34644797, 32772756, 31213300, 29777159, 28401092]
3113B8401092j376417j214157j103964r77138q63585q15181q13437o67948o06424
3104A9962841n68325m56335l01024k73696l52449m54267n79855n30909n60107
3095A5885874m79575n12761n67711n51362n22754m81719m09391m15511l67208
3086A1577882k84050k96865k71640l14726k60475k70791k10247k84299k91633
3077I093156j78296l10847j68304j43072k02759j70601j36331m6987q6168m8574
3067G601217p063j9770o3101O413n6558m9191j64117j27434p5191o5129r2864
3056F887212n0791q0536q0604j29671j14983n7168q1493l6076k0965M2942j4684
3045F263183l059j3135L0104J68633k6331k42232l61232l33191k24920k50810
$$ y = [28401092, 27024675, 25810518, 24706554, 23729416, 22865831, 22050650, 21237213, 20569265, 19962841, 19394516, 18938181, 18637157, 18363461, 18011012, 17556745, 16976890, 16445981, 15885874, 15406299, 14893538, 14325827, 13774465, 13251711, 12769992, 12360601, 11945090, 11577882, 11293832, 10996967, 10725327, 10410601, 10150126, 9879335, 9669088, 9384789, 9093156, 8914860, 8604013, 8435709, 8292637, 8089878, 7919277, 7782946, 7735959, 7649791, 7601217, 7594154, 7574384, 7511283, 7517696, 7461138, 7411947, 7247830, 7120396, 7045205, 6980076, 6887212, 6836421, 6755885, 6675281, 6545610, 6430627, 6373459, 6291966, 6255890, 6234925, 6277867, 6263183, 6260124, 6246989, 6277093, 6445726, 6419395, 6177163, 5815931, 5482740, 5257820, 5007010]
3035E007010k57202k11932j17222r7277r7914r4954o8697r9465j6078o8622r7856
3024C779791K2661K6332J8187j6037r7042p7931j16902l3487p9712n7765k3670
3013C344425o537j06591l5087j3746L2525l0326j7828n146j10220n7851l4809
3002B958809o8808J954R122n5829r6954l4350m2160j8823m9020M115M3866O2531
2990B714453l5220Q37Q3469m211L8458R0419L1501M8771K5459J1061j3411O941
2978B998527j656j179l8314J5292O8794J18790O4180j0384O48j112J03116N8630
2966C375332K3671M2725N2970r1833L8470J11519J10507N5172Q4038Q9853J01898
2955C994322J22619J62572J03344P5148J20282M7365N9054M4316N9327K9401N467
$$ y = [5007010, 4749808, 4537876, 4420654, 4323377, 4225463, 4130509, 4061812, 3962347, 3946269, 3877647, 3779791, 3802452, 3828784, 3846971, 3830934, 3733892, 3655961, 3539059, 3505572, 3425860, 3368095, 3344425, 3337888, 3231297, 3196210, 3182464, 3214989, 3184663, 3166835, 3161689, 3051469, 2993618, 2958809, 2890001, 2891955, 2901077, 2845248, 2748294, 2713944, 2671784, 2652961, 2603941, 2608056, 2651922, 2714453, 2679233, 2680070, 2763539, 2759328, 2797786, 2888205, 2919706, 2968477, 2993936, 3004997, 2991586, 2998527, 2996871, 2995692, 2957378, 2972670, 3041464, 3160254, 3224434, 3214050, 3214698, 3213586, 3316702, 3375332, 3399003, 3441728, 3494698, 3402865, 3441335, 3552854, 3663361, 3718533, 3802571, 3892424, 3994322, 4116941, 4279513, 4382857, 4458005, 4578287, 4625652, 4684706, 4729022, 4788349, 4817750, 4823217]
2944D823217l3057j7451o4037r1656j15750j28841j08843j70746j55447j33346
2934C804043r8399j88273j21616j30457j72648r3307l2877j02536j00251j21280
2924B642399n7376l2144q2401r0573l6765o0860o0826r3208n2643o6375l5896
2913A973332n2081k7952l2432k3234k8576m5362N2140q530k3460k3154P86r6487
2901A664990m5491K7822o1613k6517j1119l4289k8510q3215n2734k3792m843J3008
2889A333697l4942p300p1731l3407k3883n5462K1485L0235j9288k0246l9019n3107
2877A027032O291P2978q142r3634j7695k4726j5186K3041L4607k7198O97J5656
2865I93721J5536K8849l9108j5231J114J2950K7256J5788j9766K3888K8197J4056
$$ y = [4823217, 4790160, 4772709, 4708672, 4617016, 4501266, 4372425, 4263582, 4092836, 3937389, 3804043, 3705644, 3517371, 3395755, 3265298, 3092650, 2999343, 2966466, 2863930, 2763679, 2642399, 2585023, 2552879, 2470478, 2379905, 2343140, 2282280, 2221454, 2128246, 2075603, 2009228, 1973332, 1921251, 1893299, 1860867, 1837633, 1809057, 1763695, 1815835, 1807305, 1783845, 1760691, 1761477, 1664990, 1619499, 1647321, 1585708, 1559191, 1548072, 1513783, 1485273, 1402058, 1349324, 1325532, 1320689, 1333697, 1298755, 1291455, 1219724, 1186317, 1162434, 1106972, 1128457, 1158692, 1139404, 1119158, 1080139, 1027032, 1033323, 1106301, 1098159, 1004525, 986830, 962104, 946918, 969959, 1004566, 977368, 978065, 993721, 1009257, 1038106, 998998, 983767, 984881, 997831, 1025087, 1040875, 1021109, 1044997, 1073194, 1087250]
2853A087250o3114k3694L4501k1704P99L9657Q1432M6034m7231M0940O0371n0862
2841A184379P2000J10432J12034J37588J47890J81676K14789K23869K85229J13768
2831B783654j01994k44524l02713k89424k02516q8032q3186j45142p5791m2537
2821A207795o1033l1289r5376n4659m4600n4115R723p7599j2782k8250j7454K2443
2809G62804m3332J186M3931k2638m4939p2613L4706k9052k9919k1381j1009j9711
2797E48033J5382k3918j4880M0456j1977m5971n5601K7529O1267q035j3960m4220
2785D74105k7763M5583J541l101j1626K6130K9554O719n0435l4144N6875R7208
2773F10646p1743o8217N391J3556m180r285k4181j9449L3432r785l4469L3604
$$ y = [1087250, 1024136, 1000442, 1034943, 1013239, 1014038, 1053695, 1135127, 1181161, 1133930, 1174870, 1235241, 1184379, 1256379, 1366811, 1478845, 1616433, 1764323, 1945999, 2160788, 2384657, 2669886, 2783654, 2681660, 2437136, 2134423, 1844999, 1642483, 1554451, 1471265, 1326123, 1250332, 1207795, 1146762, 1115473, 1020097, 965438, 920838, 866723, 876446, 798847, 786065, 757815, 740361, 762804, 719472, 720658, 764589, 741951, 697012, 624399, 659105, 630053, 600134, 578753, 567744, 548033, 563415, 539497, 524617, 565073, 553096, 507125, 451524, 479053, 540320, 532285, 518325, 474105, 446342, 491925, 493466, 490365, 478739, 504869, 534423, 541142, 490707, 456563, 513438, 610646, 538903, 470686, 476077, 489633, 485453, 476168, 451987, 432538, 465970, 456185, 421716, 455320]
2761D55320K7801M5238n4625l1332L3507l0455J2674M0118J4825O186J4925J389
2749E35571l708j2659j8203j661j6378r676k0421O477k1162K1644Q069k3632j01653
2736C42608k0081L2635q751o867r40l6802J5403l3737l173l827L6761J5857j6194
2723C12892Q603j7620J7344N57n3082j6502J8740k2434q2148J5904O6936j069
2711B48121L8086R038J5827j129J9873l1067r391j5020j2719m2897L4734k1686
2699B31770j138j5522M022K2425k961J5497l9289K7153k869q000L4482K1426j0610
2686B76386n8584K5028J2643L2620p117r083j4874m3010j4835K5300n305J2894
2674B32063L0962r862K8826K7846J1742l0933M6650l5832l2398M7587l5378J8961
$$ y = [455320, 483121, 528359, 473734, 442402, 475909, 445454, 458128, 498246, 513071, 519257, 534182, 535571, 531863, 519204, 501001, 499340, 482962, 473286, 452865, 459342, 438180, 459824, 467893, 444261, 342608, 322527, 355162, 346411, 339544, 338604, 301802, 317205, 283468, 280295, 276468, 313229, 329086, 312892, 321495, 303875, 321219, 321776, 268694, 252192, 270932, 248498, 166350, 182254, 249190, 248121, 286207, 295245, 311072, 309943, 329816, 298749, 289358, 274338, 261619, 218722, 253456, 231770, 230632, 215110, 219132, 241557, 238596, 254093, 214804, 241957, 239088, 231088, 265570, 286996, 276386, 217802, 242830, 255473, 288093, 280976, 271893, 257019, 214009, 199174, 224474, 219169, 232063, 263025, 253163, 281989, 309835, 321577, 290644, 337294, 301462, 269064, 316651, 281273, 300234]
2662C00234n796l1838N4934J8817m6919J7300L2256n3063r203q664o5483J5836
2650B18411P5964j2915L3401j1076M7j5451o574l2428L9057J7148l5619L8316
2638C08281m4579O949n276j3135j396O2475K8827N876k3982j7745l2618n1097
2626B22580M3104N3664j2955j6079r116N4161J0859r1713M24L7940J8068K7269
2614C38206N02r2027L1690L5151k1103j5881m1689J0061j3701k3924r304K9978
2602B27959L3632L438j4022k6577j3949j2890N0500K4756M9764p0643k8482j1501
2590B11985N975K7798l9931K4249m0952N6870o055j0493k4057J2713q41K9458
2578B46719K2209j4255J4947j5197M4924O513K0923n6487K6683l9915j3340l7690
$$ y = [300234, 294438, 262600, 317534, 336351, 289432, 306732, 338988, 285925, 276722, 268058, 202575, 218411, 294375, 281460, 314861, 303785, 303832, 288381, 281807, 249379, 288436, 305584, 269965, 308281, 263702, 270651, 265375, 252240, 250844, 313319, 342146, 348022, 324040, 306295, 273677, 222580, 265684, 319348, 306393, 290314, 281198, 335359, 346218, 254505, 254929, 292869, 310937, 338206, 338708, 246681, 278371, 313522, 292419, 276538, 234849, 244910, 231209, 207285, 197981, 227959, 261591, 265029, 251007, 224430, 210481, 197591, 248091, 272847, 322611, 251968, 223486, 211985, 217960, 245758, 205827, 230076, 189124, 245994, 239939, 229446, 205389, 218102, 217261, 246719, 268928, 254673, 269620, 254423, 299347, 305860, 326783, 270296, 296979, 257064, 243724, 206034]
2566B06034K5121J2965l3344L9107J3117K6660n815p052j10M5141r407m1290m2715
2553B28412J0529j204Q8039j7042l5412N6711L4767n9990p859m2857N7420K206
2541C13720j066j2078j3887J106k1073K8657m0439j3886M3651l9233k1746m652
2529B19074q794P2121R5517l9436o3130K3914l3666M0728p8465m257Q7041K9956
2517C40603l7778K314l7486k3483J718M8161L061p1470J4930n0285J6627J4804
2505B21716K3764P6486n107m2937l2478L857k2593J4962n8679R569O6451K6265
2493B81276p9013p0668l7034L6859o238l0253N7265l2565Q769J5059k2162K6105
2481A47400O4151n5413o64J4464o0567J0290N933j6897l7108l784o967O104L8954
$$ y = [206034, 231155, 244120, 210776, 249883, 263000, 289660, 283845, 276793, 276683, 321824, 312417, 271127, 228412, 238941, 237737, 325776, 308734, 273322, 330033, 364800, 304810, 296951, 254094, 311514, 313720, 312654, 300576, 286689, 287795, 266722, 295379, 254940, 241054, 284705, 245472, 223726, 219074, 210280, 282401, 377918, 338482, 275352, 299266, 265600, 306328, 227863, 223606, 310647, 340603, 302825, 305139, 267653, 244170, 245888, 294049, 297110, 225640, 240570, 190285, 206912, 221716, 245480, 321966, 316859, 273922, 241444, 245301, 222708, 237670, 178991, 188560, 255011, 281276, 202263, 131595, 94561, 131420, 125182, 94929, 152194, 119629, 128398, 143457, 121295, 147400, 211551, 156138, 155474, 169938, 109371, 119661, 125594, 108697, 71589, 67805, 60838, 66942, 105896]
2468A05896M0980J9945k3849K1327m947k1459l6565k3786n147k2197M7819R687
2456A07704j2491K2167N6110N4335n2837n1905K1640l3193L7372J4222l8875l1667
2444I2582P0587L3095n0377J4845K6167J9701K1146J2963r6973n792N7222l8597
2432A56569L431K3753K4218r798l8906k2055k660L3149j0022L5161k7037m6690
2420A19113j2780L7366J9326K2346k5028k6814N4903m791o8951K8819j0219M8848
2408A82138N30M903L1154j7664K6370k0924k5621j09258N8405P9955j6067j8816
2396A75105m2115K4271K3014m850l2203m3887J4638K5452K5296k1550O5272l3593
2384A74850m3682L819N338K4353K4573j7688M1244J5933m6539L069l6179O8899
$$ y = [105896, 146876, 166821, 142972, 164299, 159352, 137893, 101328, 77542, 72395, 50198, 98017, 107704, 95213, 117380, 173490, 227825, 174988, 123083, 144723, 111530, 148902, 163124, 124249, 92582, 163169, 196264, 145887, 160732, 186899, 206600, 227746, 240709, 143736, 137944, 195166, 156569, 160000, 183753, 207971, 198173, 159267, 137212, 134552, 167701, 157679, 192840, 165803, 119113, 106333, 143699, 163025, 185371, 160343, 133529, 188432, 183641, 114690, 143509, 133290, 182138, 182668, 187571, 218725, 201061, 227431, 206507, 180886, 71628, 130033, 209988, 193921, 175105, 132990, 157261, 180275, 175425, 143222, 99335, 113973, 139425, 164721, 143171, 208443, 174850, 131168, 134987, 140325, 164678, 189251, 171563, 212807, 228740, 182201, 185270, 149091, 217990]
2372B17990l8139O8023j4285J4463J0790l9009N4198K8643J1160q665O8419J9522
2360C93110k16K5850n5453k5704l8578l6182j8830n6100N9442m35L2504J6546
2348B95954J9309R041j6702j4759n2871P1676j6145k9596K1888K431k7252K3580
2336B86554N2719Q3501K3918m6262M054K7593J7969J08626O9459K0856O4870o6915
2324F46942o7820m7713k4315k4001j5930n5752j2132M5704R169j7012r0371j9599
2312C27170N5234o36m3327K3716K5119m0579K8302k7225M0382P0897m010m1695
2300D13348M9477M0587L4214k1135l0800L5549O2057L2942O368L471m795k3689
2288E97594N309m8638k1399J8143p035p733k1681R20J8853J1936p316j2392p920
$$ y = [217990, 179851, 247874, 233589, 248052, 258842, 219833, 274031, 302674, 313834, 305169, 373588, 393110, 392894, 418744, 363291, 337587, 299009, 262827, 243997, 187897, 247339, 246904, 279408, 295954, 315263, 324304, 307602, 292843, 239972, 311648, 295503, 265907, 287795, 290226, 262974, 286554, 339273, 422774, 446692, 400430, 404484, 432077, 450046, 558672, 628131, 648987, 713857, 646942, 579122, 531409, 507094, 483093, 467163, 411411, 399279, 444983, 454152, 437140, 346769, 327170, 382404, 381768, 338441, 362157, 387276, 346697, 374999, 347774, 388156, 459053, 455043, 413348, 462825, 503412, 537626, 516491, 485691, 521240, 583297, 616239, 622607, 626078, 621283, 597594, 602903, 554265, 532866, 551009, 543974, 536241, 514560, 515480, 534333, 546269, 538953, 526561, 518641]
2275E18641n0324J4930R6285k4607m0840O271j453J4930O9767r687Q4598j7896
2263F60615j3169J9748O5110L6511N5391J0469J4347K8067p7012m5075N58L977
2251G59537k6237k3276r472K521K1772O6594J9126o10o0345j3963K9196j1138
2239G53705l4461o2039Q0863Q2938J2920M4652j8149N7202L6645J649L1280K3526
2227A010731J7651N3676M1143O5691J08368n8044j17807o3582o7534l5760m535
2216I49998l4268k444L749k5916p428L3876K5802N2409O8786n002L693k0818L1834
2203A074271M9107M5247M5622m0105K9823M4299N8755J5008K5369J24328L8175
2192A509899n181N1916J5834l0896N436Q766j3614M8696n5201k3331L3469P823
$$ y = [518641, 468317, 483247, 579532, 554925, 514085, 520356, 518903, 533833, 603600, 593913, 678511, 660615, 647446, 667194, 732304, 768815, 824206, 834675, 849022, 877089, 800077, 755002, 755560, 759537, 733300, 710024, 700552, 703073, 724845, 791439, 810565, 809955, 749610, 735647, 764843, 753705, 719244, 657205, 738068, 821006, 833926, 878578, 860429, 917631, 954276, 955925, 987205, 1010731, 1028382, 1082058, 1123201, 1188892, 1297260, 1239216, 1121409, 1057827, 990293, 954533, 949998, 915730, 913286, 917035, 891119, 883691, 917567, 943369, 995778, 1064564, 1059562, 1063255, 1042437, 1074271, 1123378, 1168625, 1214247, 1174142, 1203965, 1248264, 1307019, 1322027, 1347396, 1471724, 1509899, 1504718, 1556634, 1572468, 1541572, 1547008, 1555774, 1542160, 1590856, 1535655, 1512324, 1545793, 1553616]
2180A553616J0790j5111K116K7701P0782J2804M3884K5452P4412P4072J19764
2169B000282L281m0281p3763q3358j60636j35539j05552n1998l1773o4668j6045
2158A239950o2372q3471j18350l1109n5028k7674L1644n4925m9476K0230k9831
2147G79588l5740J3297j3101j7444m7640m126J0793k2481K5963J0992k9509j3568
2135F57024m0292o6641M7860q973M899j3307l8988O7444j9773l0024n1304k5431
2123D82494k8405K0332K391r3323M4275m201L0184K0239l6944k020j1983k1460
2111D01579N3070O1760k2374p2365R714l087k003K0882m6051M64o0274n0113N705
2098B96907J9432M9410q2890k210L7055K3454m9980O1655j1237j8723n6012L5789
$$ y = [1553616, 1564406, 1549295, 1551411, 1579112, 1649894, 1662698, 1706582, 1732034, 1806446, 1880518, 2000282, 2003563, 1963282, 1889519, 1806161, 1645525, 1509986, 1404434, 1352436, 1320663, 1255995, 1239950, 1177578, 1094107, 975757, 944648, 889620, 861946, 893590, 838665, 789189, 809419, 779588, 743848, 757145, 744044, 726600, 678960, 674834, 685627, 663146, 689109, 700101, 670592, 657024, 616732, 550091, 597951, 588978, 593877, 580570, 541582, 609026, 589253, 559229, 507925, 482494, 454089, 474421, 476812, 383489, 427764, 423563, 453747, 473986, 437042, 435022, 423039, 401579, 454649, 516409, 494035, 421670, 431384, 428297, 426294, 447176, 401125, 401589, 341315, 291202, 296907, 316339, 365749, 282859, 280649, 317704, 341158, 291178, 352833, 341596, 322873, 266861, 302650]
2086C02650j7249n7712L1308N4088J8594J09L8840q022K6456k3740l7398j5482
2074C12442M0217l7621k1634R097L8603j7654J2516q7760k2119R6141j9799p7515
2062B24914m893k1881J0782M1160J952k2209P885j0555j7052J332k9267J0207
2050A92375O2879k7980l4614j9540L3359p786m2986R663M8690J1052l7460K6843
2038B14495r886o393R553l0496n6207L6508K4028J2749n0671m5531Q5237K9977
2026B13363l3686j0712k4162j5531n6335M079L1060P130J5060j504K1612J0277
2014A60651n79p9157R553K5138n028J0933n725o0044o001K206j9932L1172O9594
2001A32781M5087q403L0888k1228k090J3898q2162j0098J6476J7762k4419j3953
$$ y = [302650, 285401, 227689, 258997, 313085, 331679, 331788, 370628, 362606, 389062, 365322, 327924, 312442, 352659, 315038, 293404, 302501, 341104, 323450, 335966, 248206, 226087, 322228, 302429, 224914, 220021, 198140, 208922, 250082, 252034, 229825, 237710, 227155, 210103, 211435, 182168, 192375, 255254, 227274, 192660, 173120, 206479, 198693, 155707, 165370, 214060, 225112, 187652, 214495, 204609, 198216, 207769, 177273, 121066, 157574, 181602, 194351, 143680, 98149, 183386, 213363, 179677, 168965, 144803, 129272, 72937, 77016, 108076, 115206, 130266, 128762, 150374, 160651, 160072, 80915, 90468, 115606, 110578, 121511, 115786, 55742, 49741, 51947, 32015, 63187, 132781, 177868, 169465, 200353, 179125, 177035, 190933, 108771, 98673, 115149, 132911, 108492, 94539]
1989I4539J9052K0428l3415K4947J2130J6239o3367l4725L7915k9185J8001j9669
1977F2890J4454O8085O069K7990l7789n240O757Q576R65j3366q680j2225m2790
1964G5696j1793O1238J2422L3249k2807m5154k8434K256n391L5987k9286R674
1952H7657l3557m6157M710L1691K4325L2077K8990M1352j4932n6655k7802j4847
1940E6852k9672K9241k2345J0021R9366K565p169j4137j8484P759r023l5383J5615
1927H5206P1007r630k1292N3306k2472L951K3481k8349M9498l1394J80K262k6223
1914A49531l6710K154Q4889j9954m5437L4376q986k2760m5303k810J9507M5587
1902A54084J2184j9668l8228q334k1573J3292k8204Q6465p100j0189M2474m1162
$$ y = [94539, 113591, 134019, 100604, 125551, 137681, 153920, 90553, 55828, 93743, 64558, 82559, 62890, 77344, 145429, 151498, 179488, 141699, 136459, 143216, 151792, 152757, 139391, 130711, 118486, 75696, 63903, 125141, 137563, 170812, 148005, 102851, 74417, 76673, 71282, 107269, 77983, 87657, 54100, 7943, 12653, 44344, 68669, 100746, 129736, 171088, 156156, 99501, 71699, 56852, 27180, 56421, 34076, 44097, 143463, 146028, 138859, 124722, 106238, 113997, 104974, 69591, 85206, 156213, 146583, 125291, 178597, 156125, 160076, 183557, 155208, 204706, 173312, 173492, 175754, 149531, 112821, 114975, 199864, 179910, 134473, 168849, 159863, 137103, 91800, 88990, 108497, 154084, 166268, 146600, 108372, 100038, 78465, 91757, 63553, 150018, 142918, 132729, 175203, 134041]
1890A34041M6549r054j2401L1326M517J8780q10j914l1013N310l0864m3719N1737
1877A62485N7732j0795m7701J0965J9449K3292m6181j6731K1800N4040K4286K9904
1865B82545l0292j6968K7437l686p2902O1852j7840M4383J0601j2159K3390k8817
1853B67544j0977J2307p276M5516M3402o156k774J4673Q1670L9752J909O7333
1841E46923k9490O728q1485m3909N322M8950o707R607J1539J0114m607L9631M0516
1828E53132n237K7690K2601J1067n566J156J4298J43936K7863j6611O22J1307
1816G86258j0359K3800O2049l4068r07J8654K1125J797j6164l1997k220K0312
1804H38280p0923N538K1316k8673l7163K930J8066q67n6580l5043K4435P3374
$$ y = [134041, 180590, 171536, 159135, 190461, 194978, 213758, 212948, 211034, 180021, 185331, 154467, 110748, 162485, 220217, 209422, 161721, 172686, 192135, 215427, 169246, 152515, 174315, 228355, 252641, 282545, 252253, 235285, 262722, 259036, 186134, 247986, 230146, 274529, 285130, 272971, 296361, 267544, 256567, 268874, 261598, 307114, 350516, 344360, 341586, 356259, 437929, 477681, 479590, 546923, 517433, 524161, 442676, 398767, 404089, 453039, 446332, 455939, 467478, 477592, 472985, 512616, 553132, 547895, 575585, 598186, 609253, 603687, 604843, 619141, 763077, 790940, 774329, 774951, 786258, 775899, 799699, 861748, 827680, 826773, 845427, 866552, 868349, 852185, 820188, 817968, 838280, 767357, 772895, 794211, 765538, 728375, 731305, 749371, 748504, 691924, 656881, 681316, 754690]
1792G54690L5890L0589O876k5973p3380N7284j8646N5333L731N0304K1488o3023
1780H35163l5344l1211J7693o7128l5212K4324k5736j3455K2052k6588l4304k7969
1768F02285m8607N0064K2384q5262M4171k5175n0771o0771L2034L6382O8838r762
1756E75810k1682j0000o8428m3068M535m2073p3738K1114K1526L5584q3731l0300
1744B85549R533L8362M214M3580o0360o5058k4426K2120j7303p8813M4232N8879
1732B60509o843l5783l7607K2162j9341m2719j4368J4290N5622m686j309K4102
1720B14029m8161j7452j3944l7550Q819M700K1412J8319M5597K9006m4766L332
1708A83341l9414k7652J563j2709L4912l3484j223M3423M3863p0699j6920K3984
$$ y = [754690, 790580, 821169, 828045, 802072, 728692, 785976, 767330, 822663, 826394, 876698, 898186, 835163, 799819, 768608, 786301, 719173, 683961, 708285, 682549, 669094, 691146, 664558, 630254, 602285, 553678, 603742, 626126, 540864, 585035, 559860, 509089, 448318, 480352, 516734, 585572, 575810, 554128, 544128, 475700, 432632, 437167, 395094, 321356, 342470, 363996, 399580, 315849, 285549, 295082, 333444, 337658, 381238, 320878, 255820, 231394, 253514, 236211, 157398, 201630, 260509, 253666, 217883, 180276, 202438, 183097, 140378, 126010, 140300, 195922, 191236, 189927, 214029, 165868, 148416, 134472, 96922, 105741, 110441, 131853, 150172, 195769, 224775, 180009, 183341, 143927, 116275, 117838, 105129, 140041, 106557, 105334, 148757, 192620, 121921, 105001, 128985]
1696A28985K3789o351k9653m0617J8821k1335L156l11k1720m122J3527L3565K6980
1683A24714o6488L6365J7766q0371Q159P424K2839L095p1110K2731j8954M4879
1671E1049K0177K453L214l3064k1073M4729p598k0038k2122K2038j180n7672M3063
1658B3976J0693l1647K4157R400n9330O676k0852M4254J5053N228k7004J8567
1646A9171p3170Q77L3295k3430m4422L3128J9694O6731J4582o1018l6290n2784
1634a03636K3708N3777O9336k8254m2558N087M1086j5854m7935O7461K2362M1952
1622H6532k5469n3380l9852J6296K4031o876n384n944m7776j2287L3965L8636
1610B492L450l2890O093p088k8955R594N6287l430P728k5871o699M91L5004k0323
$$ y = [128985, 152774, 146423, 116770, 76153, 94974, 73639, 76795, 76484, 54764, 50642, 64169, 97734, 124714, 58226, 94591, 112357, 31986, 40145, 47569, 70408, 73503, 2393, 25124, 6170, 51049, 71226, 73679, 76893, 43829, 22756, 67485, 59887, 39849, 17727, 39765, 38585, -19087, 23976, 34669, 3022, 27179, 36579, -22751, -16075, -36927, 7327, 22380, 27608, 604, 19171, -53999, -53122, -19827, -43257, -87679, -54551, -34857, 31874, 46456, -14562, -50852, -103636, -79928, -26151, 43185, 14931, -27627, -22540, 18546, 2692, -45243, 22218, 44580, 86532, 61063, 7683, -32169, -15873, 8158, 1282, -4102, -10046, -57822, -70109, -36144, 2492, 5942, -26948, -20855, -27943, -56898, -47304, 8983, 5553, 13281, -12590, -19289, -18798, 16206, -4117]
1596d117k0728J7098n826k2202o76M312K0557K498J2360l8476k0958O7989r674
1583B157l9709J2852R297j8112n2759R582q410J9343N9891K9267j4408p4185M1328
1570b3866m818k3672K6758q341O999L325m571P354J2891m0020J5967P38J7750
1557a3506K2473j6382O745J3237J7439l4196K0359o173n6415K7813k0601j3821
1545e3028L1397l7449j4248L5930O5314k4101m2533L2499n4205J951L7579M4743
1533B3849J8350p3945j0856L0939k6067L4374j3347k8686J3576K8254J512n5904
1521e7951O0625K4266L9341q4772N45N5131J9569J028n0521J3849m2364K351M5592
1508B6689p5017L1382k0506n3097O3720l3695J2283K3415k7748K2276L7603P777
$$ y = [-4117, -24845, -7747, -13573, -35775, -36451, -32139, -11582, -9084, 3276, -35200, -56158, 11831, 2157, -37552, -24700, -15403, -33515, -86274, -76692, -85102, -65759, -5868, 23399, 8991, -65194, -23866, -28684, -52356, -25598, -33939, -26940, -23615, -28186, -20832, -7941, -47961, -31994, -31256, -13506, 8967, -7415, -670, 12567, 30006, -4190, 16169, 9996, -46419, -18606, -39207, -53028, -21631, -59080, -73328, -37398, 27916, 3815, -38718, -6219, -60424, -58473, -20894, 23849, 42199, -31746, -42602, -11663, -37730, -3356, -16703, -45389, -31813, -3559, -2047, -57951, 2674, 26940, 66281, -18491, -17946, 37185, 56754, 57782, 7261, 21110, -21254, -18903, 26689, -48328, -16946, -37452, -90549, -26829, -60524, -48241, -24826, -52574, -30298, 7305, 15082]
1496A5082M32k527p105N112m5050R297K3244j8181L737j2954M794L4341M4712
1483E4934l4577J100J9120l6148N25j9129k3853l2020Q5085o9n4597N7539j19024
1470a01114K7036N2078k1682M4202J2156k8185n2019l4262L6890M8231n288N1378
1458B9421j3750K2188J8047l8000l4099p03L5400l6811k6553j8258R912M4771
1446h435m1935O515K658l968L8296K2443j4519m9268m196J4201M8639m005M967
1433A1393m2559N706P767K2949k2941M7586L5066j1907l6738n7069N164L7819
1421B236K747m4343k566M8960K1857k9576m1346j0454k7689P481O4845o107k554
1408a6509O256m9942J4204O1580J1460J9879n7405m1287O3325j5864p3121Q1573
$$ y = [15082, 15514, 12987, 5882, 10994, -34056, -24759, -1515, -19696, -15959, -28913, -24119, 10222, 54934, 20357, 21457, 40577, 4429, 4954, -14175, -38028, -70048, 15037, 14968, -39629, 17910, -101114, -74078, -22000, -43682, 520, 12676, -15509, -67528, -101790, -64900, -16669, -21957, 29421, 15671, 37859, 55906, 17906, -16193, -16896, 18504, -18307, -44860, -63118, -53206, -8435, -50370, -43855, -41197, -45165, -6869, 15574, 1055, -48213, -52409, -38208, 10431, 6426, 11393, -31166, -25460, -17693, 5256, -17685, 29901, 64967, 53060, 16322, -40747, -35583, 2236, 4983, -39360, -41926, 7034, 28891, -685, -42031, -52485, -80174, -72693, -7848, -13955, -16509, -10253, -60195, -45991, 15589, 27049, 46928, -10477, -51764, 11561, -4303, -77424, 4149]
1396D149J5964K5392K8868o6403r5891O5952j3392K5270O4739K913P230n0864
1384A3927p1409J316J9379n765L0063K6841k5748r674J1843l7670n9205N63P8518
1371b7021q187j9028J2922L3956j8736L2583j3546k5071k2644J0332O7190o124
1359A6626k9716j4774j1478j3303j3752k8067J1780K6839N9420O666k8812L3561
1347A4990o3888j6526l2524J1049O0258k834j204k0160P1384j4722q925J6337
1335A3235O391n4025J3633J565j4942K7664l4779k3650L1769j318J1240O9035
1323D5818j7669m9688n064O9544l7028m2869L5514J5921j0226n3882L3736P573
1311h320r829P3882K7595k9361n8209k5452L968j5359j3921l1450L765P7548L0023
$$ y = [4149, 20113, 45505, 74373, 7970, -87921, -21969, -35361, -10091, 54648, 57561, 64791, 13927, -57482, -56166, -36787, -42552, -12489, 14352, -11396, -21070, -9227, -46897, -106102, -105539, -27021, -35208, -54236, -41314, -7358, -26094, 6489, -7057, -32128, -54772, -44440, 22750, 16626, -13090, -27864, -39342, -52645, -66397, -94464, -82684, -55845, 3575, 10241, -18571, 14990, -48898, -65424, -97948, -86899, -26641, -29475, -30679, -50839, 20545, 5823, -3102, 13235, 19626, -34399, -20766, -19201, -34143, -6479, -41258, -64908, -33139, -34457, -23217, 45818, 28149, -21539, -26603, 42941, 5913, -36956, -1442, 14479, 4253, -49629, -15893, -8320, -18149, 55733, 83328, 53967, -4242, -29694, -25726, -41085, -55006, -86456, -82691, -5143, 24880]
1298B4880k4983K9539M0643n0158p9022K8184K1626l6133k6364L3080N5907n0126
1286c2927R021K5125p6113m816p968j076P067P132K828L76M8424j6279K3305p125
1272b3026K9021Q37J0902j8955o3986K5270L0730j4527J6606j4845k8014o692
1260e6679J0354O878M8736k9568P951k051p024K603N3912k8655k5103q855k5537
1247e3038K0944j2025J9852j3073R480L2860j4337P3443K7280l2415j9576R138
1235D8533n5176J822K3266n1241Q280q092N789l0795M3684P1923K3240n2188M5727
1222G4772m2318J0583j1530o3349l1419L2127R621N3615J8554J6922l7698J8607
1210D8487m9435l39r898k2114K0037J5595M7722J0489k4294m9060L9882r498L069
$$ y = [24880, -103, 29436, 70079, 19921, -59101, -30917, -9291, -45424, -71788, -38708, 17199, -32927, -23906, 1219, -74894, -79710, -87678, -88754, -81687, -74555, -71727, -71351, -22927, -39206, -15901, -23026, 5995, 6832, 17734, -1221, -65207, -39937, -9207, -23734, -7128, -21973, -49987, -56679, -46325, -39447, 9289, -20279, -12328, -14379, -21403, -18800, 35112, 6457, -18646, -27501, -53038, -32094, -44119, -24267, -37340, -27860, 5000, -9337, 64106, 91386, 58971, 39395, 48533, -6643, -4821, 18445, -32796, -24516, -32608, -26819, -57614, -13930, 57993, 81233, 29045, 74772, 32454, 43037, 31507, -31842, -63261, -31134, -21513, 32102, 50656, 67578, 29880, 48487, -948, -1287, -11185, -33299, -13262, 2333, 50055, 60544, 36250, -12810, 27072, 17574, 20643]
1197B0643J2299m1377n9970j1089M7769l0715N04N6152K6382J2903j7886j4345
1185A270l1941M8615Q573j6678K2962n8296j9838M0451L5082l4256O231K1788
1173B3963q2302l051O4965J6916J0481J7196J6987J3789k7157j5590O011L6819
1161G9027J5585j100m91k635k8255l5677j7653N2476k3463n1968l583K3683Q9
1148F035j5080M6418P0838j6284k0218q186r12n4836n153O8502N765K1448J0993
1135A09330m6926k5983J9885K0765j2657p124k4021L6015n836k1689K7426P770
1123G6955l1653m2961M5083L3439n9619R447m4289k087O8879j7003K3030M512
1111F3733j8125M2481J9330K0859K7123k230M95M993L4089m3936m5358j0841l3444
$$ y = [20643, 32942, -8435, -68405, -79494, -31725, -62440, -61936, -5784, 20598, 33501, 15615, 1270, -30671, 17944, 26517, 9839, 32801, -25495, -45333, -4882, 30200, -4056, 2175, 23963, -58339, -61390, 3575, 20491, 30972, 48168, 65155, 78944, 51787, 36197, 42208, 79027, 94612, 93512, 93021, 90386, 62131, 26454, 8801, 61277, 37814, -14154, -17737, 5946, 6035, -9045, 37373, 108211, 91927, 71709, 63523, 62611, 7775, 2622, 71124, 76889, 98337, 109330, 62404, 36421, 56306, 77071, 64414, 57290, 33269, 69284, 63448, 41759, 69185, 76955, 45302, 2341, 47424, 80863, 21244, 30691, -13598, -15685, 53194, 36191, 59221, 63733, 45608, 88089, 107419, 128278, 155401, 153171, 153666, 158659, 192748, 148812, 103454, 92613, 59169]
1098E9169P43O4848k7171m3653K8844R53L0285J4304l0359M0721N1468L472j7420
1085A76204o1284m8324L502K9138o884L6192M0149L0152j715q918K8453l8916
1073A77749l4480O156J1210j917O542L5967j3750J9803N2145q510k527L5546l4016
1060B49918p3019O5095K9804J4122m9586o323N7365j3095j5094k3269j0310m819
1048B20789L4897k553Q7657K3527j6613L6423j9498K2459j7639m5088j4877K1706
1036C31190R243m884J0441R5657R5567m6545j6216L5481O554P15K5277M3666p7584
1023E08562j1120l9242K8930O8623L1257j5229J7423K0837j1519n637M4594J0094
1011F47573p4690l2928K2419P6690L8372r580j7155k3441P8319J6289M4722J0131
$$ y = [59169, 59912, 124760, 97589, 53936, 82780, 83733, 114018, 128322, 97963, 138684, 190152, 193624, 176204, 114920, 66596, 70098, 99236, 92352, 128544, 168693, 198845, 197130, 188212, 216665, 177749, 143269, 149425, 160635, 158718, 165260, 201227, 187477, 207280, 259425, 250915, 248388, 283934, 249918, 176899, 241994, 271798, 285920, 236334, 230011, 287376, 274281, 259187, 235918, 225608, 220789, 255686, 253133, 340790, 364317, 347704, 384127, 364629, 387088, 369449, 324361, 309484, 331190, 340433, 335549, 345990, 441647, 537214, 490669, 474453, 509934, 516488, 517203, 542480, 586146, 508562, 497442, 458200, 487130, 555753, 587010, 571781, 589204, 610041, 598522, 592885, 637479, 647573, 572883, 539955, 562374, 639064, 677436, 667856, 650701, 627260, 705579, 721868, 766590, 776721]
999G76721j4386N8860O9872M8119j8819Q3812O7770N5684J8042M2479L4309L7352
987A259815J24406O5820M7189J13709J18153J45945J20548J33865Q4426J37442
977B351318J58209K21966K71099K31270K57848L59390K91330J86048K16847K48131
967D793456L94584N08324O35879P09497R00553J149831J536104K001496K593968
958A5223692L435561M396146L401973j435389n680631n100109l057068j986934
950I197241j332887j156128r92429p52696m64532m12650k93068k40892j92432
941C359527q5317j19922j97656k41551k69558k29586j51973j43542j02173p8150
931A740099l7161p6929j01713n8475o2633m1651q4106n7650n2162q323p5262q9661
$$ y = [776721, 762335, 821195, 891067, 939186, 920367, 1004179, 1071949, 1127633, 1145675, 1188154, 1222463, 1259815, 1384221, 1450041, 1497230, 1610939, 1729092, 1875037, 1995585, 2129450, 2213876, 2351318, 2509527, 2731493, 3002592, 3233862, 3491710, 3851100, 4142430, 4328478, 4545325, 4793456, 5188040, 5696364, 6332243, 7041740, 7942293, 9092124, 10628228, 12629724, 15223692, 18659253, 23055399, 26457372, 25021983, 19341352, 14241243, 11184175, 9197241, 7864354, 6708226, 5715797, 4963101, 4498569, 4085919, 3792851, 3551959, 3359527, 3274210, 3154288, 2956632, 2715081, 2445523, 2215937, 2063964, 1920422, 1818249, 1740099, 1702938, 1626009, 1524296, 1465821, 1403188, 1361537, 1277431, 1219781, 1167619, 1159296, 1084034, 994373]
919I94373m0174j6426k2757l6437j3293j7892Q19o8982m4733q646o415J1153p0718
906F59872L729L7444n1122o5921k2173n6868J1232q688n98l5691P274k9483l1691
893D17316r954l4799k1797l0334O8835k9896o2263k857k090l7020O5005L5747
881C55893k3536n6873l265M1545N1971k5052J8573l7322m9138L913o196P980k2411
868B56082K3035O8730k6905m5075M73m4677p3213M1468P7980K7696l9196j8437
856B47961m0025K4145M2562p0667m7830J381j5505j1647K638o102L0822M3415
844B01148K3271K7282l6584r7562J0328j7244J2709J6628K8721l4491o9243M2568
832A07531N8109m7325l6746Q665J2893O9154k9194k9285o272P396l0835j7521
$$ y = [994373, 954199, 937773, 915016, 878579, 865286, 847394, 848213, 779231, 734498, 725852, 719437, 730590, 659872, 663601, 701045, 649923, 584002, 561829, 504961, 516193, 507505, 506907, 471216, 478490, 449007, 417316, 407362, 372563, 350766, 320432, 389267, 359371, 297108, 294251, 292161, 255141, 320146, 355893, 332357, 275484, 272219, 313764, 365735, 340683, 359256, 321934, 272796, 276709, 270513, 278493, 256082, 279117, 347847, 320942, 275867, 276340, 231663, 158450, 199918, 277898, 305594, 266398, 247961, 207936, 232081, 274643, 203976, 156146, 157527, 142022, 130375, 133013, 126911, 157733, 201148, 224419, 251701, 215117, 117555, 127883, 110639, 123348, 139976, 168697, 134206, 64963, 107531, 165640, 118315, 81569, 90234, 103127, 172281, 143087, 113802, 107530, 114926, 84091, 66570]
820F6570k1478j9757K3039M7037K4496p046n0604l8342j6478j683L6631L3394
808G5779J3015n822n3923k8009O2687Q092k3927O188L9133J5959k395j1054l5020
795F0703m6828K7039J4768R133K4275j1882J3373l0799q0694M232O5863n108l6072
782H003j0647J9839Q36J3256M1924n8133K4348n382o3344O9133m6938M088M9528
769D6511j0172J9126k6270k4158r08Q432l865J0640J3876o955n4200L5808L3972
756D1837J8220n4202k599K8890l4269j3981j121L7895k5227O48K5464J3889o725
743B8719J4832n1760r107L4698j3266m0758l0232O7203J8726J4787M498K3086
731F1426m9393R200l4784J7383N9503l7995K2439J0959j7724m6202M8113j9738
$$ y = [66570, 45092, 25335, 48374, 95411, 119907, 112861, 62257, 23915, 7437, 5754, 42385, 75779, 88794, 82972, 29049, 1040, 63727, 71819, 47892, 54080, 93213, 109172, 106777, 95723, 60703, 13875, 40914, 55682, 64815, 89090, 77208, 90581, 59782, -20912, -16680, 49183, 44075, 8003, -2644, 17195, 18031, 31287, 73211, 15078, 39426, 34044, -29300, 39833, -7105, -3017, 46511, 36339, 55465, 29195, 5037, 4129, 12561, 8696, 19336, 33212, 26257, -27943, 7865, 41837, 60057, 5855, 3256, 32146, -2123, -16104, -17225, 20670, -4557, -3909, 21555, 35444, 28719, 43551, -8209, -17316, 17382, 4116, -36642, -66874, 329, 19055, 33842, 38340, 61426, 12033, 21233, -13551, 3832, 63335, 25340, 47779, 58738, 41014, -5188, 42925, 23187]
719B3187m3713M9317M8818j3472n0842m0369k4186j0889J548M2558J174m1643
707e8512M9407L3243j11L1451J185k668j8994n7334J1021M4973J7809l2849j519
694A7102N7493k7374n806m3335j8498N2210M882m285j9150l7956m626N576k5957
681d9724J1731J8107L7214J1510k1010p371q011N6502K2973o815k2709N1225o562
668H7060J9902r040k7456K5190j3657l2972m8766k3848K1190K1688l5593K7636
656A1334M2714l678m7411o271J008J5967M526k0147M1137j8903n3624J9703L3079
643A9434J3844m6142j9513r828l4796K5993K3897j0870L6444m485k618n2513J4547
630d6606J5756n385K1736K77k1381O1658l2247j5299K8452n3599l9036M6852K4588
$$ y = [23187, -20526, 28791, 77609, 64137, 13295, -27074, -51260, -62149, -60601, -18043, -16869, -58512, -9105, 24138, 24027, 55478, 56663, 53995, 35001, -22333, -11312, 33661, 51470, 18621, 17102, 74595, 47221, 41415, -1920, -20418, 31792, 36674, 32389, 13239, -24717, -29343, -23767, -49724, -37993, -19886, 17328, 28838, 7828, 457, -7554, 48948, 71921, 65106, 42397, 93622, 87060, 106962, 97922, 70466, 95656, 81999, 49027, 261, -23587, -2397, 19291, -16302, 11334, 54048, 50370, 2959, -3312, -2304, 13663, 18189, -1958, 39179, 20276, -33348, -13645, 19434, 33278, -12864, -32377, -42205, -77001, -51008, -27111, -37981, -1537, -6022, -8640, -61153, -46606, -30850, -36235, -14499, -14222, -35603, 26055, -6192, -21491, 6961, -46638, -85674, -38822, -14234]
617a4234K7693n8458L553R865j9398L1232k3631P226K8325k1612N081K0993p681
604a1046J814n450O016n2728L6674l0704J4949P708J5821J0982j836O389o6733
591f8144J3834J2812P572K8788j0379O4998k7374j4389Q190o423k2926k1018R300
578b5159j8019M2584l331P785K2329J7530o5045M185J0768l0917j4086K6413n669
565c0632P589O6097l7749k5770M374M8323p4531J5938J5989O364k570N6n4958
552f1480K0179l174j8671j2899K3867M1495j2047k6791l2869L1555L9430j4674
540b6079o4298K841P3307O092Q629J3439l0935N9391k4991P334q674l756k5733
527a3433l5273m635M5208j7942m5982l011K5111J2330J8777k722L171J9174J7640
$$ y = [-14234, 13459, -44999, -41446, -31581, -50979, -19747, -43378, -36152, -7827, -29439, -24358, -3365, -11046, -9232, -14682, -8666, -61394, -24720, -55424, -40475, -32767, -16946, -5964, -7800, -1411, -68144, -54310, -41498, -33926, -5138, -15517, 49481, 22107, 7718, 15908, 9485, -13441, -34459, -25159, -43178, -594, -3925, 3860, 26189, 43719, -21326, -17141, -6373, -37290, -51376, -24963, -30632, -23043, 43054, 5305, -20465, -16091, 32232, -42299, -26361, -10372, -4008, -6578, -6522, -61480, -41301, -44475, -63146, -76045, -52178, -10683, -22730, -49521, -82390, -50835, -11405, -26079, -90377, -87536, -14229, -8137, 492, 13931, -17004, 42387, 17396, 24730, 16056, 12300, -13433, -48706, -53341, -8133, -26075, -72057, -75068, -49957, -37627, -18850, -21572, -18401, 773, 18413]
514A8413o2603K1502L2480r613L301m41l4626j5121K6698K1506K9716k7046j3085
501h919L087n7577n3156Q4174R711m673Q367M110l0723m465o981Q644N6379K3573
487C1551k5131P679M31j2832l0157J7330n917k1071L995k9167n9432O6627N380
474e0714l028q530n5418J6218L6908R466q020K2572j84j2742m261N5087j2007
461a4653k901l107p930L2082L892n2627k5397J6906O0040j28696L9955M7794R12
448c3730l2467J1431K1458o742K9608j6494L159j5623J4976k6087m994m3519L0810
435f8214K6805l3048N9524M0951o7814m7790N9552M0157o9908J5620j413K0330
423b5248p693R94j0286n874k7716K2211P2499n6421l6677L1552k757M075L4898
$$ y = [18413, -44190, -22688, 9792, 179, 3480, 3039, -31587, -46708, -20010, 1496, 31212, 4166, -8919, -5832, -63409, -116565, -32391, -22680, -27353, -18986, -14876, -45599, -50064, -57045, -48401, 7978, 31551, 6420, 14099, 14530, 1698, -28459, -11129, -17046, -38117, -34122, -63289, -122721, -56094, -50714, -53742, -62272, -117690, -101472, -64564, -55098, -63118, -40546, -40730, -53472, -57733, -2646, -14653, -17554, -20661, -28591, 3491, 7383, -45244, -70641, -53735, 6305, -122391, -82436, -34642, -33730, -66197, -54766, -33308, -40050, -10442, -26936, -23777, -39400, -24424, -50511, -55505, -99024, -68214, -41409, -74457, -14933, 26018, -41796, -89586, -30034, 10123, -59785, -44165, -45578, -25248, -32941, -31947, -42233, -48107, -75823, -53612, 18887, -37534, -74211, -42659, -45416, -41341, -6443]
410f443k646m9166n5784l058m7816P0013L7173j0876j9164l1135N2594J9157o8001
397a15152J5573P860q080J6115l4432j7066O4350J572j2674R143J9042l0673O863
384g7559L2264r254J0562j8591l9454K6593L7564j9547M4020M8971k1973n6552
372d2956j9312j4954p718j5577M4574k0212J4687K8291k2443r140Q504k5646K8312
359e3590l2041J132N862L4694q023q148j2846k8451j0101n7453J2301j032N225
346a52471j014L9162J2119O107K0002l0365m0373M0018j1154K6004k4537j511
334a18013j9543n7877L6716M2288k4804R795K6677j1172L8186J8986j1174m0996
322a10931J3140M5366l633l1303P569L1163m3286L6188R714j1951j5446l9614
$$ y = [-6443, -9089, -58255, -114039, -117097, -164913, -94900, -57727, -68603, -87767, -118902, -66308, -47151, -115152, -99579, -91719, -99799, -83684, -118116, -135182, -70832, -69260, -81934, -72791, -53749, -84422, -77559, -45295, -54549, -43987, -62578, -102032, -75439, -37875, -57422, -13402, 35569, 13596, -42956, -62268, -77222, -84940, -100517, -55943, -76155, -61468, -33177, -55620, -64760, -56256, -81902, -53590, -85631, -84499, -78637, -43943, -51966, -60114, -72960, -101411, -111512, -168965, -156664, -157696, -152471, -153485, -114323, -102204, -96097, -76095, -106460, -146833, -106815, -117969, -91965, -116502, -118013, -137556, -195433, -158717, -116429, -141233, -131438, -104761, -115933, -77747, -58761, -69935, -110931, -97791, -52425, -56058, -87361, -79792, -48629, -91915, -55727, -46013, -57964, -73410, -113024]
310a13024q056M838J8868j1464K0091k3332M2926J0619K5088l1577l9147o8713
298a72883j3799N1983q068K5303M4094l5617l7007M5910m668j6658k7472R9370
286d9512M2000l1152j1930l3075l5979K6493J5200k4616J588K4596o3378k9590
274a69355K2756j2373J14968L4335j6952m8020k8520l3152j8134J5230N844k2496
262a55869L9877K9816J5154k8282j4957N3174n855j7535k3100L0116j8315j8105
250a13881K1164j7089J9639n3276m844N5104n867J7216l770O24n509Q491Q347
237g3651L4115p4015o5367m0879J2841M6928L0534K7455K7278n0378l2284L5260
225a22163K5692k2735l8588j2172L6122P7189j4009j6600p711L3049n1691J4563
$$ y = [-113024, -121080, -116242, -97374, -108838, -88747, -112079, -69153, -58534, -33446, -65023, -104170, -172883, -186682, -134699, -142767, -117464, -73370, -108987, -145994, -100084, -104752, -121410, -148882, -49512, -7512, -38664, -50594, -83669, -119648, -93155, -77955, -102571, -100983, -76387, -139765, -169355, -146599, -158972, -44004, -9669, -26621, -74641, -103161, -136313, -154447, -139217, -133373, -155869, -115992, -86176, -71022, -99304, -114261, -61087, -66942, -84477, -107577, -77461, -95776, -113881, -92717, -109806, -90167, -143443, -148287, -93183, -99050, -81834, -85604, -84980, -90489, -81998, -73651, -39536, -113551, -178918, -219797, -206956, -160028, -129494, -102039, -74761, -125139, -157423, -122163, -96471, -119206, -157794, -169966, -133844, -56655, -70664, -87264, -94975, -61926, -113617, -99054]
213i9054L0428m9806l5644M5568J8837m3078J8635J2944p649j3203J8543J6802
201h6677j1377M235l5387m2913O682O1164K108m7564k4227l2645P0974P1079k9087
188i3635l1828j5189m812L7609n387n7007J1563L9615J2869M0103l3254l4304
176a33657J6862J7282l1129J41J5879k41M7166M5488q5610j3483J2582J9361o513
163i5872J3018m6585j1847j4310k2626J9850j8590K6752N0718k1178m419N97l358
150a27850j1217m1428O1794j6665L998j415R185P553J9138j4441m9546j057R56
137a60995k045j6412O71J6494l1665K6339K0197K5771J6207N846k1406n63K2459
124i9102J4973J6991J8573j9424m9424j4983J4209L7811k6137l0300k4221N3488
$$ y = [-99054, -68626, -118432, -154076, -108508, -89671, -132749, -114114, -101170, -108819, -122022, -103479, -86677, -98054, -93819, -129206, -172119, -165437, -104273, -102165, -149729, -173956, -206601, -135627, -64548, -93635, -125463, -140652, -145464, -107855, -113242, -170249, -158686, -119071, -106202, -66099, -99353, -133657, -116795, -99513, -130642, -130501, -114622, -114863, -67697, -22209, -107819, -121302, -108720, -89359, -95872, -82854, -129439, -141286, -155596, -178222, -158372, -176962, -150210, -99492, -120670, -125089, -124492, -127850, -139067, -180495, -118701, -135366, -131368, -132783, -123598, -116045, -96907, -111348, -160894, -161951, -160995, -163040, -179452, -178781, -162287, -193952, -167613, -147416, -121645, -105438, -99592, -120998, -121561, -99102, -84129, -67138, -48565, -67989, -117413, -132396, -118187, -80376, -106513, -136813, -161034, -107546]
112a07546O9105o0181k5526P194j1036j9922o739n531k286J6764l1822L0201L4949
99a12376J14N984m4812L3506l8577J3317L7885k6241m320j2741P905L1114K5768
86h3474m1678m2621J8317k9157K7374j7736m202M7897l7974L1700L585N469r715
73a32215k1217L8891P961r350j5065k6862l0590J5481L0963n753n966L0240K7013
60i6469p342l2732j7550k1525J4387J339J084J3266K345l866J9950R40n534o179
46a37886L705q134m486k2725l9962L3223q58J5338m430p349j3975K8781M2469
33a16289J1245l9601q599J7362k7555l0917O9089j9361k4673L6131m5746K7742
21a51172M9155l1558j3251r910k714j729L6184j9120k2200K454J2288n355l9493
$$ y = [-107546, -38441, -98622, -124148, -116954, -127990, -147912, -154651, -160182, -162468, -145704, -177526, -147325, -112376, -112262, -106278, -151090, -117584, -156161, -142844, -104959, -131200, -135520, -148261, -140356, -109242, -83474, -125152, -167773, -149456, -178613, -151239, -168975, -173177, -125280, -163254, -131554, -127969, -122500, -132215, -153432, -114541, -106580, -115930, -130995, -157857, -188447, -172966, -142003, -147756, -153722, -123482, -96469, -103811, -136543, -154093, -175618, -161231, -159892, -158808, -145542, -143197, -147063, -127113, -126173, -131707, -137886, -134181, -142315, -146801, -169526, -209488, -176265, -177123, -161785, -166215, -173564, -187539, -158758, -116289, -105044, -144645, -153244, -135882, -163437, -194354, -125265, -144626, -169299, -133168, -178914, -151172, -102017, -133575, -146826, -156736, -159450, -161179, -124995, -144115, -166315, -163861, -151573, -156928, -196421]
8a96421O014K8437K9505K0906P138k9945n431m065
0a43862
$$ y = [-196421, -190407, -161970, -132465, -111559, -104421, -134366, -139797, -143862]
$$ Imaginary data points
##PAGE= N=2
##DATA TABLE= (X++(I..I)), XYDATA
16383h50560L0099K4875K4861k237q520K1344M6255L3159m5197k3136N0267L1862
16371f66928J8936k5693L995K8662O3424J9143K5200K4721j018J3102j5393j1084
16359e22933K8851O3964P927j0830R514K1675J4787R271J432L1870j4621K4063
16347c35030J1227K3281K7991j5171L4988J2922J8303k8159k2651L302M8536J8111
16335b02350Q789r958M4411L9505K8565J1841j3205M4942p494K1259l534K4701
16323a2528Q116J0400J7500j6662P270J1655K8313m156K8089l727L7119M9551
16311A60940K2179l7499J9088K5790n214Q494N7828L5564n5336J2273l8446N3852
16299B59513N4307J1275M303M3158j0018l468N8009M2761K3559l4202j5600j749
$$ y = [-850560, -820461, -795586, -770725, -772962, -781482, -760138, -713883, -680724, -725921, -749057, -698790, -666928, -647992, -673685, -669690, -641028, -577604, -558461, -533261, -508540, -509558, -496456, -511849, -522933, -494082, -430118, -422191, -433021, -423507, -401832, -387045, -377774, -376342, -344472, -359093, -335030, -323803, -300522, -272531, -287702, -252714, -239792, -221489, -249648, -272299, -268997, -220461, -202350, -193561, -203519, -159108, -119603, -91038, -79197, -92402, -47460, -54954, -33695, -37229, -12528, -4412, 5988, 23488, 6826, 14096, 25751, 54064, 49908, 77997, 74270, 111389, 160940, 183119, 145620, 164708, 190498, 185284, 193778, 251606, 287170, 231834, 244107, 205661, 259513, 313820, 325095, 329398, 372556, 362538, 359070, 417079, 459840, 483399, 449197, 433597, 431848]
16287D31848N71k9117J2996J0962K6395J3230M0408K8274M0454k3330p518J8708
16275E63881J8850k1377j6899N3216K9102l0760j559j5346J5067J1802l0156L6769
16263F12590N1434M4091j2025L774J1073M9083j7886m282l2187n2027N4175O8894
16251G76707Q835J1432n417J6962j6926j5725J3187J9227L4025j6150j28J9348
16239H45377Q423j3193j0642N2067O6117n997l5563j2872L8949J5026K1586l1328
16227I37950l5852l5895M7825J4947m238M6265J4121P4548J1377k3658j2333k2132
16215A012925P165J5842N1303L4828n8335L621L6459j0494J8132q371m1773n668
16203A055634M6M3044l3309J5622k0553P440L7480J1609k2000J6978L0332J0323
$$ y = [431848, 432419, 403302, 416298, 427260, 453655, 466885, 507293, 535567, 576021, 552691, 545173, 563881, 582731, 561354, 544455, 597671, 626773, 596013, 594454, 579108, 594175, 605977, 575821, 612590, 664024, 708115, 696090, 699864, 710937, 760020, 742134, 737852, 705665, 653638, 707813, 776707, 785542, 796974, 791557, 808519, 791593, 775868, 789055, 808282, 842307, 826157, 826029, 845377, 853800, 840607, 829965, 882032, 948149, 942152, 906589, 893717, 932666, 947692, 969278, 937950, 902098, 866203, 914028, 928975, 924737, 971002, 985123, 1059671, 1071048, 1047390, 1035057, 1012925, 1020090, 1035932, 1087235, 1122063, 1063728, 1067349, 1103808, 1093314, 1111446, 1103075, 1061302, 1055634, 1055680, 1098724, 1065415, 1081037, 1060484, 1067924, 1105404, 1117013, 1095013, 1111991, 1142323, 1152646]
16191A152646K0950l3909o350P001k059L722M8349j378k6283N133k0082n0905
16179A096835L1018O6681O2745j0420r4506p113j4580N9802K4999R226l0857m4482
16167A149348J0131M3448L8520J3033K0802J2876l8838M0469l6684K9094M5230
16156A327429j8077j5291p096j558m0166N7494j8008q104r542K0514K8385J0781
$$ y = [1152646, 1173596, 1139687, 1133337, 1140338, 1138279, 1142001, 1190350, 1188972, 1162689, 1167822, 1147740, 1096835, 1127853, 1194534, 1257279, 1246859, 1152353, 1145240, 1130660, 1190462, 1215461, 1224687, 1193830, 1149348, 1159479, 1202927, 1241447, 1254480, 1275282, 1288158, 1249320, 1289789, 1253105, 1282199, 1327429, 1309352, 1294061, 1286965, 1285407, 1245241, 1302735, 1284727, 1276623, 1267081, 1287595, 1315980, 1326761]
$$ [...]
##END NTUPLES=NMR SPECTRUM
##END=
