##TITLE=1H_CA-8802-2
 CDCl3, 8 sc, 
 25.12.2020
##JCAMPDX= 6.0         $$ Bruker NMR JCAMP-DX V2.0
##DATA TYPE= NMR SPECTRUM
##DATA CLASS= NTUPLES
##ORIGIN= UXNMR, Bruker Analytische Messtechnik GmbH
##OWNER= root
$$ XWIN-NMR		Version 3.5
$$ Fri Dec 25 11:52:47 2020 Russian Standard Time (UT+4h)  she@DPX200
##.OBSERVE FREQUENCY= 200.1315066352
##.OBSERVE NUCLEUS= ^1H
##.ACQUISITION MODE= SIMULTANEOUS
##.ACQUISITION SCHEME= undefined
##.AVERAGES= 8
##.DIGITISER RES= 18
##SPECTROMETER/DATA SYSTEM= spect
##.PULSE SEQUENCE= zg30
##.SOLVENT NAME= CDCl3
##.SHIFT REFERENCE= (INTERNAL, CDCl3, 0, 16.002)
##AUDIT TRAIL= $$ (NUMBER, WHEN, WHO, WHERE, WHAT)
$$ ##TITLE= Audit trail, XWIN-NMR		Version 3.5
$$ ##JCAMPDX= 5.01
$$ ##ORIGIN= Bruker BioSpin GmbH
$$ ##OWNER= she
$$ F:/spectra/data/she/nmr/H-F/1/pdata/1/auditp.txt
$$ ##AUDIT TRAIL=  $$ (NUMBER, WHEN, WHO, WHERE, WHAT)
(   1,<2020-12-25 11:50:53.90 +0400>,<she>,<DPX200>,
      <created by zg, POWCHK disabled, PULCHK disabled
       configuration hash MD5:
       00 E9 B6 7A A2 85 ED C7 34 08 36 98 17 FE 4E 26
       data hash MD5: 16K
       4C 75 B8 C4 D2 F4 F9 ED BC 99 8D 02 F9 DF 5D 21>)
(   2,<2020-12-25 11:50:56.31 +0400>,<she>,<DPX200>,
      <Start of raw data processing
       efp BC_mod = 2 LB = 0.24 FT_mod = 6 PKNL = 1 PHC0 = -10759.5 PHC1 = 7.800954 SI = 16K 
       data hash MD5: 16K
       C1 AF 9E C9 D9 71 7F FB B4 A8 EF F8 6C 21 70 D1>)
(   3,<2020-12-25 11:51:25.67 +0400>,<she>,<DPX200>,
      <pk PHC0 = 2.091587 PHC1 = -3 
       data hash MD5: 16K
       40 2F FA B4 29 31 D0 F2 8A FA 8D 1F D1 A3 5C E5>)
(   4,<2020-12-25 11:51:29.73 +0400>,<she>,<DPX200>,
      <abs ABSG = 5 
       data hash MD5: 16K
       4F F6 9F 6F D0 FB 60 BC 6F AE 52 14 47 B7 AF 77>)
(   5,<2020-12-25 11:51:48.18 +0400>,<she>,<DPX200>,
      <pk PHC0 = -0.317035 PHC1 = 0.6 
       data hash MD5: 16K
       E3 CA B8 FC 7B BE 83 56 DF 7A 87 3D 87 6F AA D0>)
(   6,<2020-12-25 11:51:51.82 +0400>,<she>,<DPX200>,
      <abs ABSG = 5 
       data hash MD5: 16K
       2E F6 32 DA 58 57 2D 7C 71 DB 86 50 B5 E6 9B A5>)
$$ ##END=
$$ 
$$ hash MD5
$$ 3A A3 82 AC 18 32 D2 41 3D 5B 87 B2 F8 65 AA 91
##$RELAX= 
##$RELAX= 
##$RELAX= 
##$RELAX= 
##$RELAX= 
##$RELAX= 
$$ Bruker specific parameters
$$ --------------------------
##$DU= <F:/spectra>
##$EXPNO= 1
##$NAME= <H-F>
##$PROCNO= 1
##$TYPE= <nmr>
##$USER= <she>
##$AMP= (0..31)
100 100 100 100 100 100 100 100 100 100 100 100 100 100 100 100 100 100 
100 100 100 100 100 100 100 100 100 100 100 100 100 100 
##$AQSEQ= 0
##$AQ_mod= 1
##$AUNM= <au_zg>
##$AUTOPOS= <>
##$BF1= 200.13
##$BF2= 200.13
##$BF3= 200.13
##$BF4= 200.13
##$BF5= 200.13
##$BF6= 200.13
##$BF7= 200.13
##$BF8= 200.13
##$BYTORDA= 1
##$CFDGTYP= 0
##$CFRGTYP= 5
##$CHEMSTR= <none>
##$CNST= (0..31)
1 1 145 1 1 1 1 1 1 1 1 1 1 1 1 1 1 1 1 1 1 1 1 1 1 1 1 1 1 1 1 1 
##$CPDPRG= <>
##$CPDPRG1= <>
##$CPDPRG2= <>
##$CPDPRG3= <>
##$CPDPRG4= <mlev>
##$CPDPRG5= <mlev>
##$CPDPRG6= <mlev>
##$CPDPRG7= <mlev>
##$CPDPRG8= <mlev>
$$ [...]
##$SUBNAM3= <"">
##$SUBNAM4= <"">
##$SUBNAM5= <"">
##$SUBNAM6= <"">
##$SUBNAM7= <"">
##$SUBNAM8= <"">
##$SUBNAM9= <"">
##$SW= 16.9725356469052
##$SWIBOX= (0..15)
0 0 2 0 0 0 0 0 0 0 0 0 0 0 0 0 
##$SW_h= 3396.73913043478
##$TD= 16384
##$TD0= 1
##$TE= 0
##$TE2= 300
##$TE3= 300
##$TEG= 300
##$TL= (0..7)
0 120 120 120 120 120 120 120 
##$TP= (0..7)
150 150 150 150 150 150 150 150 
##$TP07= 0
##$TPNAME0= <>
##$TPNAME1= <>
##$TPNAME2= <>
##$TPNAME3= <>
##$TPNAME4= <>
##$TPNAME5= <>
##$TPNAME6= <>
##$TPNAME7= <>
##$TPOAL= (0..7)
0.5 0.5 0.5 0.5 0.5 0.5 0.5 0.5 
##$TPOFFS= (0..7)
0 0 0 0 0 0 0 0 
##$TUNHIN= 0
##$TUNHOUT= 0
##$TUNXOUT= 0
##$USERA1= <user>
##$USERA2= <user>
##$USERA3= <user>
##$USERA4= <user>
##$USERA5= <user>
##$V9= 5
##$VALIST= <valist>
##$VCLIST= <CCCCCCCCCCCCCCC>
##$VD= 0
##$VDLIST= <DDDDDDDDDDDDDDD>
##$VPLIST= <PPPPPPPPPPPPPPP>
##$VTLIST= <TTTTTTTTTTTTTTT>
##$WBST= 1024
##$WBSW= 4
##$XGAIN= (0..3)
0 0 0 0 
##$XL= 0
##$YL= 0
##$YMAX_a= 942912
##$YMIN_a= -380809
##$ZGOPTNS= <>
##$ZL1= 120
##$ZL2= 120
##$ZL3= 120
##$ZL4= 120
##$ABSF1= 15.98335
##$ABSF2= -0.9893122
##$ABSG= 5
##$ABSL= 3
##$ALPHA= 0
##$AQORDER= 0
##$ASSFAC= 0
##$ASSFACI= 0
##$ASSFACX= 0
##$ASSWID= 0
##$AUNMP= <proc_1d>
##$AZFE= 0.1
##$AZFW= 0.1
##$BCFW= 0
##$BC_mod= 2
##$BYTORDP= 0
##$COROFFS= 0
##$CY= -3
##$DATMOD= 1
##$DC= 0
##$DFILT= <>
##$DTYPP= 0
##$F1P= 0
##$F2P= 0
##$FCOR= 1
##$FTSIZE= 16384
##$FT_mod= 6
##$GAMMA= 0
##$GB= 0
##$INTBC= 1
##$INTSCL= 2.992141e-10
##$ISEN= 128
##$LB= 0.24
##$LEV0= 0
##$LPBIN= 0
##$MAXI= 10000
##$MC2= 0
##$MEAN= 0
##$ME_mod= 0
##$MI= 1.114404
##$NCOEF= 0
##$NC_proc= -5
##$NLEV= 6
##$NOISF1= 3.799351
##$NOISF2= 2.8
##$NSP= 0
##$NTH_PI= 0
##$NZP= 0
##$OFFSET= 16.002
##$PC= 1
##$PHC0= -10757.73
##$PHC1= 5.400954
##$PH_mod= 1
##$PKNL= yes
##$PPARMOD= 0
##$PSCAL= 0
##$PSIGN= 0
##$REVERSE= no
##$SF= 200.1300025253
##$SI= 16384
##$SIGF1= 3
##$SIGF2= 2
##$SINO= 5.538805
##$SIOLD= 16384
##$SREGLST= <1H.CDCl3>
##$SSB= 0
##$STSI= 16384
##$STSR= 0
##$SW_p= 3396.73913043478
##$SYMM= 0
##$S_DEV= 0
##$TDeff= 16384
##$TDoff= 0
##$TI= <>
##$TILT= no
##$TM1= 0
##$TM2= 0
##$TOPLEV= 0
##$USERP1= <user>
##$USERP2= <user>
##$USERP3= <user>
##$USERP4= <user>
##$USERP5= <user>
##$WDW= 1
##$XDIM= 16384
##$YMAX_p= 328798643
##$YMIN_p= -400705
$$ End of Bruker specific parameters
$$ ---------------------------------
##NTUPLES= NMR SPECTRUM
##VAR_NAME=  FREQUENCY,     SPECTRUM/REAL,   SPECTRUM/IMAG
##SYMBOL=    X,             R,               I
##VAR_TYPE=  INDEPENDENT,   DEPENDENT,       DEPENDENT
##VAR_FORM=  AFFN,          ASDF,            ASDF
##VAR_DIM=   16384,         16384,           16384
##UNITS=     HZ,            ARBITRARY UNITS, ARBITRARY UNITS
##FACTOR=    0.207333158178281, 1,           1
##FIRST=     3202.48046225815, 0,            0
##LAST=      -194.25866817663, 0,            0
##MIN=       -194.25866817663, -400705,      0
##MAX=       3202.48046225815, 328798643,    0
$$ Real data points
##PAGE= N=1
##DATA TABLE= (X++(R..R)), XYDATA
$$ [...]
11211I2941j23916R7105k324r1540L6874j1624k7502Q6305j6689N031M1516L127
11199H9304M9367j9295q8401O486k0065m8008J2761p9279L6661Q644L7643L9469
11187B5287j0833N9454N077j12570J7242P4367P121k8947k234J3024o1205Q915
11175e302O4204Q177Q3517r2738n7717q1028k7368l8991R9982K7568q9363N0567
11163e8492O6470P2367R3775k3189O026j30315p2263M2513n0243p4409p306P8551
11151e6515J26311J5779N3975L1732j29026j7038m766o7245j01509O6227O0442
11140b1633J6029L3305M6395j6497j2323j0102J0063p6643J5654j2427n4472R1455
11128H804k4915j304K8509N619J4249N3928p228k4927l5691P5024n7844q5445
$$ y = [92941, -30975, 66130, 63806, -27734, 9140, -2484, -29986, 56319, 39630, 44661, 86177, 89304, 138671, 119376, 30975, 37461, 17396, -30612, -17851, -97130, -60469, -51825, -14182, 25287, 14454, 73908, 78985, -33585, -16343, 58024, 65145, 36198, 33964, 46988, -14217, -5302, 58902, 67079, 150596, 57858, 141, -80887, -108255, -147246, -47264, -19696, -109059, -58492, 7978, 80345, 174120, 150931, 156957, 26642, -45621, -3108, -53351, -127760, -135066, -56515, 69796, 85575, 139550, 171282, 42256, 25218, 20452, -46793, -148302, -82075, -21633, -5604, 27701, 74096, 57599, 45276, 35174, 45237, -31406, -15752, -28179, -82651, 8804, -16111, -17415, 11094, 16713, 30962, 84890, 77662, 52735, 17044, 92068, 34224, -51221]
11116e1221J14211N9349Q850l2917J5679n5454M8255n7728j04783K0496J645j4173
11104d7791j7824j5813J05454l2731l8391P6421K5395l4416l615R848n6356q0082
11092a09901j3697j2366O2687j2209J3074J16651M9863l2775p404j08892K6473
11081b8496j4721m1806n1698M0699N2777J0402l2200N5483J14807r697n0073n3772
11069h295l3094l950j1434n5560O8902R5235l5564N1303Q6040n2954r3381j01270
11057i4022L6216N3915L819Q357J3250o9354N4472O5019L3382o2850j1473r6581
11045f5850j23183J25963O6784P209k9127p1416J24541L1954j20000K1679P8432
11034D6986k4036j0422j54533R3631N0341m8576Q5435J44186j3635k11171k0707
$$ y = [-51221, 62990, 122339, 131189, 98272, 113951, 58497, 106752, 49024, -55759, -35263, -33618, -47791, -65615, -81428, 24026, -8705, -47096, 29325, 54720, 20304, 16689, 26537, -29819, -109901, -123598, -135964, -73277, -85486, -72412, 44239, 94102, 61327, 53923, -54969, -28496, -43217, -85023, -136721, -96022, -43245, -32843, -65043, -9560, 105247, 95550, 45477, -8295, -41389, -45339, -56773, -112333, -43431, 51804, 16240, 67543, 153583, 100629, 7248, -94022, -57806, -3891, -72, 8285, 21535, -47819, 6653, 71672, 105054, 42204, 30731, -65850, -189033, -63070, 3714, 10923, -18204, -89620, 34921, 66875, -53125, -31446, 46986, 22950, 12528, -142005, -48374, 1967, -46609, 38826, 183012, 169377, -41794, -62501]
11023f2501N5344M6594P5695j05572m8615K331P1397Q8941J5473j04440L9256
11012G3903j472q5512j3730K8138L2404l1323O3923l14J7428j9489j10933K3621
11000b3356J19397n9634O439j2931l3778M2581K3032N1149m1270k3640n3793K4889
10988A9085j615p4505p068L2282K3254R4379l9606k3827n5709j02033J57361J9619
10976D1617L1536M3767j30945r1723J6660M358R3813K2882m7106J1042L311N7163
10964E6375J2489j0483o4541k1151k4669l2470O6159O8297P9585J619l6693o0096
10952C4421k2487n605M5639m7331m8401L4875o8628J451P3573P464Q7624l3100
10940E9495K4583j05515o2280L2924O7700m0957J2320l5340L5993L620O9027J51773
$$ y = [-62501, -7157, 39437, 115132, 9560, -39055, -36724, 34673, 123614, 139087, 34647, 73903, 72431, -13081, -26811, 1327, 33731, 2408, 66331, 66017, 83445, 63956, -46977, -23356, 96041, 36407, 42846, 29915, -3863, 38718, 61750, 112899, 71629, 47989, -5804, 19085, 17470, -57035, -64103, -31821, -8567, 85812, 46206, 22379, -33330, -135363, 21998, 41617, 73153, 116920, -14025, -105748, -89088, -84730, 9083, 31965, -15141, -4099, -788, 56375, 68864, 58381, -6160, -27311, -51980, -84450, -18291, 50006, 129591, 131210, 94517, 34421, 11934, 6329, 51968, 4637, -43764, -8889, -77517, -76066, -2493, 4971, 92595, 59495, 84078, -21437, -83717, -50793, 16907, -24050, -11730, -47070, -11077, -7457, 61570, 213343]
10928B13343J5782p1238r6461o7755K383m3571J6319N8506O9059o4956k8751L2168
10916C4828l2414N1305j13029m3954J05760p0091j1460O1234m8374J47903j145
10905H0563m8577K0703o4914M0029N6765j27660M0246M8426l8762M7609k3417
10894C1011O7486n4378p627k9244k6841N4151P772k8060l6539L1934L5011J4031
10882E8707o3603m7170M3358O2124O063n738k5199k3065q4921N840O1820L286
10870h498p2039M2133Q8515o3646n3135J02215R5153q585p3842n5382q281O4951
10858D9559r8525J02494K102p0206N7529n8579n2688Q7221k8339L5995o0398m2245
10846g6080r893O0239L0599R7410j0905m2188m7510O600K8968p1625K2068L6384
$$ y = [213343, 229125, 157887, 61426, -6329, -3946, -47517, -31198, 27308, 96367, 31411, 2660, 34828, 2414, 53719, -59310, -103264, 2496, -67595, -79055, -17821, -66195, 81708, 80563, 31986, 52689, -12225, 27804, 84569, -43091, -2845, 45581, 6819, 54428, 31011, 98497, 44119, 36492, 7248, -19593, 34558, 42330, 14270, -22269, 9665, 44676, 58707, -4896, -52066, -8708, 53416, 59479, 53741, 28542, 5477, -79444, -73604, -11784, -8498, -80537, -38404, 50111, -13535, -66670, 35545, 130698, 122113, 48271, -7111, -15392, 49559, -48966, 53528, 55630, -14576, 42953, -15626, -68314, 18907, -9432, 26563, -33835, -76080, -85973, -25734, 4865, 102275, 91370, 49182, 1672, 8272, 37240, -34385, -12317, 24067]
10834B4067o4255J4913j1057R8849R7340p9914K4309k5156m0590J0597l886j1255
10822C3962K824L5785p4964j24143R7655Q6175q080j57593j10966J66234o3274
10811a16385r926J12360J08548Q1461r0975n1900L3677j5805o7763J057p875J5023
10799h503J4915O8081l8245O7198j8787m9872L4930k5375o966m798o5785k327
10787c5534l3569J8704L29O309N5815J042m253O0141J0896k9480l6963r895m2800
10774c9258q324N3382J17946O4579pj33257j3246J6332n0785j1169J01527m0298
10762E7422o0770l834r494J03371k2008l1775P2666k0684o3513m2981J4734k7909
10750c4775O516p1205L5056N0952L289n680J15458j0411m1759j1781q6306l8517
$$ y = [24067, -40188, -25275, -36332, 62517, 159857, 79943, 104252, 79096, 38506, 49103, 45217, 33962, 36786, 72571, -2393, -126536, -28881, 57294, 49214, -108379, -219345, -53111, -116385, -126311, -13951, 94597, 176058, 85083, 33183, 66860, 51055, -16708, -15651, -23526, -8503, 6412, 74493, 36248, 103446, 84659, 34787, 69717, 44342, 37376, 32578, -33207, -35534, -69103, -50399, -50070, -43761, 12054, 13096, 8843, 68984, 79880, 50400, 13437, 3542, -39258, -47582, 5800, 123746, 188325, 188318, 55061, 41815, 58147, 7362, -3807, 97720, 57422, -3348, -7182, -16676, 86695, 64687, 32912, 105578, 84894, 21381, -21600, -6866, -34775, -28259, -99464, -64408, -13456, -10167, -15847, 99611, 89200, 47441, 35660, -50646, -89163]
10738h9163M7597J28928n6990M7057M8280k0041R8871o9158k1451n1912j64287
10727a02269O1929N7451k9383P0525n0107K582L3671j2907m1942j44703M9105
10716a06048J1061m2776k6818k1428P1709J24001K2817l6038L4268O6234l4864
10705F2118k4527m9992j2843p113r0015L2356J23814L1038j3848o5247L5651n751
10693A5641k2205k657l0336j6802P892N4821O3401n5168o965R0529o4510j11096
10681g7455L513q875m6102N0265L1930J966M989j837Q1745q052m9754L5648M9159
10668F7140M1512m7139o0500K1982M7689J669o6622O4279n8096q2379N6324l2760
10656d6901j1930L9477j30817J68459j7246j49167n4518J15269O6745k2498j8529
$$ y = [-89163, -41566, 87362, 30372, 77429, 125709, 105668, 204539, 135381, 113930, 62018, -102269, -40340, 17111, -12272, 58253, 8146, 10728, 44399, 31492, -10450, -155153, -106048, -94987, -137763, -164581, -186009, -114300, 9701, 32518, -3520, 30748, 96982, 62118, 37591, -12401, -25244, -32357, -122372, -90016, 33798, 64836, 50988, -14259, 21392, 15641, -6564, -9221, -39557, -56359, -48467, 6354, 69755, 14587, 7622, 98151, 33641, -77455, -73942, -82817, -128919, -78654, -46724, -44758, -39769, -41606, 40139, 32087, -17667, 17981, 67140, 108652, 61513, 1013, 22995, 70684, 72353, 5731, 70010, 11914, -70465, -14141, -46901, -58831, -19354, -150171, 18288, 1042, -148125, -202643, -87374, -20629, -43127, -61656]
10645f1656J0851j4559j7155k9410J36158K1260o4539P9692k3735j1333J8714
10634D4288o8900o2770R5515m450o6010O2120N0558p2316L2433m7085k9301r841
10622g5759q7067J43665O6856j14267k6741j4274J3349N1542J7440q8729R7541
10611a6444L7674o2577J3109R1773L4285q8947j4476N1355k8883m964M7305J5845
10599G5055m5508p8181J04930K8475r9928J796J5967K9667j0180j1156K7251o8776
10587c0588j7389j5416P0798O079p5997L8710j435Q059O2979N7775o4635J4217
10575E3157j5192k0680l188K8254q9077M1643n8464p3679J24928P3222n564N8946
10563A14306k1938Q0985r8795j52424M009M1931J1674J2927k0696J3582J1466
$$ y = [-61656, -50805, -65364, -82519, -111929, 24229, 45489, -19050, 60642, 36907, 25574, 44288, -24612, -87382, 8133, 3683, -62327, -207, 50351, -21965, 10468, -36617, -65918, -75759, -162826, -19161, 47695, -66572, -93313, -107587, -94238, -42696, -25256, -113985, -16444, 21230, -41347, -28238, 63535, 97820, 8873, -5603, 45752, 16869, 11905, 59210, 75055, 29547, -48634, 56296, 84771, -15157, -13361, 2606, 32273, 22093, 10937, 38188, -30588, -47977, -63393, 7405, 13484, -62513, -23803, -25238, -17179, 45800, 103575, 38940, 53157, 37965, 17285, 14097, 42351, -46726, -5083, -63547, -137226, -12298, 60924, 55360, 114306, 92368, 173353, 74558, -77866, -73857, -31926, -20252, -7325, -28021, -14439, -2973]
10552b973Q8350N4809q5164L2975k6809o6452j10564J5285J01934O5266J8113
10541H4770L036J222R259L353n8593k4550l6871p6123n0044L40N4926M0940P0863
10528B2528M7465n5926J8652L5021j37724j07678N6899M7389M6981l0918k939
10517f0250Q2542N3840k9442n5029l5212l3073j7592N7298K7350L9675M0762R033
10505G9902N97j28572n7680J6613L8109j9641O1024j8697n3909K4415P0549O6094
10493G8804j07474q9321R6907K3448k1402j7612L2413J02357o7963l2015K9684
10482B7826m3485Q1979j7086q5864K0783k5433L2879M0144m7180Q6319M9938r0532
10470C0288j00080J24021J8599j21819p9193J7401J23390R332N1794k0142m0368
$$ y = [-2973, 85377, 140186, 55022, 87997, 61188, -5264, -115828, -100543, 1391, 66657, 84770, 87806, 89028, 98287, 101640, 43047, 18497, -18374, -94497, -144541, -144201, -89275, -48335, 22528, 69993, 14067, 32719, 67740, -69984, -177662, -120763, -73374, -26393, -57311, -60250, 22292, 76132, 46690, -8339, -43551, -76624, -94216, -36918, -9568, 30107, 70869, 79902, 80499, -48073, -105753, -89140, -51031, -70672, -9648, -28345, -82254, -57839, 12710, 78804, -28670, -117991, -21084, 2364, -19038, -36650, -4237, 98120, 30157, -1858, 27826, -15659, 66320, 49234, -36630, -15847, -41280, -8401, 31743, -15437, 70882, 120820, 30288, -69792, 54229, 72828, -48991, -128184, -110783, 12607, 21939, 73733, 53591, 13223]
10459A3223K0756l1873k3221n9177j1804Q929l8179M3345P9085k5487J31169n0430
10447E6336l8107P7253N3081j06138m8379m7793K9354K9420q0898J23482M1127
10436H8738l9077P884k2387L7316l4975o2924o0278j3239m8307L1427m222M5949
10424g4095P6974O2672N0180q6227L2005q71J6020n7574j28380J10603O6616q3410
10412a5487N3330J8980L0247k0395o1266K1748J9451j7612k9620k8391k831j5900
10400d7746K9177k4399l0653O8019R7562M6674q5697k9472R5781j15266r4670
10389i0690N6540Q4136m7897L891P7779j9976o0515q7772o36J46159j26818l0132
10377i5931L7693J5666N7769m8498n2684Q9214k3838O9525k2057j18952m7847
$$ y = [13223, 33979, 2106, -21115, -80292, -92096, -83167, -121346, -78001, 1084, -24403, 106766, 56336, 18229, 95482, 148563, 42425, -5954, -53747, -24393, 5027, -75871, 47611, 88738, 49661, 57545, 35158, 72474, 37499, -25425, -85703, -98942, -147249, -115822, -120044, -74095, 2879, 65551, 115731, 29504, 61509, 60638, 76658, 19084, -109296, 1307, 67923, -15487, 37843, 56823, 87070, 66675, 5409, 27157, 46608, 28996, -624, -29015, -31846, -47746, -18569, -42968, -73621, -5602, 91960, 138634, 52937, 23465, 119246, 3980, -90690, -34150, 49986, 2089, 5980, 83759, 63783, 3268, -84504, -85140, 61019, -65799, -95931, -58238, -42572, 15197, -33301, -85985, 3229, -20609, 48916, 26859, -92093, -139940]
10366a39940O6422R348n0828L7489J4221J0752k6515j2086J01230n8644n6239
10355a04790M8166k2279O1872L6387o0739L2583j5439L0963K4016j4418M8819
10344F5141r111j0245p261l2646K3308o1667r5210M5739J8720K5271O3727j03451
10332g7685l8384J12542K0049O6630q5214o8160P6885k6299L3016n8031p1178
10321a15829J40830Q2806N2514j55088m2089P5581n0243r903o811n7289J12009
10310B6488p0236O9211O0045k9866n070O698m3513J8223p9349k3523l2188O3611
10298c9469P583j6456K4018n5327O6159Q687o6744P3274q527L0339n1146m6914
10286g4523O5604K9060L2624p6737P6872L2456j48075n344K8959M2052o3518M655
$$ y = [-139940, -73518, -64170, -114998, -77509, -63288, -52536, -79051, -91137, 10093, -48551, -104790, -56624, -78903, -17031, 19356, -41383, -8800, -24239, 6724, 30740, 16322, 65141, 56030, 45785, 38524, 5878, 29186, -32481, -127691, -81952, -63232, -37961, 25766, -77685, -116069, -3527, 16522, 83152, -2062, -70222, 6663, -19636, 13380, -44651, -115829, 25001, 107807, 160321, 5233, -36856, 38725, -11518, -21421, -28232, -85521, 26488, -43748, 25463, 85508, 55642, 50572, 57270, 13757, 31980, -47369, -70892, -103080, -39469, -31886, -48342, -24324, -79651, -13492, -4805, -71549, 1725, -6802, 23537, -27609, -74523, -8919, 20141, 52765, -23972, 52900, 85356, -62719, -68063, -39104, 2948, -60570, -55915]
10274e5915J02355j878j01613K6652J7644k8483j3104K2169R316K4686L9306m1287
10262a52Q7210o983o6043o8720K3775M8826P8588p0309J0077J55K4434J2203J3472
10249H6533l6271O927n2163k5474N5750L0607N6273m9861j13598J67104l7083
10238H8744l5792Q987j9933o4489k6272J4241j3979n0588M0196J4960J05420L4575
10226I6070o8942l058K1630m498k1635m8916R2056N782o647K7397n5456l55m5993
10213a2565J2068k5832j6524P9307n4590l4465K3948k1036j6086k3375n5591J09993
10201c4748J5943j33580P0187K2057Q1926M4228j9860p1175N2111l578j05949
10190h2438o3731L6623P5925L4012j9867m7445P7058L4036o1732P7839l3518l8054
$$ y = [-55915, 46440, 44562, -57051, -30399, -12755, -41238, -54342, -32173, -22857, 1829, 41135, -152, 87058, 80075, 14032, -54688, -30913, 17913, 96501, 26192, 36269, 36424, 60858, 73061, 86533, 50262, 57189, 5026, -20448, 35302, 65909, 122182, 72321, -41277, 125827, 88744, 52952, 61939, 42006, -22483, -48755, -34514, -48493, -99081, -58885, -43925, 61495, 96070, 27128, 24070, 45700, 41202, 19567, -29349, 62707, 68489, 61842, 89239, 33783, 33428, -12565, -497, -26329, -42853, 36454, -18136, -52601, -28653, -49689, -65775, -89150, -144741, -34748, -18805, -152385, -82198, -60141, 21785, 66013, 46153, -25022, 27089, 23511, -82438, -146169, -109546, -33621, 391, -19476, -66921, 10137, 44173, -17559, 60280, 26762, -11292]
10178a1292m8702j6430J8364Q8029o3696k5057P1345m5615r072Q4118l8098M9031
10166E2925p4345n7321Q5804j5256j965m039j9203M7286p3877K5449k3803O3246
10154D901k8906k1580J04072Q471j42296J17661K7280q671j7853j08320m2327
10143a07568l5624L0090J26618n8105J0609m459l2975O996J1334M2983n3916N0231
10131a3786p6793J04539j8810M783r5927K690N5395K2312l439k4905l5936L3207
10119d6670Q937M4808l3447l0537n9487n9353N6330P6502p502n9421n044O8889
10107d5995Q8659n4898n2479J3570n7827J7322J2738j2130M1445K5290p4079J53298
10095E4914K8937n1225j9563j66161p565J11845M1487k9670M4040K7661L5723
$$ y = [-11292, -59994, -76424, -58060, 29969, -33727, -58784, 12561, -33054, -42126, 41992, 3894, 52925, -21420, -78741, 7063, -8193, -10158, -14197, -33400, 13886, -59991, -34542, -58345, 4901, -24005, -45585, 58487, 66958, -75338, 42323, 69603, 60932, 43079, -65241, -107568, -143192, -113102, 13516, -44589, -33980, -38439, -71414, -64418, -53084, -10101, -64017, -13786, -90579, 13960, -4850, -67, -95994, -93304, -37909, -15597, -19036, -43941, -79877, -46670, -37733, 7075, -26372, -56909, -116396, -175749, -119419, -42917, -50419, -109840, -114884, -45995, 42664, -12234, -64713, -51143, -108970, -91648, -78910, -91040, -49595, -24305, -98384, 54914, 83851, 32626, 13063, -153098, -160663, -48818, -7331, -37001, 7039, 34700, 70423]
10084G0423m1282r631k1108o0948p7722o062P8919m2097J4230M796J2301O5103
10072a3078j4241k9904q25j2460J6033p2082k3782m920L1570J00691L2577k5633
10060a6054M4694l8913n5481k4777L2064L8902o6015M8886L505J549K05J5832
10048a5603J0624k4114J6615J4554p93n495k7536q5178K4041p713q5234N3176
10036a32656Q5105m0559L4685L9168J0954m0409o6507M4027P5010K291n5534k1439
10024f5864p4226M3673J49772k4102o0386q6775l1274K3398P1394K6285n7075
10013h5180O836o125k5790J3943P8559j7881l9641k9857m0884K6497J9255K8220
10001g2048M1974P98L9413l5489j4366J3759L8683k8709J2916l0717k5120J4447
$$ y = [70423, 29141, 19510, -1598, -62546, -140268, -146330, -67411, -109508, -95278, -90482, -78181, -13078, -27319, -57223, -58048, -70508, -54475, -126557, -150339, -155259, -123689, -22998, 9579, -16054, 28640, -10273, -65754, -90531, -58467, -19565, -85580, -36694, -33189, -31640, -31435, -15603, -4979, -29093, -12478, 2076, 1283, -4212, -31748, -116926, -92885, -100598, -185832, -132656, -47551, -88110, -53425, -14257, -3303, -43712, -110219, -66192, 8818, 11109, -44425, -65864, -140090, -96417, 53355, 29253, -31133, -117908, -149182, -125784, -54390, -28105, -85180, -78344, -84469, -110259, -96316, -17757, -35638, -75279, -105136, -146020, -119523, -100268, -72048, -30074, -29276, 10137, -25352, -39718, -25959, 12724, -15985, -3069, -33786, -58906, -44459]
9989d4459K8983Q727N2493r0288L1202p3103m7014P1205L639P8254J12089q1519
9977E0209k0938M1047q0950o4660l7617O4722L0364n6913M5806L8059m3470n7869
9965i2210K1126L9779l8365m5655J4174p373O3413M3023n5043J06593K0374q7997
9953a8161o3580O450J2732J4499q3173J2242K4585l5459O9708P1149N779j6891
9941a20M3263m0190q0482j6598J2829R4081J2930q4713k5978k7689K6481N384
9929h0802K6123O0130m3914p5474n2715P8299m70j3064M3103L3647K5288q06n1307
9916e1962Q6425n9110j01518O9319L0726J2845O8207r0096m1366N8470O4128j377
9904D4691L150j04690m4516M8989N3642J9157m9575k2619J3134N4394K2920j8962
$$ y = [-44459, -15476, -6749, 45744, -44544, -13342, -86445, -133459, -62254, -58615, 19639, 131728, 50209, 29271, 70318, -10632, -75292, -112909, -48187, -17823, -74736, -28930, 9129, -34341, -92210, -71084, -31305, -69670, -115325, -101151, -108524, -45111, -2088, -57131, 49462, 69836, -18161, -81741, -75291, -62559, -48060, -131233, -118991, -94406, -129865, -60157, 10992, 16771, -120, 43143, 2953, -77529, -94127, -81298, 12783, 25713, -59000, -84978, -112667, -86186, -80802, -54679, 5451, -38463, -113937, -166652, -88353, -88823, -101887, -58784, -25137, 151, -655, -51962, 34463, -24647, -126165, -56846, -26120, -13275, 54932, -35164, -76530, -18060, 46068, 44691, 47841, -56849, -101365, -52376, 1266, 20423, -29152, -51771, -38637, 15757, 38677, 19715]
9892A9715n0477m9381k2961l1467j5983L7235J7250n1427O7971P2551l4980O1966
9880B0012M856o094O8059j09060p1698L9491O6510L0699o7535o268N0969n5110
9868c5169K6639l860j9527J55563l0809j44066l5537N4326m2527m0422J2190R611
9856i3588K8123L4844K053M872j3204o1311q3680O0127j5530J39349l3529K1984
9844i490K3822l7723M5565K4241j03802o9441O8052k6270l4544N0638j6001J7135
9832f7818P5374r9974P9095P651r9992m0289j904J0585n6738J5322R6676J08265
9820B6253J7322n1940k0323k4526J494n5738n8772k2796P9360R1317m725J5733
9808g341N3761K0145m6450n0905J0099r8227m6390j6189N1327J35838L8217n0565
$$ y = [19715, -30762, -80143, -103104, -134571, -150554, -113319, -96069, -147496, -79525, -6974, -41954, 20012, 24868, 18774, 86833, -22227, -93925, -54434, 12076, 42775, -24760, -31028, 19941, -35169, -8530, -12390, -31917, 123646, 92837, -51229, -86766, -32440, -74967, -115389, -103199, -93588, -65465, -30621, -28568, -23696, -36900, -98211, -181891, -121764, -137294, 2055, -31474, -9490, 14332, -23391, 22174, 46415, -57387, -126828, -58776, -85046, -119590, -68952, -84953, -67818, 7556, -92418, -13323, -5672, -105664, -145953, -147857, -137272, -194010, -178688, -82012, 26253, 43575, -8365, -28688, -53214, -51720, -107458, -166230, -189026, -109666, -18349, -23074, -7341, 46420, 66565, 20115, -30790, -20691, -118918, -165308, -181497, -130170, 5668, 43885, -6680]
9796f680R285P599o7759L7617p6843J3022K3986n0559J31929Q2273k2746K4608
9784A05732N5284r6871j60250M6636r9177O8682O9931n6856J15459p2820K0670
9773c580r581q949K2742k0879p8545k2413P738M2166k9366O2997O2848j1700J8401
9760C1879m6036j6042m316M723q5049j8095O1862L6894m107M7192l5194o0900
9748h7189L8688j6433o0128L4166k1825K3200Q2311K9793m2755k1051m3696L5107
9736d9812O6918p2245j6815L6212K6802J3273p0764l5366M8273R192j5801n3546
9724a13679M5293P7307p6890M663Q2767p1703k0080l0117j4369m370j1174L6118
9712i6234P1047K9610j6209M5389M1294M583j56443r342k5431l0195R8747p3185
$$ y = [-6680, 2605, 10204, -57555, -19938, -96781, -83759, -59773, -110332, 21597, 103870, 81124, 105732, 161016, 64145, -96105, -49469, -148646, -79964, -10033, -66889, 48570, -24250, -3580, -13161, -22110, 632, -20247, -98792, -121205, -113467, -71301, -100667, -37670, 25178, 13478, 31879, -14157, -30199, -34515, -29792, -114841, -132936, -71074, -34180, -38287, 8905, -26289, -87189, -48501, -64934, -125062, -90896, -112721, -89521, -7210, 22583, -20172, -41223, -84919, -49812, 17106, -55139, -71954, -35742, -8940, 4333, -66431, -101797, -53524, -44332, -60133, -113679, -68386, 8921, -67969, -63306, 19461, -52242, -72322, -102439, -116808, -121178, -132352, -96234, -25187, 4423, -11786, 33603, 74897, 79480, -76963, -86305, -111736, -141931, -43184, -116369]
9700a16369Q7393M0364K693j2096J7131n4783n2336N2421p0971p6794P6420R662
9688i7265P3050J0186k0636L395j9276K0301m0262m6386l6295p1514K3454Q8014
9676a13234N7331R6370L928J5931m7259j03101o8510K7996K0805O7508n8213j1292
9664a11740J5610J02115K4451j8901J8157n8383k5653j5653J6928n8096k7298
9653a38463O5452L9627l9183k6554P4259J1372J899o1914o5739J0512K788K6362
9641i9582O7971m3950o992l729l1823R1901P1425p5590j01639k1967K7752N8238
9629f7985N3142L3092N7757l0263q0563k7966Q6104n043m2013l4577N3520m4411
9617d9206l9586L0832P209n3187j8610O4678p5027p4837J58183J5892n9247l804
$$ y = [-116369, -28976, 11388, 14081, 1985, 19116, -35667, -88003, -35582, -106553, -183347, -106927, -97265, -24215, -14029, -34665, -31270, -50546, -30245, -70507, -116893, -153188, -224702, -201248, -113234, -55903, 40467, 44395, 60326, 13067, -90034, -158544, -130548, -109743, -42235, -100448, -111740, -96130, 5985, 30436, 11535, 29692, -28691, -54344, -69997, -53069, -111165, -138463, -73011, -33384, -72567, -99121, -24862, -13490, -11591, -73505, -139244, -128732, -125944, -99582, -31611, -75561, -82553, -86282, -118105, -26204, 45221, -30369, -132008, -153975, -126223, -67985, -14843, 18249, 76006, 45743, -34820, -62786, 23318, 18275, -23738, -58315, -4795, -49206, -88792, -57960, -50751, -103938, -122548, -57870, -132897, -207734, -49551, -33659, -92906, -96710]
9605i6710l035J08807m4758m2042K2607k9992k4106q246p8054J23854m642R697
9593f6620O6733m6527l7677Q9409P884q7146M250N48L1299M0916q3747N5224M472
9580b0982o0904k7510L9865l0125m1163m4086Q9321m5809M0723m8188N5306R7810
9568D258q8880l4647K035l0511J12375n90m7732K6539k927N9360n3142L2960J06773
9555H5871P0015j07730l4356m4558L3721N3074p0258n2601O0025l6754j4107M468
9543e3190k1896R6281m7644q2887l6499L8649P5599O0982l5083m6908j4777R2591
9531B5218L0460q2885P121L2523O361q0489m0062J9109O7516o8071l2321Q5713
9519b9807p10j0436K3154N2724J3285j52751R7775l5405j49524J11069K2414p7557
$$ y = [-96710, -99745, 9062, -35696, -77738, -55131, -85123, -109229, -117475, -195529, -71675, -76317, -66620, 113, -46414, -84091, 5318, 13202, -73944, -69694, -69146, -37847, 3069, -80678, -25454, -20982, -81886, -109396, -69531, -99656, -140819, -184905, -95584, -141393, -100670, -148858, -93552, 4258, -84622, -119269, -117234, -147745, -35370, -35960, -83692, -57153, -60080, -720, -53862, -20902, 85871, 155886, 48156, 13800, -30758, 2963, 56037, -14221, -66822, -6797, -43551, -57658, -53190, -75086, 21195, -26449, -109336, -145835, -107186, -31587, 29395, -5688, -52596, -67373, 25218, 55678, -27207, -20086, 12437, 18798, -61691, -101753, -82644, -15128, -83199, -115520, -29807, -30517, -40953, -17799, 34925, 48210, -104541, -6766, -42171, -191695, -80626, -58212, -135769]
9507a35769M5491N0406N0705m4396k3651k5286R4263p0752j37808P9448O5233
9496e2116l881n810K5683Q1643n286K7589r0882j09669N25l8711K5271P6994Q897
9483e9753P4209l6767L4055j4736j7798k4149m4559N684K6842j4464n4634J16889
9471i181q905o0491M0320L6499n3361j5059J6462L8395q949q2704J8526M8042
9459d0406q4470K6656O3508J928l635j48279O97J26514J2137m8691j9805r286
9447a23132J6498L4442M0453J6291m0477L9961j16092K4667P3472J7014j1071
9436b7974m7954m480K9026j7895M2424J0386J5391N2554o9231j6631M2996m6384
9424c7772M2042L7290J0004q4267j6545p4378n7307p957R1531N2879k1634L1320
$$ y = [-135769, -90278, -39872, 10833, -33563, -57214, -82500, 11763, -58989, -196797, -117349, -52116, -55997, -61807, -36124, 45519, 40233, 67822, -23060, -132729, -132204, -170915, -145644, -68650, -59753, 14456, -22311, 11744, -2992, -20790, -44939, -89498, -83814, -56972, -71436, -126070, -9181, -18086, -78577, -38257, -1758, -55119, -70178, -53716, -15321, -24270, -106974, -88448, -40406, -124876, -98220, -34712, -32784, -36419, -184698, -184001, -57487, -45350, -94041, -113846, -123132, -106634, -72192, -31739, -15448, -55925, -15964, -132056, -107389, -33917, -16903, -27974, -75928, -80408, -51382, -69277, -26853, -16467, -1076, 51478, -17753, -34384, 8612, -37772, 4270, 41560, 51564, -32703, -49248, -123626, -180933, -188890, -97359, -44480, -66114, -34794]
9412c4794J7459r0359o3362J3819J0736K5776M0431P931K8354L9450K4441k0370
9400d88n754r5254O4277j1137m8416K3858m9567l1454J11798L5184n7793M391
9388f0355j740O5232j9983m5600l8411j6610p4210J50836R7004j11453R5498m3634
9376c426o5450J21217l1303n1151o4751P433l7409K7726M8349K3417Q6278K9649
9364I0579m5422k3080o6816J0360j7132n5278q788k1157k9366M8341K8532L6660
9352e2567L197J8891r3938j0147J02043l0120j02446M4388K5513K5780n1551P1367
9340d9590J5867M3745o4262n0571L0004K0729m0429M3974N2385o767q7853m0465
9328a33233K3048k380O3411K5354M4035o0124q0701j6209M8164n0500n3589m0303
$$ y = [-34794, -17335, -107694, -171056, -157237, -146501, -120725, -80294, -72363, -44009, -4559, 19882, -488, -6242, -101496, -37219, -48356, -96772, -72914, -122481, -153935, -42137, -6953, -64746, -60355, -62095, 3137, -16846, -62446, -100857, -117467, -191677, -40841, 56163, -55290, 40208, -3426, -68876, 52341, 21038, -30113, -94864, -87431, -124840, -97114, -48765, -25348, 60930, 90579, 45157, 22077, -44739, -34379, -51511, -106789, -115577, -136734, -166100, -117759, -89227, -52567, -49370, -30479, -124417, -134564, -32521, -62641, -165087, -120699, -95186, -69406, -120957, -49590, -33723, 10022, -54240, -104811, -74807, -54078, -94507, -50533, 1852, -4915, -92768, -133233, -110185, -112565, -49154, -23800, 20235, -39889, -120590, -136799, -88635, -139135, -192724, -233027]
9316b33027K174Q1674Q1724L1598l6552l9294K8934K5485M0458M3905N683m5063
9304a2301M2955J7762M7404K454j4887l6540o502m0525j5573k162J5206j30865
9292a33574K3590O3943m5078N1996O7428J9958q7080o9204j3092m9275M0942J1504
9280a17942O2675N4918n4844J6862N8633r619N1030o2838o3087j27153O4774J11640
9268a4951L1425p2376o9980L3967Q0179l2466l0921J5031J9918q3529n7308Q0472
9256a00539J14988M2436p3662L34q596k0183k5044m959O8759O3247j18574m8008
9244a09801J17125J3357N0380K1438m5198p5275l2847l6961q614J15427K883q354
9232C560n7216n7166r876P8015j5654O602j24400k7820m092Q876P1582J05607
$$ y = [-233027, -230853, -149179, -67455, -35857, -72409, -111703, -82769, -57284, -16826, 27079, 32762, -12301, 30654, 48416, 95820, 98274, 83387, 46847, 40345, -180, -15753, -17915, -2709, -133574, -109984, -46041, -91119, -39123, 28305, 48263, -38817, -108021, -121113, -170388, -129446, -117942, -55267, -349, -55193, -38331, 20302, 10683, 61713, -1125, -64212, -191365, -126591, -14951, 16474, -55902, -125882, -91915, -11736, -44202, -75123, -60092, -40174, -123703, -181011, -100539, 14449, 56885, -16777, -16443, -25039, -45222, -70266, -75225, -6466, 56781, -61793, -109801, 7324, 20681, 71061, 92499, 47301, -27974, -60821, -97782, -106396, 9031, 11914, 3560, -53656, -110822, -120698, -42683, -58337, -51735, -176135, -203955, -208047, -199171, -127589, -21982]
9220b1982k7292p481o2004J7433J4148L4935L7668l5372n2825O9568K430k6735
9208e7509N2497N1695n4684n3609P334P2907k4738k3772O6988p479k028n7257
9196b9655r0699J1466l3959P5527Q3791j08388k4387N3513J1776q0801L3231N4516
9184d4069k0728K2157k7645J573M8254k4310K3533K6469l4932m319m3858l418
9172h1293J4105L8843M7264m9337j2750o8070N4872n7228J5063L5173o5850j1263
9160a40471m1788O3885J50341q9902L458n535k6502m751n7284J8701R1762P9799
9148D1713j4175J1987j12251K8475J36444j2989p8586m5390N0465p9522q0086
9137a53915Q5471J30600N426j57421m7122P0169m5541J2028O21J5029l57j6352
$$ y = [-21982, -49274, -56755, -118759, -101326, -87178, -52243, -14575, -49947, -102772, -33204, -30774, -57509, -5012, 46683, -8001, -61610, -54276, 18631, -6107, -29879, 37109, 29630, 27602, -29655, -120354, -108888, -142847, -67320, 16471, -91917, -116304, -62791, -51015, -131816, -98585, -44069, -64797, -42640, -70285, -68712, -20458, -44768, -21235, 5234, -29698, -34017, -77875, -81293, -67188, -28345, 18919, -30418, -43168, -111238, -56366, -113594, -98531, -63358, -129208, -140471, -182259, -118374, 31967, -57935, -54477, -60012, -86514, -91265, -148549, -129848, -38086, 41713, 27538, 39525, -72726, -44251, 92193, 79204, 618, -44772, 5693, -73829, -153915, -68444, 62156, 67582, -89839, -136961, -66792, -112333, -100305, -99684, -84655, -85012, -101364]
9125a01364o5794N0118J0245o766P4246M8513o9457m5351N7274j4893M2198M2781
9113B1750K9311R704q0120J1060J24409N28m0337o6813j04480k1839k0649N6920
9101h0556L7424N8080n0057p1599L8619M4144Q098K0579j2557o8397K0274m0429
9089i6377p7981J06485M0263m5496M818k957M5480l9533Q675J39536n0663j21412
9077h9162J36358m8128J4907p7469M5985l482q1463q1051L0033P9101L067q2684
9065a53988R6786J6457l7811j2458N622Q555n6551o1335j9209J13101m9595Q5972
9053f4454J40197M9830j5995n3313J2728J1064p2264L9737j20898l5295Q2482
9042b6181j384l0213O328L0649P3616o4690p8817M0948r147k3075r6844N8989
$$ y = [-101364, -167158, -117040, -106795, -113561, -39315, 9198, -60259, -105610, -48336, -63229, -21031, 21750, 51061, 60765, -19355, -8295, 116114, 116642, 76305, 9492, -94988, -116827, -137476, -80556, -43132, 14948, -35109, -106708, -68089, -23945, -15847, 4732, -7825, -76222, -55948, -96377, -174358, -67873, -27610, -73106, -68288, -71245, -25765, -65298, -56623, 82913, 32250, -89162, 47196, -932, 13975, -63494, -17509, -20991, -102454, -183505, -153472, -74371, -71304, -153988, -57202, -40745, -78556, -91014, -85392, -76837, -133388, -194723, -213932, -100831, -150426, -64454, 75743, 125573, 109578, 56265, 68993, 80057, 7793, 47530, -73368, -108663, -26181, -27565, -57778, -51450, -20801, 52815, -11875, -90692, -49744, -58891, -81966, -178810, -119821]
9030a19821Q2584j02562L0106J3351P504K6883p5398l4904M1888M0323P8275N5031
9018D3260O0212N5434p4000j3846L8754m9233k2510j13868L3176M2769N7244J0966
9006F8358n3590M7826O2405l8970q6941q5213j0693l4801p6173P6070J22431k3076
8994c2367j4398J5681N5195K5755o2657n6198O1080k4455q143R4117n7669j7004
8982b1063M2701j1115N2970J8981r7914l7576P51m4581L2138P0593q4330o8967
8970a47412L0851Q7009k7476j7747l7319M2338r1460L6896N8128n5151K2001N6302
8958d3040L7689o6159P766J08027O9305r2852m6997K0031m3536l0411K4931P7610
8946B2364l8965k7839r0103M7100J38683j5004j8802j5885j23192J5611L2107
$$ y = [-119821, -37237, -139799, -109693, -96342, -88838, -61955, -137353, -172257, -130369, -90046, -11771, 43260, 103472, 158906, 84906, 71060, 109814, 60581, 38071, -75797, -42621, 148, 57392, 68358, 14768, 62594, 124999, 86029, -912, -86125, -96818, -131619, -207792, -131722, -9291, -32367, -46765, -31084, 24111, 49866, -12791, -68989, -7909, -32364, -40507, 53610, -4059, -21063, 21638, 10523, 63493, 82474, -15440, -53016, -52265, -96846, -64708, 5885, -78445, -147412, -116561, -29552, -57028, -74775, -112094, -69756, -161216, -124320, -66192, -121343, -99342, -43040, -5351, -71510, -63744, 44283, 113588, 20736, -26261, -6230, -49766, -80177, -55246, 22364, -16601, -44440, -134543, -87443, 51240, 36236, 17434, 1549, -121643, -106032, -73925]
8935g3925q3832J8921M3179J9413l4137o5884J54194Q1704M6081l874l200m7363
8923E1277o5860m1709K1486P8140R8633j3735J1494l6417k9716J3751M2205l8529
8911I1020n8359J6088j57820m0706N7479l649Q0472L0226n6781J24664M2247q8046
8899C6835k4197r960m0450l0696j9496n9858M0363J27018N7988M8805J9282j5102
8887A30532K9197r4384j12523J10345l5760j17145M5996l605R7119M5553j05915
8876a0590P7764K1273j28030r2982K9462m6609j6449O9712O733L3903M4168o6299
8864g7944N8298O5481K4934m6930j18002n6749Q2833M8777R0812J2872J0497K8609
8852A23488n2050m7946P0913K8918K5909j30881K0226r4645n518J37165Q133O316
$$ y = [-73925, -157757, -138836, -95657, -76244, -110381, -176265, -22071, 59633, 105714, 101840, 98640, 51277, -14583, -56292, -34806, 43334, 141967, 128232, 139726, 103309, 73593, 87344, 129549, 91020, 32661, 48749, -109071, -149777, -92298, -95947, -15475, 14751, -42030, 82634, 124881, 36835, 12638, 2678, -37772, -68468, -87964, -147822, -107459, 19559, 77547, 126352, 145634, 130532, 159729, 65345, -47178, 63167, 27407, -89738, -43742, -47347, 49772, 95325, -10590, 67174, 88447, -39583, -132565, -103103, -149712, -166161, -96449, -89716, -55813, -11645, -77944, -19646, 45835, 70769, 23839, -94163, -150912, -68079, -19302, 71510, 84382, 94879, 123488, 71438, 23492, 94405, 123323, 149232, 18351, 38577, -56068, -61586, 75579, 83712, 90028]
8840I0028O4843j30806j2154r0830J2239J05614o6010o0255l698L3553J00903
8829D3427K6895j7660P6302k3427j05846L5028O8425P4204k5587p7611j5984k2954
8817C5212k6970n4111j771O7344L4495l2582m1589k7378N1017P9141L0687l7299
8805G6196l4233n3404k5575k3975R6584J43638J3247j09739J668J12124J71864
8794C68395j27288o2828K9883o0221K3062n6414K7046J50131m238p133m7791J2959
8782B45563l3602p8569J900M7511m3255l8611l7964R2647L8363m2072K7114L731
8770A82756n6869j3659k373M962L7071R0987j2604N4116k1916j7461L4235k3395
8758B55850l4055N9399o8240L3208K3360m6978J9019j0735J05741R135p9668p820
$$ y = [90028, 154871, 24065, 11911, -78919, -66680, 38934, -27076, -87331, -91029, -57476, 43427, 70322, 52662, 128964, 105537, -309, 34719, 103144, 177348, 151761, 74150, 58166, 35212, 8242, -45869, -47640, 19704, 54199, 21617, -19972, -47350, 3667, 82808, 113495, 76196, 41963, -11441, -37016, -60991, 35593, 179231, 192478, 82739, 84407, 196531, 368395, 241107, 178279, 208162, 147941, 171003, 114589, 141635, 291766, 287528, 280395, 232604, 245563, 211961, 133392, 135292, 182803, 139548, 100937, 62973, 155620, 193983, 151911, 179025, 182756, 125887, 112228, 109855, 114817, 151888, 242875, 230271, 284387, 262471, 245010, 279245, 255850, 221795, 281194, 212954, 246162, 269522, 222544, 241563, 230828, 336569, 345704, 266036, 258216]
8746B58216q5517J26402l2899n8972j624m7867j4040Q2758J6931K6350J7308k7811
8734B59235Q450K5625l6940o363m5229N6287O4056o5697q275O4781L5768Q537
8722C60235n1864m4518M7549J5741J0211J6969O575J4972P007j06394j7360N3454
8710C12577O4982l9877J0801O9025l5426j06629k3884J05964j1854n6801P6596
8699C65474K1185L7196N0275M817J8124J53221p6117m9674K9319l6044K408n260
8687E14924r5478J41216K5583j8852N6514k4657m841l4243j6167J8113r7265O0475
8675E25322q3884L2142J12240J27941P1777L9419j00518m6735J15508J1676O0672
8664H65560n1798k4012P7757l9988m1100J34162Q4981k1727l3057m1025L3590
$$ y = [258216, 172699, 299101, 266202, 207230, 205606, 157739, 143699, 226457, 243388, 269738, 287046, 259235, 267685, 293310, 256370, 250007, 204778, 261065, 325121, 259424, 251149, 315930, 351698, 360235, 308371, 263853, 311402, 327143, 337354, 354323, 360898, 375870, 382877, 276483, 259123, 312577, 377559, 337682, 348483, 417508, 382082, 275453, 251569, 357533, 345679, 288878, 365474, 386659, 423855, 474130, 478947, 497071, 650292, 574175, 524501, 553820, 517776, 520184, 514924, 419446, 560662, 586245, 567393, 623907, 599250, 594409, 560166, 543999, 562112, 464847, 525322, 441438, 473580, 585820, 713761, 785538, 824957, 724439, 677704, 793212, 804888, 865560, 813762, 789750, 867507, 827519, 786419, 920581, 1005562, 983835, 950778, 909753, 943343]
8653I43343o6186K0753O2703K6473K766m7494j2896j6158j6926R7516k8834j0404
8641I54656n3046M1925J52899o193L9461q46k2709L1020K8993N2636m4288j5564
8629A158944Q451P2444K1009l7630L0862K8038L8868l6717m6649K8739Q7049J14934
8617A468342O0264j01356j09655M1868M9427J6458j7035l2192L7339M0012q009
8606A445463Q2686J03878o446J48143J25703r0665N662l4821q6983O3858R7570
8595A854048J43933M3830J01893J06754J50925J28480p6325j15019N8314J2290
8585B409123m951N2157K914K8963k0069Q14J13714n4874L669M8496K5938L578
8573B609472O8133O8675R466J7079l9416J15982J11056K2024J24236q9014l5014
$$ y = [943343, 877157, 897910, 960613, 987086, 989852, 942358, 929462, 913304, 896378, 993894, 965060, 954656, 901610, 943535, 1096434, 1090241, 1129702, 1128856, 1106147, 1137167, 1166160, 1218796, 1174508, 1158944, 1167395, 1239839, 1260848, 1223218, 1254080, 1282118, 1320986, 1284269, 1237620, 1266359, 1353408, 1468342, 1528606, 1427250, 1317595, 1359463, 1408890, 1425348, 1408313, 1376121, 1413460, 1453472, 1445463, 1528149, 1632027, 1625581, 1773724, 1899427, 1808762, 1814424, 1779603, 1692620, 1756478, 1854048, 1997981, 2041811, 2143704, 2250458, 2401383, 2529863, 2453538, 2338519, 2396833, 2409123, 2404172, 2456329, 2459243, 2488206, 2468137, 2468951, 2582665, 2527791, 2531460, 2579956, 2605894, 2609472, 2677605, 2746280, 2755746, 2772825, 2733409, 2849391, 2960447, 2982471, 3106707, 3017693, 2982679]
8562B982679M3678K9481R1883N2614l6690J51992J56533J60565J45503K5649P4465
8551C878352Q8510K2250J35457P2419n4599l5342K4689l9128J5459j8579l4974
8540D054514j40610j11635q3385r1313q2807j00822r4199N7636K5617k8775l3851
8529C370370N210j4849J2146N2257p161j25203o8094j5397n2745j7178Q6251M3966
8517C269573N0741J17688L9883J28585L7559J5157J00995j8345p9233k3686q179
8506C630738j8922r4466L7501j32448j64080q8622r8101r7832l5822j82549p7627
8495B677770k7581m3678N3287R3887J0661K991j4349l6828k8691M8599M3086L0917
8483B810071M2168P1865J21723K27399K00955L04299P5438k09284k57788k37310
$$ y = [2982679, 3026357, 3055838, 3147721, 3200335, 3163645, 3315637, 3472170, 3632735, 3778238, 3803887, 3878352, 3966862, 3989112, 4124569, 4196988, 4142389, 4107047, 4131736, 4092608, 4108067, 4089488, 4054514, 3913904, 3802269, 3718884, 3627571, 3544764, 3443942, 3349743, 3407379, 3432996, 3404221, 3370370, 3375580, 3360731, 3372877, 3425134, 3417973, 3292770, 3224676, 3209279, 3156534, 3139356, 3225607, 3269573, 3320314, 3438002, 3477885, 3606470, 3644029, 3659186, 3760181, 3741836, 3662603, 3638917, 3630738, 3611816, 3517350, 3554851, 3422403, 3258323, 3169701, 3071600, 2973768, 2937946, 2755397, 2677770, 2650189, 2606511, 2659798, 2753685, 2764346, 2767337, 2752988, 2716160, 2687469, 2736068, 2779154, 2810071, 2852239, 2924104, 3045827, 3273226, 3474181, 3778480, 3853918, 3644634, 3386846, 3149536]
8473C149536j10409q1745n7735p1592M2378n8829n4234p00m3055l2412P5673o7287
8461B689589J7738N3026j1891J9315N2872j2833P0710Q1529r2329K4531N8181
8450B950438N1704J11127P3492M5630J41836P1048K849K6446J02483j4922M3151
8439C605282L7191O6316J24696L8680P9875J12480J03608k70k50J47061L8540
8428D353209J31026J49773M7790P8074J46779J46280K90753J15034P4050K11675
8418E744443K93775K98019M38866K68829J94619L86843N85574N58644N78023O20599
8408I968234O72224P03864O44665Q51686J188183J194762R06458O27231K01537
8399A6958844K08284O15993Q58282Q73113L06625m10378p62935j205318j191793
$$ y = [3149536, 3039127, 2957382, 2899647, 2828055, 2870433, 2811604, 2757370, 2756670, 2713615, 2681203, 2756876, 2689589, 2707327, 2760353, 2748462, 2767777, 2820649, 2807816, 2878526, 2960055, 2867726, 2892257, 2950438, 3002142, 3113269, 3186761, 3232391, 3374227, 3445275, 3448124, 3474570, 3577053, 3562131, 3605282, 3642473, 3708789, 3833485, 3872165, 3952040, 4064520, 4168128, 4167858, 4167608, 4314669, 4353209, 4484235, 4634008, 4681798, 4759872, 4906651, 5052931, 5343684, 5458718, 5532768, 5744443, 6038218, 6336237, 6775103, 7043932, 7238551, 7625394, 8210968, 8769612, 9347635, 9968234, 10640458, 11344322, 11988987, 12840673, 14028856, 15223618, 16130076, 16757307, 16958844, 17167128, 17783121, 18641403, 19514516, 19821141, 19410763, 18647828, 17442510, 16250717]
8390A6250717q92513p47965n59785l34187k02654j98128k01983l00190l29604
8381A2483708k23549k15203j88164j8657J11868R4141K70547L86661L71941N24305
8371A3597598O64361P73943Q81515P29957P53669Q24797P57401P06310O13368
8362B0302919P43656J142651J228648P74465J83988j3849r7755k26880n64150
8353B3473693j229010j661666j573263j404233j071867p87373p20037o51233m08250
8344A3966761k24054k61692k86179l07503k62625j99810j92797k9720k9226k84456
8334A1888699k70302j72947j00314j9519p2891K5493m3239n0486q8902q9214j73372
8323A0833006j46101o2798N48j5932Q7927J06496J85228J98397J15014k6475q7676
$$ y = [16250717, 15358204, 14610239, 14050454, 13716267, 13513613, 13315485, 13113502, 12813312, 12483708, 12260159, 12044956, 11856792, 11838135, 11950003, 12044144, 12314691, 12701352, 13073293, 13597598, 14261959, 15035902, 15917417, 16647374, 17401043, 18225840, 18983241, 19689551, 20302919, 21046575, 22189226, 23417874, 24192339, 24376327, 24362478, 24264723, 24037843, 23473693, 22244683, 20583017, 19009754, 17605521, 16533654, 15746281, 15026244, 14375011, 13966761, 13742707, 13481015, 13194836, 12887333, 12624708, 12424898, 12232101, 12202381, 12173155, 11888699, 11618397, 11445450, 11345136, 11325617, 11252726, 11278219, 11234980, 11184494, 11095592, 11006378, 10833006, 10686905, 10624107, 10624655, 10608723, 10696650, 10803146, 10988374, 11186771, 11301785, 11275310, 11187634]
8312A1187634j1552O0531P3243P6065j5509M8382j07388j06709n3894j6734q0067
8301A1054002q7197m070K3043J94548J60755j32528q1792P5347J61754N6058p9335
8290A1340585J5492Q1649p549o8194p2099j86913j41508j08332o5204J0254l2294
8279A0765887M703R8566J30215J75089J83432J24865J48477J37269J52522R4126
8269A2015151p3065P0200j60231k89158k76076k46024j02973q1799j59459J828
8259A0698394k40767j87859j29532j93517l3981j10393j75611j02236n011K8435
8249I547922j40299j29165j05731r1809J7313J6590Q2106J43315Q1677R2310J7879
8238I532108J13811R2921J32049J37324O9075J99051J37897K77148J90975J23760
$$ y = [11187634, 11176082, 11236613, 11309856, 11385921, 11370412, 11418794, 11311406, 11204697, 11150803, 11134069, 11054002, 10966805, 10962735, 10985778, 11180326, 11341081, 11208553, 11126761, 11202108, 11363862, 11419920, 11340585, 11356077, 11437726, 11430177, 11361983, 11289884, 11102971, 10961463, 10853131, 10787927, 10798181, 10765887, 10770590, 10869156, 10999371, 11174460, 11357892, 11482757, 11631234, 11768503, 11921025, 12015151, 11942086, 12012286, 11852055, 11562897, 11286821, 11040797, 10937824, 10856025, 10696566, 10698394, 10457627, 10269768, 10140236, 9946719, 9912738, 9802345, 9626734, 9524498, 9519487, 9547922, 9407623, 9278458, 9172727, 9080918, 9098231, 9114821, 9196927, 9340242, 9421919, 9514229, 9532108, 9645919, 9738840, 9870889, 10008213, 10077288, 10276339, 10414236, 10691384, 10882359, 11006119]
8228A1006119K14205L93798L40112K32521J63724J69381O3446K04024P7921n547
8218A2859704R782o5045r8935m7062m6012P503P9194O6559J62651J47809K08678
8207A3284826J63064K64690L76595K55664J42829J26775L06374L95926L61265
8198A5678008M81256N47763N97166O37873Q03119J223117K236146j72816K28265
8189B2259897R48003P44151R27849O27704O09138N45064Q12860J021987R66127
8180B9462780Q60145P63879K01063K21865J64516L54242P11320Q22109R29138
8171C4491057R96459O31934O78487O78836R14683P06803J67875l87103l59841
8162C8519190j85614J79487M90816P81301P99204P18251O99805O66918Q27282
$$ y = [11006119, 11220324, 11614122, 11954234, 12186755, 12350479, 12519860, 12583306, 12787330, 12865251, 12859704, 12869486, 12804441, 12705506, 12658444, 12612432, 12619935, 12699129, 12765688, 12928339, 13076148, 13284826, 13447890, 13712580, 14089175, 14344839, 14487668, 14614443, 14920817, 15316743, 15678008, 16159264, 16707027, 17304193, 17942066, 18745185, 19968302, 22204448, 22031632, 22259897, 23207900, 23952051, 24879900, 25507604, 26116742, 26661806, 27474666, 28496653, 29462780, 30322925, 31086804, 31287867, 31509732, 31674248, 32028490, 32739810, 33561919, 34491057, 35487516, 36119450, 36797937, 37476773, 38391456, 39098259, 39266134, 38879031, 38519190, 38333576, 38513063, 39003879, 39785180, 40584384, 41302635, 42002440, 42669358, 43496640]
8153D3496640R98281R81164J016699J165882J324597J491786J745774J903431
8145E4124254J768249J417279J253903J379811J303194J319614J461054J597488
8137F5624846J722538J523415J229758N49303M63299P90924J023453J411523Q71050
8128G5210109m57807q69874o59088l77372m16974j284675j639873j415583j261256
8119F6827607j123686j020344p94888l47789m4966J60642K93392M72814N23220
8110F4946002O11085R13742J148463J420364J673796J357346P94112M00663M14988
8101G3680561P53007J332328K054072K869360L513236L766473K957128J305995
8093I2232160K83114m07659r19166j756315k149565j658412j128195m40860l2624
$$ y = [43496640, 44494921, 45476085, 46492784, 47658666, 48983263, 50475049, 52220823, 54124254, 55892503, 57309782, 58563685, 59943496, 61246690, 62566304, 64027358, 65624846, 67347384, 68870799, 70100557, 70649860, 71113159, 71904083, 72927536, 74339059, 75210109, 74752302, 73882428, 73223340, 72845968, 72428994, 71144319, 69504446, 68088863, 66827607, 65703921, 64683577, 63888689, 63540900, 63495934, 63656576, 63949968, 64422782, 64946002, 65557087, 66470829, 67619292, 69039656, 70713452, 72070798, 72864910, 73265573, 73680561, 74433568, 75765896, 77819968, 80689328, 84202564, 87969037, 90926165, 92232160, 92515274, 92107615, 91188449, 89432134, 87282569, 85624157, 84495962, 84055102, 84022478]
8084H4022478m01093n14536p30897r74116r66889j094501j052626o35757m27113
8075G7224950j12743J2584K54571N20358M43500J86834K7245M2408K27457J08738
8065G8935902J56428K37134M27656P36050J054121J348605J759028K005918K311020
8056H8971862K658982L250292L994624M737707N025051N124428M513841L595267
8048A21872054K664664K484719K860581L462263L606895K903608J130249p74866
8040A40210167l407181n602109o488172o245571n407272m313328l373993k336667
8032A03035874j434383p75295l98746k84833k99973l60883n441N59446R94867
8023A01030633J490617J797225K209759K596255K736452K472964K528732K856064
$$ y = [84022478, 83621385, 83106849, 82375952, 81401836, 80434947, 79340446, 78287820, 77652063, 77224950, 77112207, 77124791, 77379362, 77899720, 78343220, 78530054, 78557299, 78599707, 78827164, 78935902, 79092330, 79329464, 79757120, 80493170, 81547291, 82895896, 84654924, 86660842, 88971862, 91630844, 94881136, 98875760, 103613467, 108638518, 113762946, 118276787, 121872054, 124536718, 127021437, 129882018, 133344281, 136951176, 139854784, 140985033, 140210167, 136802986, 131200877, 124712705, 118467134, 113059862, 108746534, 105372541, 103035874, 101601491, 100826196, 100427450, 100142617, 99842644, 99481761, 99476320, 100035766, 101030633, 102521250, 104318475, 106528234, 109124489, 111860941, 114333905, 116862637, 119718701]
8015A19718701L011537K886667K109335J711867J556446J543989J597487J181003
8007A35317032j89806j553789k543146k820171l368599l073490k539082k182890
7999A17046059k328164k153379j522291n86897K47620J336967J938721K683386
7991A16662022L104437L374607K991413K747898K658711L128171L998530N624072
7983A44289861O552647Q087336R042799J0927253J2420703J5964092K0631461
7976B27916152K8653547L5810864L6418080m987506l9823663l9973832l5469579
7969B08544063k4939959j9444423j4969503j2161720r381922q378960o799013
7962A12468563n589760l955978l325262k174101j669147j155713j087531o11067
$$ y = [119718701, 122730238, 125616905, 127726240, 129438107, 130994553, 132538542, 134136029, 135317032, 135127226, 133573437, 131030291, 128210120, 124841521, 121768031, 119228949, 117046059, 114717895, 112564516, 111042225, 110455328, 110702948, 112039915, 113978636, 116662022, 119766459, 123141066, 126132479, 128880377, 131539088, 134667259, 138665789, 144289861, 150842508, 158929844, 167972643, 178899896, 191320599, 207284691, 227916152, 256569699, 292380563, 328798643, 323811137, 283987474, 244013642, 208544063, 183604104, 164159681, 149190178, 137028458, 127646536, 119267576, 112468563, 106878803, 102922825, 99597563, 97423462, 95754315, 94598602, 93511071, 92900004]
7954I2900004n34885k79403n12352p15787j186313j234968j522215j497257j534571
7945H3882253j282032j681583k213472k661081k588262k320443j909118j774350
7937F7451912j639904j974547j985650j923897j825108j706712j379309j289011
7929E3727774j036683q02496o59415o35262n41240n36343m85760k98880k03110
7920D8528585m29415l61996l76303n49794n89103o12782n49977j15754j24572
7911D4818889m5314m45138o77719q46594q67229q13965o94780o77724r11134r88882
7901C7850410q99939p86247n26432k84450j22423O2330J6336n2257Q056L6083
7891C5301467J02569R2785k63662p04010q60050q62433o55595m23244o07829o65693
$$ y = [92900004, 92365119, 92085716, 91573364, 90857577, 89671264, 88436296, 86914081, 85416824, 83882253, 82600221, 80918638, 78705166, 76044085, 73455823, 71135380, 69226262, 67451912, 65812008, 63837461, 61851811, 59927914, 58102806, 56396094, 55016785, 53727774, 52691091, 51888595, 51229180, 50593918, 50052678, 49516335, 49030575, 48731695, 48528585, 48099170, 47737174, 47360871, 46811077, 46221974, 45609192, 45059215, 44943461, 44818889, 44773575, 44328437, 43650718, 42804124, 41936895, 41122930, 40428150, 39750426, 38839292, 37850410, 36950471, 36164224, 35637792, 35353342, 35230919, 35293249, 35309585, 35257328, 35265384, 35301467, 35404036, 35496821, 35233159, 34529149, 33669099, 32806666, 32151071, 31727827, 31119998, 30454305]
7881C0454305m01971m15188k10449j9833j34897j62818n64931o78277n58254o83990
7871B6623697o89443n61047n54688m53164l43967k41287o6548J82875J24896k0642
7861B4000682j29708l2435o4052K94616K86251L86978J39411j13273m47215o50996
7851B3670259j052395q99573q74509p10861n92329n31082m40410l53852n19240
7842A7696008l36528m07871m24357m28520l53330k62571j70312l16802l31022
7833A4664695k35555j91454l38214j95895m7038p6080K6379J18673R0612k043
7823A3814080r7899k45827k06893r7535q8395r7309k78571m11944m68273k20661
7813A1600773k02499k49565l23243l01884l74913l24109j25591k16020j32653
$$ y = [30454305, 30052334, 29637146, 29426697, 29406864, 29271967, 29109149, 28544218, 27865941, 27307687, 26623697, 25934254, 25373207, 24818519, 24365355, 24021388, 23780101, 23713553, 23896428, 24021324, 24000682, 23870974, 23838539, 23774487, 24069103, 24355354, 24742332, 24881743, 24768470, 24321255, 23670259, 22617864, 21718291, 20843782, 20132921, 19540592, 19009510, 18569100, 18215248, 17696008, 17359480, 16951609, 16527252, 16098732, 15745402, 15482831, 15312519, 14995717, 14664695, 14429140, 14237686, 13899472, 13703577, 13656539, 13580459, 13606838, 13725511, 13816123, 13814080, 13716181, 13470354, 13263461, 13165926, 13077531, 12980222, 12701651, 12289707, 11821434, 11600773, 11398274, 11148709, 10825466, 10523582, 10148669, 9824560, 9698969, 9482949, 9350296]
7804I350296o9117k46693o1700j558k2804j1697p4715j21537j21292k05527j35411
7793H278245l1495n7770j10491o6291j08570m9208j3890k7781j19534m4329p6564
7782G572322k35219j48542j69869j94393K7378k3386n1979L9382j40868n6806
7772F618020J6476q6115n9984r2381k42833m841l0867o0654o019p7782j25908
7761E847112k2666j45695m3601j01041m1240o9181j11541l3970J08007l9658N9133
7750E405659j85117j8175m8391j45588P6271R115j90378K6907j24516k2724R316
7739D792379o8927o9160j3259m9995L6473k5858j08924j35560m4726q9550j1863
7728D211030j37048j01169k8170j55472m6795k9798J9200L2607j05836j18557
$$ y = [9350296, 9281179, 9034486, 8972786, 8971228, 8948424, 8936727, 8862012, 8740475, 8619183, 8413656, 8278245, 8246750, 8188980, 8078489, 8012198, 7903628, 7854420, 7840530, 7812749, 7693215, 7648886, 7572322, 7337103, 7188561, 7018692, 6824299, 6851677, 6828291, 6776312, 6815694, 6674826, 6618020, 6634496, 6548381, 6488397, 6396016, 6153183, 6148342, 6117475, 6056821, 6050802, 5973020, 5847112, 5824446, 5678751, 5635150, 5534109, 5492869, 5423688, 5312147, 5278177, 5386184, 5346526, 5405659, 5220542, 5202367, 5153976, 5008388, 5084659, 5093774, 4903396, 4930303, 4805787, 4783063, 4792379, 4723452, 4654292, 4641033, 4591038, 4627511, 4601653, 4492729, 4357169, 4312443, 4222893, 4211030, 4073982, 3972813, 3944643, 3789171, 3742376, 3712578, 3731778, 3764385, 3658549, 3539992]
7718C539992K493P180m6636j03563M3042k0948L2005J8965j98004n8160j2511
7707C203855p0300o6215m8514M5008q7210q0138M4063J14098R0150j23550q8445
7696B932802k5550k1828K4358j32642J07850r9060j56268q806n2458m6268R3308
7685B615438j5371k1647o5222j06804P2510N4044m4270k8546L7973p4334r6635
7674B327136q4177L9642O5855q6403l0634J3470J1971m9423J9084O0568q8802
7663B198287j20039q1540q6739J01939N3371N4421J35057q132l3330K1127j2709
7652B221713k4641j24443o651M956L6352j7011k3822J04333j13309j06234j8839
7641A932404k8625K5573q3643j09451j9457o5469L2218l11J54891K9356l3817
$$ y = [3539992, 3542485, 3549665, 3503029, 3399466, 3442508, 3421560, 3453565, 3472530, 3274526, 3216366, 3203855, 3133555, 3067340, 3018826, 3063834, 2976624, 2896486, 2940549, 3054647, 3144797, 3021247, 2932802, 2907252, 2885424, 2909782, 2777140, 2884990, 2785930, 2629662, 2620856, 2568398, 2522130, 2615438, 2600067, 2578420, 2513198, 2406394, 2478904, 2532948, 2488678, 2460132, 2498105, 2423771, 2327136, 2242959, 2282601, 2348456, 2262053, 2231419, 2244889, 2256860, 2207437, 2226521, 2287089, 2198287, 2078248, 1996708, 1909969, 2011908, 2065279, 2119700, 2254757, 2246625, 2213295, 2234422, 2221713, 2197072, 2072629, 2065978, 2070934, 2107286, 2090275, 2066453, 2170786, 2057477, 1951243, 1932404, 1903779, 1929352, 1845709, 1736258, 1716801, 1651332, 1683550, 1683239, 1838130, 1867486, 1833669]
7630A833669p3841p1772N3342l0324r4345q039J3511J01318k9185k5734N7528
7619A726128P0970l41j69736N7565N7966j06092K7610J009l2126P6431j76021
7608A533363o11O0566k3788J7371o1136l0029l9715R501q43o6156M2094j22556
7596A318061k4641p403L8874J04880k8390j05545m573j2666L2250P4988j6068
7585A369767j06510O0321l2013j0396N1760J0196K7572o6657j00063m8357j47846
7574A007774N2974O1938j2376o8212p7667K8195P912P9751K3463r046n3132j30651
7562I10923l5678K1060N8239R9360n7728j5807J7681N7786J45529k2710o3560
7551A115095J2581p5578n8633l76J2804j06618J5928R118j37977J03555N8176
$$ y = [1833669, 1759828, 1688056, 1741398, 1711074, 1616729, 1608690, 1622201, 1723519, 1694334, 1668600, 1726128, 1797098, 1796757, 1627021, 1684586, 1742552, 1636460, 1664070, 1665079, 1632953, 1709384, 1533363, 1532752, 1593318, 1569530, 1586901, 1525765, 1495736, 1456021, 1465522, 1464679, 1398523, 1440617, 1318061, 1293420, 1286017, 1324891, 1429771, 1401381, 1295836, 1291263, 1278597, 1310847, 1385835, 1369767, 1263257, 1323578, 1291565, 1281169, 1332929, 1343125, 1370697, 1304040, 1203977, 1155620, 1007774, 1060748, 1122686, 1110310, 1042098, 964431, 992626, 1000538, 1080289, 1103752, 1094706, 1041574, 910923, 875245, 896305, 954544, 1053904, 996176, 980369, 998050, 1055836, 1201365, 1178655, 1115095, 1127676, 1052098, 993465, 993089, 1005893, 899275, 915203, 924321, 786344, 889899, 948075]
7540I48075m9370K3872l4240o3618l7537o9038Q460j9275N2669j0825p4789Q541
7528F82925O7954M9831r9189o0508M6680r1726O1959Q0096K4698J04297p7613
7517G89404M036k9505L2409j361J2491p2632r4735o7605L1153P7174J18561L1195
7505H30585l2131j16731o8426o1214J19149L834q7266o1171N9031O7700J03084
7494G56444J0902J06223p7378j14538q4152k562J12527L1259j5672l8936j8885
7483F65232O5633P5543q6241o1015m614K0030l4404J9838P4625P3937R8853l2229
7471H75188N8101J42416J7573K32634K09975K05661N8025j70030j61647j80630
7461A287266n0893J2336k08187j53303j32542j7252l1369r1817l6893l1660l0793
$$ y = [948075, 898705, 922577, 888337, 824719, 787182, 718144, 726604, 707329, 759998, 749173, 674384, 682925, 750879, 800710, 701521, 641013, 687693, 595967, 657926, 738022, 762720, 867017, 789404, 793440, 763935, 796344, 794983, 807474, 734842, 640107, 572502, 603655, 680829, 799390, 830585, 798454, 681723, 613297, 552083, 671232, 675066, 587800, 526629, 585660, 653360, 756444, 767346, 873569, 796191, 681653, 597501, 594939, 707466, 738725, 723053, 684117, 665232, 730865, 806408, 720167, 659152, 654538, 674568, 640164, 660002, 734627, 808564, 907417, 875188, 933289, 1075705, 1093278, 1325912, 1535887, 1741548, 1799573, 1629543, 1467896, 1287266, 1236373, 1248709, 1040522, 887219, 754677, 737425, 706056, 614239, 577346, 545686, 514893]
7450E14893o254Q3592Q9549n3692p8266j31343l5336M4360k4320j3053N0748r3746
7438C47132J1653K0026q4430Q6319K9681q7293K3753o8766p250J36730J02863
7427E10418k2188m9524n2945l6674o2178m3433J7729N3043j05605j355J12126
7416C19414P0524J4571o0004j0928o1100o7416q1318N6344m6246J63271J06964
7405D04076j51248p0002m6584O176k3151n681N1832J4854o6434Q3985Q5267J28602
7393D11692k7586m7252j05434l9339O0520q9840M3214l0134j363k6983K665R0421
7381B40581O578j3632J7972K2335m3565r2580n1801q5972j368O7513l4003O9300
7369A01358J03573k486P1117j36722N1756M5842j16726R110L3229L1120M1390
$$ y = [514893, 508639, 592231, 681780, 628088, 549822, 418479, 383143, 427503, 403183, 390130, 440878, 347132, 358785, 378811, 294381, 380700, 410381, 323088, 346841, 278075, 270825, 407555, 510418, 488230, 438706, 385761, 349087, 286909, 243476, 261205, 314248, 208643, 207288, 319414, 389938, 404509, 344505, 333577, 272477, 205061, 123743, 180087, 133841, 297112, 404076, 252828, 182826, 136242, 142418, 119267, 113586, 165418, 180272, 113838, 197823, 283090, 411692, 384106, 336854, 231420, 192081, 252601, 162761, 205975, 175841, 174478, 147495, 150160, 240581, 247159, 233527, 251499, 273834, 230269, 137689, 85888, -84, -1452, 66061, 32058, 101358, 204931, 202445, 273562, 136840, 188596, 234438, 117712, 126822, 160051, 191171, 232561]
7358B32561o439L386j07037r497L3639o2436M4670j1767L6518J26560j03701l6219
7346A40238p216l5106K2162n5771l0774K1285P3273p949k0466K3958k0018K6363
7334A29979N4897j75694q4244R1462J34230L7831J17095n8545o4058q0916j25450
7323b3413K8317R4595N0789o8785n9821N1334L3527N0339m4060K435k023j27045
7311a3811k8468M6798j1917L8748j7021l5765Q1240n3461K7367O9091N4710l0
7299A57481o0646J3323l5101J6494j00907o1034M1793N7957M7292j0435J0213
7288G6430N5187r7349q6120j5696J1838M5649n2391r7563N5278J09684J9823J2765
7276C7535N9511k0471j19065q810m585n524r7499J9167J04876J05979l397j511
$$ y = [232561, 226122, 229508, 122471, 112974, 146613, 84177, 128847, 117080, 153598, 280158, 176457, 140238, 133022, 97916, 120078, 64307, 33533, 54818, 128091, 120142, 99676, 123634, 103616, 129979, 184876, 9182, -75062, 16400, 150630, 188461, 305556, 247011, 182953, 102037, -23413, 4904, 99499, 150288, 81503, 21682, 73016, 106543, 156882, 112822, 115257, 113234, -13811, -42279, 4519, -7398, 31350, 14329, -21436, 59804, 6343, 33710, 102801, 157511, 157481, 96835, 110158, 75057, 91551, -9356, -70390, -28597, 29360, 76652, 66217, 76430, 131617, 34268, -51852, -67548, -55710, -10061, -62452, -160015, -104737, 4947, 24770, 37535, 97046, 76575, -42490, -51300, -55885, -61409, -158908, -139741, -34865, 71114, 67717, 66206]
7264F6206k2873k3131K2800k8110o8014j8470K817P4796j3890K7336K8051K0930
7252F8448N150o0273j8953K8823p4159l7743j669J3678M2444k512J04764L1957
7240I9955j3907Q2469j33570K960Q542q159P3068j01430j8720O3141N206r035
7228E0520K5710K7907k7099o322o1369J2396k134L1028L784j7570j1761j56j5773
7215I161M1601q4088n2635K7415k1588M4664J5823O8757J6263o9353L707P0801
7203G0528o631m3753J4188J56015k6355j66406m4497J17428M8737j5594j27809
7192b4149k0129J1272j2350j4303Q0529l2000M5753n626r6722P0695K057m4388
7180c9361P796m9144J4023R0657j2190o3247q519J17859J40067j38943k1649l0656
$$ y = [66206, 43333, 20202, 43002, 14892, -53122, -71592, -68775, 6021, -7869, 19467, 47518, 68448, 73598, 13325, -5628, 23195, -50964, -88707, -90376, -76698, -34254, -36766, 67998, 99955, 86048, 168517, 34947, 37907, 46449, 38290, 111358, 9928, -8792, 54349, 59555, 50520, 76230, 104137, 77038, 70716, 9347, 21743, 19609, 50637, 54421, 36851, 25090, 24934, 9161, 50762, -33326, -85961, -58546, -80134, -35470, -19647, 49110, 65373, -3980, -273, 70528, 63897, 20144, 34332, 190347, 163992, -2414, -46911, 70517, 119254, 103660, -24149, -44278, -33006, -45356, -59659, 20870, -11130, 34623, 28997, -67725, 2970, 5027, -39361, -31565, -80709, -66686, 23971, 11781, -51466, -59985, 57874, 197941, 58998, 37349, 6693]
7168F693p2763n675R2157p273k1290K3495K708j6709K8503P0305N5862l134o4808
7155H8071j760q3123j2549o3118R87K7657m8651J11531N0498K4490K1620k5067
7143I0586R8582j17181n9827r258m4836j6206N6632O3547n1704M134M9207J06410
7131A70086R253q9397m0177J1295L3015j26166o3805J64258O4605M6738Q3676
7120B63381o4922k0349j12784j01940J3786j02706J03108Q1020j10790J15195
7110F2999j6004O3535l7507K9486L5232p1459o4144q2202L6403J00568q32L8321
7098I4396m2981J0231l703l8852N6921J7854o880j49491r5130J52603P4716q595
7086F1089J1003j27138J1577L139Q1079l4806l3934j1631J10786K3394r1386o0027
$$ y = [6693, -66070, -71745, 20412, 13139, -8151, 15344, 18052, 1343, 29846, 100151, 156013, 152879, 88071, 86311, 3188, -9361, -72479, -71492, -43835, -92486, 19045, 69543, 94033, 115653, 90586, 189168, 71987, 12160, 2902, -41934, -58140, -1508, 62039, 10335, 14469, 63676, 170086, 179339, 89942, 49765, 61060, 94075, -32091, -95896, 68362, 132967, 179705, 263381, 198459, 178110, 65326, -36614, -22828, -125534, -22426, 58594, -52196, 62999, 46995, 110530, 73023, 102509, 137741, 66282, 2138, -80064, -43661, 56907, 56075, 94396, 51415, 61646, 57943, 19091, 76012, 93866, 86986, -62505, -157635, -5032, 69684, 61089, 72092, -55046, -43469, -40330, 40749, 5943, -27991, -39622, 71164, 94558, 3172, -56855]
7074e6855J26037R5864J5736o6766r2635k6293l8202K8396N9572O8759J9262q6294
7062D6581p3989p2677N9222J21359j08733j753M1728l0459k9773m1045j277J22902
7050C2086N0957j8332J8649j01079K0430L6954k210Q2096j0237q4367M5335j0527
7038E9755l8095R7106m4474p8732R408J4778k9631N886N8042M201M8377k3542
7026H3079r3458M7954L012q5506K8229J4257p745P5703o5824N7133J04922N5486
7014B17242j51980j29661q490J15572M6003l9302Q0379P312n32K3767k0770k6204
7002A13336K2918j3264j00058l9844J2725L314R1439j5525l0605R4655q8886j04585
6990e4380J3196N4107m2749M9752j5554r1563J07174N1962J4435M5094k3103j0840
$$ y = [-56855, 69182, 165046, 180782, 114016, 21381, -4912, -43114, -14718, 44854, 113613, 132875, 46581, -27408, -100085, -40863, 80496, -28237, -29990, 11738, -18721, -48494, -89539, -90816, 32086, 83043, 64711, 83360, -17719, 2711, 39665, 37455, 119551, 109314, 24947, 70282, 59755, 21660, 118766, 74292, -4440, 4968, 19746, -9885, -3999, 54043, 58244, 106621, 83079, -10379, 37575, 40587, -44919, -16690, -2433, -10178, 65525, -299, 56834, 161756, 217242, 65262, -64399, -72889, 42683, 88686, 49384, 129763, 137075, 136543, 160310, 139540, 113336, 136254, 122990, 22932, -16912, -4187, -873, 90566, 75041, 44436, 139091, 50205, -54380, -41184, 12923, -29826, 19926, 4372, -87191, 19983, 71945, 86380, 131474, 108371, 97531]
6978I7531R227l5031K1006N2672n5555m4182O1270R143l8492l1177K2311k7656
6966D1067N5867m812l2025o7112K8384O8734P3480l9113q0361J3383L8848p1742
6954B4598l8943M3463J22316J9477n7444J13672j6340o3091q1712l7534R7421
6943A25883M0839o5993q5205o0444J66504J3900l4429q450o9916Q111K8894p6399
6931a6705K6647N8104n7893j8158K3334R1964K5142K5984p0509j3315k3187l6047
6919A5361P0981m358J02844J25534p7158m4742k4751N621o0857J12791q282j05850
6907A07134k7800p51K9931R4114N49l6466m3347M098R2637l8585j0258m9377o5787
6894E6092L4874M0279k5396J5012j4722P9877j7111n7261j7027O3269N6305k4859
$$ y = [97531, 106758, 71727, 92733, 145405, 89850, 45668, 106938, 116081, 77589, 46412, 68723, 41067, 96934, 92122, 60097, -7015, 21369, 90103, 163583, 124470, 44109, 57492, 96340, 24598, -14345, 29118, 151434, 170911, 113467, 227139, 210799, 147708, 65996, 28462, 125883, 166722, 100729, 15524, -44920, 121584, 135484, 101055, 92605, 22689, 30800, 59694, -16705, 9942, 68046, 10153, -8005, 15329, 107293, 132435, 158419, 87910, 74595, 51408, 15361, 86342, 81984, 184828, 310362, 233204, 188462, 163711, 169332, 108475, 221266, 212984, 107134, 79334, 78583, 108514, 202628, 203177, 166711, 123364, 127462, 220099, 181514, 171256, 121879, 56092, 90966, 131245, 105849, 120861, 106139, 186016, 168905, 111644, 94617, 157886, 214191, 189332]
6882A89332n6744R0165J0463o9085o950j312m2187J05946r4440K6205J65690K610
6870C19693p6583j2586j5462o0853o46m2372n3821O7819m0444k3793J1901k3005
6858D9848J19269N6130m6269J4231p920K8160L9753J1141m9263o5486J7039Q689
6846A75322k8169R3102r1990j24948L6810m755q958K6568O3985R8289M772j32605
6834A07423m2334N1727N0094j2450L2376k5225p0344R636M8034P9062R2125l7480
6822B82644k0692r2846k8287P4014M8530M278R2426j08269j12231o2685J22822
6811A99704P3202p440r9868M2211K630m2549l6164J70733o6891j07516j8203O35
6799A10484J34822N0743p1946J2230p2622r257L0480J676M1061L2898O4442p5691
$$ y = [189332, 132588, 222753, 233216, 164131, 157181, 155869, 113682, 219628, 125188, 151393, 317083, 319693, 243110, 230524, 215062, 154209, 153563, 111191, 57370, 125189, 84745, 60952, 72853, 49848, 169117, 225247, 178978, 193209, 185289, 213449, 253202, 264343, 215080, 149594, 166633, 175322, 147153, 240255, 148265, 23317, 60127, 55372, 46414, 72982, 136967, 235256, 240028, 107423, 65089, 116816, 166910, 154460, 186836, 161611, 91267, 100903, 148937, 227999, 320124, 282644, 261952, 169106, 140819, 214833, 263363, 267641, 360067, 251798, 139567, 76882, 199704, 272906, 265466, 165598, 207809, 210439, 167890, 131726, 302459, 235568, 128052, 109849, 110484, 245306, 296049, 224103, 236333, 163711, 154454, 184934, 186610, 227671, 260569, 325011, 249320]
6787B49320r1602J58181K42p3959M0431P736j9155J7339l5252o1109R5406n7904
6775B29674r2630Q9500K5597m0257J20822q6228j8954q855n0171L6551L7660L749
6763B46458L2084J0806r2273J15011J87704p0699q0929J5618k6052P337P6053
6752D21118j21586K9670L4939q5532N3808j2042p6378J27339k1030L2529m6477
6741C36358m7087J8676J41410j12560n3698Q2115k3597j29524O7065L4852P3244
6730C87254j5734j04053L1511J01411K0665M565K1069M7761m7584n2948l0532
6719C63385J00870O4181q3233J1267K910r2834Q3932j2001r3427N8953r293M3188
6707D37898l9489p1599P9227M4147M2359Q916k8541J7346L4553j8268N3537L3271
$$ y = [249320, 157718, 315899, 316141, 242182, 282613, 290349, 271194, 288533, 253281, 192172, 287578, 229674, 137044, 226544, 252141, 211884, 332706, 246478, 227524, 218669, 168498, 205049, 242709, 246458, 278542, 289348, 197075, 312086, 499790, 429091, 348162, 363780, 337728, 345065, 421118, 299532, 329202, 364141, 278609, 332417, 320375, 243997, 371336, 350306, 382835, 336358, 289271, 307947, 449357, 336797, 283099, 365214, 341617, 212093, 279158, 314010, 387254, 371520, 267467, 298978, 400389, 421054, 425619, 446688, 494449, 446865, 393917, 363385, 464255, 528436, 445203, 456470, 459380, 366546, 450478, 438477, 345050, 404003, 394710, 437898, 398409, 326810, 406037, 450184, 492543, 501459, 472918, 490264, 524817, 506549, 560086, 593357]
6695E93357j21552l441P3118P5302K6602p2273n8597J01493l3721m591o6955P9263
6683E88005N5478p6400Q187j3273Q1343k1433j41551P8106n287L363L7857p7441
6671E16954K8489K6323q8191O8909M9162K0385N842J05208o6931M5815N2784L0471
6659G95220k9133j12355R211Q6818q8961p061k9335Q5322J9929l4118k2913L96
6647F73020J03945K2141j05376M5087k9377l2021j3338n8293Q4343O7158l6419
6636G20870k9296J6594m2014R5821M1896k6236K2854J06340j37944l8488J8369
6625G48766P2454J5340n0565k0702J8944Q0908N7748r2005M4904O6368l3056k3769
6613H85335R85J44075k3092n6249J2334M1285L7239k5316L2852J00872n5431M8707
$$ y = [593357, 471805, 468364, 541482, 616784, 643386, 571113, 512516, 614009, 580288, 575697, 508742, 588005, 643483, 567083, 575270, 561997, 643340, 621907, 480356, 558462, 553175, 556538, 594395, 516954, 545443, 571766, 483575, 552484, 601646, 622031, 627873, 733081, 666150, 711965, 764749, 795220, 766087, 653732, 662943, 749761, 660800, 653739, 624404, 709726, 729655, 695537, 672624, 673020, 776965, 799106, 693730, 738817, 709440, 677419, 664081, 605788, 690131, 757289, 720870, 691574, 708168, 666154, 761975, 803871, 777635, 800489, 906829, 768885, 730397, 748766, 821220, 836560, 785995, 765293, 784237, 865145, 922893, 830888, 875792, 942160, 909104, 885335, 886320, 1030395, 1007303, 951054, 963388, 1004673, 1041912, 1016596, 1049448, 1150320, 1094889, 1143596]
6601A143596q789j14936O7933q16l013l9089k1621r1373k823J53628l3679j2503
6589A036515M078q21q042n254O1819l1118o9455m076n2714Q3948O3117q7643j17189
6576H73165O028Q2410P940M2560J8789K7171N2119j7925K6930M9391n5497m1307
6564A071774M459P9292J1737o921j070N8197L2351m0876j0552N3984k2869j7049
6552A212457k5870k2297p111j3067J49898q8645O869J5185n2600M4107n0296j4441
6540A154189P4747O6079j29404l7369P3771M8984L1628J03743l8440j1944K1145
6529A357129J1664m0737j04051j9472M6143O7367J6657j5997R3158k2255R6646
6518A486252Q1948p2758j2742q8377K0557J4239M08M918P8028M6384r434J5785
$$ y = [1143596, 1134807, 1019871, 1087804, 1086988, 1083975, 1044886, 1023265, 931892, 929069, 1082697, 1049018, 1036515, 1040593, 1039772, 1031730, 1026476, 1088295, 1057177, 987722, 983646, 930932, 1014880, 1077997, 990354, 873165, 879193, 961603, 969543, 1012103, 1030892, 1058063, 1110182, 1092257, 1119187, 1168578, 1113081, 1071774, 1076233, 1155525, 1167262, 1160341, 1159271, 1217468, 1249819, 1208943, 1198391, 1252375, 1229506, 1212457, 1186587, 1164290, 1157179, 1144112, 1294010, 1205365, 1212234, 1227419, 1174819, 1218926, 1168630, 1154189, 1228936, 1295015, 1165611, 1128242, 1202013, 1250997, 1282625, 1386368, 1347928, 1335984, 1357129, 1368793, 1328056, 1224005, 1204533, 1250676, 1318043, 1334700, 1318703, 1411861, 1389606, 1486252, 1568200, 1495442, 1482700, 1394323, 1414880, 1429119, 1429527, 1434445, 1512473, 1558857, 1549423, 1565208]
6506A565208J12542J5472l2867Q0554j25292R813q451R4216M0406k6672Q7687
6495A812616K4220m0591m5484l4717L5421L1381L5721J9820N1049k9320O7922
6484A928038R1081M1111l3607J0030K5184k2713j07552M3550P4963l597J10184
6473B156672k9323R8227J00481L311j8032K9085j24668K8039P7331L0612j4045
6462B337690r855k2556O5787N5655K8171N5835m6158J3209P0641L2203j9528O9556
6450B630650R806n8397J4529N0588K0891O3447Q7145k2697l219r314P6751N4554
6438B914734k9147l5203J07693J8593p1146J00345N2580L5020O2106o4632k2673
6427C068270o7864l2266P8557J00591m5702Q232l1008Q3806Q0348J2539J3954
$$ y = [1565208, 1677750, 1693222, 1660355, 1740909, 1615617, 1625430, 1616979, 1711195, 1751601, 1724929, 1812616, 1836836, 1796245, 1750761, 1716044, 1751465, 1782846, 1818567, 1838387, 1889436, 1860116, 1928038, 2019119, 2060230, 2026623, 2036653, 2061837, 2039124, 1931572, 1975122, 2050085, 2046488, 2156672, 2127349, 2225576, 2326057, 2329368, 2311336, 2340421, 2215753, 2243792, 2321123, 2351735, 2337690, 2327835, 2305279, 2371066, 2426721, 2454892, 2510727, 2464569, 2477778, 2548419, 2580622, 2561094, 2630650, 2640456, 2582059, 2596588, 2647176, 2668067, 2731514, 2818659, 2795962, 2792743, 2783429, 2860180, 2914734, 2885587, 2850384, 2958077, 2976670, 2905524, 3005869, 3058449, 3093469, 3155575, 3090943, 3068270, 3000406, 2968140, 3046697, 3147288, 3101586, 3109818, 3078810, 3162616, 3242964, 3255503, 3269457]
6416C269457l701p5964n9505O1599M7554L0512J9088K7060L6049K9000k5371M2752
6404C398530J6085L076n0159o0152K673L1828M9058J8752M6846J05934n8157n395
6392C498919j4781K4358P9798K761K7076Q3333K420J26928K8218n1771J10998
6381C918257k9477O1218N0193R727J24727J76981l3875K10209J81687J6948o4512
6370D622083r0294j32875k2238j33473j08378J00493R7592j2089J0409P3028M9024
6359D453282R7897J3253L2369M4801n1701p9530m1460k258J00626j11846j45382
6348D310051k3371M7147j30643j4952k3645j78897j40014J77m205J08196p4193
6337C875651j30450N8860n7935J1604k2898l5931j0362l1315J2337o0216j8716
$$ y = [3269457, 3265756, 3189792, 3130287, 3191886, 3239440, 3269952, 3289040, 3316100, 3352149, 3381149, 3355778, 3398530, 3414615, 3417691, 3367532, 3307380, 3310053, 3341881, 3390939, 3409691, 3456537, 3562471, 3504314, 3498919, 3484138, 3508496, 3588294, 3591055, 3618131, 3701464, 3703884, 3830812, 3859030, 3807259, 3918257, 3888780, 3949998, 4000191, 4009918, 4134645, 4311626, 4277751, 4487960, 4669647, 4686595, 4622083, 4531789, 4398914, 4376676, 4243203, 4134825, 4235318, 4332910, 4320821, 4331230, 4404258, 4453282, 4551179, 4564432, 4596801, 4641602, 4589901, 4510371, 4468911, 4466653, 4567279, 4455433, 4310051, 4286680, 4333827, 4203184, 4188232, 4164587, 3985690, 3845676, 3845853, 3841648, 3949844, 3875651, 3745201, 3804061, 3746126, 3757730, 3734832, 3698901, 3688539, 3657224, 3669561, 3609345, 3590629]
6326C590629O8851N1844N8617l5779l1026J2207o2324P4835J3730r8036L905M6608
6314C694061j6867J6446Q2262Q7659Q543k4601k6635n466k4706J0869N5482P732
6302C864779n8932R1916O8217l4514P0162J48073P9172j818k1004J10960m4935
6291D272076j38793o2996M8759j1004m3834l913O1943k5101o1229n7661k688j5758
6279C959801L0675L673M1683J24794K2573N1493O0325J02793J06856L7805M4693
6268D587164P2938Q7173J53618N0935Q3771K11793J42921R7943J97829J36150
6258E822235R2563l9698j015K4182P9746J03274J85566J28232L12232K54989J70406
6247G132712L06250M23342M27453L65861J19547j66809k80043l25440k77448k05579
$$ y = [3590629, 3659480, 3711324, 3769941, 3734162, 3703136, 3715343, 3653019, 3727854, 3741584, 3643548, 3647453, 3694061, 3677194, 3693640, 3775902, 3863561, 3872104, 3847503, 3820868, 3815402, 3790696, 3801565, 3857047, 3864779, 3805847, 3897763, 3965980, 3931466, 4001628, 4149701, 4228873, 4227055, 4206051, 4317011, 4272076, 4133283, 4070287, 4119046, 4108042, 4064208, 4060295, 4122238, 4097137, 4035908, 3978247, 3975559, 3959801, 3990476, 3994149, 4035832, 4160626, 4183199, 4234692, 4295017, 4397810, 4504666, 4542471, 4587164, 4660102, 4747275, 4900893, 4951828, 5035599, 5247392, 5390313, 5488256, 5686085, 5822235, 5914798, 5875100, 5874085, 5898267, 5978013, 6081287, 6266853, 6395085, 6707317, 6962306, 7132712, 7438962, 7862304, 8289757, 8655618, 8775165, 8608356, 8328313, 8002873, 7725425, 7519846]
6237G519846j48042n4677J27937O7059P5133K64909K78483J41718O5252L0310
6227H367928q8841k80242l03328l41693j81115j47185j37701j31852N7719k6878
6217F786812n5966L1131L2487J10006N2588J05291l7343J25780K37050P1325J23077
6206G582238J06929J70998K69446J63888J35064J71685K16435J88422J69759K65505
6196I440369K73352K65181L16782K95651L47099M79328N23467M86665O52544P27612
6186A3808050P38031R43691R71145J116760J347246J467472J800905K224069K567571
6177B6984940K876624L113032L323180L596736L375015K739623J754279P93349
6169D8556778J84925j44792j136935k265262k991690l115078l042454k984450
$$ y = [7519846, 7371804, 7317127, 7445064, 7512123, 7587256, 7852165, 8130648, 8272366, 8337618, 8367928, 8279087, 7998845, 7695517, 7353824, 7172709, 7025524, 6887823, 6755971, 6813690, 6786812, 6730846, 6761977, 6794464, 6904470, 6957058, 7062349, 7025006, 7150786, 7387836, 7459161, 7582238, 7689167, 7860165, 8129611, 8293499, 8428563, 8600248, 8816683, 9005105, 9174864, 9440369, 9713721, 9978902, 10295684, 10591335, 10938434, 11417762, 11941229, 12427894, 13080438, 13808050, 14546081, 15489772, 16460917, 17577677, 18924923, 20392395, 22193300, 24417369, 26984940, 29861564, 32974596, 36297776, 39894512, 43269527, 46009150, 47763429, 48556778, 48741703, 48596911, 47459976, 45194714, 42203024, 39087946, 36045492, 33061042]
6161C3061042k594879k285763k202684k015373j980150j836466j877404j757898
6153A6510425j414808j101691j053020q67195q85555o84856n44013o15247m34116
6144H909924m10163m06941l34016k88127l18414k04926k31736k71132j31830l24285
6134E988354j80135j18190j93044p2027n1529k07611k20597k39509p1413K2251
6124D656550q1411r9496j66008n1575j3264k0104q9172o9010j56513r9673o6966
6113C743358M3022n8212k8644J445O9797L5114m8648q2328R291J3745q4948l0256
6101C582736J6229o3450J02119j7753k599P5691R2056j45108k6990l220Q0735
6090C690446l7254p3561J1151P8957k4244r2808K4991P4014L8058M7066K7494
$$ y = [33061042, 30466163, 28180400, 25977716, 23962343, 21982193, 20145727, 18268323, 16510425, 15095617, 13993926, 12940906, 12073711, 11188156, 10503300, 9959287, 9344040, 8909924, 8499761, 8092820, 7758804, 7470677, 7152263, 6947337, 6715601, 6444469, 6312639, 5988354, 5808219, 5690029, 5496985, 5424958, 5373429, 5165818, 4945221, 4705712, 4634299, 4656550, 4575139, 4475643, 4309635, 4258060, 4244796, 4224692, 4135520, 4066510, 3909997, 3810324, 3743358, 3786380, 3728168, 3699524, 3700969, 3770766, 3805880, 3757232, 3674904, 3684195, 3697940, 3612992, 3582736, 3598965, 3535515, 3637634, 3619881, 3617282, 3692973, 3785029, 3639921, 3612931, 3609711, 3690446, 3653192, 3579631, 3590782, 3669739, 3645495, 3552687, 3577678, 3651692, 3689750, 3736816, 3764310]
6079C764310O0855r944Q2522J22384J06235M8318J68758J26602J4307J29648J88784
6068D802779J9120J98630J56915J41473K66122J04525Q8958K76247J63472K77369
6058F495610L92482K75667L50315N47599N57120P05007R16766R25364J214248
6049A2380178J379435J550395J505256J019790J15076p99149j393798j548232
6041A4208951j552915j276316j060884q80333p35435o51011n19081l50597k31940
6032F950439j53390j65857j60163j54717q1644j40526j36822j28915l2582r8974
6022E696849j70881k22108K030q3973o4804j49286k4443r109j00275l1924J50622
6011D992698O1108k9049l713Q0286j5716o5961M6933P8785k8754q1538q9059l3045
$$ y = [3764310, 3825165, 3815221, 3897743, 4020127, 4126362, 4174680, 4343438, 4470040, 4484347, 4613995, 4802779, 4821899, 5020529, 5177444, 5318917, 5585039, 5689564, 5778522, 6054769, 6218241, 6495610, 6888092, 7163759, 7514074, 8061673, 8618793, 9323800, 10240566, 11165930, 12380178, 13759613, 15310008, 16815264, 17835054, 17950130, 17150981, 15757183, 14208951, 12656036, 11379720, 10318836, 9438503, 8703068, 8052057, 7532976, 7182379, 6950439, 6797049, 6631192, 6471029, 6316312, 6234668, 6094142, 5957320, 5828405, 5795823, 5696849, 5525968, 5303860, 5305890, 5221917, 5157113, 5007827, 4983384, 4974275, 4874000, 4842076, 4992698, 5053806, 5024757, 5021044, 5101330, 5085614, 5019653, 5066586, 5145371, 5116617, 5035079, 4946020, 4912975]
5999D912975j8591m9581p237M8738j277R053N0885L4888N0525P2803K9429m2488
5987E090122k1935J06403l5352Q4643K12119K15041J15257J80801K19707K32441
5977F399247J99067J71540K97295K24458J60481L25525L46561M55589M41818M60555
5967I482136N64303O57951O79469P99328Q82989R88512J241879J411202J685356
5958A8393125J622392J619417J386830J036915P90067K85934k54939q12642j198680
5949B2868419j354031j525588j583147j608116j398515j207330j291243j263365
5941A1637084q35994p89833q41240p31592o12943m88411l57671m13680k59148
5932F306572k31828k40712k94041k54544k99800k20283j27896j01052k09925j92654
$$ y = [4912975, 4894384, 4844803, 4837566, 4886304, 4885027, 4894080, 4944965, 4979853, 5030378, 5103181, 5132610, 5090122, 5068187, 5174590, 5139238, 5223881, 5436000, 5651041, 5766298, 5947099, 6166806, 6399247, 6598314, 6769854, 7067149, 7291607, 7452088, 7777613, 8124174, 8579763, 9021581, 9482136, 10046439, 10704390, 11383859, 12183187, 13066176, 14054688, 15296567, 16707769, 18393125, 20015517, 21634934, 23021764, 24058679, 24848746, 25134680, 24879741, 24067099, 22868419, 21514388, 19988800, 18405653, 16797537, 15399022, 14191692, 12900449, 11637084, 10801090, 10011257, 9170017, 8438425, 7825482, 7337071, 6979400, 6565720, 6306572, 6074744, 5834032, 5539991, 5285447, 4985647, 4765364, 4637468, 4536416, 4326491, 4133837]
5922D133837l3236r9198j41190J2311p0303j47219j77291j96833n9896k6150p7399
5911C117433o9594o6302J0891j29153m3218l2867j25271N891N0294j12590n4493
5900B551021j5622Q7585L6141k3212J1424J7474j33658q5198o3880O1234K1618
5889B464927k10526M9775J76390j03163N740J44442M0280J6902o3371j0388M4765
5878B555773j66907M4840P2645l1072j06917n7414n2495j10917k1698J73M4832
5867B170843m5537r0035n5912P0758p7396p395m490p286q4587K5424J648M7997
5855A944032N9391n5256k4940j5186q2448K1159q0499Q5218J08691k1723p82o7415
5843A870242l2017P0040j1507r8933N1741j01488n0707n6237o6794J04811r9798
$$ y = [4133837, 4100601, 4001403, 3860213, 3872524, 3802221, 3655002, 3477711, 3280878, 3220982, 3194832, 3117433, 3047839, 2981537, 2992428, 2863275, 2820057, 2787190, 2661919, 2667810, 2718104, 2605514, 2551021, 2535399, 2622984, 2659125, 2635913, 2647337, 2664811, 2531153, 2445955, 2382075, 2443309, 2464927, 2254401, 2304176, 2480566, 2377403, 2383143, 2527585, 2567865, 2584767, 2521396, 2511008, 2555773, 2388866, 2433706, 2506351, 2475279, 2368362, 2310948, 2258453, 2147536, 2125838, 2126011, 2170843, 2125306, 2035271, 1979359, 2050117, 1972721, 1965326, 1960836, 1953550, 1868963, 1894387, 1896035, 1944032, 2003423, 1948167, 1923227, 1908041, 1825593, 1846752, 1766253, 1851471, 1960162, 1938439, 1937657, 1870242, 1838225, 1908265, 1896758, 1797825, 1849566, 1748078, 1697371, 1641134, 1574340, 1679151, 1579353]
5832A579353m9374m062j717r2824k5548O161r2746o7929J03707J4410j18703L3702
5820A284430J01782P3003r5924j25421M9828Q677q1443n0555N3926J22733L2397
5809A373433j50206R2976J11214p7414k1485m5405k9398L7172m4365j10374O1541
5798A197689Q6042N8492J2624l7243o2346J2863j6630j05727Q0962m3490j24263
5787A058973n74L9352J34084N0734r1509L6712M2138m8989o0916M7615M6812l4749
5775A219683j1174M7400L8997k1667o5537J9929O5017K3772q36K796o9519m1321
5763A207540L8280N3465j353Q201l2493K8066L9704L203P0378r149J9758k4785
5751A400815k0819p2974k9216P0404J30216L1536m7610N4408J45036m9732n1683
$$ y = [1579353, 1529979, 1525917, 1524200, 1431376, 1405828, 1411989, 1319243, 1251314, 1355021, 1369431, 1250728, 1284430, 1386212, 1459215, 1363291, 1237870, 1287698, 1296375, 1214932, 1164377, 1218303, 1341036, 1373433, 1223227, 1316203, 1427417, 1350003, 1328518, 1283113, 1253715, 1290887, 1246522, 1136148, 1197689, 1283731, 1342223, 1354847, 1317604, 1255258, 1268121, 1251491, 1145764, 1226726, 1183236, 1058973, 1058399, 1097751, 1231835, 1282569, 1191060, 1227772, 1269910, 1220921, 1160005, 1207620, 1254432, 1219683, 1208509, 1255909, 1294906, 1273239, 1207702, 1227631, 1292648, 1316420, 1315584, 1318380, 1248861, 1207540, 1245820, 1299285, 1297932, 1306133, 1273640, 1301706, 1341410, 1344613, 1414991, 1405842, 1425600, 1400815, 1379996, 1307022, 1277806, 1348210, 1478426, 1509962, 1462352, 1516760, 1661796, 1612064, 1560381]
5740A560381M2187n5180r7765R2659Q5790M7579R8826K6145m3424O6272j7922
5729A805548M594L9503p5570k2685J9934k924k8279L5563J403r2577J03151K1295
5717A808956j4280M99j11861n6587M3623O6553j3104N1120M0033m8184J7402M4690
5705A828860k3030k0479n3405J5266P2348M1561k6661J6536j0685k8667P4312
5694A885956p7099n1225K0267o7290K6621m1478O8852Q1100M4817k1027N8203
5683A927697O8625j20529r9323j2545j1916J6547m5165r0551L5663J2643j6516
5672A664630L4069k6911l7877J16720k3096K1116n6956j36084j1815M4683L7509
5661A625988j106J1047l0365j4762J02328k0768p4244m638j6058o5429k1065j4974
$$ y = [1560381, 1602568, 1547388, 1449623, 1542282, 1628072, 1675651, 1774477, 1800622, 1757198, 1823470, 1805548, 1810142, 1849645, 1774075, 1751390, 1771324, 1768400, 1740121, 1775684, 1777087, 1684510, 1787661, 1808956, 1794676, 1795175, 1683314, 1626727, 1670350, 1736903, 1723799, 1774919, 1814952, 1766768, 1784170, 1828860, 1805830, 1785351, 1731946, 1747212, 1819560, 1861121, 1834460, 1850996, 1840311, 1811644, 1885956, 1808857, 1757632, 1777899, 1710609, 1737230, 1695752, 1764604, 1845704, 1890521, 1869494, 1927697, 1996322, 1875793, 1776470, 1763925, 1752009, 1768556, 1723391, 1632840, 1668503, 1681146, 1664630, 1698699, 1671788, 1633911, 1750631, 1727535, 1748651, 1691695, 1555611, 1543796, 1588479, 1625988, 1624882, 1635929, 1605564, 1590802, 1693130, 1672362, 1598118, 1593480, 1577422, 1511993, 1490928, 1475954]
5649A475954q3457J6233m1640m8026M6519j8714l6576O7233R5064n959r3782j06117
5637A266732o7314N442p2179n2288J39898n3446m7591J8459K2699J07341j7107
5626A250646j30103O6673p5544k9071J9286P4475M7317l0307N5762j9743o9936
5615A159455L0818j5045k2032l9974p7923n1173m0283m5736Q1141R5601J4118
5604A088967K978j24872O733L7836j02561R9838J349j27981J30169L7243L8123
5593A087822M3380q869K1284j5820m3802q51j38458K7760l0641L9252J33949J0705
5581A125711m1981R0679p8805n4240p7720J363p8661K4966R9339L7883p873k1817
5569A018844n6620L5660P5257j00762K3202M1978l0511l462j3637J089P0923n1944
$$ y = [1475954, 1392497, 1408730, 1367090, 1319064, 1365583, 1346869, 1310293, 1377526, 1472590, 1466631, 1372849, 1266732, 1199418, 1204860, 1132681, 1080393, 1220291, 1166845, 1119254, 1137713, 1160412, 1267753, 1250646, 1120543, 1187216, 1111672, 1082601, 1101887, 1176362, 1223679, 1193372, 1249134, 1229391, 1159455, 1190273, 1175228, 1153196, 1113222, 1035299, 984126, 943843, 898107, 979248, 1074849, 1088967, 1091945, 967073, 973806, 1011642, 909081, 1008919, 1010268, 882287, 1012456, 1049699, 1087822, 1131202, 1122333, 1143617, 1127797, 1083995, 1083144, 944686, 972446, 941805, 981057, 1115006, 1125711, 1083730, 1174409, 1095604, 1041364, 963644, 965007, 886346, 911312, 1010651, 1048534, 1040661, 1018844, 962224, 997884, 1073141, 972379, 995581, 1037559, 1007048, 1003586, 989949, 991038, 1061961, 1010017]
5557A010017Q3570J10695j20992r08L4024l9955j2264j491M533M9734L8151o020
5545A149094k0745l0780Q167Q6481k6398n4811N7885n3792j07182O264J32088
5534A146271M2774l5911q7123n1609J21740o5209q3888J29060R106l2730J3277
5523A105758o4145J18507J07090l9090O2613k2047m5773m9189J5553l8288K2383
5512A173372P0883l7905m9688K7293J7868O0761K7175o3691o0609M4503j21684
5501A088278k6685J88317K4492J4498p1040k740L2456j16605m798L2382M1331
5490A199886O869l8051K0785n0383J3935Q2021p874R1608j24432n1768N98k4525
5478A118669R9782M3346p5433O8945K0188L1365J11393m0003l5441k1016q0240
$$ y = [1010017, 1093587, 1204282, 1083290, 1082382, 1116406, 1076451, 1064187, 1062696, 1067229, 1116963, 1155114, 1149094, 1128349, 1097569, 1105736, 1192217, 1165819, 1111008, 1168893, 1115101, 1007919, 1014183, 1146271, 1189045, 1153134, 1066011, 1014402, 1136142, 1070933, 987045, 1116105, 1125211, 1092481, 1105758, 1041613, 1160120, 1267210, 1228120, 1290733, 1268686, 1222913, 1173724, 1189277, 1150989, 1173372, 1244255, 1206350, 1156662, 1183955, 1201823, 1262584, 1289759, 1226068, 1165459, 1209962, 1088278, 1061593, 1249910, 1274402, 1288900, 1217860, 1215120, 1247576, 1130971, 1126173, 1158555, 1199886, 1206755, 1168704, 1189489, 1139106, 1153041, 1235062, 1227188, 1318796, 1194364, 1142596, 1143194, 1118669, 1218451, 1261797, 1186364, 1255309, 1275497, 1306862, 1418255, 1378252, 1342811, 1321795, 1241555]
5467A241555k1732J36838r7564r9759O7791p2260l6325K3397N4743L9397q2700
5456A153381j7772J61587m7482l7001n8335N942J23585k5094l007q0415M5368
5445A220757j1029P225K3698J7114K4407J7131l1099N2670O0239l6803O0709J6546
5433A421565J1321J3434q4369j34875J61087L3449K5600N2731n936O9147L0471
5422A593625j21082J3155J42944K1206j7255o8674k9061J22180K6639M861J21127
5411A809665j8508q0585n470m9327P1252Q9335O9450p7441k4898Q7749L3882J26132
5399B031236n7367K5229P6583q6937k8473J28617k8423Q9553M956j16655R9357
5388B137676P3346l8156J9605K0255R898J3350M8514N8597K05397J22472O3018
$$ y = [1241555, 1219823, 1356661, 1259097, 1159338, 1227129, 1154869, 1118544, 1141941, 1196684, 1236081, 1153381, 1135609, 1297196, 1249714, 1212713, 1154378, 1160320, 1283905, 1258811, 1255804, 1175389, 1220757, 1209728, 1216953, 1240651, 1257765, 1282172, 1299303, 1268204, 1320874, 1381113, 1344310, 1405019, 1421565, 1432886, 1446320, 1361951, 1227076, 1388163, 1421612, 1447212, 1499943, 1494007, 1563154, 1593625, 1472543, 1485698, 1628642, 1649848, 1632593, 1563919, 1534858, 1657038, 1683677, 1688538, 1809665, 1791157, 1710572, 1705102, 1655775, 1727027, 1816362, 1885812, 1808371, 1783473, 1871222, 1905104, 2031236, 1973869, 1999098, 2075681, 1988744, 1960271, 2088888, 2060465, 2150018, 2154974, 2038319, 2137676, 2211022, 2172866, 2192471, 2212726, 2222624, 2235974, 2284488, 2343085, 2548482, 2670954, 2733972]
5377B733972L4859p8391j9048O626l3699J437l3148P5616K732P6215N7640R738
5365B834549O2150N4063j34245j6532L8726K9162N7125q732k5746O3340m6948
5354B906912o205l6698o7772l0751k1432O992k1133K3408J19717J23004M6283
5343C042325P5612L9546L1610m2636M3069P443k1242j6385N6736o7403q4606p5597
5331B988472P6727N1329N8112O3326R8802Q2768j61163j40147O4893L7941q5524
5320C135536J1317k4354o5914M6834p8445p4271M8322m6206j0759l3747o6057
5309B842256L3408J17872Q7930O7993K3428L2386j3768j15557l4464J7117l6646
5298C021955M39l9921O0564M1816R9314R1157j7610J04573P9415n1561P2381j1092
$$ y = [2733972, 2768831, 2690440, 2671392, 2678018, 2644319, 2645756, 2612608, 2688224, 2690956, 2767171, 2824811, 2834549, 2896699, 2950762, 2816517, 2799985, 2838711, 2867873, 2924998, 2916266, 2890520, 2953860, 2906912, 2900707, 2864009, 2796237, 2765486, 2744054, 2751046, 2729913, 2753321, 2873038, 2996042, 3042325, 3117937, 3157483, 3189093, 3146457, 3189526, 3196969, 3175727, 3159342, 3216078, 3148675, 3064069, 2988472, 3065199, 3116528, 3174640, 3237966, 3336768, 3419536, 3258373, 3118226, 3183119, 3221060, 3135536, 3146853, 3122499, 3056585, 3103419, 3024974, 2950703, 2999025, 2952819, 2942060, 2908313, 2842256, 2875664, 2993536, 3081466, 3149459, 3172887, 3205273, 3191505, 3075948, 3041484, 3058601, 3021955, 3022394, 2982473, 3043037, 3084853, 3184167, 3275324, 3257714, 3362287, 3441702, 3390141, 3462522, 3451430]
5286C451430n423J03534q5113O7649J06441k7401m3466k0766k7996j5688j88049
5275C315152j76529o8108J35060L8858j6927J6949L5229Q3016p376j53645O8567
5264C270246O3826m3362m7302q5710n5933P2285L938Q758J01172j5799l4973R5008
5252C332154K7623Q3844N3253N2897J01925P6601J56902K1442P4691J22188J41332
5241D244852J66807J96861m1787q1131p2343j99966j01085q3836j42044L115r7676
5230C791767k37121l2152k5231J9467j5668k5n0596l2462n7067o2064M6010Q470
5218C353328m9450o3002M0087J5877P0453O9954k1110K7326q6219l2357N9229
5207C384116q251O2204R9522R4259J19308J48887J69361O2377O3115n2803j00952
$$ y = [3451430, 3446007, 3549541, 3464428, 3532077, 3638518, 3611117, 3567651, 3546885, 3518889, 3503201, 3315152, 3138623, 3070515, 3205575, 3244433, 3227506, 3244455, 3279684, 3362700, 3355324, 3201679, 3270246, 3334072, 3290710, 3243408, 3157698, 3101765, 3174050, 3177988, 3186746, 3287918, 3272119, 3237146, 3332154, 3359777, 3443621, 3496874, 3549771, 3651696, 3728297, 3885199, 3906641, 3981332, 4103520, 4244852, 4411659, 4608520, 4566733, 4485602, 4413259, 4213293, 4112208, 4028372, 3886328, 3889443, 3791767, 3554646, 3522494, 3497263, 3516730, 3501062, 3501037, 3450441, 3417979, 3360912, 3298848, 3344858, 3353328, 3303878, 3240876, 3280963, 3296840, 3367293, 3437247, 3416137, 3443463, 3357244, 3324887, 3384116, 3375865, 3438069, 3537591, 3631850, 3751158, 3900045, 4069406, 4131783, 4194898, 4142095, 4041143]
5196D041143j52129j29387k9262o6671o9156j32894j15326j13441l9038J5421
5186C209260j01461o6925J0284p2954J01358J2998k5379M8570o9057j48680j5703
5175B882311o0889M1949R5850K3256M372p8672q1595n3116M2829j3984j2982k7703
5163B761626K2281J0218M9763R1083k7127L0493R768l3810n837l3887R842M6877
5151B931290o6248L9603p3993M9615N4266o578o1623K9072n0698j9519m7151l182
5139B774854J09246O0396n000J6965P5021K3225J7837M8485n2516K4561J2250
5128C105324J7705l4656P3851l979P7745Q5554n2489N0070P3651Q0543J57298
5117C630617K5428L9524J70926J32724J83798Q2708j03199p2244j42104n1162
$$ y = [4041143, 3889014, 3759627, 3730365, 3663694, 3594538, 3461644, 3346318, 3232877, 3193839, 3209260, 3107799, 3040874, 3051158, 2978204, 3079562, 3092560, 3067181, 3115751, 3046694, 2898014, 2882311, 2821422, 2863371, 2959221, 2982477, 2986849, 2908177, 2826582, 2773466, 2816295, 2802311, 2789329, 2761626, 2783907, 2794125, 2843888, 2934971, 2907844, 2938337, 2948105, 2914295, 2908458, 2874571, 2884413, 2931290, 2865042, 2904645, 2830652, 2880267, 2934533, 2927955, 2866332, 2895404, 2844706, 2825187, 2778036, 2774854, 2884100, 2944496, 2939496, 2956461, 3031482, 3054707, 3072544, 3121029, 3068513, 3093074, 3105324, 3123029, 3088373, 3162224, 3158245, 3235990, 3321544, 3269055, 3319125, 3392776, 3473319, 3630617, 3656045, 3695569, 3866495, 3999219, 4183017, 4265725, 4162526, 4090282, 3948178, 3897016]
5107C897016N0949N2556J35160l1823K6192M3388Q7964Q3633J17278J06047K13728
5096D782088J40671K41744J65773O2168k3467n9841j71351o2010p4773k3946P9336
5085E056392O0968n5943p2445j31440r2990j12037L1540q345r8161P0447N6611
5074D704597q1646J46032n1098P4204P6645j26950j9122N218j3485l1580k3113
5063D659702j5292R0939J03461J50063K21186K43151J59083K68810K16644J13226
5053F210973J77081J42119O6661q5029k06758j78188j21571j17515j60010L2237
5043E760000k7716j19444R290o3243L8521L7480J02519R1734r6066o9280p1090
5032E592705j31758j5086j1407l2221k8550q2721P2526J03526M980P8629J05612
$$ y = [3897016, 3947965, 4000521, 4135681, 4103858, 4130050, 4173438, 4261402, 4345035, 4462313, 4568360, 4782088, 4922759, 5164503, 5330276, 5392444, 5368977, 5309136, 5137785, 5075775, 5001002, 4977056, 5056392, 5117360, 5061417, 4988972, 4857532, 4764542, 4652505, 4684045, 4675700, 4577539, 4647986, 4704597, 4622951, 4768983, 4717885, 4792089, 4868734, 4741784, 4722662, 4727880, 4714395, 4682815, 4659702, 4644410, 4735349, 4838810, 4988873, 5210059, 5453210, 5612293, 5881103, 6097747, 6210973, 6388054, 6530173, 6596834, 6511805, 6305047, 6126859, 6005288, 5887773, 5727763, 5760000, 5732284, 5612840, 5622130, 5558887, 5597408, 5634888, 5737407, 5829141, 5733075, 5663795, 5592705, 5460947, 5445861, 5434454, 5402233, 5373683, 5290962, 5363488, 5467014, 5471994, 5550623, 5656235]
5021E656235L3200M0857K0777l1637k13j6962R0859J19136P3023J30165J1962
5010F127402l8022j46240m8814o2123j95745p6533k537n9713j8463j79520n9586
4999E240106j7856K0087J18050Q9297N4168J05594L5675N1345k0716n7440J6526
4988E634836O1103R5004P9486R7144J13253J8839K7121J02679N3420L2794O5857
4977F381536R9202k0049L9720J33314Q6985J97459L5131J20532J84667J18839
4967G377336J46996J74117J66243O2088J18044K47311J02559J71924L14788K17612
4957I099018K88054J15359J16731K24600R5086L23979K42647J53750J89526J56189
4947A1004939K03623K46245K44432K42391L96450J85216K17247L84243L21470
$$ y = [5656235, 5689435, 5730292, 5751069, 5719432, 5719219, 5702257, 5793116, 5912252, 5985275, 6115440, 6127402, 6089380, 5943140, 5894326, 5832203, 5636458, 5559925, 5557388, 5497675, 5479212, 5299692, 5240106, 5222250, 5242337, 5360387, 5449684, 5503852, 5609446, 5645121, 5696466, 5675750, 5618310, 5634836, 5695939, 5790943, 5870429, 5967573, 6080826, 6099665, 6126786, 6229465, 6282885, 6315679, 6381536, 6480738, 6460689, 6500409, 6633723, 6720708, 6918167, 6953298, 7073830, 7258497, 7377336, 7524332, 7698449, 7864692, 7926780, 8044824, 8292135, 8394694, 8566618, 8881406, 9099018, 9387072, 9502431, 9619162, 9843762, 9938848, 10262827, 10505474, 10659224, 10848750, 11004939, 11208562, 11454807, 11699239, 11941630, 12338080, 12523296, 12740543, 13124786, 13446256]
4938A3446256L76054M42517M26358M32725N26020O30790Q34194Q97217R88922
4929A9001053R94485J048974J121770J075062J299447J408742J427660J417979
4921B8795172J453944J429888J418406J327377J434135J368844J459700J518458
4913D0205924J142922P06003L52955k72397o06112o96365p43035m53492o46156
4904C8990247q56859q52449j210009j464481j612006j791074j648780j571352
4896B7983237j338218j177058j205527j002778r91993q93115p99861r10607q49981
4887A8814099p77256o67366n27303n77685n34949m70918m26395k75466k92482
4878A4264279l41999m03241l25206l14992k27979j70352j93189p1421k28880k77420
$$ y = [13446256, 13822310, 14264827, 14691185, 15123910, 15649930, 16280720, 17114914, 18012131, 19001053, 19995538, 21044512, 22166282, 23241344, 24540791, 25949533, 27377193, 28795172, 30249116, 31679004, 33097410, 34424787, 35858922, 37227766, 38687466, 40205924, 41348846, 42054849, 42407804, 42135407, 41529295, 40832930, 40089895, 39636403, 38990247, 38133388, 37280939, 36070930, 34606449, 32994443, 31203369, 29554589, 27983237, 26645019, 25467961, 24262434, 23259656, 22267663, 21374548, 20574687, 19664080, 18814099, 18036843, 17369477, 16842174, 16264489, 15729540, 15258622, 14832227, 14556761, 14264279, 13922280, 13519039, 13193833, 12878841, 12650862, 12480510, 12287321, 12215900, 11987020, 11709600]
4868A1709600k11675k46395j43038k74941k29838j48595k65660j99603j20766
4859I869089q6367n1217j00423j14409l3638j59036j51848l3953j97398k20121
4849H720679j86416j42797q6586o0361l6335j27153p3980l7756j28501l0447O5549
$$ y = [11709600, 11497925, 11251530, 11108492, 10833551, 10603713, 10455118, 10189458, 9989855, 9869089, 9782722, 9731505, 9631082, 9516673, 9483035, 9323999, 9172151, 9138198, 8940800, 8720679, 8534263, 8391466, 8304880, 8244519, 8208184, 8081031, 8007051, 7969295, 7840794, 7810347, 7875896]
$$ [...]
##END NTUPLES=NMR SPECTRUM
##END=
