##TITLE=1H_CA-8802-1
 CDCl3, 8 sc, 
 25.12.2020
##JCAMPDX= 6.0         $$ Bruker NMR JCAMP-DX V2.0
##DATA TYPE= NMR SPECTRUM
##DATA CLASS= NTUPLES
##ORIGIN= UXNMR, Bruker Analytische Messtechnik GmbH
##OWNER= root
$$ XWIN-NMR		Version 3.5
$$ Fri Dec 25 11:46:11 2020 Russian Standard Time (UT+4h)  she@DPX200
##.OBSERVE FREQUENCY= 200.1315066352
##.OBSERVE NUCLEUS= ^1H
##.ACQUISITION MODE= SIMULTANEOUS
##.ACQUISITION SCHEME= undefined
##.AVERAGES= 8
##.DIGITISER RES= 18
##SPECTROMETER/DATA SYSTEM= spect
##.PULSE SEQUENCE= zg30
##.SOLVENT NAME= CDCl3
##.SHIFT REFERENCE= (INTERNAL, CDCl3, 0, 15.9833)
##AUDIT TRAIL= $$ (NUMBER, WHEN, WHO, WHERE, WHAT)
$$ ##TITLE= Audit trail, XWIN-NMR		Version 3.5
$$ ##JCAMPDX= 5.01
$$ ##ORIGIN= Bruker BioSpin GmbH
$$ ##OWNER= she
$$ F:/spectra/data/she/nmr/H-F/1/pdata/1/auditp.txt
$$ ##AUDIT TRAIL=  $$ (NUMBER, WHEN, WHO, WHERE, WHAT)
(   1,<2020-12-25 11:44:55.10 +0400>,<she>,<DPX200>,
      <created by zg, POWCHK disabled, PULCHK disabled
       configuration hash MD5:
       00 E9 B6 7A A2 85 ED C7 34 08 36 98 17 FE 4E 26
       data hash MD5: 16K
       CE 1C B0 8E B5 58 2C F1 33 40 68 3E 34 D3 08 BD>)
(   2,<2020-12-25 11:44:57.60 +0400>,<she>,<DPX200>,
      <Start of raw data processing
       efp BC_mod = 2 LB = 0.24 FT_mod = 6 PKNL = 1 PHC0 = -10760.26 PHC1 = 8.800954 SI = 16K 
       data hash MD5: 16K
       72 6E 9D A5 61 65 66 77 24 D5 A2 DF D6 1F 7A BD>)
(   3,<2020-12-25 11:45:11.15 +0400>,<she>,<DPX200>,
      <pk PHC0 = 0.7557167 PHC1 = -0.9999996 
       data hash MD5: 16K
       15 09 14 78 C1 4A 89 6B 28 24 DC F1 81 04 32 DE>)
(   4,<2020-12-25 11:45:14.31 +0400>,<she>,<DPX200>,
      <abs ABSG = 5 
       data hash MD5: 16K
       8C 2E BD 69 2D 96 26 4D B8 55 D9 FB 8C F7 62 B7>)
$$ ##END=
$$ 
$$ hash MD5
$$ ED 10 C1 46 35 6B C9 46 CF 7D 23 3D BE FA 3A 82
##$RELAX= 
##$RELAX= 
##$RELAX= 
##$RELAX= 
##$RELAX= 
##$RELAX= 
$$ Bruker specific parameters
$$ --------------------------
##$DU= <F:/spectra>
##$EXPNO= 1
##$NAME= <H-F>
##$PROCNO= 1
##$TYPE= <nmr>
##$USER= <she>
##$AMP= (0..31)
100 100 100 100 100 100 100 100 100 100 100 100 100 100 100 100 100 100 
100 100 100 100 100 100 100 100 100 100 100 100 100 100 
##$AQSEQ= 0
##$AQ_mod= 1
##$AUNM= <au_zg>
##$AUTOPOS= <>
##$BF1= 200.13
##$BF2= 200.13
##$BF3= 200.13
##$BF4= 200.13
##$BF5= 200.13
##$BF6= 200.13
##$BF7= 200.13
##$BF8= 200.13
##$BYTORDA= 1
##$CFDGTYP= 0
##$CFRGTYP= 5
##$CHEMSTR= <none>
##$CNST= (0..31)
1 1 145 1 1 1 1 1 1 1 1 1 1 1 1 1 1 1 1 1 1 1 1 1 1 1 1 1 1 1 1 1 
##$CPDPRG= <>
##$CPDPRG1= <>
##$CPDPRG2= <>
##$CPDPRG3= <>
##$CPDPRG4= <mlev>
##$CPDPRG5= <mlev>
##$CPDPRG6= <mlev>
##$CPDPRG7= <mlev>
##$CPDPRG8= <mlev>
##$CPDPRGB= <>
##$CPDPRGT= <>
##$D= (0..31)
0 1.2 0 0 0 0 0 0 0 0.06 0 0.03 0 0 0 0 0.0002 0 0 0 0 0 0 0 0 0 0 0 0 
0 0 0 
##$DATE= 1608882294
##$DBL= (0..7)
120 120 120 120 120 120 120 120 
##$DBP= (0..7)
150 150 150 150 150 150 150 150 
##$DBP07= 0
##$DBPNAM0= <>
##$DBPNAM1= <>
##$DBPNAM2= <>
##$DBPNAM3= <>
$$ [...]
##$SUBNAM3= <"">
##$SUBNAM4= <"">
##$SUBNAM5= <"">
##$SUBNAM6= <"">
##$SUBNAM7= <"">
##$SUBNAM8= <"">
##$SUBNAM9= <"">
##$SW= 16.9725356469052
##$SWIBOX= (0..15)
0 0 2 0 0 0 0 0 0 0 0 0 0 0 0 0 
##$SW_h= 3396.73913043478
##$TD= 16384
##$TD0= 1
##$TE= 0
##$TE2= 300
##$TE3= 300
##$TEG= 300
##$TL= (0..7)
0 120 120 120 120 120 120 120 
##$TP= (0..7)
150 150 150 150 150 150 150 150 
##$TP07= 0
##$TPNAME0= <>
##$TPNAME1= <>
##$TPNAME2= <>
##$TPNAME3= <>
##$TPNAME4= <>
##$TPNAME5= <>
##$TPNAME6= <>
##$TPNAME7= <>
##$TPOAL= (0..7)
0.5 0.5 0.5 0.5 0.5 0.5 0.5 0.5 
##$TPOFFS= (0..7)
0 0 0 0 0 0 0 0 
##$TUNHIN= 0
##$TUNHOUT= 0
##$TUNXOUT= 0
##$USERA1= <user>
##$USERA2= <user>
##$USERA3= <user>
##$USERA4= <user>
##$USERA5= <user>
##$V9= 5
##$VALIST= <valist>
##$VCLIST= <CCCCCCCCCCCCCCC>
##$VD= 0
##$VDLIST= <DDDDDDDDDDDDDDD>
##$VPLIST= <PPPPPPPPPPPPPPP>
##$VTLIST= <TTTTTTTTTTTTTTT>
##$WBST= 1024
##$WBSW= 4
##$XGAIN= (0..3)
0 0 0 0 
##$XL= 0
##$YL= 0
##$YMAX_a= 710096
##$YMIN_a= -278459
##$ZGOPTNS= <>
##$ZL1= 120
##$ZL2= 120
##$ZL3= 120
##$ZL4= 120
##$ABSF1= 15.97196
##$ABSF2= -1.000702
##$ABSG= 5
##$ABSL= 3
##$ALPHA= 0
##$AQORDER= 0
##$ASSFAC= 0
##$ASSFACI= 0
##$ASSFACX= 0
##$ASSWID= 0
##$AUNMP= <proc_1d>
##$AZFE= 0.1
##$AZFW= 0.1
##$BCFW= 0
##$BC_mod= 2
##$BYTORDP= 0
##$COROFFS= 0
##$CY= -3
##$DATMOD= 1
##$DC= 0
##$DFILT= <>
##$DTYPP= 0
##$F1P= 0
##$F2P= 0
##$FCOR= 1
##$FTSIZE= 16384
##$FT_mod= 6
##$GAMMA= 0
##$GB= 0
##$INTBC= 1
##$INTSCL= 2.992141e-10
##$ISEN= 128
##$LB= 0.24
##$LEV0= 0
##$LPBIN= 0
##$MAXI= 10000
##$MC2= 0
##$MEAN= 0
##$ME_mod= 0
##$MI= 1.114404
##$NCOEF= 0
##$NC_proc= -5
##$NLEV= 6
##$NOISF1= 3.799351
##$NOISF2= 2.8
##$NSP= 0
##$NTH_PI= 0
##$NZP= 0
##$OFFSET= 15.98335
##$PC= 1
##$PHC0= -10759.5
##$PHC1= 7.800954
##$PH_mod= 1
##$PKNL= yes
##$PPARMOD= 0
##$PSCAL= 0
##$PSIGN= 0
##$REVERSE= no
##$SF= 200.130006257223
##$SI= 16384
##$SIGF1= 3
##$SIGF2= 2
##$SINO= 5.538805
##$SIOLD= 16384
##$SREGLST= <1H.CDCl3>
##$SSB= 0
##$STSI= 16384
##$STSR= 0
##$SW_p= 3396.73913043478
##$SYMM= 0
##$S_DEV= 0
##$TDeff= 16384
##$TDoff= 0
##$TI= <>
##$TILT= no
##$TM1= 0
##$TM2= 0
##$TOPLEV= 0
##$USERP1= <user>
##$USERP2= <user>
##$USERP3= <user>
##$USERP4= <user>
##$USERP5= <user>
##$WDW= 1
##$XDIM= 16384
##$YMAX_p= 318290380
##$YMIN_p= -307934
$$ End of Bruker specific parameters
$$ ---------------------------------
##NTUPLES= NMR SPECTRUM
##VAR_NAME=  FREQUENCY,     SPECTRUM/REAL,   SPECTRUM/IMAG
##SYMBOL=    X,             R,               I
##VAR_TYPE=  INDEPENDENT,   DEPENDENT,       DEPENDENT
##VAR_FORM=  AFFN,          ASDF,            ASDF
##VAR_DIM=   16384,         16384,           16384
##UNITS=     HZ,            ARBITRARY UNITS, ARBITRARY UNITS
##FACTOR=    0.207333158178281, 1,           1
##FIRST=     3198.74789550737, 0,            0
##LAST=      -197.991234927409, 0,           0
##MIN=       -197.991234927409, -307934,     0
##MAX=       3198.74789550737, 318290380,    0
$$ Real data points
##PAGE= N=1
##DATA TABLE= (X++(R..R)), XYDATA
$$ [...]
$$ plain form
6094 872988 856729 825793 837396 836594 742071 793882 771085 708253 793420 790652 810717 770077
6082 770077 739119 729365 696683 697622 657725 652782 676589 681591 699091 657870 527138 543747
6070 543747 584741 624282 527727 449287 449664 441553 507856 594715 516627 480850 531795 522590
6058 522590 480241 537583 496624 429529 418804 383641 385414 408642 356322 274234 316124 412682
6046 412682 414069 389013 480786 458801 501837 487083 418990 392930 432598 456934 473986 509862
6034 509862 544350 449304 463668 516141 491433 421504 417272 492062 476093 413480 353277 352651
6022 352651 289425 301999 355477 360000 321915 235862 268651 333783 287943 278542 255439 219350
6010 219350 312704 286548 273535 261140 336691 352126 300471 319565 297352 298851 241008 284330
$$ packed form
6094H72988j6259l0936J1603q02r4523N1811k2797o2832Q5167k768K0065m0640
6082G70077l0958r754l2682R39l9897m943K3807N002J7500m1221j30732J6609
6070E43747M0994L9541r6555p8440L77q111O6303Q6859p8088l5777N0945r205
6058E22590m2349N7342m0959o7095j0725l5163J773K3228n2320q2088M1890R6558
6046D12682J387k5056R1773k1985M3036j4754o8093k6060L9668K4336J7052L5876
6034E09862L4488r5046J4364N2473k4708o9929m232P4790j5969o2613o0203o26
6022C52651o3226J2574N3478M523l8085q6053L2789O5132m5840r401k3103l6089
6010B19350R3354k6156j3013j2395P5551J5435n1655J9094k2213J499n7843M3322
$$ plain form
5998 284330 272492 352522 375348 353847 326124 314876 296171 345186 354922 416351 454611 518220
5986 518220 490849 394039 349243 301661 334045 407143 365786 392777 386787 360502 365729 333875
5974 333875 374801 355305 241462 249932 338338 301478 239097 145635 195838 278623 283541 226192
5962 226192 275923 311096 194088 155358 202216 241161 301999 345518 288679 200512 175795
5951 175795 160097 146237 109020 128071 189606 203892 165790 155528 125098 139260 104938 107264
5939 107264 163080 155641 133948 224550 194332 120603 73933 160591 129897 76838 109388 84825
5927 84825 75317 72196 159853 212356 198158 131833 89598 86741 61493 93842 11385 41530
5915 41530 110987 180752 141570 128717 114396 151862 190634 130362 156063 114492 113526 147221
$$ packed form
5998B84330j1838Q0030K2826k1501k7723j1248j8705M9015R736O1429L8260O3609
5986E18220k7371r6810m4796m7582L2384P3098m1357K6991n990k6285N227l1854
5974C33875M0926j9496j13843Q470Q8406l6860o2381r3462N0203Q2785M918n7349
5962B26192M9731L5173j17008l8730M6858L8945O0838M3519n6839q8167k4717
5951A75795j5698j3860l7217J9051O1535J4286l8102j0262l0430J4162l4322K326
5939A07264N5816p439k1693R0602l0218p3729m6670Q6658l0694n3059L2550k4563
5927H4825r508l121Q7657N2503j4198o6325m2235k857k5248L2349q2457L0145
5915D1530O9457O9765l9182j2853j4321L7466L8772o0272K5701m1571r66L3695
$$ plain form
5903 147221 126726 97224 41448 39390 33930 48599 154531 115680 45218 57238 138879 116765
5891 116765 37050 11872 66705 123666 253062 182434 148055 181732 241389 267060 263558 168837
5879 168837 142484 184861 177021 144375 158681 156275 162305 164638 176796 183958 218014 237870 230222
5866 230222 205434 229705 256186 201771 159238 193165 252925 264148 247396 216323 200732 241379
5854 241379 314111 412498 465159 480467 542903 615915 568177 412447 308671 203457 217349
5843 217349 307443 333380 256018 213435 194535 196845 227901 287547 192337 194294 250128 248067
5831 248067 257903 346431 323902 267960 303205 313064 305773 258901 160346 130997 172428 197240
5819 197240 253122 326458 364156 289000 189824 195016 289873 296882 317450 285059 266156 323424
$$ packed form
5903A47221k0495k9502n5776k058n460J4669J05932l8851p0462J2020Q1641k2114
5891A16765p9715k5178N4833N6961J29396p0628l4379L3677N9657K5671l502r4721
5879A68837k6353M2377p840l2646J4306k406O030K333J2158P162L4056J9856p648
5866B30222k4788K4271K6481n4415m2533L3927N9760J1223j6752l1073j5591M0647
5854B41379P2732R8387N2661J5308O2436P3012m7738j55730j03776j05214J3892
5843B17349R0094K5937p7362m2583j8900K310L1056N9646r5210J957N5834k061
5831B48067R836Q8528k2529n5942L5245R859p291m6872r8555k9349M1431K4812
5819A97240N5882P3336L7698p5156r9176N192R4857P009K0568l2391j8903N7268
$$ plain form
5807 323424 335774 328962 314802 356560 374638 305724 327713 388198 333893 396188 479480 511527
5795 511527 452186 441531 465144 389689 322897 294991 368233 394254 390032 367058 393193 399650
5783 399650 349890 301937 343245 375161 352819 351062 466209 401838 306991 324730 290769 438440
5771 438440 478829 435775 456500 381664 257763 322078 422639 478765 492510 574089 530261
5760 530261 554031 644767 586449 583776 544372 610919 694091 689561 679258 590547 568550 589544
5748 589544 696193 719768 693495 792172 836823 864097 802474 813343 926090 898499 861857
5737 861857 858303 815446 774705 774039 891437 932510 1040927 1145763 1171958 1195424 1278087 1259919
5725 1259919 1241232 1276731 1395143 1471122 1504037 1558811 1523089 1461650 1420906 1475674 1530450
$$ packed form
5807C23424J2350o812j4160M1758J8078o8914K1989O0485n4305O2295Q3292L2047
5795E11527n9341j0655K3613p5455o6792k7906P3242K6021m222k2974K6135O457
5783C99650m9760m7953M1308L1916k2342j757J15147o4371r4847J7739l3961J47671
5771D38440M0389m3054K0725p4836j23901O4315J00561N6126J3745Q1579m3828
5760E30261K3770R0736n8318k673l9404O6547Q3172m530j0303q8711k1997K0994
5748E89544J06649K3575k6273R8677M4651K7274o1623J0869J12747k7591l6642
5737H61857l554m2857m0741o66J17398M1073J08417J04836K6195K3466Q2663j8168
5725A259919j8687L5499J18412P5979L2915N4774l5722o1439m0744N4768N4776
$$ plain form
5714 1530450 1524355 1503477 1390913 1424796 1500013 1438766 1525449 1559428 1639964 1748113 1776559
5703 1776559 1903539 2086856 2130241 2087611 2100126 2160612 2210094 2197716 2147299 2061828 1964050
5692 1964050 1903604 1858239 1832532 1838741 1872851 1877811 1946714 1966291 1969019 2041742 2187275 2174675
5680 2174675 2067575 1998536 2013532 2098069 2301711 2397985 2383658 2385846 2245803 2124806 2125347
5669 2125347 2099214 2053834 2000254 1932956 1965857 1967661 2060296 1945297 1847527 1844896 1983276
5658 1983276 2078875 2143645 2286553 2228460 2100345 2004567 1885021 1757965 1712116 1710024 1778797
5647 1778797 1743185 1664839 1505347 1413601 1405864 1452829 1469422 1531333 1587310 1702626 1811502
5636 1811502 1854768 1866427 1875518 1796629 1653247 1628862 1530604 1482784 1409919 1349484 1291091
$$ packed form
5714A530450o095k0878j12564L3883P5217o1247Q6683L3979Q0536J08149K8446
5703A776559J26980J83317M3385m2630J2515O0486M9482j2378n0417q5471r7778
5692A964050o0446m5365k5707O209L4110M960O8903J9577K728P2723J45533j2600
5680B174675j07100o9039J4996Q4537K03642R6274j4327K188j40043j20997N41
5669B125347k6133m5380n3580o7298L2901J804R2635j14999r7770k631J38380
5658A983276R5599O4770J42908n8093j28115r5778j19546j27056m5849k092O8773
5647A778797l5612p8346j59492r1746p737M6965J6593O1911N5977J15316J08876
5636A811502M3266J1659R091p8889j43382k4385r8258m7820p2865o0435n8393
$$ plain form
5625 1291091 1221264 1172738 1112434 954019 901118 977883 974599 870270 841162 949580 971740
5614 971740 1000255 1056170 1055143 1105017 1111630 1159558 1110889 1019782 904774 772522 787038 746398
5602 746398 727513 679180 667211 728807 708723 671158 648704 682146 617329 577976 538080 552173
5590 552173 567575 429115 383124 456590 561208 564216 512788 497899 539875 645813 667526
5579 667526 665133 700900 615279 606989 616988 597417 531868 460004 422464 487121 503547 458148
5567 458148 395555 323543 325593 318879 363135 404047 370485 390634 422474 458877 423365 383338
5555 383338 436793 528554 504510 533180 534558 511924 497073 463880 558108 575869 576384 493049
5543 493049 434323 464188 519220 528940 510891 565205 599404 538349 480966 467859 474202 439171
$$ packed form
5625A291091o9827m8526o0304j58415n2901P6765l284j04329k9108J08418K2160
5614I71740K8515N5915j027M9874O613M7928m8669r1107j15008j32252J4516m0640
5602G46398j8885m8333j1969O1596k0084l7565k2454L3442o4817l9353l9896J4093
5590E52173J5402j38460m5991P3466J04618L008n1428j4889M1976J05938K1713
5579F67526k393L5767q5621q290R999j9571o5549p1864l7540O4657J6426m5399
5567D58148o2593p2012K050o714M4256M0912l3562K0149L1840L6403l5512m0027
5555C83338N3455R1761k4044K8670J378k2634j4851l3193R4228J7761N15q3335
5543D93049n8726K9865N5032R720j8049N4314L4199o1055n7383j3107O343l5031
$$ plain form
5531 439171 460832 532681 531071 569629 558266 567415 690487 606201 474529 456007 487280 466585
5519 466585 478880 524073 496108 491084 557275 539871 530362 472816 522514 516829 605660 615538
5507 615538 495207 482402 428257 434565 464135 443181 365801 267858 341041 393863 434845 501347
5495 501347 446970 420882 410597 402345 349264 378487 414220 426925 437242 431699 389682 391905
5483 391905 371688 399380 362753 432386 465068 415294 408408 486999 538228 512655 548012 588966
5471 588966 548822 506486 492621 464918 506641 446438 484326 471145 452719 438663 397184 413655
5459 413655 464496 429729 382856 530526 580235 607347 566368 581217 546335 559892 557407 527258
5447 527258 528893 515150 511139 516275 530680 598565 595244 456572 509133 645272 672159 656444
$$ packed form
5531D39171K1661P1849j610L8558j1363R149J23072q4286j31672j8522L1273k0695
5519D66585J2295M5193k7965n024O6191j7404r509n7546M9698n685Q8831R878
5507F15538j20331j2805n4145O308K9570k0954p7380r7943P3183N2822M0982O6502
5495E01347n4377k6088j0285q252n3081K9223L5733J2705J0317n543m2017K223
5483C91905k0217K7692l6627O9633L2682m9774o886P8591N1229k5573L5357M0954
5471E88966m0144m2336j3865k7703M1723o0203L7888j3181j8426j4056m1479J6471
5459D13655N0841l4767m6873J47670M9709K7112m0979J4849l4882J3557k485l0149
5447E27258J635j3743m011N136J4405O7885l321j38672N2561J36139K6887j5715
$$ plain form
5435 656444 635456 673261 675188 710634 711637 709692 729129 736170 707927 608482 570682 510691
5423 510691 646786 756415 745086 710568 720002 710182 727645 676112 673840 666751 641537 614540
5411 614540 575457 599857 632373 612286 628783 635098 627092 692613 656371 662932 705061 777686
5399 777686 775260 755971 737541 781597 747373 674877 648618 703639 726652 777096 829414 814604
5387 814604 793246 810202 786582 801265 884945 916101 897070 867146 864218 908375 963548 978418
5375 978418 1009957 984123 974444 1016963 1017524 965983 996825 1039259 1102054 1107331 1216374 1308880
5363 1308880 1326844 1371043 1504598 1555979 1516438 1539367 1541511 1521139 1496320 1419589 1389372
5352 1389372 1477937 1532593 1597533 1670796 1704039 1723369 1785134 1882495 1949190 2094095 2253302
$$ packed form
5435F56444k0988L7805J927L5446J003j945J9437P041k8243r9445l7800n9991
5423E10691J36095J09629j1329l4518R434r820J7463n1533k272p089k5214k6997
5411F14540l9083K4400L2516k0087J6497O315q006O5521l6242O561M2129P2625
5399G77686k426j9289j8430M4056l4224p2496k6259N5021K3013N0444N2318j4810
5387H14604k1358J6956k3620J4683Q3680L1156j9031k9924k928M4157N5173J4870
5375I78418L1539k5834r679M2519N61n1541L0842M2434O2795N277J09043R2506
5363A308880J7964M4199J33555N1381l9541K2929K144k0372k4819p6731l0217
5352A389372Q8565N4656O4940P3263L3243J9330O1765R7361O6695J44905J59207
$$ plain form
5341 2253302 2543743 2775068 2917009 2738992 2424099 2236741 2080419 1954252 1898397 1891596
5331 1891596 1870714 1786408 1739467 1748666 1840152 1909851 1925869 1936396 1970483 2076360 2166472
5320 2166472 2308709 2507098 2658632 2658232 2612291 2529733 2517022 2512506 2515367 2567468 2669289
5309 2669289 2731258 2767138 2858403 2973032 3094758 3305734 3613128 3930396 4267709 4587443
5299 4587443 4787391 4972307 5115121 4966572 4481348 4074552 3698588 3494133 3323250 3185046
5289 3185046 3046535 2934521 2917431 2980845 2972164 3093393 3223463 3266010 3331164 3479228 3688828
5278 3688828 3993142 4180136 4120640 3969777 3702378 3413821 3277385 3256131 3252473 3237965
5268 3237965 3204238 3258157 3250922 3399422 3473427 3529702 3617422 3806505 4014300 4336260 4643911
$$ packed form
5341B253302K90441K31325J41941j78017l14893j87358j56322j26167n5855o801
5331A891596k0882q4306m6941R199R1486O9699J6018J0527L4087J05877R0112
5320B166472J42237J98389J51534m00m5941q2558j2711m516K861N2101J01821
5309B669289O1969L5880R1265J14629J21726K10976L07394L17268L37313L19734
5299D587443J99948J84916J42814j48549m85224m06796l75964k04455j70883j38204
5289C185046j38511j12014j7090O3414q681J21229J30070M2547O5154J48064K09600
5278C688828L04314J86994n9496j50863k67399k88557j36436k1254l658j4508
5268C237965l3727N3919p235J48500P4005N6275Q7720J89083K07795L21960L07651
$$ plain form
5257 4643911 4678933 4300829 3977565 3740649 3545646 3407131 3348154 3360685 3279015 3312733
5247 3312733 3286187 3350710 3426098 3386859 3368271 3431951 3470536 3540618 3758906 3889702 3973729
5236 3973729 4030053 4040562 3834789 3722000 3672579 3522278 3569471 3570650 3558113 3550350 3492265
5225 3492265 3450651 3465497 3407428 3356052 3449953 3469131 3445043 3410680 3368512 3514510 3536074
5214 3536074 3614965 3599516 3533640 3646783 3774533 3843601 3934697 4002230 4053111 4277650 4357383
5203 4357383 4470513 4540377 4587800 4814645 4951058 5182935 5423246 5679163 5866789 6023613
5193 6023613 6285161 6594970 6894329 7178084 7570086 8076106 8524567 9082823 9751718 10500004
5183 10500004 11491469 12603608 13957283 15462679 17382374 19625415 22191030 24604921
$$ packed form
5257D643911L5022l78104l23264k36916j95003j38515n8977J2531q1670L3718
5247C312733k6546O4523P5388l9239j8588O3680L8585P0082K18288J30796Q4027
5236C973729N6324J0509k05773j12789m9421j50301M7193J179j2537p763n8085
5225C492265m1614J4846n8069n1376R3901J9178k4088l4363m2168J45998K1564
5214C536074P8891j5449o5876J13143J27750O9068R1096O7533N0881K24539P9733
5203D357383J13130O9864M7423K26845J36413K31877K40311K55917J87626J56824
5193F023613K61548L09809K99359K83755L92002N06020M48461N58256O68895P48286
5183A0500004R91465J112139J353675J505396J919695K243041K565615K413891
$$ plain form
5175 24604921 25929460 25606403 24014920 22213080 20632471 19598404 19269812 19290922 19732216
5166 19732216 20647055 22076656 23941973 25547708 25795333 24236049 21740715 19227566
5158 19227566 17133854 15551899 14262162 13366892 12555229 11865616 11451000 11055258 10799426
5149 10799426 10736760 10832050 10944571 11093660 11270009 11291587 11010289 10808565 10648179 10608914
5139 10608914 10714476 10954655 11230294 11561155 11968788 12587783 13403514 14322857 15228862
5130 15228862 16054326 16743176 17545250 18635027 19986324 21732826 24013328 26933105 30146562
5121 30146562 32780023 33433214 31993291 29450886 27130619 25502196 24482967 24154721
5113 24154721 24337833 25005005 26253027 28264612 30645680 32332732 32036417 29594767 26060320
$$ packed form
5175B4604921J324539l23057j591483j801840j580609j034067l28592K1110M41294
5166A9732216R14839J429601J865317J605735K47625j559284k495334k513149
5158A9227566k093712j581955j289737q95270q11663o89613m14616l95742k55832
5149A0799426o2666R5290J12521J49089J76349K1578k81298k01724j60386l9265
5139A0608914J05562K40179K75639L30861M07633O18995Q15731R19343R06005
5130A5228862Q25464O88850Q02074J089777J351297J746502K280502K919777L213457
5121C0146562K633461O53191j439923k542405k320267j628423j019229l28246
5113B4154721J83112O67172J248022K011585K381068J687052k96315k441650l534447
$$ plain form
5104 26060320 22811584 20406342 18524383 16804486 15165162 13845619 12772668 11883005
5096 11883005 11150881 10560278 10049137 9661529 9290102 9018466 8766483 8470051 8182395
5087 8182395 7872948 7639433 7470637 7240270 7109932 6988079 6894409 6783343 6616670 6527604
5077 6527604 6498722 6440281 6450060 6441241 6407907 6460514 6438375 6486540 6587271 6680120 6848473
5066 6848473 6995514 7129692 7182634 7129753 6897350 6694735 6689403 6655844 6596965 6575010 6614907
5055 6614907 6627001 6641804 6744633 6793686 6998754 7105581 7022526 6951685 6795223 6666888
5045 6666888 6561792 6600986 6567612 6465737 6413895 6466459 6585326 6659777 6657607 6728686 6790413
5034 6790413 6861394 6959126 6915237 6957199 7007897 7046520 7030001 7003913 7036545 6963063 6940395
$$ packed form
5104B6060320l248736k405242j881959j719897j639324j319543j072951q89663
5096A1883005p32124n90603n11141l87608l71427k71636k51983k96432k87656
5087H182395l09447k33515j68796k30367j30338j21853r3670j11066j66673q9066
5077F527604k8882n8441R779q819l3334N2607k2139M8165J00731R2849J68353
5066F848473J47041J34178N2942n2881k32403k02615n332l3559n8879k1955L9897
5055F614907J2094J4803J02829M9053K05068J06827q3055p0841j56462j28335
5045F666888j05096L9194l3374j01875n1842N2564J18867P4451k170P1079O1727
5034F790413P0981R7732m3889M1962N0698L8623j6519k6088L2632p3482k2668
$$ plain form
5023 6940395 6971589 7040759 7053508 7082121 7173056 7240848 7285020 7359518 7429135 7547389 7651893
5012 7651893 7653470 7830328 7918225 8023965 8170373 8264703 8445975 8601066 8745474 8864951
5002 8864951 9108675 9342868 9522563 9827981 10027170 10269313 10605350 10848802 11141212 11327669
4992 11327669 11514796 11587028 11449300 11348039 11360024 11289172 11366537 11433841 11615836 11801881
4982 11801881 12043195 12208360 12392778 12647481 12904773 13178913 13586997 13978038 14182260
4973 14182260 14326082 14307788 14212586 14028184 13937667 13845031 13930006 13981355 14119233 14326286
4963 14326286 14632734 15045488 15552061 16177341 16805794 17419711 18229548 19162847 20153005
4954 20153005 21282313 22316531 23255714 24039430 24690778 25266299 25661721 26010956 26229457
$$ packed form
5023F940395L1194O9170J2749K8613R0935O7792M4172P4498O9617J18254J04504
5012G651893J577J76858Q7897J05740J46408R4330J81272J55091J44408J19477
5002H864951K43724K34193J79695L05418J99189K42143L36037K43452K92410J86457
4992A1327669J87127P2232j37728j01261J1985p0852P7365O7304J81995J86045
4982A1801881K41314J65165J84418K54703K57292K74140M08084L91041K04222
4973A4182260J43822j8294r5202j84402r0517r2636Q4975N1349J37878K07053
4963A4326286L06448M12754N06573O25280O28453O13917Q09837R33299R90158
4954B0153005J129308J034218R39183P83716O51348N75521L95422L49235K18501
$$ plain form
4945 26229457 26500638 26751836 27060106 27359725 27735302 28164131 28536481 28768060 28975280
4936 28975280 29082339 29120774 29255521 29232970 29263919 29160226 28996792 28804046 28623183 28453147
4926 28453147 28358240 28437914 28613912 28918796 29453603 30214750 31112421 32088085 33250988 34547148
4916 34547148 35842751 37353872 39023273 40992785 43329700 45934058 48758501 51600243
4908 51600243 54499912 57339646 60178502 62945467 65067876 65979929 65179620 63296107
4900 63296107 61048532 58930153 57322530 56005396 54570597 52575671 49995818 47065047
4892 47065047 44059516 41198909 38735713 36725365 34927004 33360071 32214482 31093882
4884 31093882 30074277 29240731 28585137 27986104 27541232 27132477 26611247 26103084 25599597
$$ packed form
4945B6229457K71181K51198L08270K99619L75577M28829L72350K31579K07220
4936B8975280J07059L8435J34747k2551L0949j03693j63434j92746j80863j70036
4926B8453147r4907P9674J75998L04884N34807P61147Q97671R75664J162903J296160
4916C4547148J295603J511121J669401J969512K336915K604358K824443K841742
4908E1600243K899669K839734K838856K766965K122409R12053q00309j883513
4900F3296107k247575k118379j607623j317134j434799j994926k579853k930771
4892D7065047l005531k860607k463196k010348j798361j566933j145589j120600
4884C1093882j019605q33546o55594n99033m44872m08755n21230n08163n03487
$$ plain form
4875 25599597 25148249 24676568 24219927 23699419 23237285 22832459 22357833 21970098 21591411
4866 21591411 21149301 20725456 20447870 20171739 19805493 19331225 18672734 17902310 17152167
4857 17152167 16496858 16000701 15582907 15078799 14773222 14379472 14112843 13905130 13790185
4848 13790185 13713174 13576602 13496012 13462351 13373808 13315532 13430587 13516532 13515154 13726714 13964664
4837 13964664 14184810 14623757 15181510 15789492 16428087 17447614 18532654 19823680 21374856
4828 21374856 23233380 25598225 28413833 31165964 32367207 30925346 27888881 24739316
4820 24739316 22252361 20499477 19151210 18115454 17305455 16666522 16085328 15677064 15400329
4811 15400329 15177254 15159154 15241942 15404031 15757250 16260906 16839819 17548634 18483869 19707333
$$ packed form
4875B5599597m51348m71681m56641n20508m62134m04826m74626l87735l78687
4866B1591411m42110m23845k77586k76131l66246m74268o58491p70424p50143
4857A7152167o55309m96157m17794n04108l05577l93750k66629k07713j14945
4848A3790185p7011j36572q0590l3661q8543n8276J15055Q5945j378K11560K37950
4837A3964664K20146M38947N57753O07982O38595J019527J085040J291026J551176
4828B1374856J858524K364845K815608K752131J201243j441861l036465l149565
4820B4739316k486955j752884j348267j035756q09999o38933n81194m08264k76735
4811A5400329k23075j8100Q2788J62089L53219N03656N78913P08815R35235J223464
$$ plain form
4801 19707333 21254655 23044247 25339722 28093544 31129387 33121493 32567156 29855335
4793 29855335 26294204 23201656 20931659 19285312 18081942 17124637 16297966 15576810 15018421
4784 15018421 14638114 14282023 14204832 14203784 14242142 14479364 14789041 15324036 15986807 16878101
4774 16878101 17890499 19175191 20853992 22903268 24643668 25062006 23674539 21209470
4766 21209470 18846089 17045435 15712050 14795695 14038097 13388587 12956491 12501649 12260008
4757 12260008 12063065 11870196 11757794 11873523 12076169 12325070 12586018 12913373 13406478
4748 13406478 14148762 15015479 16096688 17386640 19078917 21252572 23383308 24513436
4740 24513436 23613680 21107184 18201923 15931029 14377108 13122413 12054590 11160936
$$ packed form
4801A9707333J547322J789592K295475K753822L035843J992106n54337k711821
4793B9855335l561131l092548k269997j646347j203370r57305q26671p21156n58389
4784A5018421l80307l56091p7191j048L8358K37222L09677N34995O62771Q91294
4774A6878101J012398J284692J678801K049276J740400M18338j387467k465069
4766B1209470k363381j800654j333385r16355p57598o49510m32096m54842k41641
4757A2260008j96943j92869j12402J15729K02646K48901K60948L27355M93105
4748A3406478P42284Q66717J081209J289952J692277K173655K130736J130128
4740B4513436q99756k506496k905261k270894j553921j254695j067823q93654
$$ plain form
4732 11160936 10401210 9762568 9279059 8818707 8371866 8095657 7751944 7462805 7178553
4723 7178553 6998742 6905339 6709332 6575014 6495416 6470518 6338316 6101544 6038055 6014325
4713 6014325 6034533 5979308 5890264 5897526 5838250 5751700 5643428 5640806 5595816 5598943 5640491 5597549
4701 5597549 5593316 5447972 5346688 5375020 5390838 5382764 5272470 5215512 5143081 5084659 5020021
4690 5020021 4969576 4967235 5024828 4975092 4991973 5056292 5001293 4908305 4900403 4987870 5045441 5074623
4678 5074623 5037873 5006031 5034250 4987025 4966086 4995916 4934886 4945379 4981389 5002545 4874997
4667 4874997 4832451 4816740 4858871 4994208 5116476 5169072 5170546 5227108 5298564 5383660 5434549
4656 5434549 5518985 5565502 5707823 5800860 5895110 6038270 6034276 6113713 6149755 6178454 6034323
$$ packed form
4732A1160936p59726o38642m83509m60352m46841k76209l43713k89139k84252
4723G178553j79811r3403j96007j34318p9598k4898j32202k36772o3489k3730
4713F014325K0208n5225q9044P262n9276q6550j08272k622m4990L127M1548m2942
4701E597549m233j45344j01284K8332J5818q074j10294n6958p2431n8422o4638
4690E020021n0445k341N7593m9736J6881O4319n4999r2988p902Q7467N7571K9182
4678E074623l6750l1842K8219m7225k0939K9830o1030J0493L6010K1156j27548
4667D874997m2546j5711M2131J35337J22268N2596J474N6562P1456Q5096N0889
4656E434549Q4436M6517J42321R3037R4250J43160l994P9437L6042K8699j44131
$$ plain form
4645 6034323 5779185 5608334 5555320 5496813 5409994 5332689 5429915 5522626 5549627 5581240 5631189
4634 5631189 5767233 5823490 5950222 6057573 6095780 5978924 5793337 5620986 5466456 5309546
4624 5309546 5184560 5076459 5058783 4938345 4864674 4733820 4678960 4675967 4599087 4593961 4490181
4613 4490181 4542695 4491356 4387168 4418646 4473423 4471568 4418437 4357798 4441785 4431604 4440101 4375495
4601 4375495 4428574 4436714 4428080 4530414 4546068 4533430 4519117 4491477 4501875 4671582 4849496
4590 4849496 4930823 4968206 4907405 4871592 4903368 4903014 4965770 4986592 4959298 4960207 4966833 5049764
4578 5049764 5228221 5404977 5591494 5813507 6123558 6372231 6601443 6721988 6689974 6524279
4568 6524279 6376913 6256635 6092788 5998870 6001923 6082755 6178326 6121482 6215945 6334162 6478679
$$ packed form
4645F034323k55138j70851n3014n8507q6819p7305R7226R2711K7001L1613M9949
4634E631189J36044N6257J26732J07351L8207j16856j85587j72351j54530j56910
4624E309546j24986j08101j7676j20438p3671j30854n4860k993p6880n126j03780
4613D490181N2514n1339j04188L1478N4777j855n3131o0639Q3987j0181Q497o4606
4601D375495N3079Q140q634J02334J5654j2638j4313k7640J0398J69707J77914
4590D849496Q1327L7383o0801l5813L1776l54O2756K0822k7294R09O626Q2931
4578E049764J78457J76756J86517K22013L10051K48673K29212J20545l2014j65695
4568F524279j47366j20278j63847r3918L053Q0832R5571n6844R4463J18217J44517
$$ plain form
4557 6478679 6673712 6835849 6816886 6800850 6616915 6280952 6025777 5748437 5574264 5369650
4547 5369650 5273515 5275475 5258997 5171488 5149157 5246403 5311757 5468006 5560488 5682504 5811459
4536 5811459 5974821 6192543 6504387 6973120 7459947 7873046 7774013 7229050 6750619 6415121
4526 6415121 6248464 6099521 5975581 5926332 5863632 5888507 5909938 6029546 6142266 6260557
4516 6260557 6486744 6649585 6991652 7364608 7861258 8445041 9051842 9741140 10157413 10280704
4506 10280704 10187368 10104898 9594858 8795002 8158169 7629850 7266800 7141897 7072529 7077452
4496 7077452 7173460 7305019 7482103 7663761 8001371 8307666 8669176 8900626 8679366 8129480
4486 8129480 7575831 7268779 7024582 6819677 6637424 6492094 6443850 6442971 6458498 6499397 6464003
$$ packed form
4557F478679J95033J62137j8963j6036j83935l35963k55175k77340j74173k04614
4547E369650r6135J960j6478q7509k2331R7246O5354J56249R2482J22016J28955
4536E811459J63362K17722L11844M68733M86827M13099r9033n44963m78431l35498
4526F415121j66657j48943j23940m9249o2700K4875K1431J19608J12720J18291
4516F260557K26187J62841L42067L72956M96650N83783O06801O89298M16273J23291
4506A0280704r3336q2470n10040p99856o36833n28319l63050j24903o9368M923
4496G077452R6008J31559J77084J81658L37610L06295L61510K31450k21260n49886
4486H129480n53649l07052k44197k04905j82253j45330m8244q79J5527M0899l5394
$$ plain form
4475 6464003 6450224 6575928 6620829 6618611 6668012 6658448 6670965 6678248 6769307 6816680 6907306 6933683
4463 6933683 7029970 7183672 7272700 7278025 7391037 7495355 7621135 7635298 7585084 7656583 7791462
4452 7791462 7967011 8121452 8304404 8287943 8230741 8314938 8415033 8540686 8697180 8960658
4442 8960658 9254845 9627419 10073694 10320837 10476581 10608134 10734609 10868790 11184826 11522605
4432 11522605 11834018 12200567 12586588 12977757 13579528 14249085 15064927 16008201 17126991
4423 17126991 18258887 19320660 20158589 20829575 21335303 21762921 22299621 22749746 23202303
4414 23202303 23748015 24314477 25036406 25675362 26178230 26542139 26743755 27047582 27374778
4405 27374778 27873132 28551100 29310669 30111449 30484388 30248576 29845150 29387191 29080878
$$ packed form
4475F464003j3779J25704M4901k218M9401r564J2517P283R1059M7373R0626K6377
4463F933683R6287J53702Q9028N325J13012J04318J25780J4163n0214P1499J34879
4452G791462J75549J54441J82952j6461n7202Q4197J00095J25653J56494K63478
4442H960658K94187L72574M46275K47143J55744J31553J26475J34181L16036L37779
4432A1522605L11413L66549L86021L91169O01771O69557Q15842R43274J118790
4423A7126991J131896J061773Q37929O70986N05728M27618N36700M50125M52557
4414B3202303N45712N66462P21929O38956N02868L63909K01616L03827L27196
4405B7374778M98354O77968P59569Q00780L72939k35812m03426m57959l06313
$$ plain form
4396 29080878 28651618 28184000 27602620 27010142 26423213 25671973 24939126 23991475 23111169
4387 23111169 22408202 22037317 21887614 21561898 20931191 20092154 19210865 18469567 18046927
4378 18046927 17954866 17883353 17377735 16332754 15181047 14368610 13680131 13264536 13056858
4369 13056858 12995852 13148733 13449251 13664056 13518848 13206027 12577290 11823989 11283129 10811979
4359 10811979 10614086 10441184 10388019 10412836 10314783 10086629 9784764 9521475 9127759 8660237
4349 8660237 8262543 7940645 7693313 7513982 7355288 7140708 6921405 6774881 6526830 6405758
4339 6405758 6321395 6192211 6112736 6043266 6039943 5943883 5931735 5784966 5593455 5494908 5421705
4328 5421705 5368060 5228329 5077386 4955803 4930436 4931646 4842097 4722522 4609801 4643169 4690571
$$ packed form
4396B9080878m29260m67618n81380n92478n86929p51240p32847r47651q80306
4387B3111169p02967l70885j49703l25716o30707q39037q81289p41298m22640
4378A8046927r2061p1513n05618j044981j151707q12437o88479m15595k07678
4369A3056858o1006J52881L00518K14805j45208l12821o28737p53301n40860m71150
4359A0811979j97893j72902n3165K4817r8053k28154l01865k63289l93716m67522
4349H660237l97694l21898k47332j79331j58694k14580k19303j46524k48051j21072
4339F405758q4363j29184p9475o9470l323r6060j2148j46769j91511r8547p3203
4328E421705n3645j39731j50943j21583k5367J210q9549j19575j12721L3368M7402
$$ plain form
4317 4690571 4696144 4738634 4708444 4758236 4841328 5033606 5157711 5321809 5424905 5525387 5579104
4306 5579104 5522863 5225135 4967889 4733171 4563271 4516006 4364532 4243028 4162828 4121810
4296 4121810 4024242 3931451 3979173 3982565 3912169 3865866 3959658 4030609 3995811 4028215 4027821 4113824
4284 4113824 4145901 4186993 4387871 4539759 4683499 4753731 4924744 4847961 4666703 4525260
4274 4525260 4312309 4257092 4184534 4013754 3905875 3774785 3699659 3677996 3561153 3475261
4264 3475261 3430969 3390082 3348695 3396411 3310036 3213194 3214796 3251247 3309726 3339662 3303153 3275844
4252 3275844 3267495 3289684 3337483 3294258 3341133 3433138 3395835 3475496 3429928 3478393 3483686 3625804
4240 3625804 3674668 3650224 3678645 3709827 3728876 3763915 3847974 3900984 3923021 3909806 4023196
$$ packed form
4317D690571N573M2490l0190M9792Q3092J92278J24105J64098J03096J00482N3717
4306E579104n6241k97728k57246k34718j69900m7265j51474j21504q0200m1018
4296D121810r7568r2791M7722L392p0396m6303R3792P0951l4798L2404l94Q6003
4284D113824L2077M1092K00878J51888J43740P0232J71013p6783j81258j41443
4274D525260k12951n5217p2558j70780j07879j31090p5126k1663j16843q5892
4264C475261m4292m0887m1387M7716q6375r6842J602L6451N8479K9936l6509k7309
4252C275844q349K2189M7799m3225M6875R2005l7303P9661m5568M8465N293J42118
4240C625804M8864k4444K8421L1182J9049L5039Q4059N3010K2037j3215J13390
$$ plain form
4229 4023196 4093295 4168605 4251981 4347026 4379123 4406269 4551824 4577468 4560323 4583808 4604617
4218 4604617 4641855 4765826 4841667 4960985 5191547 5368614 5441632 5562548 5807234 6010920
4208 6010920 6275793 6555138 6896607 7300548 7716728 8149373 8771894 9498755 10312712 11192939
4198 11192939 11837489 11919719 11686358 11504175 11515075 11784856 12149323 12682954 13383741 14427062
4188 14427062 15706806 17179323 18773269 19681925 19510692 18776024 18263718 18159019 18550415
4179 18550415 19352041 20098355 20416661 20486768 20711251 21268306 22202341 23096631 23482889 23841950
4169 23841950 23996509 24091319 24516786 25219887 25662399 24949524 23682869 22710054 22247750
4160 22247750 22355651 23056847 24197139 25197078 25358623 24717082 24296044 24290641 24280315 23937131
$$ packed form
4229D023196P0099P5310Q3376R5045L2097K7146J45555K5644j7145K3485K0809
4218D604617L7238J23971P5841J19318K30562J77067P3018J20916K44686K03686
4208F010920K64873K79345L41469M03941M16180M32645O22521P26861Q13957Q80227
4198A1192939O44550Q2230k33361j82183J0900K69781L64467N33631P00787J043321
4188A4427062J279744J472517J593946R08656j71233p34668n12306j04699L91396
4179A8550415Q01626P46314L18306P0107K24483N57055R34035Q94290L86258L59061
4169B3841950J54559R4810M25467P03101M42512p12875j266655r72815m62304
4160B2247750J07901P01196J140292R99939J61545o41541m21038n403j0326l43184
$$ plain form
4150 23937131 23543196 22872267 21815575 20985133 20658282 20754332 20817728 20536925 19943336 19583348
4140 19583348 19540851 19818600 20311143 20808790 20323020 18692003 16994696 15705189 14735419
4131 14735419 14135721 13771547 13587573 13526080 13588852 13756801 14010634 14131342 13738586 13032646
4121 13032646 12365896 11845871 11507099 11295035 11074569 10723312 10381538 10179428 10048862
4112 10048862 9934691 9732823 9415913 9368830 9421865 9451586 9604780 9789227 10006702 9984685
4102 9984685 9818885 9541902 9312160 9192252 9212827 9355585 9529289 9786506 10231553 10846933
4092 10846933 11526822 12280750 12721317 12814007 12850304 13099408 13562711 13763655 13574146 13349423
4082 13349423 13319983 13447961 13532259 13581876 13607701 13523686 13334675 13261737 13538144 13806874
$$ packed form
4150B3937131l93935o70929j056692q30442l26851R6050O3396k80803n93589l59988
4140A9583348m2497K77749M92543M97647m85770j631017j697307j289507r69770
4131A4735419n99698l64174j83974o1493O2772J67949K53833J20708l92756p05940
4121A3032646o66750n20025l38772k12064k20466l51257l41774k02110j30566
4112A0048862j14171k01868l16910m7083N3035K9721J53194J84447K17475k2017
4102I984685j65800k76983k29742j19908K0575J42758J73704K57217M45047O15380
4092A0846933O79889P53928M40567R2690L6297K49104M63303K00944j89509k24723
4082A3349423k9440J27978Q4298M9617K5825q4015j89011p2938K76407K68730
$$ plain form
4072 13806874 14121897 14233643 14266339 14625181 15259054 15872502 16156364 16081935 15993453 16184967
4062 16184967 16759688 17820203 19119644 19826600 19747049 19280004 18622648 18215249 18074025
4053 18074025 18219523 18204329 17707997 16801997 15465258 14262782 13233631 12424346 11672596
4044 11672596 11080765 10870769 10762449 10760304 10845543 10715852 10554736 10064184 9607239 9455395
4034 9455395 9441615 9547878 9401242 9121431 8942972 8754771 8533311 8253446 8011984 7927585
4024 7927585 7868358 7710024 7489110 7126246 6647504 6312465 6005969 5772479 5596301 5529352
4014 5529352 5610015 5752628 5879957 5743997 5323718 4983387 4676988 4530933 4337713 4169473
4004 4169473 4086967 4063171 4090852 3948335 3847967 3752483 3664695 3669209 3686179 3699725 3582979
$$ packed form
4072A3806874L15023J11746L2696L58842O33873O13448K83862p4429q8482J91514
4062A6184967N74721J060515J299441P06956p9551m67045o57356m07399j41224
4053A8074025J45498j5194m96332r06000j336739j202476j029151q09285p51750
4044A1672596n91831k09996j08320k145Q5239j29691j61116m90552m56945j51844
4034I455395j3780J06263j46636k79811j78459j88201k21460k79865k41462q4399
4024G927585n9227j58334k20914l62864m78742l35039l06496k33490j76178o6949
4014E529352Q0663J42613J27329j35960m20279l40331l06399j46055j93220j68240
4004D169473q2506k3796K7681j42517j00368r5484q7788M514J6970J3546j16746
$$ plain form
3993 3582979 3527140 3401209 3385585 3368841 3351208 3269005 3205515 3234200 3244491 3164672 3079988
3982 3079988 3046641 3099218 3094572 3085557 3100043 3182691 3194252 3146802 3182329 3106087 3141516 3172400
3970 3172400 3134832 3144524 3116484 3114729 3019147 2998868 3120060 3164786 3122801 3167139 3281949
3959 3281949 3279168 3284908 3390039 3422612 3484745 3614964 3692543 3781060 3937611 4086217 4258030
3948 4258030 4523953 4833956 5191890 5652706 6170765 6518277 6837175 7204860 7531128 7348733
3938 7348733 6883087 6233058 5594115 5040475 4646881 4392508 4196062 4051685 3902716 3783785
3928 3783785 3630703 3523514 3386023 3388672 3459702 3412720 3436890 3441821 3430587 3512843 3587188
3917 3587188 3649218 3604317 3646908 3781571 3934974 4170980 4350441 4588305 4686000 4750025
$$ packed form
3993C582979n5839j25931j5624j6744j7633q2203o3490K8685J0291p9819q4684
3982C079988l3347N2577m646r015J4486Q2648J1561m7450L5527p6242L5429L0884
3970C172400l7568R692k8040j755r5582k0279J21192M4726m1985M4338J14810
3959C281949k781N740J05131L2573O2133J30219P7579Q8517J56551J48606J71813
3948D258030K65923L10003L57934M60816N18059L47512L18898L67685L26268j82395
3938G348733m65646o50029o38943n53640l93594k54373j96446j44377j48969j18931
3928C783785j53082j07189j37491K649P1030m6982K4170M931j1234Q2256P4345
3917C587188O2030m4901M2591J34663J53403K36006J79461K37864R7695O4025
$$ plain form
3907 4750025 4861260 5017996 5271620 5548932 6021180 6569085 7073261 7661042 8248304 8909728
3897 8909728 8950915 8197012 7277131 6595465 6258073 6064074 5984926 6065743 6084108 6109293
3887 6109293 6097169 6283827 6529126 6953276 7681646 8264240 8302699 7691131 6800953 6088480
3877 6088480 5556842 5150283 4850926 4549422 4311928 4158796 4112672 4085031 3992604 3812971
3867 3812971 3643395 3555101 3499665 3435975 3402245 3346633 3250147 3187484 3287528 3235061 3165043
3856 3165043 3148867 3190938 3254359 3281864 3256788 3311864 3394353 3456741 3566683 3596716 3712553
3845 3712553 3857641 3918081 4113699 4377589 4692491 4938979 5025125 4982067 4965142 4981678
3835 4981678 4921824 4936100 4948516 5106870 5315536 5510113 5819215 6236706 6805720 7402166
$$ packed form
3907D750025J11235J56736K53624K77312M72248N47905N04176N87781N87262O61424
3897H909728M1187p53903r19881o81666l37392j93999p9148Q0817J8365K5185
3887F109293j2124J86658K45299M24150P28370N82594L8459o11568q90178p12473
3877F088480n31638m06559k99357l01504k37494j53132m6124k7641r2427j79633
3867C812971j69576q8294n5436o3690l3730n5612r6486o2663J00044n2467p0018
3856C165043j6176M2071O3421K7505k5076N5076Q2489O2388J09942L0033J15837
3845C712553J45088O0440J95618K63890L14902K46488Q6146m3058j6925J6536
3835D981678n9854J4276J2416J58354K08666J94577L09102M17491N69014N96446
$$ plain form
3825 7402166 7697452 7505713 7321739 7405866 7646008 7842012 7835194 7521194 7129004 6866004
3815 6866004 6808021 6875038 7049198 7273327 7785290 8363814 8840411 9174220 9278161 9493296
3805 9493296 9978289 10624664 11396333 11455556 10839516 10093456 9621745 9497150 9407684 9267963
3795 9267963 9034733 8822878 8523058 8204323 7991987 8001615 8202617 8391707 8460212 8504402
3785 8504402 8559214 8663900 8631807 8627562 8698267 8821261 8656417 8131881 7648262 7268123
3775 7268123 6955997 6879989 6801108 6775664 6780660 6797298 6842416 6873445 7088068 7187588 7459114
3764 7459114 7636596 7848436 8130610 8385551 8748736 9095198 9660618 10238134 11022172 11947342
3754 11947342 12873449 14022013 15274822 16750196 18620463 20888180 23855158 27088486
$$ packed form
3825G402166K95286j91739j83974Q4127K40142J96004o818l14000l92190k63000
3815F866004n7983O7017J74160K24129N11963N78524M76597L33809J03941K15135
3805I493296M84993O46375P71669N9223o16040p46060m71711j24595q9466j39721
3795I267963k33230k11855k99820l18735k12336R628K01002J89090O8505M4190
3785H504402N4812J04686l2093m245P0705J22994j64844n24536m83619l80139
3775G268123l12126p6008p8881k5444M996J6638M5118L1029K14623R9520K71526
3764G459114J77482K11840K82174K54941L63185L46462N65420N77516P84038R25170
3754A1947342R26107J148564J252809J475374J870267K267717K966978L233328
$$ plain form
3746 27088486 29677458 29615395 27039884 24063414 21748442 20302243 19347783 18937754 18859904
3737 18859904 18925678 19331988 19932777 20909241 22125864 23657748 25751068 28288988 31442452
3728 31442452 35289882 39788849 44198244 47114696 48324317 48771583 47169109 42565366
3720 42565366 37104921 32433222 28885462 26378277 24570058 23189368 22134096 21444014
3712 21444014 21182108 21274768 21732902 22447678 23520173 24938710 26802931 29258359 32100604
3703 32100604 34688609 35060285 32100356 27678595 23737902 20833227 18589242 16945472
3695 16945472 15645211 14519143 13669162 12877420 12239459 11762908 11325075 10909984 10565021
3686 10565021 10169899 9810651 9437593 9142369 8779197 8491105 8324004 8176074 8030615
$$ packed form
3746B7088486K588972o2063k575511k976470k314972j446199r54460m10029p7850
3737A8859904O5774M06310O00789R76464J216623J531884K093320K537920L153464
3728C1442452L847430M498967M409395K916452J209621M47266j602474m603743
3720D2565366n460445m671699l547760k507185j808219j380690j055272o90082
3712B1444014k61906R2660M58134P14776J072495J418537J864221K455428K842245
3703C2100604K588005L71676k959929m421761l940693k904675k243985j643770
3695A6945472j300261j126068q49981p91742o37961m76551m37833m15091l44963
3686A0565021l95122l59248l73058k95224l63172k88092j67101j47930j45459
$$ plain form
3677 8030615 7960616 7828978 7776852 7724738 7597922 7467996 7175494 7000811 6898496 6740766
3667 6740766 6621130 6544268 6515257 6437113 6318893 6254769 6250926 6227322 6290697 6333403 6289991
3656 6289991 6147615 6022859 5951765 5903531 5856971 5857491 5788508 5728735 5745708 5673168 5602217
3645 5602217 5596846 5667173 5788172 5826267 5866522 5915222 5979467 6000286 6041811 6086641 6200271
3634 6200271 6386206 6448968 6552508 6605869 6692154 6729382 6800553 6951065 6988744 7039612 7292965
3623 7292965 7457005 7644243 7922243 8084633 8319264 8582617 8733265 8815341 8896067 8919063
3613 8919063 8953272 8970800 8956693 9043734 9022792 9071242 9097646 9060227 9179045 9193180 9421786
3602 9421786 9643921 9796367 9967465 10102696 10344218 10569930 10847760 11152961 11305450 11480611
$$ packed form
3677H030615o9999j31638n2126n2114j26816j29926k92502j74683j02315j57730
3667F740766j19636p6862k9011p8144j18220o4124l843k3604O3375M2706m3412
3656F289991j42376j24756p1094m8234m6560N20o8983n9773J6973p2540p0951
3645E602217n371P0327J20999L8095M0255M8700O4245K0819M1525M4830J13630
3634F200271J85935O2762J03540N3361Q6285L7228P1171J50512L7679N0868K53353
3623G292965J64040J87238K78000J62390K34631K63353J50648Q2076Q0726K2996
3613H919063L4209J7528j4107Q7041k0942M8450K6404l7419J18818J4135K28606
3602I421786K22135J52446J71098J35231K41522K25712K77830L05201J52489J75161
$$ plain form
3592 11480611 11674753 11899788 12103704 12328839 12680752 13097402 13662561 14306581 15030745
3583 15030745 15867807 16894439 18241514 19788027 21687934 23925585 26556238 29810119
3575 29810119 33112799 35309155 35131291 33051322 30486278 28679689 27711451 27474656 27876762
3566 27876762 28810671 30314803 32460169 35065986 37581594 38522652 37169841 34600166
3558 34600166 32090495 30427716 29806205 30096978 31040490 32590761 34628104 36187078 36341459
3549 36341459 34846852 32868778 31453808 30633043 30334166 30237987 30184352 30295200 30862558
3540 30862558 31945160 33241382 33760740 32712366 30190210 27458782 25385402 23798792
3532 23798792 22288140 20975162 19922054 19103616 18574339 18104550 17915676 17969926 18219427
$$ packed form
3592A1480611J94142K25035K03916K25135L51913M16650N65159O44020P24164
3583A5030745Q37062J026632J347075J546513J899907K237651K630653L253881
3575B9810119L302680K196356j77864k079969k565044j806589r68238k36795M02106
3566B7876762R33909J504132K145366K605817K515608R41058j352811k569675
3558C4600166k509671j662779o21511K90773R43512J550271K037343J558974J54381
3549C6341459j494607j978074j414970q20765k98877r6179n3635J10848N67358
3540C0862558J082602J296222N19358j048374k522156k731428k073380j586610
3532B3798792j510652j312978j053108q18438n29277m69789j88874N4250K49501
$$ plain form
3523 18219427 18487766 18513811 18115430 17133397 15930918 14958642 14146289 13527051 13044650
3514 13044650 12745732 12650518 12601228 12645336 12607916 12600379 12383813 12097873 11818759 11641285
3504 11641285 11743143 11803602 11836365 11744069 11584827 11321899 10899030 10346276 9774687 9376190
3494 9376190 9010258 8868755 8736064 8586779 8538623 8599361 8707535 8897186 9117263 9413009
3484 9413009 9683561 10000177 10486147 11081307 11840529 12561105 13171990 13485355 13480256 13029527
3474 13029527 12215799 11632500 11244772 11074463 11185014 11514005 12083814 12832100 13209341
3465 13209341 12629458 11599981 10811875 10251358 9861677 9672631 9656449 9819391 10046440
3456 10046440 10446208 10940403 11388284 11616813 11437774 11166014 10889379 10540662 10302865
$$ packed form
3523A8219427K68339K6045l98381r82033j202479r72276q12353o19238m82401
3514A3044650k98918r5214m9290M4108l7420p537k16566k85940k79114j77474
3504A1641285J01858O0459L2763r2296j59242k62928m22869n52754n71589l98497
3494I376190l65932j41503j32691j49285m8156O0738J08174J89651K20077K95746
3484I413009K70552L16616M85970N95160P59222P20576O10885L13365n099m50729
3474A3029527q13728n83299l87728j70309J10551L28991N69809P48286L77241
3465A3209341n79883j029477p88106n60517l89681j89046j6182J62942K27049
3456A0046440L99768M94195M47881K28529j79039k71760k76635l48717k37797
$$ plain form
3447 10302865 10279956 10568885 10987904 11325160 11489288 11243563 10565656 9825840 9273830 8796385
3437 8796385 8294946 7892180 7604909 7278369 7007584 6664054 6316044 6036991 5833745 5686244
3427 5686244 5608465 5500966 5430945 5358607 5252087 5164933 5026630 5023558 4939155 4934059 4932105
3416 4932105 4942604 4968397 4989443 4952504 4998866 5090402 5046471 5034137 4989722 5069067 5124161
3405 5124161 5065149 5064040 4908777 4834384 4808914 4761206 4803881 4778261 4693213 4591742 4538935
3394 4538935 4447683 4348674 4349832 4293361 4252701 4188693 4168705 4281866 4327970 4316789 4246312
3383 4246312 4322229 4450861 4538139 4593349 4645543 4872180 5039685 5079047 5215401 5271388 5502449
3372 5502449 5616247 5728034 6050946 6298100 6507768 6684556 6901790 6887264 6891163 6948470
$$ packed form
3447A0302865k2909K88929M19019L37256J64128k45725o77907p39816n52010m77445
3437H796385n01439m02766k87271l26540k70785l43530l48010k79053k03246j47501
3427E686244p7779j07499p0021p2338j06520q7154j38303l072q4403n096j954
3416D932105J0499K5793K1046l6939M6362R1536m3931j2334m4415P9345N5094
3405E124161n9012j109j55263p4393k5470m7708M2675k5620q5048j01471n2807
3394D538935r1252r9009J158n6471m0660o4008j9988J13161M6104j1181p0477
3383D246312P5917J28632Q7278N5210N2194K26637J67505L9362J36354N5987K31061
3372E502449J13798J11787L22912K47154K09668J76788K17234j4526L899N7307
$$ plain form
3362 6948470 6910138 7000716 7026112 7031264 7045552 7078220 7113443 7090373 7140680 7144627 7189333 7169005
3350 7169005 7243027 7356247 7328502 7517004 7674476 7669984 7749726 7631379 7503709 7251210
3340 7251210 7011124 6716072 6401603 6259331 5989496 5745574 5480397 5112569 4899391 4726108
3330 4726108 4717711 4481132 4291850 4201957 4073761 4053305 3997462 4090431 4056624 4038657 4137375
3319 4137375 4150064 4198910 4131017 4100945 4224379 4184873 4123672 4117093 4183878 4293164 4332324
3308 4332324 4441309 4544486 4695028 4832401 4828211 4836051 4871265 5008293 5074118 5182648 5383313
3297 5383313 5572397 5706084 5955616 6212495 6302719 6299649 6338584 6328653 6298073 6246131 6224337
3286 6224337 6223229 6279763 6323824 6375242 6332197 6347761 6362294 6452078 6505185 6616590 6760479
$$ packed form
3362F948470l8332R0578K5396N152J4288L2668L5223k3070N0307L947M4706k0328
3350G169005P4022J13220k7745J88502J57472m492P9742j18347j27670k52499
3340G251210k40086k95052l14469j42272k69835k43922k65177l67828k13178j73283
3330D726108q397k36579j89282q9893j28196k0456n5843R2969l3807j7967R8718
3319D137375J2689M8846o7893l0072J23434l9506o1201o579O6785J09286L9160
3308D332324J08985J03177J50542J37373m190P840L5214J37028O5825J08530K00665
3297E383313J89084J33687K49532K56879R0224l070L8935r931l0580n1942k1794
3286F224337j108N6534M4061N1418m3045J5564J4533Q9784N3107J11405J43889
$$ plain form
3275 6760479 6913007 7169426 7353935 7547102 7633652 7689939 7608388 7655811 7653181 7596717 7559573
3264 7559573 7571267 7573234 7503775 7482905 7420840 7389861 7330430 7161055 7007895 6956984 6910571
3253 6910571 6918803 6863496 6833439 6876381 6895411 6871842 6673304 6554363 6434432 6433027 6545405
3242 6545405 6636598 6660168 6704077 6797437 6830914 6991416 7162186 7344304 7549371 7837269
3232 7837269 8075917 8457789 8841083 9262528 9471988 9408431 9265772 9075732 8889970 8817556
3222 8817556 8870458 9040955 9175902 9350031 9537081 9782100 9952648 10157908 10365859 10566563
3212 10566563 10844352 11209918 11618714 11975145 12176532 12349131 12769348 13129634 13500850
3203 13500850 13961414 14473826 15037306 15530698 15936801 16218527 16364537 16439123 16477922 16687946
$$ packed form
3275F760479J52528K56419J84509J93167Q6550N6287q1551M7423k630n6464l7144
3264G559573J1694J967o9459k0870o2065l0979n9431j69375j53160n0911m6413
3253F910571Q232n5307l0057M2942J9030k3569j98538j18941j19931j405J12378
3242F545405R1193K3570M3909R3360L3477J60502J70770J82118K05067K87898
3232G837269K38648L81872L83294M21445K09460o3557j42659j90040j85762p2414
3222H817556N2902J70497J34947J74129J87050K45019J70548K05260K07951K00704
3212A0566563K77789L65566M08796L56431K01387J72599M20217L60286L71216
3203A3500850M60564N12412N63480M93392M06103K81726J46010P4586L8799K10024
$$ plain form
3193 16687946 16831384 17073532 17307756 17654351 18115483 18629346 19164797 19590782 19823696
3184 19823696 19867247 19967068 20323690 20693372 21157099 21725955 22372007 23036564 23595136 24012675
3174 24012675 24364082 24758943 25438957 26283593 27267074 28339474 29621822 31139289 32956996
3165 32956996 35014150 37075485 39340592 41650394 44206033 47128124 50502365 54260933
3157 54260933 58266889 61612762 63497828 64814981 66753214 68802815 70149949 70843686
3149 70843686 71953040 73977594 76837114 80819984 85947350 92424445 100338835 109909609
3141 109909609 121339269 134884532 150985625 170155483 193318449 221876924 255681997
3134 255681997 290991314 314316790 318290380 303523651 279756146 258379136 239186752
$$ packed form
3193A6687946J43438K42148K34224L46595M61132N13863N35451M25985K32914
3184A9823696M3551R9821L56622L69682M63727N68856O46052O64557N58572M17539
3174B4012675L51407L94861O80014Q44636R83481J072400J282348J517467J817707
3165C2956996K057154K061335K265107K309802K555639K922091L374241L758568
3157E4260933M005956L345873J885066J317153J938233K049601J347134O93737
3149G0843686J109354K024554K859520L982870N127366O477095P914390R570774
3141A09909609J1429660J3545263J6101093J9169858K3162966K8558475L3805073
3134B55681997L5309317K3325476L973590j4766729k3767505k1377010j9192384
$$ plain form
3127 239186752 218867433 196138598 173929650 155234793 140656097 129529590 121331684
3120 121331684 115425935 111300361 107424646 102349604 95207474 86751037 78358565 71095840
3112 71095840 64957239 59791525 55394779 51619349 48470784 45758581 43319873 41231122
3104 41231122 39318599 37579693 35892613 34457770 33173830 32134959 31213136 30203150
3096 30203150 29274376 28444529 27671036 26989503 26239890 25504590 24639037 23818849 23013594
3087 23013594 22237760 21486146 20803883 20218396 19723286 19159675 18709199 18293486 17941632
3078 17941632 17537548 17191916 16886598 16547837 16285312 15976949 15770503 15558558 15233719
3069 15233719 15173486 14999676 14924258 14908046 14895960 14938432 14898055 15037150 15230231 15450160
$$ packed form
3127B39186752k0319319k2728835k2208948j8694857j4578696j1126507q197906
3120A21331684n905749m125574l875715n075042p142130q456437q392472p262725
3112G1095840o138601n165714m396746l775430l148565k712203k438708k088751
3104D1231122j912523j738906j687080j434843j283940j038871r21823j009986
3096C0203150r28774q29847p73493o81533p49613p35300q65553q20188q05255
3087B3013594p75834p51614o82263n85487m95110n63611m50476m15713l51854
3078A7941632m04084l45632l05318l38761k62525l08363k06446k11945l24839
3069A5233719o0233j73810p5418j6212j2086M2472m0377J39095J93081K19929
$$ plain form
3059 15450160 15759690 16187378 16646916 17119616 17363679 17329293 17034330 16808062 16724660 16755243
3049 16755243 16830182 16920477 17044709 17344073 17752868 18305673 18912783 19719869 20631892 21634297
3039 21634297 22735649 24094731 25815546 27869731 30317052 33246014 36887349 41358597
3031 41358597 46816683 52842849 57865223 58673055 53916186 46504252 39550804 34034768
3023 34034768 29813385 26621472 24050101 21933030 19995605 18360585 17027556 15874916
3015 15874916 14804723 13991767 13242872 12501150 11833992 11194680 10658399 10158796 9685416
3006 9685416 9184239 8814870 8541597 8343098 8062285 7733756 7511302 7290201 7095441 6798958
2996 6798958 6628681 6506676 6333130 6221676 6001472 5809932 5590643 5394443 5209238 5048228
$$ packed form
3059A5450160L09530M27688M59538M72700K44063l4386k94963k26268q3402L0583
3049A6755243P4939R0295J24232K99364M08795N52805O07110Q07086R12023J002405
3039B1634297J101352J359082J720815K054185K447321K928962L641335M471248
3031D1358597N458086O026166N022374Q07832m756869p411934o953448n516036
3023C4034768m221383l191913k571371k117071j937425j635020j333029j152640
3015A5874916j070193q12956p48895p41722o67158o39312n36281m99603m73380
3006I685416n01177l69369k73273j98499k80813l28529k22454k21101j94760k96483
2996F798958j70277j22005j73546j11454k20204j91540k19289j96200j85205j61010
$$ plain form
2986 5048228 4962554 4825628 4724632 4574745 4459907 4401560 4344260 4212552 4098444 3971520
2976 3971520 3877876 3835990 3723301 3637105 3611823 3624575 3612381 3534138 3454557 3292415 3168620
2965 3168620 3142801 3185025 3113534 3032441 2884356 2760128 2735762 2755424 2675700 2595253 2606777
2954 2606777 2568053 2479759 2494650 2516062 2487726 2471961 2451416 2475114 2446431 2450221 2371348 2413160
2942 2413160 2492295 2460382 2386149 2380921 2395925 2363190 2408096 2435008 2378138 2376783 2419001 2406985
2930 2406985 2380254 2440716 2517130 2524377 2605015 2641726 2554404 2529288 2446308 2495642 2423525 2385893
2918 2385893 2297895 2259566 2282446 2239380 2210000 2183592 2162313 2085656 2045679 2027651 1906051
2907 1906051 1940227 1951622 1942931 1968896 1890616 1872235 1899892 1916503 1875768 1911488 1923827 1838475
$$ packed form
2986E048228q5674j36926j00996j49887j14838n8347n7300j31708j14108j26924
2976C971520r3644m1886j12689q6196k5282J2752j2194p8243p9581j62142j23795
2965C168620k5819M2224p1491q1093j48085j24228k4366J9662p9724q0447J1524
2954B606777l8724q8294J4891K1412k8336j5765k0545K3698k8683L790p8873M1812
2942B413160P9135l1913p4233n228J5004l2735M4906K6912n6870j355M2218j2016
2930B406985k6731O0462P6414P247Q0638L6711q7322k5116q2980M9334p2117l7632
2918B385893q7998l8329K2880m3066k9380k6408k1279p6657l9977j8028j21600
2907A906051L4176J1395q691K5965p8280j8381K7657J6611m0735L5720J2339q5352
$$ plain form
2895 1838475 1913082 1946661 1988580 2122118 2137061 2211593 2186536 2114126 2045947 1865632 1802568
2884 1802568 1747067 1675639 1737597 1663181 1701930 1719170 1658304 1655981 1595287 1621459 1602065 1651833
2872 1651833 1626021 1602461 1712349 1753981 1900556 1922960 1814479 1857057 1896904 1878403 1841527
2861 1841527 1805464 1811646 1887244 1946213 1967196 2041756 2034594 2097027 2302858 2476184 2656973
2850 2656973 2875506 3194995 3511119 3927736 4478761 5143704 5713908 5420292 4602488 3905543
2840 3905543 3463606 3161817 2972905 2840059 2725206 2695931 2639693 2615961 2608106 2626756 2666677
2829 2666677 2685725 2725801 2790873 2952970 3031176 3119881 3196839 3057545 2876538 2774754 2670308
2818 2670308 2537014 2459285 2348735 2241984 2205673 2138801 2023007 2004848 1983386 1937990 1926692
$$ packed form
2895A838475P4607L3579M1919J33538J4943P4532k5057p2410o8179j80315o3064
2884A802568n5501p1428O1958p4416L8749J7240o0866k323o0694K6172j9394M9768
2872A651833k5812k3560J09888M1632J46575K2404j08481M2578L9847j8501l6876
2861A841527l6063O182P5598N8969K0983P4560p162O2433K05831J73326J80789
2850B656973K18533L19489L16124M16617N51025O64943N70204k93616q17804o96945
2840C905543m41937l01789j88912j32846j14853k9275n6238k3732p855J8650L9921
2829B666677J9048M0076O5072J62097P8206Q8705P6958j39294j81007j01784j04446
2818B670308j33294p7729j10550j06751l6311o6872j15794j8159k1462m5396j1298
$$ plain form
2807 1926692 1811665 1798174 1820521 1867443 1936599 1997946 2141467 2303684 2540244 2808313
2797 2808313 3083742 3121769 2924682 2606050 2254554 1944321 1672034 1569261 1494647 1353652
2787 1353652 1229110 1130416 1119891 1065313 982833 1014427 998168 817992 721544 668722 601561
2776 601561 634451 617615 499548 496542 509175 518949 578252 500348 572218 593961 591487 571361
2764 571361 558406 505095 466778 541998 534584 554817 468778 406709 420219 362294 355128 294796
2752 294796 283022 317147 242408 294984 284057 265241 293517 403672 499448 482316 493710
2741 493710 598930 687687 707404 666388 623148 602559 568010 612654 645854 725607 642065
2730 642065 615887 584527 650682 733803 729828 703339 712288 796548 858216 913597 972504 929628
$$ packed form
2807A926692j15027j3491K2347M6922O9156O1347J43521J62217K36560K68069
2797B808313K75429L8027j97087l18632l51496l10233k72287j02773p4614j40995
2787A353652j24542r8694j0525n4578q2480L1594j6259j80176r6448n2822o7161
2776F01561L2890j6836j18067l006J2633R774N9303p7904P1870K1743k474k0126
2764E71361j2955n3311l8317P5220p414K0233q6039o2069J3510n7925p166o0332
2752B94796j1774L4125p4739N2576j0927j8816K8276J10155R5776j7132J1394
2741D93710J05220Q8757J9717m1016m3240k0589l4549M4644L3200P9753q3542
2730F42065k6178l1360O6155Q3121l975k6489Q949Q4260O1668N5381N8907m2876
$$ plain form
2718 929628 875132 851565 783009 816824 722475 727294 681213 602530 633106 550338 440778 417784
2706 417784 421857 392873 346049 312997 297570 300439 298288 319643 280810 207287 141916 176934
2694 176934 219678 222651 271473 273415 227645 303690 348053 424760 380724 292978 378172 333297
2682 333297 341679 300130 258617 281053 249409 200807 143710 181019 198115 217553 267224 254996
2670 254996 257737 234795 301222 310151 233360 186868 184402 289862 348701 310254 244830 182614
2658 182614 211047 149645 125160 145222 6206 20845 67973 55445 64917 44961 112092 84779
2646 84779 98234 143648 171688 131073 92356 104109 134632 182276 217106 195184 136323 148829
2634 148829 148090 160676 157479 210956 187753 130951 137142 138297 161276 164450 133753 158316 159814
$$ packed form
2718I29628n4496k3567o8556L3815r4349M819m6081p8683L0576q2768j09560k2994
2706D17784M073k8984m6824l3052j5427K869k151K1355l8833p3523o5371L5018
2694A76934M2744K973M8822J942m5770P6045M4363P6707m4036q7746Q5194m4875
2682C33297Q382m1549m1513K2436l1644m8602n7097L7309J7096J9438M9671j2228
2670B54996K741k2942O6427Q929p6791m6492k466J05460N8839l8447o5424o2216
2658A82614K8433o1402k4485K0062j39016J4639M7128j2528R472j9956O7131k7313
2646H4779J3455M5414K8040m0615l8717J1753L0523M7644L4830k1922n8861J2506
2634A48829p39J2586l197N3477k3203n6802O191J155K2979L174l0697K4563J498
$$ plain form
2621 159814 167591 92977 84881 104828 100918 130110 105180 69499 105327 148496 146315 129706
2609 129706 62508 30296 -5711 2896 -33448 -90618 6412 -71446 -150306 -128087 -86869 -101660
2597 -101660 -104440 -135186 -69967 -113426 -207883 -158862 -153457 -118316 -103600 -139294 -146717 -201830
2585 -201830 -235422 -170534 -73818 -55073 -116350 -117558 -149262 -104810 -89223 -42074 29062 17318
2573 17318 17457 -21876 -62941 -20464 -51541 -96192 60525 76423 2734 -55712 -16734 19122
2561 19122 76656 81630 29343 41308 114111 52045 7877 114179 71495 6777 20439 105776
2549 105776 86101 54553 -25582 49280 65991 107942 38317 112593 127788 118726 120109 109453
2537 109453 132083 124610 61342 71897 87871 125248 99461 -9884 67070 61917 62166 56835
$$ packed form
2621A59814P777p4614q096J9947l910K9192k4930l5681L5828M3169k181j6609
2609A29706o7198l2212l6007Q607l6344n7170R7030p7858p8860K2219M1218j4791
2597a01660k780l0746O5219m3459r4457M9021N405L5141J4716l5694p423n5113
2585b01830l3592O4888R6716J8745o1277j208l1704M4452J5587M7149P1136j1744
2573A7318J39l9333m1065M2477l1077m4651J56717J5898p3689n8446L8978L5856
2561A9122N7534M974n2287J1965P2803o2066m4168J06302m2684o4718J3662Q5337
2549A05776j9675l1548q0135P4862J6711M1951o9625P4276J5195r062J383j0656
2537A09453K2630p473o3268J0555J5974L7377k5787j09345P6954n153K49n331
$$ plain form
2525 56835 107573 186485 228178 221970 211237 112076 136477 85053 74130 132228 119674 135108
2513 135108 46182 73773 83127 107741 82071 22385 52082 78981 92406 75237 46870 40070
2501 40070 -34420 13347 10090 -84645 -34461 -30507 8198 -39281 -39951 -40720 -51902 20624 25581
2488 25581 74647 102659 32706 -39113 -44739 29385 58170 90826 109433 33422 22133 12823
2476 12823 21227 -60312 -10054 27364 -46936 32250 41821 24239 33991 -2052 103258 135226
2464 135226 85428 -21077 -12225 87820 38850 79572 17131 70354 67669 107839 124342 126826
2452 126826 129930 51564 51913 79150 32323 56299 17713 70720 121326 179817 130026 100036
2440 100036 180026 197054 205295 71689 97554 80877 108210 85936 47085 31127 18654 32562
$$ packed form
2525E6835N0738P8912M1693o208j0733r9161K4401n1424j0923N8098j2554J5434
2513A35108q8926K7591R354K4614k5670n9686K9697K6899J3425j7169k8367o800
2501D0070p4490M7767l257r4735N0184L954L8705m7479o70p69j1182P2526M957
2488B5581M9066K8012o9953p1819n626P4124K8785L2656J8607p6011j1289r310
2476A2823Q404q1539N0258L7418p4300P9186R571j7582R752l6043J05310L1968
2464A35226m9798j06505Q852J00045m8970M0722o2441N3223k685M0170J6503K484
2452A26826L104p8366L49K7237m6827K3976l8586N3007N0606N8491m9791k9990
2440A00036P9990J7028Q241j33606K5865j6677K7333k2274l8851j5958j2473J3908
$$ plain form
2428 32562 27092 49488 82793 74789 76855 167938 73594 8913 -52864 -3728 16414 51670
2416 51670 26619 -60842 69671 86289 18253 -7179 -44648 -68080 -27952 -17260 -88517 -166471
2404 -166471 -166214 -144302 -90203 -132222 -163063 -87665 -72403 -120961 -146186 -183458 -164133 -82018
2392 -82018 -118014 -105042 -7048 21962 -50717 -48836 51937 973 -32120 -30989 -19374 -47704
2380 -47704 -61824 -18093 -3926 2254 10486 -46510 -20646 28469 -424 34528 67236 79984
2368 79984 101054 135046 129034 106775 64933 57873 116072 165285 133153 155430 173151 212156
2356 212156 124703 138210 145492 107591 152503 117369 128831 95410 81004 58946 114743 174234
2344 174234 95704 103621 49539 48102 77858 89779 122892 80899 158271 231467 168498 158555
$$ packed form
2428C2562n470K2396L3305q004K066R1083r4344o4681o1777M9136K0142L5256
2416E1670k5051q7461J30513J6618o8036k5432l7469k3432M0128J0692p1257p7954
2404a66471K57K1912N4099m2019l0841P5398J5262m8558k5225l7272J9325Q2115
2392h2018l5996J2972R7994K9010p2679J881J00773n0964l3093J131J1615k8330
2380d7704j4120M3731J4167O180Q232n6996K5864M9115k8893L4952L2708J2748
2368G9984K1070L3992o012k2259m1842p060N8199M9213l2132K2277J7721L9005
2356B12156q7453J3507P282l7901M4912l5134J1462l3421j4406k2058N5797N9491
2344A74234p8530P917n4082j437K9756J1921L3113m1993P7372P3196o2969r943
$$ plain form
2332 158555 198942 211763 257028 298237 294129 239349 321838 353318 370321 362370 261305 227374
2320 227374 260947 210544 188450 135373 187470 165850 208151 201938 183862 125379 46668 32763
2308 32763 -5806 -2978 4474 51290 125439 112066 71388 107079 159681 126156 156019 99843
2296 99843 189699 261419 235569 220288 207942 323737 360053 406949 399500 338456 253868 272495
2284 272495 287860 157065 222627 326871 354690 439078 423432 428403 356416 292603 334055
2273 334055 404728 355859 314599 234730 171995 233841 312740 349005 336805 337509 333653 441864
2261 441864 412710 340453 398123 456025 497556 560081 559228 426958 431852 391739 307834 307322
2249 307322 280719 324634 461875 394404 363246 344242 407228 464984 510389 507343 458586 483724
$$ packed form
2332A58555M0387J2821M5265M1209m108n4780Q2489L1480J7003p951j01065l3931
2320B27374L3573n0403k2094n3077N2097k1620M2301o213j8076n8483p8711j3905
2308C2763l8569K828P452M6816P4149j3373m0678L5691N2602l3525K9863n6176
2296I9843Q9856P1720k5850j5281j2346J15795L6316M6896p449o1044q4588J8627
2284B72495J5365j30795O5562J04244K7819Q4388j5646M971p1987o3813M1452
2273C34055P0673m8869m1260p9869o2735O1846P8899L6265j2200P04l856J08211
2261D41864k9154p2257N7670N7902M1531O2525q53j32270M894m0113q3905n12
2249C07322k6603M3915J37241o7471l1158j9004O2986N7756M5405l046m8757K5138
$$ plain form
2237 483724 514017 542306 469734 444756 543613 499739 534408 571679 569292 537455 654196 619007
2225 619007 666764 811660 914353 998922 962694 906880 838306 686801 651546 595961 605221
2214 605221 602613 611295 671217 644571 713220 685040 701879 655952 629770 617011 605102 629148
2202 629148 594351 704456 765742 767077 728649 744616 845149 946037 882834 910769 1024773
2191 1024773 1128365 1295753 1303074 1348394 1358705 1342762 1254714 1309952 1256057 1196898 1161949
2180 1161949 1144525 1071730 1150591 1275579 1310698 1362857 1393082 1422041 1560574 1658523 1706052
2169 1706052 1775884 1860489 1859631 1795665 1681604 1585479 1443401 1358258 1255023 1244865 1151969
2158 1151969 1094740 1070761 1071448 1079303 995830 956236 896298 934897 914075 777894 677575 724029
$$ packed form
2237D83724L0293K8289p2572k4978R8857m3874L4669L7271k387l1837J16741l5189
2225F19007M7757J44896J02693Q4569l6228n5814o8574j51505l5255n5585R260
2214F05221k608Q682N9922k6646O8649k8180J6839m5927k6182j2759j1909K4046
2202F29148l4797J10105O1286J335l8428J5967J00533J00888o3203K7935J14004
2191A024773J03592J67388P321M5320J0311j5943q8048N5238n3895n9159l4949
2180A161949j7424p2795P8861J24988L5119N2159L0225K8959J38533R7949M7529
2169A706052O9832Q4605q58o3966j14061r6125j42078q5143j03235j0158r2896
2158A151969n7229k3979O87P855q3473l9594n9938L8599k0822j36181j00319M6454
$$ plain form
2146 724029 695128 659261 666597 638187 618851 605536 575833 556537 537115 564627 637113 687888
2134 687888 779274 844474 908151 884043 873981 833591 692433 584878 514155 505989 512014 513717
2122 513717 574342 556040 574530 513765 452381 482756 433653 409583 442204 475582 441160 432682
2110 432682 379237 357366 431993 410519 392181 380251 410643 527179 505511 598776 634305
2099 634305 766846 895573 890385 892219 774853 644062 504077 469595 435661 307548 322284
2088 322284 404999 444362 357610 317513 332686 344286 322696 357663 315818 285813 299624 338740
2076 338740 267342 220154 275391 255475 283406 247448 260657 304425 294135 363964 415209 483474
2064 483474 445531 548294 501609 439617 321741 277710 306147 217231 253914 150283 96238
$$ packed form
2146G24029k8901l5867P336k8410j9336j3315k9703j9296j9422K7512P2486N0775
2134F87888R1386O5200O3677k4108j0062m0390j41158j07555p0723q166O025J703
2122E13717O0625j8302J8490o0765o1384L0375m9103k4070L2621L3378l4422q478
2110D32682n3445k1871P4627k1474j8338j1930L0392J16536k1668R3265L5529
2099F34305J32541J28727n188J834j17366j30791j39985l4482l3934j28113J4736
2088C22284Q2715L9363q6752m0097J5173J1600k1590L4967m1845l0005J3811L9116
2076C38740p1398m7188N5237j9916K7931l5958J3209M3768j0290O9829N1245O8265
2064D83474l7943J02763m6685o1992j17876m4031K8437q8916L6683j03631n4045
$$ plain form
2053 96238 173020 177218 101805 129284 188016 212614 143014 71798 5784 61781 156735 197563
2041 197563 108858 99249 67950 67544 118982 37132 37137 54505 -5840 64936 53522 74155 167478
2028 167478 116227 85422 34701 -19758 -43640 21083 40011 24097 8940 -20197 -28605 4539
2016 4539 -69529 7608 53383 45913 78101 34399 62447 27242 51691 26099 56497 73958
2004 73958 86620 56297 -29342 -64819 -86123 -28487 83223 69831 102157 74263 42696 33464
1992 33464 28265 81031 48939 66801 75189 117319 57316 106 -21462 -75040 -70614 -90239
1980 -90239 -105576 -137068 -132667 -56463 -99324 -91307 -36975 -47028 -22207 -35734 -79551 -174218
1968 -174218 -220019 -167569 -106776 -64457 -15450 -35064 -100960 -40202 -109820 -97438 -12571 -63505
$$ packed form
2053I6238P6782M198p5413K7479N8732K4598o9600p1216o6014N5997R4954M0828
2041A97563q8705r609l1299m06N1438q1850NJ7368o0345P0776j1414K0633R3323
2028A67478n1251l0805n0721n4459k3882O4723J8928j5914j5157k9137q408L3144
2016D539p4068P7137M5775p470L2188m3702K8048l5205K4449k5592L0398J7461
2004G3958J2662l0323q5639l5477k1304N7636J11710j3392L2326k7894l1567r232
1992C3464n199N2766l2092J7862Q388M2130o0003n7210k1568n3578M426j9625
1980i0239j5337l1492M401P6204m2861Q017N4332j0053K4821j3527m3817r4667
1968a74218m5801N2450O0793M2319M9007j9614o5896O0758o9618J2382Q4867n0934
$$ plain form
1956 -63505 -34042 -11313 26685 46801 -49115 -40579 7841 15449 -25151 -77694 -57511 -33342
1944 -33342 -67240 -163353 -92385 -62484 -8944 70646 32362 62487 27467 -95846 -15191 22177
1932 22177 -51609 -46393 -13394 -53285 -50726 -38617 -102452 -42074 -54380 -23475 -49962 -91112
1920 -91112 20915 -30514 -39079 -38250 -17147 -34050 -130853 -169531 -152950 -81736 -29121 25281
1908 25281 39952 -40115 -9166 -63272 -121611 -14422 -83758 -78691 -9228 34028 110572 24563
1896 24563 27959 -1809 1239 11423 22474 34764 -34098 -18218 6581 57494 39688 -22760
1884 -22760 35503 62412 71429 93385 22959 38404 40031 63931 53346 73053 60346 -7054
1872 -7054 -13199 -8873 -1129 -49694 -43662 72834 84325 34680 34870 67984 75105 83966 115795
$$ packed form
1956f3505K9463K2729L7998K0116r5916Q536M8420P608m0600n2543K0183K4169
1944c3342l3898r6113P0968K9901N3540P9590l8284L0125l5020j23313Q0655L7368
1932B2177p3786N216L2999l9891K559J2109o3835O0378j2306L0905k6487m1150
1920i1112J12027n1429q565Q29K1103j6903r6803l8678J6581P1214N2615N4402
1908B5281J4671q0067L0949n4106n8339J07189o9336N067O9463M3256P6544q6009
1896B4563L396k9768L048J0184J1051J2290o8862J5880K4799N0913j7806o2448
1884b2760N8263K6909R017K1956p0426J5445J627K3900j0585J9707j2707o7400
1872g054o145M326P744m8565O032J16496J1491m9645J90L3114P121Q861L1829
$$ plain form
1859 115795 102941 66509 -5474 -30801 48191 158413 135577 27346 28523 86226 136357
1848 136357 61400 -819 -16999 31309 80387 121605 155274 151118 75696 63874 86457 20280
1836 20280 78034 80141 107555 181867 122865 116732 120678 168249 174362 229135 156396 117076 79691
1823 79691 -501 35572 110926 170235 129259 145082 142498 157011 142483 167054 184482 156703
1811 156703 239418 240940 220610 208743 144338 159811 180042 239652 235989 197115 146808 169439
1799 169439 224983 186013 180772 171538 192693 197371 106654 32370 6928 41536 82310 59125
1787 59125 80363 63142 68800 134282 222848 242628 200057 223650 102329 162795 236453 263165
1775 263165 252616 107922 123482 120978 181113 211214 123136 99191 -7289 1062 41760 46045
$$ packed form
1859A15795j2854l6432p1983k5327P8992J10222k2836j08231J177N7703N0131
1848A36357p4957o2219j6180M8308M9078M1218L3669m156p5422j1822K2583o6177
1836B0280N7754K107K7414P4312n9002o133L946M7571O113N4773p2739l9320l7385
1823G9691q0192L6073P5354N9309m0976J5823k584J4513j4528K4571J7428k7779
1811A56703Q2715J522k0330j1867o4405J5473K0231N9610l663l8874n0307K2631
1799A69439N5544l8970n241r234K1155M678r0717p4284k5442L4608M0774k3185
1787E9125K1238j7221N658O5482Q8566J9780m2571K3593j21321O0466P3658K6712
1775B63165j0549j44694J5560k504O0135L0101q8078k3945j06480Q351M0698M285
$$ plain form
1763 46045 67879 30728 89731 88070 3582 6687 -7080 18378 -21455 6566 92893 46623
1751 46623 49700 25275 -12683 -47370 -86105 -48589 -6574 24911 -78951 -64847 -49834 -94371
1739 -94371 8864 129663 20496 -45001 -28153 -108787 -108498 -60725 -3660 34087 30795 25494
1727 25494 61535 29055 -6089 -58810 -60822 -31706 -153741 -130745 -104240 -91103 -38494 -51304
1715 -51304 -36241 39732 -16613 -55228 9916 -14706 -47211 12833 66607 26817 66692 32659
1703 32659 -13250 -81391 -115073 -109267 -139274 -137938 -92646 -84591 -61697 -83551 -64606 -70541 -84588
1690 -84588 -35634 -83874 -93991 543 28840 43669 58260 49282 31148 63256 13683 -25834
1678 -25834 757 -43810 -11720 60848 89764 120993 125482 58715 -9153 36522 102072 75793
$$ packed form
1763D6045K1834l7151N9003j661q4488L105j3767K5458l9833K8021Q6327m6270
1751D6623L077k4425l7958l4687l8735L7516M2015L1485j03862J4104J5013m4537
1739i4371J03235J20799j09167o5497J6848q0634K89M7773N7065L7747l292n301
1727B5494L6041l2480l5144n2721k012K9116j22035K2996K6505J3137N2609j2810
1715e1304J5063P5973n6345l8615O5144k4622l2505O0044N3774l9790L9875l4033
1703C2659m5909o8141l3682N806l0007J336M5292Q055K2894k1854J8945n935j4047
1690h4588M8954m8240j0117R4534K8297J4829J4591q978j8134L2108m9573l9517
1678b5834K6591m4567L2090P2568K8916L1229M489o6767o7868M5675O5550k6279
$$ plain form
1666 75793 80154 21504 27764 37092 18964 713 -103798 -17983 -43595 -53194 -85594 -89574 -40525
1653 -40525 -73638 -57647 -35258 26551 -2082 -62471 -12312 -72050 -34941 -68085 -87490 39558
1641 39558 41055 27301 -89940 -48550 23947 -38684 -55594 -88595 -106215 -77653 -59643 52023
1629 52023 -8448 22555 45295 35075 26299 -67622 -70059 -58292 -104038 -145972 -99151 36956
1617 36956 42905 19454 -1405 -66611 -38375 -24280 -40562 -52723 -7999 27194 -26393 -23601
1605 -23601 -70161 -86731 -44588 -50029 -44863 -101604 -83740 -64824 -32919 -5942 -2378 -4408 -27275
1592 -27275 -58225 -78558 -85389 -58744 -95814 -97753 -134309 -151633 -75261 -105376 -103894 -78659
1580 -78659 -1957 9097 -54238 -75792 -52435 -36885 -56014 -84164 -143910 -111875 -65242 -98056
$$ packed form
1666G5793M361n8650O260R328j8128j8251j04511Q5815k5612r599l2400l980M9049
1653d0525l3113J5991K2389O1809k8633o0389N0159n9738L7109l3144j9405J27048
1641C9558J497j3754j17241M1390P2497o2631j6910l3001j7620K8562J8010J11666
1629E2023o0471L1003K2740j0220q776r3921k437J1767m5746m1934M6821J36107
1617C6956N949k3451k0859o5206K8236J4095j6282j2161M4724L5193n3587K792
1605b3601m6560j6570M2143n441N166n6741J7864J8916L1905K6977L564k030k2867
1592b7275l0950k0333o831K6645l7070j939l6556j7324P6372l0115J482K5235
1580g8659P6702J1054o3335k1554K3357J5550j9129k8150n9746L2035M6633l2814
$$ plain form
1568 -98056 -132517 -87840 -112817 -52915 -15359 -5543 62568 6934 -45116 -31582 -15348 -56569
1556 -56569 -68532 -127143 -23804 -36310 -139632 -219512 -163533 -133169 -60867 -92269 -137990
1545 -137990 -100142 -118841 -137611 -137107 -24888 -24576 -28349 -119290 -74093 -82686 -36269 -96774 -79274
1532 -79274 -98539 -124072 -119681 -98537 -129313 -160978 -56365 -72498 2544 19844 29545 -13754
1520 -13754 -157811 -157739 -156599 -133414 -48134 -24310 -93866 -137827 -120005 -113558 -65035 -81218 -21266
1507 -21266 25784 -50522 -43901 45064 31132 10856 76272 38066 17049 -9835 -40139 -87360
1495 -87360 -96712 -50219 -44467 58418 -43428 -51697 -91376 -79090 -64379 -93641 -41072 -94302
1483 -94302 -26658 12365 19731 35091 -51454 -76892 -60960 -24734 -63570 -71838 -28963 28046
$$ packed form
1568i8056l4461M4677k4977N9902L7556R816O8111n5634n2050J3534J6234m1221
1556e6569j1963n8611J03339j2506j03322p9880N5979L0364P2302l1402m5721
1545a37990L7848j8699j8770N04J12219L12l773r0941M5197q593M6417o0505J7500
1532g9274j9265k5533M391K1144l0776l1665J04613j6133P5042J7300R701m3299
1520a3754j44057P2J140K3185Q5280K3824o9556m3961J7822O447M8523j6183N9952
1507b1266M7050p6306O621Q8965j3932k0276O5416l8206k1017k6884l0304m7221
1495h7360r352M6493N752J02885j01846q269l9679J2286J4711k9262N2569n3230
1483i4302O7644L9023P366J5360q6545k5438J5932L6226l8836q268M2875N7009
$$ plain form
1471 28046 24186 73366 163790 110796 28580 52422 -29561 -62650 -55183 -84330 -35204 -68686
1459 -68686 2230 -80948 -131921 -85212 13135 28549 10933 61854 70222 52136 27798 24436
1447 24436 38932 40057 -24669 -60835 -46995 -106983 -88646 -65849 -39678 -61020 -37302 -13739
1435 -13739 703 -60902 -33794 20187 -40398 -44845 -77660 -62500 -119927 -129625 -103451 -62796
1423 -62796 -155217 -154724 -177799 -133787 -93071 -42840 -56403 -108653 -82297 -89186 -76393 -127077
1411 -127077 -123460 -124613 -141205 -48014 -85836 -154178 -122294 -131416 -82955 -66203 -49563 -96250
1399 -96250 -153542 -105801 -105168 -173354 -201905 -172639 -178806 -229074 -163061 -171018 -155552 -115152 -174748
1386 -174748 -118258 -208560 -268998 -233102 -166054 -99733 -129568 -151145 -203628 -152839 -142119 -186289
$$ packed form
1471B8046l860M9180R0424n2994q2216K3842q1983l3089P467k9147M9126l3482
1459f8686P0916q3178n0973M6709R8347J5414j7616N0921Q368j8086k4338l362
1447B4436J4496J125o4726l6166J3840n9988J8337K2797K6171k1342K3718K3563
1435a3739J4442o1605K7108N3981o0585m447l2815J5160n7427r698K6174M0655
1423f2796r2421M93k3075M4012M0716N0231j3563n2250K6356o889J2793n0684
1411a27077L617j153j6592R3191l7822o8342L1884r122M8461J6752J6640m6687
1399i6250n7292M7741O33o8186k8551K9266o167n0268O6013p957J5466M0400n9596
1386a74748N6490r0302o0438L5896O7048O6321k9835k1577n2483N0789J0720m4170
$$ plain form
1374 -186289 -168986 -113134 -86868 -58157 -111824 -189732 -164808 -144080 -128876 -48491 17804 29289
1362 29289 -15739 -15532 7647 -67363 -89271 -47686 -93457 -80857 -87303 -139534 -193826 -207719
1350 -207719 -140333 -176821 -216802 -131751 -92596 -120160 -161285 -141576 -186993 -75606 -58942
1339 -58942 -151369 -132482 -151752 -205016 -201930 -128836 302 -13119 -49168 -69594 -29940 -47442
1327 -47442 -79216 -117220 -177551 -83337 -84271 -95425 -69786 -34795 -81955 -80306 56224 61141
1315 61141 37134 3639 -53106 16394 16038 -33499 -8022 72299 59499 43404 8461 -59505
1303 -59505 -65315 -38742 -28708 45510 24907 -52102 -82648 -88139 -88059 -83659 -90497 -71112 -87548
1290 -87548 53973 51184 54960 59582 28570 55862 10553 -30140 -93780 -137347 -101808 -37058
$$ packed form
1374a86289J7303N5852K6266K8711n3667p7908K4924K0728J5204Q0385O6295J1485
1362B9289m5028K07K3179p5010k1908M1585m5771J2600o446n2231n4292j3893
1350b07719O7386l6488l9981Q5051L9155k7564m1125J9709m5417J11387J6664
1339e8942r2427J8887j9270n3264L086P3094J29138j3421l6049k0426L9654j7502
1327d7442l1774l8004o0331R4214r34j1154K5639L4991m7160J649J36530M917
1315F1141k4007l3495n6745O9500l56m9537K5477Q0321j2800j6095l4943o7966
1303e9505n810K6573J0034P4218k0603p7009l0546n491Q0M400o838J9385j6436
1290h7548J41521k789L776M622l1012K7292m5309m0693o3640m3567L5539O4750
$$ plain form
1278 -37058 254 11796 -14450 -74534 -29800 -37818 -33590 -34127 -112239 -56796 62264 47549
1266 47549 1410 25929 55571 103247 74961 85973 91247 34826 79877 96506 107335 65855
1254 65855 41413 75311 76443 118565 70579 -8359 34343 17927 15022 -66275 -29229 45571
1242 45571 -8840 36499 53915 125693 57074 5303 54057 74745 41757 32771 47167 10616
1230 10616 -31702 24104 1095 24854 9757 72464 70418 -55997 -48543 -68762 -4515 52251
1218 52251 48641 19858 9274 -14067 12676 48923 31697 3916 -28985 -12475 -23713 -2211
1206 -2211 -7638 37995 82594 149822 80858 63068 105988 32953 45048 109692 77575 54238
1194 54238 -44307 -79934 -88748 -57309 -57360 -17906 31653 13059 -2136 -18768 14469 8763 -29315
$$ packed form
1278c7058L7312J1542k6246o0084M4734q018M228n37p8112N5443J19060j4715
1266D7549m6139K4519K9642M7676k8286J1012N274n6421M5051J6629J0829m1480
1254F5855k4442L3898J132M2122m7986p8938M2702j6416k905q1297L7046P4800
1242D5571n4411M5339J7416P1778o8619n1771M8754K0688l2988q986J4396l6551
1230A0616m2318N5806k3009K3759j5097O2707k046j26415P454k0219O4247N6766
1218E2251l610k8783j0584k3341K6743L6247j7226k7781l2901J6510j1238K1502
1206b211n427M5633M4599O7228o8964j7790M2920p3035J2095O4644l2117k3337
1194E4238r8545l5627q814L1439n1L9454M9559j8594j5195j6632L3237n706l8078
$$ plain form
1181 -29315 -28623 -11194 -8213 32433 -17612 -3392 -39116 -11454 -2239 -45260 -82228 -47502 4855
1168 4855 -3190 -13009 -29000 28037 48676 45061 44963 -21328 -9964 59160 101629 80311 20625
1155 20625 2076 54069 33383 64654 43063 -21292 32221 42041 38683 6456 -27601 -16628
1143 -16628 -44809 -84920 -61664 -20976 -27724 -116845 -102016 -107875 -79360 -37397 15392 97824
1131 97824 99669 72965 80306 109279 86705 103934 99011 51386 46411 72126 104967 161862 71742
1118 71742 44815 9569 58830 110426 122871 142015 135019 178972 266498 183725 197428 244367
1106 244367 219926 138036 112301 145209 136057 199260 155071 130265 138032 207957 181380 177607
1094 177607 189040 221939 200192 216926 226931 234099 228580 155559 260287 242475 263360 227582
$$ packed form
1181b9315O92J7429K981M0646n0045J4220l5724K7662R215m3021l6968L4726N2357
1168D855q045r819j5991N7037K0639l615r8o6291J1364O9124M2469k1318n9686
1155B0625j8549N1993k0686L1271k1591o4355N3513R820l358l2227l4057J0973
1143a6628k8181m0111K3256M0688o748q9121J4829n859K8515M1963N2789Q2432
1131I7824J845k6704P341K8973k2574J7229m923m7625m975K5715L2841N6895r0120
1118G1742k6927l5246M9261N1596J2445J9144o996M3953Q7526q2773J3703M6939
1106B44367k4441q1890k5735L2908r152O3203m4189k4806P767O9925k6577l773
1094A77607J1433L2899k1747J6734J0005P168n519p3021J04728j7812K0885l5778
$$ plain form
1082 227582 175097 222739 193594 218387 221559 310739 302436 261436 290379 345508 279307 240783
1070 240783 230049 224717 254848 317345 280768 321854 376671 338735 367350 396305 348032 280467
1058 280467 297225 316246 320333 346541 376794 505799 448524 460095 501873 464613 461667 438195
1046 438195 451562 524792 525882 514354 550725 567123 525510 512090 452149 443335 512615 491784
1034 491784 518737 576431 532469 449165 544408 602286 612597 577117 611954 535101 533276 635303
1022 635303 708643 625948 690990 722770 706250 742944 736565 677667 763711 876171 921385 885789
1010 885789 840456 845191 923529 909193 949272 972902 959059 972906 986948 1096226 1196402
999 1196402 1158126 1161218 1152406 1132183 1163842 1231960 1276190 1376802 1464769 1520674 1582787 1684626
$$ packed form
1082B27582n2485M7642k9145K4793L172Q9180q303m1000K8943N5129o6201l8524
1070B40783j0734n332L0131O2497l6577M1086N4817l7936K8615K8955m8273o7565
1058B80467J6758J9021M087K6208L0253J29005n7275J1571M1778l7260k946k3472
1046D38195J3367P3230J090j1528L6371J6398m1613j3420n9941q814O9280k0831
1034D91784K6953N7694m3962q3304R5243N7878J0311l5480L4837p6853j825J02027
1022F35303P3340q2695O5042L1780j6520L6694o379n8898Q6044J12460M5214l5596
1010H85789m5333M735P8338j4336M0079K3630j3843J3847J4042J09278J00176
999A196402l8276L092q812k0223L1659O8118M4230J00612Q7967N5905O2113J01839
$$ plain form
987 1684626 1734629 1819905 1922233 2071141 2185279 2345453 2505414 2694649 2959366 3188019
977 3188019 3355828 3536902 3803245 4093298 4409970 4684498 5098173 5447260 5777944 6090716
967 6090716 6576869 7231310 7990129 9017969 10202667 11668756 13297955 15331120 17711773
958 17711773 20806795 24809942 30087018 34656146 32378295 25844993 20132374 16418169
950 16418169 13836648 11944578 10524135 9345804 8214991 7231267 6459651 5825213 5392967
941 5392967 5077358 4814815 4592046 4262061 3935119 3566704 3232122 2991525 2810616 2662518
931 2662518 2516086 2384897 2217424 2074308 1975240 1862443 1802150 1715551 1635499 1583058 1458882
920 1458882 1459390 1365771 1312044 1374757 1313683 1232123 1233383 1169652 1137618 1123127 1087381 989904
$$ packed form
987A684626N0003Q5276J02328J48908J14138J60174J59961J89235K64717K28653
977C188019J67809J81074K66343K90053L16672K74528M13675L49087L30684L12772
967F090716M86153O54441P58819J027840J184698J466089J629199K033165K380653
958A7711773L095022M003147N277076M569128k277851o533302n712619l714205
950A6418169k581521j892070j420443j178331j130813r83724p71616o34438m32246
941E392967l15609k62543k22769l29985l26942l68415l34582k40597j80909j48098
931B662518j46432j31189j67473j43116r9068j12797o0293q6599q0052n2441j24176
920A458882N08r3619n3727O2713o1074q1560J260o3731l2034j4491l5746r7477
$$ plain form
908 989904 958206 938097 934251 851201 875029 846199 874557 893209 882622 756626 766014 749110
896 749110 686174 653807 729670 721008 729810 769038 696119 622252 672037 709717 660896 681706
884 681706 681348 638336 596038 535915 506139 488026 462427 445120 528508 569336 510319 420733
872 420733 354373 310743 383781 478903 460304 440231 421185 398549 392666 398769 386752 291348
860 291348 347059 372206 360524 375244 393098 378955 348409 348618 376279 375059 423430 349245
848 349245 249017 285458 204833 250528 288002 276015 241769 199435 239755 263902 261452 300106
836 300106 263375 271494 236748 228823 167652 218258 229113 133954 202253 109691 68670 92796
824 92796 71919 124706 114264 147664 179080 194210 143482 116341 69800 57569 141112 158242
$$ packed form
908I89904l1698k0109l846q3050K3828k8830K8358J8652j0587j25996R388j6904
896G49110o2936l2367P5863q662Q802L9228p2919p3867M9785L7680m8821K0810
884F81706l58m3012m2298o0123k9776j8113k5599j7307Q3388M0828n9017q9586
872D20733o6360m3630P3038R5122j8599k0073j9046k2636n883O103j2017r5404
860B91348N5711K5147j1682J4720J7854j4143l0546K09K7661j220M8371p4185
848C49245j00228L6441q0625M5695L7474j1987l4246m2334M0320K4147k450L8654
836C00106l6731Q119l4746p925o1171N0606J0855r5159O8299r2562m1021K4126
824I2796k0877N2787j0442L3400L1416J5130n0728k7141m6541j2231Q3543J7130
$$ plain form
812 158242 85931 75633 10509 -4092 41104 15485 4690 -20058 88444 114407 110573 110088
800 110088 -2070 54799 82678 120639 78812 -31569 -19592 13863 10309 49585 -3455 -3085
788 -3085 -37198 1526 -3960 -26638 -31681 -89390 -74264 -65997 -5908 -18932 -73892 -120180 -108160
775 -108160 -55544 21647 -2892 -31449 -152871 -170420 -157479 -161649 -126637 -10033 -21275 -59852
763 -59852 -19964 -33164 60691 2515 -39440 -41633 -35591 -14633 -63016 -7801 37246 19325
751 19325 -9687 -100686 -57070 -12059 80440 139820 66992 37496 2371 -14911 -67222 -1311
739 -1311 -12506 -30508 -63906 -55998 -27109 -64505 -14616 66635 70495 119237 68684 -29807 -8020
726 -8020 20661 31586 50599 71528 39582 81617 23837 35572 76472 -18335 -57116 25950
$$ packed form
812A58242p2311j0298o5124j4601M5196k5619j0795k4748J08502K5963l834m85
800A10088j12158N6869K7879L7961m1827j10381J1977L3455l554L9276n3040L70
788c085l4113L8724n486k2678n043n7709J5126Q267O0089j3024n4960m6288J2020
775a08160N2616P7191k4539k8557j21422j7549J2941m170L5012J16604j1242l8577
763e9852L9888j3200R3855n8176m1955k193O042K0958m8383N5215M5047j7921
751A9325k9012r0999M3616M5011R2499N9380p2828k9496l5125j7282n2311O5911
739a311j1195j8002l3398P908K8889l7396M9889Q1251L860M8742n0553r8491K1787
726h020K8681J0925J9013K0929l1946M2035n7780J1735M0900r4807l8781Q3066
$$ plain form
714 25950 131596 168970 171947 171276 38744 64304 102892 61220 97183 90323 60373 65986 55530
701 55530 34529 54201 22976 26557 148076 183480 134458 73065 16794 86320 98725 102469
689 102469 121836 167702 133522 31499 10690 84888 115350 109545 93633 127897 109120 89459
677 89459 100952 72967 122389 86023 47356 57349 128091 152576 165929 174878 113130 45705
665 45705 49522 27438 35678 87195 91999 -5464 -51341 2046 9663 -30931 26318 65024 -6673
652 -6673 -24051 -46563 -69659 -32908 -20404 -42198 -25651 -25689 -56894 -92316 -58864 -88078 -53992
639 -53992 -32541 -121387 -86018 -92149 -79513 -27039 -39360 -54639 -95362 -788 -12912 -131409
627 -131409 -141425 -131842 -73595 -39615 6358 -73026 -97609 -106145 -162418 -226046 -172388 -96964
$$ packed form
714B5950J05646L7374K977o71j32532K5560L8588m1672L5963o860k9950N613j0456
701E5530k1001J9672l1225L581J21519L5404m9022o1393n6271O9526J2405L744
689A02469J9367M5866l4180j02023k0809P4198L0462n805j5912L4264j8777j9661
677H9459J1493k7985M9422l6366l8667R993P0742K4485J3353Q949o1748o7425
665D5705L817k2084Q240N1517M804r7463m5877N3387P617m0594N7249L8706p1697
652f673j7378k2512k3096L6751J2504k1794J6547l8l1205l5422L3452k9214L4086
639e3992K1451q8846L5369o131J2636N2474j2321j5279m0723R4574j2124j18497
627a31409j0016R583N8247L3980M5973p9384k4583q536n6273o3628N3658P5424
$$ plain form
615 -96964 -83823 -104900 -86977 -87235 -142617 -85745 -62487 19784 961 -60479 -136383 -130018 -127457
602 -127457 -141296 -120963 -121424 -163294 -259634 -217948 -91738 -88199 -58838 -73081 -60664 -26327
590 -26327 -32252 -147589 -156965 -104688 -88188 -105815 -48009 -108698 -161625 -182260 -191031 -190447 -204516
577 -204516 -162557 -143092 -155216 -102059 -125129 -155454 -90696 -103642 -88747 -4324 24597 -109158
565 -109158 -32850 -23060 -19108 -62818 -46222 -36681 24526 135414 13578 -76364 -40641 -20219
553 -20219 3673 41023 25954 22290 53484 -26546 -70167 -19417 60960 124957 72475 87036
541 87036 50933 17811 42698 13133 12804 31947 56023 -17951 16442 40643 -18176 36683
529 36683 4264 220 65930 79841 107626 57067 102146 164247 98690 165121 205209 213071
$$ packed form
615i6964J3141k1077J7923k58n5382N6872K3258Q2271j8823o1440p5904O365K561
602a27457j3839K0333m61m1870r6340M1686J26210L539K9361j4243J2417L4337
590b6327n925j15337r376N2277J6500j7627N7806o0689n2927k0635q771N84j4069
577b04516M1959J9465j2124N3157k3070l0325O4758j2946J4895Q4423K8921j33755
565a09158P6308R790L952m3710J6596R541O1207J10888j21836q9942L5723K0422
553b0219K3892L7350j5069l664L1194q0030m3621N0750Q0377O3997n2482J4561
541H7036l6103l3122K4887k9565l29J9143K4076p3974L4393K4201n8819N4859
529C6683l2419m044O5710J3911K7785n0559M5079O2101o5557O6431M0088P862
$$ plain form
517 213071 179233 57334 -31586 -4543 3778 31956 53145 48300 75708 63954 153186 143789
505 143789 141000 80348 98583 114147 117625 128253 108759 108654 109523 33659 83491 60063 -8211
492 -8211 -20628 -122863 -77178 -67806 -66066 14017 40717 37457 -1260 -49998 -39566 22421 10922
479 10922 -32914 49346 105177 77124 2076 -2979 -5059 10823 5546 -40844 68696 101279
467 101279 53088 27868 13565 -12170 -65814 -57567 -38359 -44686 -89316 26958 62635 50925
455 50925 11138 -30514 -44886 32780 6493 48260 -3193 -27228 1129 -36577 -333 -81225
443 -81225 -89667 -53784 -16658 -183 -58950 -48674 22659 28758 33225 -30273 21346 -50367 -62070
430 -62070 -33619 -34506 2190 76467 13566 47758 76805 21060 -12125 -74044 -51048 -13967
$$ packed form
517B13071l3838j21899q8920K7043Q321K8178K1189m845K7408j1754Q9232r397
505A43789k789o0652J8235J5564L478J0628j9494j05Q69p5864M9832k3428o8274
492h211j2417j02235M5685R372J740Q0083K6700l260l8717m8738J0432O1987j1499
479A0922m3836Q2260N5831k8053p5048n055k080J5882n277m6390J09540L2583
467A01279m8191k5220j4303k5735n3644Q247J9208o327m4630J16274L5677j1710
455E0925l9787m1652j4372P7666k6287M1767n1453k4035K8357l7706L6244q0892
443h1225q442L5883L7126J6475n8767J0276P1333O099M467o3498N1619p1713j1703
430f2070K8451q87L6696P4277o2901L4192K9047n5745l3185o1919K2996L7081
$$ plain form
418 -13967 -35444 -84426 -34533 11930 22796 -36802 -60070 -12496 16879 4971 -74938 -21488
406 -21488 -69828 -76373 -49914 -13284 53226 -24461 -5064 -43737 -13015 -61879 -92032 -48628
394 -48628 -20845 7907 -50964 -109849 -62007 -117063 -142014 -130481 -87313 -129492 -51609 -40285
382 -40285 -44659 -52830 -60490 -78703 -82308 -35757 29583 9213 -12221 -35244 -65916 -66205 32381
369 32381 73852 40744 -14413 -51431 -38481 -70649 -90986 -28611 25378 -596 4358 -5473
357 -5473 72759 8399 -48394 -53751 -39854 15016 33924 -74801 -132982 -70672 -71644 -146379 -69959
344 -69959 -51011 -7272 -46966 -107051 16002 46510 45048 -4284 1322 -2857 -50189 -31080
332 -31080 -109364 -25695 40117 34861 1916 -70354 -96117 -46692 16600 -29067 -39569 -27048
$$ packed form
418a3967k1477m8982M9893M6463J0866n9598k3268M7574K9375j1908p9909N3450
406b1488m8340o545K6459L6630O6510p7687J9397l8673L0722m8864l0153M3404
394d8628K7783K8752n8871n8885M7842n5056k4951J1533M3168m2179P7883J1324
382d0285m374q171p660j8213l605M6551O5340k0370k1434k3023l0672k89R8586
369C2381M1471l3108n5157l7018J2950l2168k0337O2375N3989k5974M954r831
357e473P8232o4360n6793n357J3897N4870J8908j08725n8181O2310r72p4735P6420
344f9959J8948M3739l9694o0085J23053L0508j462m9332N606m179m7332J9109
332c1080p8284Q3669O5812n256l2945p2270k5763M9425O3292m5667j0502J2521
$$ plain form
320 -27048 -54605 -14327 -12577 -90687 -68976 -33789 -16615 -24982 -60928 -77814 -162242 -95154
308 -95154 -100721 -24635 60796 9642 -37431 -58482 -3386 -43612 -99527 -71613 -16859 -7600
296 -7600 23301 -31034 -128101 -84512 -70254 -52271 -46685 -14334 -62518 -90970 -49311 -38201
284 -38201 -59816 -112176 -95758 -19607 10117 -17291 -100396 -178218 -118202 -67796 -28329 121814
272 121814 67922 -8133 -19748 -62482 -91398 -87834 39322 40489 28934 -15420 -21809 -49573
260 -49573 -51077 -1549 -6006 -30984 -95912 -123686 -26033 -18349 -15917 -37679 47227 20889 -19816
247 -19816 20188 -19150 -49574 -164638 -158735 -73227 -24480 -61529 -101352 -104799 -97378 -110472
235 -110472 -127660 -121943 -129453 -135599 -106473 -80652 -8762 25851 -37635 -42780 -8079 -91953 -164695
$$ packed form
320b7048k7557M0278J750p8110K1711L5187J7174q367l5946j6886q4428O7088
308i5154n567P6086Q5431n1154m7073k1051N5096m0226n5915K7914N4754R259
296g600L0901n4335r7067M3589J4258J7983N586L2351m8184k8452M1659J1110
284c8201k1615n2360J6418P6151K9724k7408q3105p7822O0016N0406L9467J50143
272A21814n3892p6055j1615m2734k8916L564J27156J167j1555m4354o389k7764
260d9573j504M9528m457k4978o4928k7774R7653P684K432k1762Q4906k6338m0705
247a9816M0004l9338l0424j15064N903Q5508M8747l7049l9823l447P421j3094
235a10472j7188N717p510o146K9126K5821P1890L4613o3486n145L4701q3874p2742
$$ plain form
222 -164695 -123235 -83403 -49200 -66545 -87223 -134219 -126854 -67438 -62947 -56796 -103846 -83029
210 -83029 -13803 -247 -33822 -21666 -67258 -82487 -98881 -111345 -120250 -129852 -86583 -122907
198 -122907 -130214 -50888 -15902 -76416 -13722 51222 48583 -36407 -57695 -47380 -17517 -11421
186 -11421 16461 11748 -1318 -59147 -113098 -90889 21071 71595 15378 -12332 -6405 10567
174 10567 -37230 -53857 -43895 29610 87396 22655 -19776 -50323 -138544 -98047 -68154 -46944
162 -46944 -12446 -16228 17039 13463 -2455 -62190 -40906 35145 53102 1476 -86931 -108967
150 -108967 -104192 -94516 -9876 -2209 -34576 -9852 -32948 -6634 6117 -18992 -80410 -33704
138 -33704 29634 20865 5536 -95478 -56456 -63390 -87579 -90964 -101202 -62117 -46455 -15954
$$ packed form
222a64695M1460L9832L4203j7345k0678m6996P365N9416M491O151m7050K0817
210h3029O9226J3556l3575J2156m5592j5229j6394j2464q905r602M3269l6324
198a22907p307P9326L4986o0514O2694O4944k639q4990k1288J0315K9863O096
186a1421K7882m713j3066n7829n3951K2209J11960N0524n6217k7710N927J6972
174A0567m7797j6627R962P3505N7786o4741m2431l0547q8221M0497K9893K1210
162d6944L4498l782L3267l576j5918n9735K1284P6051J7957n1626q8407k2036
150a08967M775R676Q4640P667l2367K4724k3096K6314J2751k5109o1418M6706
138c3704O3338q769j5329j01014L9022o934k4189l385j0238L9085J5662L0501
$$ plain form
126 -15954 -4951 30356 41769 32925 30657 31639 -19215 -44672 -51566 -114612 -97456 -78449 -59731
113 -59731 10675 -3090 -39726 -45435 -79672 -40607 -69919 -94208 -66983 -69948 -9871 -64244
101 -64244 -61091 -90761 -91029 -17721 -1664 -2645 1146 -55963 -57886 -75775 -50599 -127352 -70979
88 -70979 -93575 -103808 -55431 -112379 -134867 -96714 -57385 -4145 -6037 -31851 -59696 -102750
76 -102750 -66519 -101769 -112595 -188730 -164173 -149902 -82256 -46233 -28593 -34902 -48771 -91132
64 -91132 -73871 -31350 26130 -19548 -63135 -49984 -16206 -11695 -55805 -76142 -107972 -48620
52 -48620 -11031 9168 -53042 -77367 -18830 41806 -2795 24887 -75259 -106333 -100874 -87716
40 -87716 -70231 -50618 -71417 -67899 -70940 -72108 -26486 -95636 -118569 -118282 -109198 -118688 -32804 -52353
$$ packed form
126a5954J1003L5307J1413q844k268R82n0854k5457o894o3046J7156J9007J8718
113e9731P0406j3765l6636n709l4237L9065k9312k4289K7225k965O0077n4373
101f4244L153k9670k68P3308J6057r81L791n7109j923j7889K5176p6753N6373
88g0979k2596j0233M8377n6948k2488L8153L9329N3240j892k5814k7845m3054
76a02750L6231l5250j0826p6135K4557J4271O7646L6023J7640o309j3869m2361
64i1132J7261M2521N7480m5678m3587J3151L3778M511m4110k0337l1830N9352
52d8620L7589K0199o2210k4325N8537O0636m4601K7682j00146l1074N459J3158
40h7716J7485J9613k0799L518l041j168M5622o9150k2933K87R084r490Q5884j9549
$$ plain form
26 -52353 -31346 -37658 -82713 -93080 -82456 -75414 -57513 5180 -4882 -34960 -13432 -16299 -11210
13 -11210 -50004 -13189 -9018 -50402 -59276 -39980 -27864 -42652 -56044 -32837 -28003 -50176 -62095
0 -62095
$$ packed form
26e2353K1007o312m5055j0367J0624P042J7901O2693j0062l0078K1528k867N089
13a1210l8794L6815M171m1384q874J9296J2116j4788j3392K3207M834k2173j1919
0f2095
$$ Imaginary data points
##PAGE= N=2
##DATA TABLE= (X++(I..I)), XYDATA
$$ plain form
16383 -1211454 -1140079 -1089305 -1073997 -999020 -1000679 -899479 -907845 -921368 -937383 -999442 -962668
16372 -962668 -883025 -860248 -849303 -878256 -824218 -788662 -749668 -769485 -738767 -706021 -720572
16361 -720572 -673528 -617375 -584781 -649950 -648979 -634075 -581660 -566857 -581219 -553127 -526940 -523084
16349 -523084 -506982 -425738 -403118 -391039 -403030 -371428 -305888 -363340 -382041 -351869 -271672
16338 -271672 -252391 -248007 -236845 -260273 -298217 -151522 -148967 -122857 -136032 -135214 -101571 -93934
16326 -93934 -80207 -54696 -53943 -25993 59554 120000 124529 89906 83102 83980 137498 202779 225732
16313 225732 207132 197145 202366 309011 296368 283299 306445 347051 355100 397684 316550 284859
16301 284859 329155 359012 417687 451358 423241 416342 436837 509202 489747 491781 506266 524324
$$ packed form
16383a211454P1375N0774J5308P4977j659J01200q366j3523j6015o2059L6774
16372i62668P9643K2777J0945k8953N4038L5556L8994j9817L0718L2746j4551
16361g20572M7044N6153L2594o5169R71J4904N2415J4803j4362K8092K6187L856
16349e23084J6102Q1244K2620J2079j1991L1602O5540n7452j8701L0172Q0197
16338b71672J9281M384J1162k3428l7944J46695K555K6110j3175Q18L3643P637
16326i3934J3727K5511P53K7950Q5547O0446M529l4623o804Q78N3518O5281K2953
16313B25732j8600r987N221J06645j2643j3069K3146M0606Q049M2584q1134l1691
16301B84859M4296K9857N8675L3671k8117o899K0495P2365j9455K034J4485J8058
$$ plain form
16289 524324 551339 591017 596651 577316 628182 663152 660087 647668 619115 625860 714221 704452
16277 704452 663718 590137 608391 683490 720620 811218 805821 859703 833212 774662 827483 825840
16265 825840 929926 922309 946179 972555 984081 1004031 974789 981365 1023903 1006257 1087432 1076631
16253 1076631 1089134 1102610 1062843 1113189 1122801 1118676 1111112 1091367 1115413 1147582 1132912 1130205
16241 1130205 1114331 1121871 1169835 1157246 1167470 1184680 1165369 1167746 1214595 1303896 1339375 1340596
16229 1340596 1288721 1312707 1311716 1345740 1280515 1288747 1333172 1311204 1380186 1468484 1449224 1390473
16217 1390473 1459002 1487607 1490146 1469160 1416510 1413760 1458559 1501478 1504272 1522968 1560622 1500413
16205 1500413 1434826 1400314 1446850 1457400 1435136 1478899 1472867 1519287 1447156 1431935 1507230
$$ packed form
16289E24324K7015L9678N634j9335N0866L4970l065j2419k8553O745Q8361r769
16277G04452m0734p3581J8254P5099L7130R0598n397N3882k6491n8550N2821j643
16265H25840J04086p617K3870K6376J1526J9950k9242O576M2538j7646Q1175j0801
16253A076631J2503J3476l9767N0346R612m125p564j9745K4046L2169j4670k707
16241A130205j5874P540M7964j2589J0224J7210j9311K377M6849Q9301L5479J221
16229A340596n1875K3986r91L4024o5225Q232M4425k1968O8982Q8298j9260n8751
16217A390473O8529K8605K539k0986n2650k750M4799M2919K794J8696L7654o0209
16205A500413o5587l4512M6536J0550k2264M3763o032M6420p2131j5221P5295
$$ plain form
16194 1507230 1523365 1484039 1505132 1521881 1528381 1566080 1547755 1561775 1589966 1594559 1575371 1524157
$$ packed form
16194A507230J6135l9326K1093J6749O500L7699j8325J4020K8191M593j9188n1214
$$ [...]
##END NTUPLES=NMR SPECTRUM
##END=
