##TITLE=1H_CA-8801-2
 CDCl3, 8 sc, 
 22.12.2020
##JCAMPDX= 6.0         $$ Bruker NMR JCAMP-DX V2.0
##DATA TYPE= NMR SPECTRUM
##DATA CLASS= NTUPLES
##ORIGIN= UXNMR, Bruker Analytische Messtechnik GmbH
##OWNER= root
$$ XWIN-NMR		Version 3.5
$$ Tue Dec 22 11:58:52 2020 Russian Standard Time (UT+4h)  she@DPX200
##.OBSERVE FREQUENCY= 200.1315066352
##.OBSERVE NUCLEUS= ^1H
##.ACQUISITION MODE= SIMULTANEOUS
##.ACQUISITION SCHEME= undefined
##.AVERAGES= 8
##.DIGITISER RES= 18
##SPECTROMETER/DATA SYSTEM= spect
##.PULSE SEQUENCE= zg30
##.SOLVENT NAME= CDCl3
##.SHIFT REFERENCE= (INTERNAL, CDCl3, 0, 15.9678)
##AUDIT TRAIL= $$ (NUMBER, WHEN, WHO, WHERE, WHAT)
$$ ##TITLE= Audit trail, XWIN-NMR		Version 3.5
$$ ##JCAMPDX= 5.01
$$ ##ORIGIN= Bruker BioSpin GmbH
$$ ##OWNER= she
$$ F:/spectra/data/she/nmr/H-F/1/pdata/1/auditp.txt
$$ ##AUDIT TRAIL=  $$ (NUMBER, WHEN, WHO, WHERE, WHAT)
(   1,<2020-12-22 11:57:36.39 +0400>,<she>,<DPX200>,
      <created by zg, POWCHK disabled, PULCHK disabled
       configuration hash MD5:
       00 E9 B6 7A A2 85 ED C7 34 08 36 98 17 FE 4E 26
       data hash MD5: 16K
       50 CD 54 39 0C C7 FF 32 56 8B 7E 14 E0 F2 86 F3>)
(   2,<2020-12-22 11:57:39.67 +0400>,<she>,<DPX200>,
      <Start of raw data processing
       efp BC_mod = 2 LB = 0.24 FT_mod = 6 PKNL = 1 PHC0 = -10763.23 PHC1 = 12.20095 SI = 16K 
       data hash MD5: 16K
       34 2B 6A 46 30 17 71 6F AB FD F6 96 7A C8 07 52>)
(   3,<2020-12-22 11:58:04.01 +0400>,<she>,<DPX200>,
      <pk PHC0 = 0.8921173 PHC1 = -2 
       data hash MD5: 16K
       69 AF AE FD EE 87 C2 DE B6 94 6A 66 4D A8 56 48>)
(   4,<2020-12-22 11:58:07.75 +0400>,<she>,<DPX200>,
      <abs ABSG = 5 
       data hash MD5: 16K
       9C 9E DF C8 D8 F2 9B 60 85 F4 27 EC DC BD BC BF>)
$$ ##END=
$$ 
$$ hash MD5
$$ 44 9E 1D 5A 8F C8 4F 35 46 02 CB 50 EB 0A ED 7C
##$RELAX= 
##$RELAX= 
##$RELAX= 
##$RELAX= 
##$RELAX= 
##$RELAX= 
$$ Bruker specific parameters
$$ --------------------------
##$DU= <F:/spectra>
##$EXPNO= 1
##$NAME= <H-F>
##$PROCNO= 1
##$TYPE= <nmr>
##$USER= <she>
##$AMP= (0..31)
100 100 100 100 100 100 100 100 100 100 100 100 100 100 100 100 100 100 
100 100 100 100 100 100 100 100 100 100 100 100 100 100 
##$AQSEQ= 0
##$AQ_mod= 1
##$AUNM= <au_zg>
##$AUTOPOS= <>
##$BF1= 200.13
##$BF2= 200.13
##$BF3= 200.13
##$BF4= 200.13
##$BF5= 200.13
##$BF6= 200.13
##$BF7= 200.13
##$BF8= 200.13
##$BYTORDA= 1
##$CFDGTYP= 0
##$CFRGTYP= 5
##$CHEMSTR= <none>
##$CNST= (0..31)
1 1 145 1 1 1 1 1 1 1 1 1 1 1 1 1 1 1 1 1 1 1 1 1 1 1 1 1 1 1 1 1 
##$CPDPRG= <>
##$CPDPRG1= <>
##$CPDPRG2= <>
##$CPDPRG3= <>
##$CPDPRG4= <mlev>
##$CPDPRG5= <mlev>
##$CPDPRG6= <mlev>
##$CPDPRG7= <mlev>
##$CPDPRG8= <mlev>
##$CPDPRGB= <>
##$CPDPRGT= <>
##$D= (0..31)
0 1.2 0 0 0 0 0 0 0 0.06 0 0.03 0 0 0 0 0.0002 0 0 0 0 0 0 0 0 0 0 0 0 
0 0 0 
##$DATE= 1608623855
##$DBL= (0..7)
120 120 120 120 120 120 120 120 
##$DBP= (0..7)
150 150 150 150 150 150 150 150 
##$DBP07= 0
##$DBPNAM0= <>
##$DBPNAM1= <>
##$DBPNAM2= <>
##$DBPNAM3= <>
##$DBPNAM4= <>
$$ [...]
##$SUBNAM3= <"">
##$SUBNAM4= <"">
##$SUBNAM5= <"">
##$SUBNAM6= <"">
##$SUBNAM7= <"">
##$SUBNAM8= <"">
##$SUBNAM9= <"">
##$SW= 16.9725356469052
##$SWIBOX= (0..15)
0 0 2 0 0 0 0 0 0 0 0 0 0 0 0 0 
##$SW_h= 3396.73913043478
##$TD= 16384
##$TD0= 1
##$TE= 0
##$TE2= 300
##$TE3= 300
##$TEG= 300
##$TL= (0..7)
0 120 120 120 120 120 120 120 
##$TP= (0..7)
150 150 150 150 150 150 150 150 
##$TP07= 0
##$TPNAME0= <>
##$TPNAME1= <>
##$TPNAME2= <>
##$TPNAME3= <>
##$TPNAME4= <>
##$TPNAME5= <>
##$TPNAME6= <>
##$TPNAME7= <>
##$TPOAL= (0..7)
0.5 0.5 0.5 0.5 0.5 0.5 0.5 0.5 
##$TPOFFS= (0..7)
0 0 0 0 0 0 0 0 
##$TUNHIN= 0
##$TUNHOUT= 0
##$TUNXOUT= 0
##$USERA1= <user>
##$USERA2= <user>
##$USERA3= <user>
##$USERA4= <user>
##$USERA5= <user>
##$V9= 5
##$VALIST= <valist>
##$VCLIST= <CCCCCCCCCCCCCCC>
##$VD= 0
##$VDLIST= <DDDDDDDDDDDDDDD>
##$VPLIST= <PPPPPPPPPPPPPPP>
##$VTLIST= <TTTTTTTTTTTTTTT>
##$WBST= 1024
##$WBSW= 4
##$XGAIN= (0..3)
0 0 0 0 
##$XL= 0
##$YL= 0
##$YMAX_a= 156629
##$YMIN_a= -52163
##$ZGOPTNS= <>
##$ZL1= 120
##$ZL2= 120
##$ZL3= 120
##$ZL4= 120
##$ABSF1= 15.95849
##$ABSF2= -1.014172
##$ABSG= 5
##$ABSL= 3
##$ALPHA= 0
##$AQORDER= 0
##$ASSFAC= 0
##$ASSFACI= 0
##$ASSFACX= 0
##$ASSWID= 0
##$AUNMP= <proc_1d>
##$AZFE= 0.1
##$AZFW= 0.1
##$BCFW= 0
##$BC_mod= 2
##$BYTORDP= 0
##$COROFFS= 0
##$CY= -3
##$DATMOD= 1
##$DC= 0
##$DFILT= <>
##$DTYPP= 0
##$F1P= 0
##$F2P= 0
##$FCOR= 1
##$FTSIZE= 16384
##$FT_mod= 6
##$GAMMA= 0
##$GB= 0
##$INTBC= 1
##$INTSCL= 2.992141e-10
##$ISEN= 128
##$LB= 0.24
##$LEV0= 0
##$LPBIN= 0
##$MAXI= 10000
##$MC2= 0
##$MEAN= 0
##$ME_mod= 0
##$MI= 1.114404
##$NCOEF= 0
##$NC_proc= -8
##$NLEV= 6
##$NOISF1= 3.799351
##$NOISF2= 2.8
##$NSP= 0
##$NTH_PI= 0
##$NZP= 0
##$OFFSET= 15.96781
##$PC= 1
##$PHC0= -10762.34
##$PHC1= 10.20095
##$PH_mod= 1
##$PKNL= yes
##$PPARMOD= 0
##$PSCAL= 0
##$PSIGN= 0
##$REVERSE= no
##$SF= 200.130009366516
##$SI= 16384
##$SIGF1= 3
##$SIGF2= 2
##$SINO= 5.538805
##$SIOLD= 16384
##$SREGLST= <1H.CDCl3>
##$SSB= 0
##$STSI= 16384
##$STSR= 0
##$SW_p= 3396.73913043478
##$SYMM= 0
##$S_DEV= 0
##$TDeff= 16384
##$TDoff= 0
##$TI= <>
##$TILT= no
##$TM1= 0
##$TM2= 0
##$TOPLEV= 0
##$USERP1= <user>
##$USERP2= <user>
##$USERP3= <user>
##$USERP4= <user>
##$USERP5= <user>
##$WDW= 1
##$XDIM= 16384
##$YMAX_p= 295438981
##$YMIN_p= -1560793
$$ End of Bruker specific parameters
$$ ---------------------------------
##NTUPLES= NMR SPECTRUM
##VAR_NAME=  FREQUENCY,     SPECTRUM/REAL,   SPECTRUM/IMAG
##SYMBOL=    X,             R,               I
##VAR_TYPE=  INDEPENDENT,   DEPENDENT,       DEPENDENT
##VAR_FORM=  AFFN,          ASDF,            ASDF
##VAR_DIM=   16384,         16384,           16384
##UNITS=     HZ,            ARBITRARY UNITS, ARBITRARY UNITS
##FACTOR=    0.207333158178281, 1,           1
##FIRST=     3195.63790024558, 0,            0
##LAST=      -201.101230189204, 0,           0
##MIN=       -201.101230189204, -1560793,    0
##MAX=       3195.63790024558, 295438981,    0
$$ Real data points
##PAGE= N=1
##DATA TABLE= (X++(R..R)), XYDATA
$$ [...]
$$ plain form
11190 -356393 -50224 -153374 274583 -294754 -1100098 -497732 -229613 -193421 132671 -260497
11180 -260497 -547935 282364 233864 -434886 -483824 -216165 -576655 -341523 -449290 -974133
11170 -974133 -1161014 -1560793 -722351 -164744 192963 35689 62925 235981 -255635 18692
11160 18692 142056 -836636 -885937 -214350 -67626 -855059 -901961 -495520 -227621 -378297
11150 -378297 -755362 -462298 -228420 -235512 -117581 361182 652005 -208631 -272774 532355
11140 532355 318661 -31925 -202018 -281059 5902 211977 136527 324405 516472 232478
11130 232478 -85375 491608 366970 -499391 -603868 -151879 -16317 154103 84622 83536
11120 83536 142796 382431 -87911 149992 -108054 -255913 -259699 37652 229684 -406899
$$ packed form
11190c56393L06169j03150M27957n69337q05344O02366K68119L6192L26092l93168
11180b60497k87438Q30299m8500o68750m8938K67659l60490K35132j07767n24843
11170i74133j86881l99779Q38442N57607L57707j57274K7236J73056m91616K74327
11160A8692J23364r78692m9301O71587J46724p87433m6902M06441K67899j50676
11150c78297l77065K93064K33878p092J17931M78763K90823q60636o4143Q05129
11140E32355k13694l50586j70093p9041K86961K06075p5450J87878J92067k83994
11130B32478l17853N76983j24638q66361j04477M51989J35562J70420o9481j086
11120H3536N9260K39635m70342K37903k58046j47859l786K97351J92032o36583
$$ plain form
11110 -406899 -547559 -285744 -308970 222096 371842 -455787 -315730 248637 -370582 -278573
11100 -278573 127081 256857 67592 -361494 -563428 -744400 -89752 -500319 -878278 -559374
11090 -559374 -553461 -753005 -51075 324097 -181862 -163735 -20068 -607731 129127 126030
11080 126030 -467633 -363536 -267198 -714607 -290358 353923 249467 99920 363626 198773
11070 198773 303342 689524 -203383 -329962 282148 439471 61031 570148 29436 -725866
11060 -725866 -628284 -132606 173921 322996 -23720 -285524 -884233 -484595 2326 -696373
11050 -696373 -172806 -346172 -690140 -164288 31998 -213850 43078 -284963 -796408 -505925
11040 -505925 -428567 -320612 -498591 -360969 -524733 -286876 -132629 -75473 365504 -27377
$$ packed form
11110d06899j40660K61815k3226N31066J49746q27629J40057N64367o19219R2009
11100b78573M05654J29776j89265m29086k01934j80972O54648m10567l77959L18904
11090e59374N913j99544P01930L75172n05959J8127J43667n87663P36858l097
11080A26030n93663J04097R6338m47409M24249O44281j04456j49547K63706j64853
11070A98773J04569L86182q92907j26579O12110J57323l78440N09117n40712p55302
11060g25866R7582M95678L06527J49075l46716k61804n98709L99638M86921o98699
11050f96373N23567j73366l43968N25852J96286k45848K56928l28041n11445K90483
11040e05925P7358J07955j77979J37622j63764K37857J54247N7156M40977l92881
$$ plain form
11030 -27377 -544471 -412848 94112 -354385 -396376 -679922 -646271 -809213 -1059713 -926087
11020 -926087 -417762 252006 665082 132268 -550332 221284 155703 -101463 105176 -494789
11010 -494789 -479606 247344 482545 2210 -711078 -1270614 -1145978 -692258 -478986 271051
11000 271051 336402 217693 673430 218798 -169840 -298399 -129268 182593 117065 -63377
10990 -63377 -761544 -758665 -373911 -30904 -109082 10192 -348848 -664466 -417065 -250524
10980 -250524 -619791 -387117 -146482 -215729 -854191 -757062 -844670 -702858 -126638 -588261
10970 -588261 -681360 -251796 33076 -456819 -580589 -683132 -776920 -955568 -225514 -216658
10960 -216658 -124838 -129036 -721162 -396450 166850 -158358 -100237 -8973 -19831 -58724 321188
$$ packed form
11030b7377n17094J31623N06960m48497m1991k83546L3651j62942k50500J33626
11020i26087N08325O69768M13076n32814o82600P71616o5581k57166K06639n99965
11010d94789J5183P26950K35201m80335p13288n59536J24636M53720K13272P50037
11000B71051O5351j18709M55737m54632l88638j28559J69131L11861o5528j80442
10990f3377o98167K879L84754L43007p8178J19274l59040l15618K47401J66541
10980b50524l69267K32674K40635o9247o38462R7129q7608J41812N76220m61623
10970e88261r3099M29564K84872m89895j23770j02543r3788j78648P30054Q856
10960b16658R1820m198n92126L24712N63300l25208N8121R1264j0858l8893L79912
$$ plain form
10949 321188 -63902 -249565 307357 740215 -18169 661033 310731 -441145 -540575 -36107
10939 -36107 280725 -376094 359005 274490 -229958 84060 -322549 26369 171644 -569971
10929 -569971 -519008 -354585 -773617 -941095 -534394 -723898 -483981 -184290 195086 -239883
10919 -239883 -919293 -328000 -155431 -353258 -280575 -571726 -914790 -255410 883906 453449
10909 453449 242915 26440 425743 900145 681575 -15639 16055 -52717 -170471 -158831
10899 -158831 -325708 -119110 95950 470178 342599 188835 -28690 -215175 353994 324592
10889 324592 119560 -700009 -945142 -724834 -1288204 -972563 -247170 -79298 467341 576100
10879 576100 -56725 -367431 -272631 -636159 -866872 -1107618 -265291 200473 154924 -92112
$$ packed form
10949C21188l85090j85663N56922M32858p58384O79202l50302p51876r9430N04468
10939c6107L16832o56819P35099q4515n04448L14018m06609L48918J45275p41615
10929e69971N0963J64423m19032j67478M06701j89504K39917K99691L79376m34969
10919b39883o79410N91293J72569j97827P2683k91151l43064O59380J139316m30457
10909D53449k10534k16475L99303M74402k18570o97214L1694o8772j17754J1640
10899a58831j66877K06598K15060L74228j27579j53764k17525j86485N69169k9402
10889C24592k05032q19569k45133K20308n63370L15641P25393J67872N46639J08759
10879E76100o32825l10706R4800l63528k30713k40746Q42327M65764m5549k47036
$$ plain form
10869 -92112 60464 -70180 331922 589521 -33367 -282664 -373939 -415430 -116435 -42706
10859 -42706 -354904 14110 -222880 -517765 -110032 69252 -409251 -328866 574659 -20298
10849 -20298 -323556 -276513 -754428 -345754 -149893 -207591 -226133 -4479 -353435 -1434
10839 -1434 -106382 -431735 -659798 -1024031 -4844 -91883 -737822 -374481 -92471 -242479
10829 -242479 -768828 -793985 -344201 -579235 -167074 135155 10075 331792 70274 212331
10819 212331 -196574 -958789 -285333 162679 151454 357297 -390113 -178112 167716 370327
10809 370327 528007 229405 403710 887897 634798 35706 -202937 567760 613845 105986
10799 105986 123586 -449693 6789 779587 721278 511379 581122 474216 -158409 -42255
$$ packed form
10869i2112J52576j30644M02102K57599o22888k49297r1275m1491K98995P3729
10859d2706l12198L69014k36990k94885M07733J79284m78503Q0385R03525n94957
10849b0298l03258M7043m77915M08674J95861n7698j8542K21654l48956L52001
10839a434j04948l25353k28063l64233J019187q7039o45939L63341K82010j50008
10829b42479n26349k5157M49784k35034M12161L02229j25080L21717k61518J42057
10819B12331m08905p62215O73456M48012j1225K05843p47410K12001L45828K02611
10809C70327J57680k98602J74305M84187k53099n99092k38643P70697M6085n07859
10799A05986J7600n73279M56482P72798n8309k09899O9743j06906o32625J16154
$$ plain form
10789 -42255 111598 -19828 131055 -292138 -818756 43959 472067 486651 39816 -130486
10779 -130486 -351333 -413591 -265098 -363749 -169345 -245060 -173298 -430073 284552 369757
10769 369757 -189796 -54213 -432936 -906252 -378376 262203 -36913 -447240 -683821 -677509
10759 -677509 -466996 -378824 -817738 -384950 358617 77805 -640688 -201063 43310 -408746
10749 -408746 -691957 -682251 -907686 -308379 766678 491920 300731 318823 239624 737122
10739 737122 598670 -33784 -463331 -509354 -1220333 -562183 745442 522547 -293565 -402585
10729 -402585 -939025 -556427 -148294 49704 -58952 10854 230166 -55885 -22935 -72747
10719 -72747 193377 203131 10127 -410708 -69387 44306 82404 -145642 167676 56300
$$ packed form
10789d2255J53853j31426J50883m23193n26618Q62715M28108J4584m46835j70302
10779a30486k20847o2258J48493r8651J94404p5715P1762k56775P14625Q5205
10769C69757n59553J35583l78723m73316N27876O40579k99116m10327k36581O312
10759f77509K10513Q8172m38914M32788P43567k80812p18493M39625K44373m52056
10749d08746k83211R706k25435N99307J075057k74758j91189J8092p9199M97498
10739G37122j38452o32454m29547m6023p10979O58150J307625k22895q16112j09020
10729d02585n36440L82598M08133J97998j08656O9806K19312k86051L2950m9812
10719g2747K66124R754j93004m20835L41321J13693L8098k28046L13318j11376
$$ plain form
10709 56300 -371796 -417565 -561949 -1363396 -924821 -663315 -341881 -444691 -267110 -94683
10699 -94683 -276919 -518215 -651651 -851755 -114901 327281 76391 129026 453043 518927
10689 518927 850295 1222381 656464 -63821 -234226 -189460 -322766 -339533 -46533 -17359
10679 -17359 676461 46713 -584236 207422 364479 141851 147743 114191 -372084 267490
10669 267490 504834 37368 -233205 -108981 -52690 -127450 -22025 553364 130550 180183
10659 180183 294075 -406486 -821613 -537919 -709479 -601344 -236465 46112 240749 635259
10649 635259 494912 297795 91608 -393433 -1094 54944 -397451 -483662 -563738 -160927
10639 -160927 285415 280581 461448 -256102 -364899 -125441 -303601 -104118 -369515 -620650
$$ packed form
10709E6300m28096m5769j44384q01447M38575K61506L21434j02810J77581J72427
10699i4683j82236k41296j33436k00104P36854M42182k50890N2635L24017O5884
10689E18927L31368L72086n65917p20285j70405M4766j33306j6767K93000K9174
10679a7359O93820o29748o30949P91658J57057k22628N892l3552m86275O39574
10669B67490K37344m67466k70573J24224N6291p4760J05425N75389m22814M9633
10659A80183J13892p00561m15127K83694j71560J08135L64879K82577J94637L94510
10649F35259j40347j97117k06187m85041L92339N6038m52395q6211q0076M02811
10639a60927M46342m834J80867p17550j08797K39458j78160J99483k65397k51135
$$ plain form
10629 -620650 -884983 -1257199 -661591 -441192 419144 876861 751398 384115 -206459 -66657
10619 -66657 -285459 86229 -326654 -485748 -106327 -534826 -347023 -229499 -277540 -167777
10609 -167777 323584 442063 128040 -293117 164718 -459589 -802416 -45304 470816 497944
10599 497944 525204 567553 -248416 -87803 -302045 -380344 -271858 -432707 -922889 -239125
10589 -239125 150660 506252 387822 453863 359577 -184676 -188298 -448782 -77492 354137
10579 354137 357940 325891 282686 240936 -1647 226663 861457 94742 -522394 -210318
10569 -210318 -228244 -32115 191715 -156576 158668 305790 -372420 -566250 -781458 -621665
10559 -621665 -318305 -159728 -17002 57973 632707 -13120 107795 -194154 -95370 109428
$$ packed form
10629f20650k64333l72216N95608K20399Q60336M57717j25463l67283n90574J39802
10619f6657k18802L71688m12883j59094L79421m28499J87803J17524m8041J09763
10609a67777M91361J18479l14023m21157M57835o24307l42827P57112N16120K7128
10599D97944K7260M2349q15969J60613k14242p8299J08486j60849m90182O83764
10589b39125L89785L55592j18430O6041r4286n44253l622k60484L71290M31629
10579C54137L803l2049m3205m1750k42583K28310O34794p66715o17136L12076
10569b10318j7926J96129K23830l48291L15244J47122o78210j93830k15208J59793
10559f21665L03360J58577J42726P4975N74734o45827J20915l01949R8784K04798
$$ plain form
10549 109428 -299159 364161 163753 199191 462040 209343 -293705 -138678 -231978 -389068
10539 -389068 -230547 -138983 -18059 -497261 337290 24636 -395754 -17037 48854 -187095
10529 -187095 -193277 -386634 -385662 -460046 -66808 235096 -113737 -79374 -403279 -682168 -335332
10518 -335332 124289 30530 441226 503749 159006 -280312 -83797 -172160 -45425 -739443
10508 -739443 -966008 -917104 -951190 -502405 -90421 -248346 -197526 -555755 -571913 -677377
10498 -677377 -196678 18046 67468 -282431 -775145 -492835 -710383 -638896 -137649 -422227
10488 -422227 -382958 8487 163796 -33990 -50576 70695 -263475 -416128 -207669 22878
10478 22878 150439 -112801 -347577 -147062 459742 812880 487362 729070 -238239 -1100630
$$ packed form
10549A09428m08587O63320k00408L5438K62849k52697n03048J55027r3300j57090
10539c89068J58521R1564J20924m79202Q34551l12654m20390L78717O5891k35949
10529a87095o182j93357R72p4384L93238L01904l48833L4363l23905k78889L46836
10518c35332M59621r3759M10696O2523l44743m39318J96515q8363J26735o94018
10508g39443k26565M8904l4086M48785M11984j57925N0820l58229j6158j05464
10498f77377M80699K14724M9422l49899m92714K82310k17548P1487N01247k84578
10488d22227L9269L91445J55309j97786j6586J21271l34170j52653K08459K30547
10478B2878J27561k63240k34776K00515O06804L53138l25518K41708r67309q62391
$$ plain form
10468 -1100630 -1049671 -509351 -49553 424061 273564 7932 27884 51759 -647982 -547832
10458 -547832 154757 -123343 -168257 158585 159494 -129206 -282507 -753 -443754 45330
10448 45330 156615 -40521 411765 542781 211481 -13326 173516 -308228 -891382 139402
10438 139402 500074 126929 -112323 -589534 -846871 -633835 -274311 26557 152301 132905
10428 132905 -227306 -63574 574029 -30049 -37144 -177202 -493699 -198842 -208365 -43324
10418 -43324 217157 247001 -152021 93727 546799 137478 -359032 -766320 -438786 231596
10408 231596 -98774 54924 159634 -79642 173096 -19040 -383315 -280564 -423479 -57238
10398 -57238 -344328 -63809 -29721 354328 126746 63324 53171 -369793 -475135 -32989
$$ packed form
10468a100630N0959N40320M59798M73614j50497k65632J9952K3875o99741J00150
10458e47832P02589k78100m4914L26842R09k88700j53301K81754m43001M89084
10448D5330J11285j97136M52286J31016l31300k24807J86842m81744n83154J030784
10438A39402L60672l73145k39252m77211k57337K13036L59524L00868J25744j9396
10428A32905l60211J63732O37603o04078p095j40058l16497K94857r523J65041
10418d3324K60481K9844l99022K45748M53072m09321m96510m07288L27534O70382
10408B31596l30370J53698J04710k39276K52738j92136l64275J02751j42915L66241
10398e7238k87090K80519L4088L84049k27582o3422j0153m22964j05342M42146
$$ plain form
10388 -32989 1032364 348904 -51536 -158612 488666 377706 -310963 -301703 39195 151883
10378 151883 103382 -262895 -754000 -177971 265213 -69217 -28793 -480651 -541717 -404668
10368 -404668 -612083 -952860 -272029 -497003 -281805 -511058 -595732 -180963 -115631 -525785
10358 -525785 -126005 712262 101737 179731 259361 -297834 -193538 -252439 -124132 -25541
10348 -25541 -67589 -8509 -611053 -977660 -401453 -128421 -162547 -278407 -229196 -149749 -576518
10337 -576518 -939061 -1279788 -553815 -813936 -881635 -72775 -300476 -661808 -624547 -805961
10327 -805961 -680960 -445691 -663821 -538678 -139576 -91174 -458653 -514011 -883463 -546304
10317 -546304 325635 -341099 -478224 -68198 -456017 -158314 65750 247413 296998 775059
$$ packed form
10388c2989J065353o83460m00440j07076O47278j10960o88669R260L40898J12688
10378A51883m8501l66277m91105N76029M43184l34430M0424m51858o1066J37049
10368d04668k07415l40777O80831k24974K15198k29253q4674M14769O5332m10154
10358e25785L99780Q38267o10525P7994P9630n57195J04296n8901J28307R8591
10348b5541m2048N9080o02544l66607N76207K73032l4126j15860M9211P9447m26769
10337e76518l62543l40727P25973k60121o7699Q08860k27701l61332L7261j81414
10327h05961J25001K35269k18130J25143L99102M8402l67479n5358l69452L37159
10317e46304Q71939o66734j37125M10026l87819K97703K24064J81663M9585M78061
$$ plain form
10307 775059 16600 -137411 68386 -220511 203546 -324981 -737865 -338810 -152922 -316816
10297 -316816 -545340 -1019693 -813362 -316448 -294523 -562074 -677116 -1023220 -998984 -79638
10287 -79638 -457162 -631423 -19538 330409 797763 239862 -189398 -756198 -915054 -982958
10277 -982958 -915780 -443793 216162 53536 -343243 -493304 -548443 -671293 -872530 -862948
10267 -862948 -216384 -149127 -19665 340638 377265 -287323 -85148 508684 281987 -91048
10257 -91048 195058 933093 149714 -142788 -526342 135682 86956 -179162 345450 260024
10247 260024 -205067 -326068 273128 645290 931061 -23640 -15185 -357331 -1069066 -1193937
10237 -1193937 -1211184 -1207871 -872809 -386429 7804 153782 218904 -259564 -317761 74330
$$ packed form
10307G75059p58459j54011K05797k88897M24057n28527m12884L99055J85888j63894
10297c16816k28524m74353K06331M96914K1925k67551j15042l46104K4236R19346
10287g9638l77524j74261O11885L49947M67354n57901m29260n66800j58856o7904
10277i82958O7178M71987O59955j62626l96779j50061n5139j22850k01237R582
10267h62948O46564O7257J29462L60303L6627o64588K02175N93832k26697l73035
10257i1048K86106P38035p83379k92502l83554O62024m8726k66118N24612q5426
10247B60024m65091j21001N99196L72162K85771r54701Q455l42146p11735j24871
10237a193937j7247L313L35062M86380L94233J45978O5122m78468n8197L92091
$$ plain form
10227 74330 -169741 -171413 -443500 -47347 122858 -830383 -649901 -312030 -257851 183834
10217 183834 -188428 -443532 -300636 215370 -157463 -688421 -864100 -774203 -525222 -413908
10207 -413908 -754339 -977449 133597 270036 8066 -442919 -1016560 -591493 158517
10198 158517 229942 198066 140354 179399 170079 151775 377699 177602 -231289 -1739 242748
10187 242748 -266308 -74929 665577 35519 -406430 -71242 -134747 -49067 156956 -473268
10177 -473268 -81446 52009 -355901 -428963 -199785 -332838 -1162132 -1468728 -1009754 -764002
10167 -764002 -359560 -171587 -433616 -316655 200114 329963 -204631 74087 201880 94499
10157 94499 453355 103588 -638062 -180860 -173421 -487150 -717693 -83310 -313374 42783
$$ packed form
10227G4330k44071j672k72087L96153J70205r53241J80482L37871N4179M41685
10217A83834l72262k55104J42896N16006l72833n30958j75679Q9897K48981J11314
10207d13908l40431k23110J111046J36439k61970m50985n73641M25067P50010
10198A58517P1425l1876n7712L9045r320j8304K25924k00097m08891K29550K44487
10187B42748n09056J91379P40506o30058m41949L35188o3505Q5680K06023o30224
10177d73268L91822J33455m07910p3062K29178j33053q29294l06596M58974K45752
10167g64002M04442J87973k62029J16961N16769J29849n34594K78718J27793j07381
10157I4499L58856l49767p41650M57202P439l13729k30543O34383k30064L56157
$$ plain form
10147 42783 583402 193296 40527 252803 410629 342233 181390 -175642 -303737 18625
10137 18625 -168984 220069 790184 1019030 679342 498636 371697 356634 156604 340839
10127 340839 -154226 -488509 -330647 -61292 -250671 -314718 -398931 -925209 -891416 -191245
10117 -191245 160010 414710 140009 62846 588144 701059 -103662 -220938 164771 266265
10107 266265 199092 169180 549030 905462 687501 -19136 39959 -515055 -594728 -588767 -170173
10096 -170173 -4974 -107374 13054 211647 152407 50792 -68275 69451 233838 533126
10086 533126 465987 11368 -71115 14614 -64702 -122307 -62483 143962 -142385 -37938 -81636
10075 -81636 -410670 -462761 -132023 57633 -13429 -159859 66992 230025 322884 446875
$$ packed form
10147D2783N40619l90106j52769K12276J57826o8396j60843l57032j28095L22362
10137A8625j87609L89053N70115K28846l39688j80706j26939j5063k00030J84235
10127C40839m95065l34283J57862K69355j89379o4047q4213n26278L3793P00171
10117a91245L51255K54700k74701p7163N25298J12915q04721j17276L85709J01494
10107B66265o7173k9912L79850L56432k17961p06637N9095n55014p9673N961M18594
10096a70173J65199j02400J20428J98593n9240j01615j19067J37726J64387K99288
10086E33126o7139m54619q2483Q5729p9316n7605N9824K06445k86347J04447m3698
10075h1636l29034n2091L30738J89656p1062j46430K26851J63033R2859J23991
$$ plain form
10065 446875 101552 23804 207 -449813 -498952 -204792 58813 -325834 -221709 -118079
10055 -118079 -1034455 -792650 -582325 -846684 -249448 -429390 -606216 -391095 -372127 -922441
10045 -922441 -223813 530830 844369 997327 11693 14221 377284 661564 159174 -352387
10035 -352387 -272824 -606956 -758813 -394937 92434 -403779 -258193 22881 454793 924566
10025 924566 672341 -595539 -375837 80821 212632 -159669 -183843 69800 520814 1107660
10015 1107660 268062 499726 729974 -293400 -597987 201168 107325 -371063 -83041
10006 -83041 -206101 -754596 -185685 258990 165297 63897 -117258 334389 176512 32257
9996 32257 48603 252617 157829 434254 -21595 -550328 298102 238878 79724 -135470
$$ packed form
10065D46875l45323p7748k3597m50020m9139K94160K63605l84647J04125J03630
10055a18079r16376K41805K10325k64359N97236j79942j76826K15121J8968n50314
10045i22441O98628P54643L13539J52958r85634K528L63063K84280n02390n11561
10035c52387P9563l34132j51857L63876M87371m96213J45586K81074M31912M69773
10025I24566k52225j267880K19702M56658J31811l72301k4174K53643M51014N86846
10015A107660q39598K31664K30248j023374l04587P99155r3843m78388K88022
10006h3041j23060n48495N68911M44675r3693j01400j81155M51647j57877j44255
9996C2257J6346K04014r4788K76425m55849n28733Q48430n9224j59154k15194
$$ plain form
9986 -135470 90524 -480363 9673 215740 84217 277712 -275308 -1298 308723 74853
9976 74853 405982 986071 525832 405627 289130 -14519 521031 776005 132091 -442210
9966 -442210 268083 131315 318460 423618 388847 -254184 -111596 317797 453215 -5970
9956 -5970 -246109 95841 -1202 -312195 -53213 233294 539704 328792 367682 789614
9946 789614 1032092 749708 333849 -136940 -490047 -457655 -43658 120851 384873 601204
9936 601204 2745 -840749 155791 765739 369376 483818 409356 -18389 -339240 189562
9926 189562 -254091 -280936 3864 -492303 -424304 -104721 214014 297522 133408 -181578
9916 -181578 -37442 263052 194673 134761 70133 -5685 -343638 -258514 186340 330434 585764
$$ packed form
9986a35470K25994n70887M90036K06067j31523J93495n53020K74010L10021k33870
9976G4853L31129N80089m60239j20205j16497l03649N35550K54974o43914n74301
9966d42210P10293j36768J87145J05158l4771o43031J42588M29393J35418m59185
9956e970k40139L41950r7043l10993K58982K86507L06410k10912L8890M21932
9946G89614K42478k82384m15859m70789l53107L2392M13997J64509K64022K16331
9936F01204n98459q43494R96540O09948l96363J14442p4462m27745l20851N28802
9926A89562m43653k6845K84800m96167O7999L19583L18735Q3508j64114l14986
9916a81578J44136L00494o8379n9912o4628p5818l37953Q5124M44854J44094K55330
$$ plain form
9905 585764 808861 296168 -148109 339646 106184 -179166 -707912 -503499 86634 302867
9895 302867 713592 318893 597616 736811 710902 482067 233055 24205 217631 -357039
9885 -357039 -373406 -646453 -674630 -482568 -334424 61179 575580 121055 111506 -14196
9875 -14196 -331585 -220190 -285613 -1188032 -278990 416198 348413 102231 271927 322944
9865 322944 399336 299516 200877 602849 287972 -165165 526428 786835 303081 124225
9855 124225 606319 95119 -136933 170836 498136 1067693 617379 108384 396818 93371
9845 93371 -528430 209638 263951 242623 -43705 187164 733713 268271 61132 156501
9835 156501 -458374 -122658 -226789 -32951 102051 -161245 305199 -66306 -788987 -513372
$$ packed form
9905E85764K23097n12693m44277M87755k33462k85350n28746K04413N90133K16233
9895C02867M10725l94699K78723J39195k5909k28835k49012k08850J93426n74670
9885c57039j6367k73047k8177J92062J48144L95603N14401m54525r549j25702
9875a4196l17389J11395o5423r02419R09042O95188o7785k46182J69696N1017
9865C22944P6392r9820r8639M01972l14877m53137O91593K60407m83754j78856
9855A24225M82094n11200k32052L07769L27300N69557m50314n08995K88434l03447
9845I3371o21801P38068N4313k1328k86328K30869N46549m65442k07139R5369
9835A56501o14875L35716j04131J93838J35002k63296M66444l71505p22681K75615
$$ plain form
9825 -513372 -53214 158054 110604 441953 774319 148923 183946 148886 37630 468686
9815 468686 275088 377782 97440 -370790 -278621 3040 88478 612622 289302 -149861
9805 -149861 -46477 69043 -96020 -16010 328092 384373 -93367 262546 397927 -246758
9795 -246758 -352947 -111180 485194 534419 -298828 -444536 704049 297203 73119 431861
9785 431861 -298841 51153 1049618 515706 -227172 -116544 49589 763594 628557 21995
9775 21995 528117 647960 193157 -31987 -8693 432677 79832 143127 258103 157387
9765 157387 222619 263243 -250230 -205254 -227103 -74328 -24936 46082 271513 -145645 -19507
9754 -19507 171953 -528899 7428 587146 825305 857753 110330 -251645 -503639 -545237
$$ packed form
9825e13372M60158K11268m7450L31349L32366o25396L5023l5060j11256M31056
9815D68686j93598J02694k80342m68230R2169K81661Q5438N24144l23320m39163
9805a49861J03384J15520j65063Q0010L44102N6281m77740L55913J35381o44685
9795b46758j06189K41767N96374M9225q33247j45708J148585m06846k24084L58742
9785D31861p30702L49994R98465n33912p42878J10628J66133P14005j35037o06562
9775B1995N06122J19843m54803k25144K3294M41370l52845O3295J14976j00716
9765A57387O5232M0624n13473M4976k1849J52775M9392P1018K25431m17158J26138
9754a9507J91460p00852N36327N79718K38159L2448p47423l61975k51994m1598
$$ plain form
9744 -545237 -793519 -341772 158083 -47844 -148974 -512447 -782123 -514253 -11003 -180045
9734 -180045 -203143 67242 144881 -391331 -214193 -380844 -766814 -798033 264915 1075184
9724 1075184 909958 640643 210196 41541 187634 -133526 -646100 -211122 -929 283429
9714 283429 1268 13666 -232046 -5458 463546 634726 -496622 -138797 78753 -80418
9704 -80418 250255 -82219 147779 725457 630075 9528 -153388 217827 221594 -167645
9694 -167645 -136356 -285397 -112320 16719 43976 712340 758048 23915 116272 -35370
9684 -35370 -116770 -695297 -377354 434814 -229110 353530 219146 -315883 175816 458425
9674 458425 -212957 -119214 272316 142398 -4029 98362 -47048 30372 250587 499465
$$ packed form
9744e45237k48282M51747M99855k05927j01130l63473k69676K67870N03250j69042
9734a80045k3098K70385P7639n36212J77138j66651l85970l1219J062948Q10269
9724A075184j65226k69315m30447j68655J46093l21160n12574M34978K10193K84358
9714B83429k82161J2398k45712K26588M69004J71180j131348L57825K17550j59171
9704h0418L30673l32474K29998N77678r5382o20547j62916L71215L767l89239
9694a67645L1289j49041J73077J29039K7257O68364M5708p34133R2357j51642
9684c5370q1400n78527L17943Q12168o63924N82640j34384n35029M91699K82609
9674D58425o71382R3743L91530j29918j46427J02391j45410P7420K20215K48878
$$ plain form
9664 499465 -104239 -341197 -371021 -82165 306688 -33980 -499077 -607237 -385391 216685
9654 216685 106295 273404 -20308 3607 522265 427519 -545403 61751 295632 -335045
9644 -335045 -188243 26162 -439776 -480783 -477048 -359293 -121060 152548 140799 -7337
9634 -7337 235964 125373 430892 76356 -106474 -462901 -400667 -741120 -536282 -202957
9624 -202957 258265 -126682 -69919 -27397 208496 266201 -242205 -291329 -133946 -36001 -249149
9613 -249149 -481861 -714132 -518959 -540755 -146561 -218245 -564150 -31954 -223394 -238861
9603 -238861 -529396 72726 -350591 -893766 -531764 -672585 76453 387729 -21117 40998
9593 40998 446478 563650 -67059 238387 -254092 -502019 -221975 422138 141124 120993
$$ packed form
9664D99465o03704k36958k9824K88856L88853l40668m65097j08160K21846O02076
9654B16685j10390J67109k93712K3915N18658r4746r72922O07154K33881o30677
9644c35045J46802K14405m65938m1007L735J17755K38233K73608j1749j48136
9634g337K43301j10591L05519l54536j82830l56427O2234l40453K04838L33325
9624b02957M61222l84947N6763M2522K35893N7705n08406m9124J57383R7945k13148
9613b49149k32712k32271J95173k1796L94194p1684l45905N32196j91440j5467
9603b38861k90535O02122m23317n43175L62002j40821P49038L11276m08846O2115
9593D0998M05480J17172o30709L05446m92479k47927K80044O44113k81014k0131
$$ plain form
9583 120993 511802 132391 -187763 -178692 -327203 -414115 -386619 -72137 215931 393809
9573 393809 173031 -157432 36222 409714 208776 169052 386710 19641 -120461 201367
9563 201367 -290900 -333485 444493 417459 -330517 -524060 -552698 -10640 633821 445734
9553 445734 367053 -95687 -70330 -335098 -486453 -186608 -136171 3739 -92907 -644493
9543 -644493 -889084 -301192 273152 622911 374046 -691346 -516375 198801 12200 -143017
9533 -143017 -50846 -491291 -335584 3459 558390 -373339 -342899 271147 153285 898007
9523 898007 1128682 692578 208506 107068 484867 409250 250147 386987 443486 97525
9513 97525 50621 -102289 506450 -85499 -69615 578923 336454 -129429 -199280 174262
$$ packed form
9583A20993L90809l79411l20154R071j48511q6912K7496L14482K88068J77878
9573C93809k20778l30463J93654L73492k00938l9724K17658l67069j40102L21828
9563B01367m92267m2585P77978k7034p47976j93543k8638N42058O44461j88087
9553D45734p8681m62740K5357k64768j51355K99845N0437J39910r6646n51586
9543f44493k44591N87892N74344L49759k48865j065392J74971P15176j86601j55217
9533a43017R2171m40445J55707L39043N54931r31729L0440O14046j17862P44722
9523H98007K30675m36104m84072j01438L77799p5617j59103J36840N6499l45961
9513I7525m6904j52910O08739n91949J5884O48538k42469m65883o9851L73542
$$ plain form
9503 174262 -665651 -489733 -285417 -312974 -172009 -543191 -93648 -360598 222914 155589
9493 155589 -173701 41682 191716 -81260 -168280 -272961 -53104 -111498 8624 40084
9483 40084 507926 152623 -236577 -362598 203957 -180116 25373 256404 398067 526884
9473 526884 361383 482289 155491 -88034 100210 491885 84740 134253 195987 479573
9463 479573 298794 209794 -73534 209996 -123588 361200 -25774 60726 646737 891414
9453 891414 19773 -375823 -165805 60994 -942711 -648646 212739 188781 -346336 272619
9443 272619 -27271 -114025 -107971 243468 51675 -64985 -37436 -577702 9564 -395101
9433 -395101 -909223 -876972 -528871 -57910 70310 506153 284290 67323 509949 93886
$$ packed form
9503A74262q39913J75918K04316k7557J40965l71182M49543k66950N83512o7325
9493A55589l29290K15383J50034k72976q7020j04681K19857n8394J20122L1460
9483D0084M67842l55303l89200j26021N66555l84073K05489K31031J41663J28817
9473E26884j65501J20906l26798k43525J88244L91675m07145M9513O1734K83586
9463D79573j80779q9000k83328K83530l33584M84788l86974Q6500N86011K44677
9453H91414q71641l95596K10018K26799j003705K94065Q61385k3958n35117O18955
9443B72619k99890q6754O054L51439j91793j16660K7549n40266N87266m04665
9433c95101n14122L2251L48101M70961J28220M35843k21863k16967M42626m16063
$$ plain form
9423 93886 -545297 -478331 -758403 -59468 202934 576510 -216479 514385 968291 366265
9413 366265 595566 227266 -295803 -196141 304655 158479 431760 -287846 108768 675282
9403 675282 475182 -5435 227849 552623 254395 76395 965239 783737 419710 557101
9393 557101 905161 -17849 -261483 -494877 -310518 -423220 91674 254716 -17953 -135738
9383 -135738 -603690 -844022 -185963 -197003 -564377 -939024 -703821 -332711 184134 578287
9373 578287 309053 502167 182556 355442 798325 511345 -116114 -697878 172020 348562
9363 348562 -218072 -347667 -196844 -223739 -190804 -107133 -309790 126104 662135 -146646
9353 -146646 -104652 268867 -672470 -141798 253672 9694 116112 92284 249673 409447
$$ packed form
9423I3886o39183O6966k80072O98935K62402L73576p92989P30864M53906o02026
9413C66265K29301l68300n23069R9662N00796j46176K73281p19606L96614N66514
9403F75282k00100m80617K33284L24774k98228j78000Q88844j81502l64027J37391
9393E57101L48060r23010k43634k33394J84359j12702N14894J63042k72669j17785
9383a35738m67952k40332O58059j1040l67374l74647K35203L71110N16845L94153
9373E78287k69234J93114l19611J72886M42883k86980o27459n81764Q69898J76542
9363C48562n66634j29595J50823k6895L2935Q3671k02657M35894N36031q08781
9353a46646M1994L73519r41337N30672L95470k43978J06418k3828J57389J59774
$$ plain form
9343 409447 225718 -224851 -344190 -290982 -16829 102608 168486 17957 -298271 -63835
9333 -63835 343844 -395070 -473014 -86099 313179 -399443 -323789 269100 759050 934695
9323 934695 696537 617766 616102 1191697 806701 697137 394302 786380 348317 843558
9313 843558 389931 -59706 705714 1413816 227813 303676 152126 -226619 21160 568339
9303 568339 768862 170399 101561 578348 197057 446249 -704030 -471495 249297 -253311
9293 -253311 -226498 298634 286422 165711 220096 -523018 -52615 -200933 66172 -308250
9283 -308250 -407314 235312 389470 584415 598419 60803 -270793 337664 703745 16330
9273 16330 -182969 -325712 -201328 365516 519473 574313 458567 -338482 -196805 -257996
$$ packed form
9343D09447j83729m50569j19339N3208K74153J19437O5878j50529l16228K34436
9333f3835M07679p38914p7944L86915L99278p12622P5654N92889M89950J75645
9323I34695k38158p8771j664N75595l84996j09564l02835L92078m38063M95241
9313H43558m53627m49637P65420P08102j186003P5863j51550l78745K47779N47179
9303E68339K00523n98463o8838M76787l81291K49192j150279K32535P20792n02608
9293b53311K6813N25132j2212j20711N4385p43114M70403j48318K67105l74422
9283c08250r9064O42626J54158J94945J4004n37616l31596O08457L66081o87415
9273A6330j99299j42743J24384N66844J53957N4840j15746p97049J41677o1191
$$ plain form
9263 -257996 -354293 -4270 -81516 410553 234314 351688 -87613 -113993 -245796 -260910
9253 -260910 583699 361838 216696 1009810 979709 86396 -241173 -495324 -254255 405413
9243 405413 991307 1335544 1116915 742244 363067 -91235 -16022 -361312 -333678 -256287
9233 -256287 -123014 -218940 3120 968395 736708 150598 228867 -341505 -453609 -866125
9223 -866125 -328542 -85802 -69817 -115100 340034 82782 -333695 228883 25651 517343
9213 517343 1000512 551907 207869 280877 493238 852949 432236 -152419 -153814 -473422
9203 -473422 -493663 -483126 161204 264208 -25905 67736 520616 332832 25166 415886
9193 415886 271410 -6137 -60773 -174760 123927 218361 1104465 616469 -133931 -311581
$$ packed form
9263b57996r6297L50023p7246M92069j76239J17374m39301k6380j31803j5114
9253b60910Q44609k21861j45142P93114l0101q93313l27569k54151K41069O59668
9243D05413N85894L44237k18629l74671l79177m54302P5213l45290K7634P7391
9233b56287J33273r5926K22060R65275k31687n86110P8269n70372j12104m12516
9223h66125N37583K42740J5985m5283M55134k57252m16477N62578k03232M91692
9213E17343M83169m48605l44038P3008K12361L59711m20713n84655j395l19608
9203d73422k0241J0537O44330J03004k90113R3641M52880j87784l07666L90720
9193D15886j44476k77547n4636j13987K98687R4434Q86104m87996p50400j77650
$$ plain form
9183 -311581 -221406 -114757 60315 818617 780301 671914 578481 904194 675182 -9489
9173 -9489 10338 -136545 -254696 -227461 -525700 132983 -9353 37887 429535 435923 516497
9162 516497 877628 754675 -78004 -222467 -312477 -583469 -276813 23557 432038 275698
9152 275698 504111 843824 844157 184611 -91520 88357 336386 307420 88831 233925
9142 233925 574256 702107 840041 -52319 110708 276370 570602 646167 620510 515649
9132 515649 12217 -153143 -222536 -172524 224152 -113678 -280402 -157632 -248269 -286608
9122 -286608 -928258 -557601 -74482 -233268 -3147 830401 962156 525697 397170 -99353
9112 -99353 -700801 27923 210303 596422 1045960 1061896 474313 835442 713767 206906
$$ packed form
9183c11581R0175J06649J75072P58302l8316j08387r3433L25713k29012o84671
9173i489J9827j46883j18151K7235k98239O58683j42336M7240L91648O388Q0574
9162E16497L61131j22953q32679j44463r0010k70992L06656L00370M08481j56340
9152B75698K28413L39713L33o59546k76131J79877K48029k8966k18589J45094
9142B33925L40331J27851J37934q92360J63027J65662K94232P5565k5657j04861
9132E15649n03432j65360o9393N0012L96676l37830j66724J22770r0637l8339
9122b86608o41650L70657M83119j58786K30121Q33548J31755m36459j28527m96523
9112i9353o01448P28724J82380L86119M49538J5936n87583L61129j21675n06861
$$ plain form
9102 206906 -179382 555782 772338 228247 673256 351617 185123 662603 239000 -595514
9092 -595514 -185518 252329 -53376 386317 491221 -276491 -53460 -40781 32343 -77417
9082 -77417 437212 412565 299983 183494 237601 41303 14209 167510 261868 -114664 -30957
9071 -30957 -455526 -462377 218966 -10599 468427 947378 1137647 579434 435619 608624
9061 608624 787244 763912 484076 520591 627300 142691 700046 963582 246642 -259920
9051 -259920 -11505 338275 853754 943854 693770 1113274 970446 496695 438794 254977
9041 254977 186567 197352 -136492 201066 253103 -97812 669235 904760 762974 587794
9031 587794 508277 1009278 571971 103398 18209 -235621 236208 244495 505930 484947 68458
$$ packed form
9102B06906l86288P35164K16556n44091M45009l21639j66494M77480m23603q34514
9092e95514M09996M37847l05705M39693J04904p67712K23031J2679P3124j09760
9082g7417N14629k4647j12582j16489N4107j96298k7094J53301R4358l76532Q3707
9071c0957m24569o851O81343k29565M79026M78951J90269n58213j43815J73005
9061F08624J78620k3332k79836L6515J06709m84609N57355K63536p16940n06562
9051b59920K48415L49780N15479R0100k50084M19504j42828m73751n7901j83817
9041B54977o8410J0785l33844L37558N2037l50915P67047K35525j41786j75180
9031E87794p9517N01001m37307m68573q5189k53830M71829Q287K61435k0983m16489
$$ plain form
9020 68458 -28777 204066 124409 -18481 273009 447634 1021188 1106480 1049456 864060 367458
9009 367458 242586 787705 672774 394694 53412 631612 922371 642729 563362 738645
8999 738645 629349 818820 890889 498380 711573 427734 680206 900476 971135 279378
8989 279378 49450 -4318 -54696 821832 1014670 422807 355832 427791 638610 423841
8979 423841 637622 602938 115518 627130 786452 138439 214571 208104 144029 871615 1014633
8968 1014633 479988 238405 318391 527981 150671 389847 193421 -103803 -88093 -425431
8958 -425431 110545 234904 213787 610882 646638 502129 211759 282758 596572 202646
8948 202646 364660 71628 743865 683461 365187 160135 409471 639911 953716 974619
$$ packed form
9020F8458r7235K32843p9657j42890K91490J74625N73554Q5292n7024j85396m96602
9009C67458j24872N45119j14931k78080l41282N78200K90759k79642p9367J75283
8999G38645j09296J89471P2069l92509K13193k83839K52472K20270P0659o91757
8989B79378k29928n3768n0378Q76528J92838n91863o6975P1959K10819k14769
8979D23841K13781l4684m87420N11612J59322o48013P6132o467o4075P27586J43018
8968A014633n34645k41583P9986K09590l77310K39176j96426k97224J5710l37338
8958d25431N35976J24359k1117L97095L5756j44509k90370P0999L13814l93926
8948B02646J62014k93032O72237o0404l18274k05052K49336K30440L13805K0903
$$ plain form
8938 974619 498312 458862 751317 698627 499464 64126 221634 646288 610413 502135
8928 502135 258843 513336 409918 544976 580262 62888 -236372 66799 137786 324801
8918 324801 -402742 -206133 -46514 664759 139394 457903 780609 509049 578255 867923
8908 867923 658911 331264 473340 1018504 1029841 429572 737265 248171 528510 237869
8898 237869 237588 283526 681459 926942 124689 -378436 231861 -56303 69732 517976
8888 517976 497546 587948 282613 390304 674542 1031588 967665 534082 1009934 1263885
8878 1263885 1055927 955251 520521 588150 805912 741822 30002 74714 570875 513747
8868 513747 1292401 1084928 718897 866843 950387 219543 -345927 -138747 395508 904169
$$ packed form
8938I74619m76307l9450K92455n2690j99163m35338J57508M24654l5875j08278
8928E02135k43292K54493j03418J35058L5286n17374k99260L03171P0987J87015
8918C24801p27543J96609J59619P11273n25365L18509L22706k71560O9206K89668
8908H67923k09012l27647J42076N45164J1337o00269L07693m89094K80339k90641
8898B37869k81M5938L97933K45483q02253n03125O10297k88164J26035M48244
8888E17976k0430R0402l05335J07691K84238L57046o3923m33583M75852K53951
8878A263885k07958j00676m34730O7629K17762o4090p11820M4712M96161n7128
8868E13747P78654k07473l66031J47946Q3544p30844n65470K07180N34255N08661
$$ plain form
8858 904169 1206282 685915 342624 938526 855318 572457 664366 565017 419096 589065
8848 589065 772596 557655 963812 847337 490459 704355 1060650 1476840 1843968 1706564
8838 1706564 1235662 697691 845566 774392 589956 1090875 452660 914907 868427 573662
8828 573662 891509 842001 642957 750920 658056 641551 417248 308327 770519 893157
8818 893157 627365 418241 578409 635901 863178 516808 301963 627135 767893 658175
8808 658175 852356 1252459 720066 601509 625407 501328 1139527 1421819 611310 598979
8798 598979 704857 527889 471804 1100926 700621 448742 309888 285624 351191 580224
8788 580224 734250 550808 612383 318431 311956 684988 1152631 336449 431059 685871
$$ packed form
8858I04169L02113n20367l43291N95902q3208k82861R1909r9349j45921J69969
8848E89065J83531k14941M06157j16475l56878K13896L56295M16190L67128j37404
8838A706564m70902n37971J47875p1174j84436N00919o38215M62247m6480k94765
8828E73662L17847m9508j99044J07963r2864j6505k24303j08921M62192J22638
8818H93157k65792k09124J60168N7492K27277l46370k14845L25172J40758j09718
8808F58175J94181M00103n32393j18557K3898j24079O38199K82292q10509j2331
8798E98979J05878j76968n6085O29122m00305k51879j38854k4264O5567K29033
8788E80224J54026j83442O1575k93952o475L73032M67643q16182R4610K54812
$$ plain form
8778 685871 610378 1044189 1497536 1002649 863694 995414 569335 447757 863785 404546
8768 404546 46505 270969 256448 185430 155689 308229 619523 620163 1309338 1212794 672389
8757 672389 961716 1105527 1158637 1079770 1030647 1046246 1493824 1443398 1265549 1346390 1124508
8746 1124508 104391 733833 1456701 850878 740225 784713 857129 975427 1681727 1321511
8736 1321511 1671886 1612712 1776285 1538717 774973 1375591 1657204 1762406 1134891 1332950
8726 1332950 1541033 1396917 933929 588167 1286117 932767 1043695 1788002 1656006 1560242
8716 1560242 1569458 1383386 1550692 1862748 1598095 1658754 1708977 1362064 1173891 1861154
8706 1861154 2640179 2492765 2825248 3092044 2414098 2160925 2211562 2436385 2127160 2350997
$$ packed form
8778F85871p5493M33811M53347m94887j38955J31720m26079j21578M16028m59239
8768D04546l58041K24464j4521p1018k9741J52540L11294O40O89175r6544n40405
8757F72389K89327J43811N3110p8867m9123J5599M47578n0426j77849Q0841k21882
8746A124508j020117O29442P22868o05823j10653M4488P2416J18298P06300l60216
8736A321511L50375n9174J63573k37568p63744O00618K81613J05202o27515J98059
8726A332950K08083j44116m62988l45762O97950l53350J10928P44307j31996r5764
8716A560242R216j86072J67306L12056k64653O0659N0223l46913j88173O87263
8706A861154P79025j47414L32483K66796o77946k53173N0637K24823l09225K23837
$$ plain form
8696 2350997 2430147 3077973 3356759 3508514 3074508 3186580 3274396 3127674 2893819 2828890
8686 2828890 2637341 2455179 2657310 2585059 2860279 3242730 2597075 2547582 3460744 2585620
8676 2585620 2445596 2765509 2652082 2456285 2225818 2719583 2686198 2530520 2684023 2955731
8666 2955731 3131189 2901875 3255056 2850918 3405252 3400434 2967682 4092218 4059393 3583425
8656 3583425 3549784 3934335 3783052 4085827 4396442 3973020 3854008 3806369 3833297 3592510
8646 3592510 3507706 3511562 3385890 3088926 3149033 3823968 4358516 3604604 3024700 3217417
8636 3217417 3351796 3615648 3782127 2782088 3036434 3098516 3215009 2903998 2722668 3896775
8626 3896775 3889215 4012411 4280866 3516613 3755671 4171568 3428052 3411569 3598898 3259716
$$ packed form
8696B350997P9150O47826K78786J51755m34006J12072Q7816j46722k33855o4929
8686B828890j91549j82162K02131p2251K75220L82451o45655m9493R13162q75124
8676B585620j40024L19913j13427j95797k30467M93765l3385j55678J53503K71708
8666B955731J75458k29314L53181m04138N54334m818m32752J124536l2825m75968
8656C583425l3641L84551j51283L02775L10615m23422j19012m7639K6928k40787
8646C592510q4804L856j25672k96964O0107O74935N34548p53912n79904J92717
8636C217417J34379K63852J66479j000039K54346O2082J16493l11011j81330J174107
8626C896775p560J23196K68455p64253K39058M15897p43516j6483J87329l39182
$$ plain form
8616 3259716 2952425 3246660 3497846 3797979 3881767 3390817 3766341 3875768 4266355 5084212
8606 5084212 4536329 3820804 4357910 4659455 5211065 4879300 4860658 4537873 4742588 4616321
8596 4616321 4425957 5050057 4591674 4213085 3966612 3857258 3921705 3496089 3426699 3607138
8586 3607138 4150913 4048587 4017808 4244631 4024748 3850792 3987693 4187980 4310822 4349266
8576 4349266 4578443 4842298 3985424 4417099 4281175 3752644 3851529 4463847 4040266 4026917
8566 4026917 4783184 4993953 4719310 4358136 4880637 5092022 5441103 5013128 4358019 4193461
8556 4193461 4938006 4728602 4497894 5119137 4812888 4541821 4775092 5366542 4465158 4447365
8546 4447365 4683002 4827548 5614647 4729258 4080291 4700134 5072010 5224334 5288197 5365368
$$ packed form
8616C259716l07291K94235K51186L00133Q3788m90950L75524J09427L90587Q17857
8606E084212n47883p15525N37106L01545N51610l31765j8642l22785K04715j26267
8596D616321j90364O24100m58383l78589k46473j09354O4447m25616o9390J80439
8586C607138N43775j02326l0779K26823k19883j73956J36901K00287J22842L8444
8576D349266K29177K63855q56874M31675j35924n28531R8885O12318m23581j3349
8566D026917P56267K10769k74643l61174N22501K11385L49081m27975o55109j64558
8556D193461P44545k09404k30708O21243l06249k71067K33271N91450r01384j7793
8546D447365K35637J44546P87099q85389o48967O19843L71876J52324O3863P7171
$$ plain form
8536 5365368 5166884 5216806 5678388 6198144 6251997 6120943 5931816 6496278 6460465 5595660
8526 5595660 5437772 5731486 5815611 6292163 5836848 6127212 6252314 5726182 5192599 5391738
8516 5391738 5568002 5421742 5754594 5818441 5277158 5330618 5455778 5945820 6032080 5952864
8506 5952864 5466329 5185218 5748621 6662531 6535046 5980153 5854994 5722364 6072557 6264832
8496 6264832 6362348 6631646 6864109 6641098 6972165 6523096 6663532 6682749 6159347 6623751
8486 6623751 6582157 6020006 5917153 6565784 6977482 6894472 7181678 7182521 7565036 7513998 6886859
8475 6886859 7631564 7807047 7349846 6979738 7183864 7648238 8181481 8071217 7603817 7948091
8465 7948091 8243386 7950471 8290185 8744457 8332400 7826972 7796427 8537688 8949555 8475369
$$ packed form
8536E365368j98484M9922M61582N19756N3853j31054j89127N64462l5813q64805
8526E595660j57888K93714Q4125M76552m55315K90364J25102n26132n33583J99139
8516E391738J76264j46260L32852O3847n41283N3460J25160M90042Q6260p9216
8506E952864m86535k81111N63403R13910j27485n54893j25159j32630L50193J92275
8496F264832R7516K69298K32463k23011L31067m49069J40436J9217n23402M64404
8486F623751m1594n62151j02853O48631M11698q3010K87206Q43L82515n1038o27139
8475F886859P44705J75483m57201l70108K04126M64374N33243j10264m67400L44274
8465G948091K95295k92915L39714M54272m12057n05428l0545P41261M11867m74186
$$ plain form
8455 8475369 8121914 8641478 9064936 9358390 9070363 9127860 9373932 8606104 8371617 9466193
8445 9466193 9607894 10062949 9533534 9379396 9633527 10313176 10334970 10110087 11066894 11488308
8435 11488308 10400194 10394610 10901553 10916874 10766164 11149626 10543829 11079976 11010296 10617548
8425 10617548 11267433 10835441 10602200 10545362 11555895 12033697 11797854 11904723 12150308
8416 12150308 11975911 12248708 12894148 12649372 12642233 13630435 13457016 13872710 14566158 14146290
8406 14146290 14623694 14554135 14228038 14348395 14653962 14766489 14914570 15271001 15281164 15319931
8396 15319931 16100865 16119244 16488535 16436125 16463011 16737705 16914664 17311116 17124962 16879156
8386 16879156 17599445 17536195 18140861 19043633 18728999 19254486 19975226 20533973 20604557 20905968
$$ packed form
8455H475369l53455N19564M23458K93454k88027N7497K46072p67828k34487J094576
8445I466193J41701M55055n29415j54138K54131O79649K1794k24883R56807M21414
8435A1488308j088114n584N06943J5321j50710L83462o05797N36147o9680l92748
8425A0617548O49885m31992k33241n6838J010533M77802k35843J06869K45585
8416A2150308j74397K72797O45440k44776p139R88202j73419M15694O93448m19868
8406A4146290M77404o9559l26097J20357L05567J12527J48081L56431J0163L8767
8396A5319931P80934J8379L69291n2410K6886K74694J76959L96452j86154k45806
8386A6879156P20289o3250O04666R02772l14634N25487P20740N58747P0584L01411
$$ plain form
8376 20905968 20847476 21477534 22427232 22496185 22267056 22952053 24100100 24298832 24446381 25309234
8366 25309234 25551766 25993121 25400485 25381779 26503574 27381900 27828938 28396326 28626527
8357 28626527 29115953 29848739 30696428 31438782 30854859 31578187 32985155 33576899 34343114
8348 34343114 35380743 36680943 36807918 38336219 38774230 38821437 39949743 41500045 43161416
8339 43161416 45001150 46481930 47871283 49432107 50804478 52317926 53954598 55792544
8331 55792544 58115812 60520696 62690893 64808909 67037677 69296663 72581819 75681871
8323 75681871 78686180 81852013 85251526 89246242 93463074 97575806 102893518 108606786
8315 108606786 115409321 123098098 131332627 140681281 151914680 164091260 175397533 186704026
$$ packed form
8376B0905968n8492O30058R49698O8953k29129O84997J148047J98732J47549Q62853
8366B5309234K42532M41355n92636j8706J121795Q78326M47038N67388K30201
8357B8626527M89426P32786Q47689P42354n83923P23328J406968N91744P66215
8348C4343114J037629J300200J26975J528301M38011M7207J128306J550302J661371
8339D3161416J839734J480780J389353J560824J372371J513448J636672J837946
8331E5792544K323268K404884K170197K118016K228768K258986L285156L100052
8323G5681871L004309L165833L399513L994716M216832M112732N317712N713268
8315A08606786O802535P688777Q234529R348654J1233399J2176580J1306273J1306493
$$ plain form
8307 186704026 195701884 203058569 207416832 208613525 209492378 209130361 206379178 202713983
8299 202713983 196812528 187984392 178402086 168924378 159740273 152935070 146763014 142135496
8291 142135496 139127324 136649235 135145681 133952498 134113658 135259889 136319589 137421709
8283 137421709 140058061 144032115 147860068 152924946 159003353 165563706 172822813 181798674
8275 181798674 192534941 204744203 217832442 232016441 246689573 260381115 271822713
8268 271822713 280344989 286124280 290813531 293981275 295438981 294816883 293919887 291331177
8260 291331177 286336389 281423777 276976090 273794366 271829933 269826364 267121341 264135804
8252 264135804 259887264 253794845 246661193 239640290 230346488 218458363 206976809 195739680
$$ packed form
8307A86704026Q997858P356685M358263J196693Q78853l62017k751183l665195
8299B02713983n901455q828136r582306r477708r184105o805203o172056m627518
8291A42135496l008172k478089j503554j193183J61160J146231J059700J102120
8283A37421709K636352L974054L827953N064878O078407O560353P259107Q975861
8275A81798674J0736267J2209262J3088239J4183999J4673132J3691542J1441598
8268B71822713Q522276N779291M689251L167744J457706o22098q96996k588710
8260B91331177m994788m912612m447687l181724j964433k003569k705023k985537
8252B64135804m248540o092419p133652p020903r293802j1888125j1481554j1237129
$$ plain form
8244 195739680 184433160 173982336 165711366 158339260 151559814 146264334 142103550 138482445
8236 138482445 136634526 135008040 133221764 132615192 132811094 133745156 134670732 136015794 138384900
8227 138384900 141646709 146588376 152401540 158434465 165992053 175166080 185880270 196993579
8219 196993579 208468753 219606000 230262757 238979961 244705572 247118737 246650680 242974360
8211 242974360 237834093 230414920 219755886 206743304 192215941 177119841 163169512
8204 163169512 150025243 137860428 127588681 118831949 109530534 102508540 96358335 90452373
8196 90452373 85521916 81659242 77176987 75526972 73501750 66136777 63428396 60747780
8188 60747780 58120733 55919673 54379353 52421449 50489492 49011328 47842709 45918093
$$ packed form
8244A95739680j1306520j0450824q270970p372106o779446n295480m160784l621105
8236A38482445j847919j626486j786276o06572J95902R34062R25576J345062K369106
8227A38384900L261809M941667N813164O032925P557588R174027J0714190J1113309
8219A96993579J1475174J1137247J0656757Q717204N725611K413165m68057l676320
8211B42974360n140267p419173j0659034j3012582j4527363j5096100j3950329
8204A63169512j3144269j2164815j0271747q756732r301415p021994o150205n905962
8196I0452373m930457l862674m482255j650015k025222p364973k708381k680616
8188F0747780k627047k201060j540320j957904j931957j478164j168619j924616
$$ plain form
8180 45918093 45112103 43877505 42160933 40972037 40234525 39269842 38168620 38310429 37593224
8171 37593224 36550457 35621643 35361808 34030827 33654074 33520519 32380018 31821310 31823174
8162 31823174 30719175 30827652 30295236 29762714 29345151 28596482 28529497 28494159 28489536 28283508
8152 28283508 27596083 26567190 26288047 26330791 26794317 25872765 24858580 25073255 25461673
8143 25461673 24899228 24736273 25470292 24876238 24940602 24721189 24330571 25076340 25210098 24480357
8133 24480357 24590256 25666824 25309996 24578603 24988523 24863570 24386980 24880144 24870263 24718778
8123 24718778 24986941 24703281 24712057 24756375 24987763 24824096 24959674 25796501 25683505 26056269
8113 26056269 26955781 26631373 26700331 27236626 27628576 27252629 27100995 26938510 26860982 28074809
$$ packed form
8180D5918093q05990j234598j716572j188896p37512r64683j101222J41809p17205
8171C7593224j042767r28814k59835j330981l76753j33555j140501n58708J864
8162C1823174j103999J08477n32416n32522m17563p48669o6985l5338m623k06028
8152B8283508o87425j028893k79143M2744M63526r21552j014185K14675L88418
8143B5461673n62445j62955P34019n94054O4364k19413l90618P45769J33758p29741
8133B4480357J09899J076568l56828p31393M09920j24953m76590M93164r881j51485
8123B4718778K68163k83660Q776M4318K31388j63667J35578Q36827j12996L72764
8113B6056269Q99512l24408O8958N36295L91950l75947j51634j62485p7528J213827
$$ plain form
8103 28074809 28621181 28306000 28412545 28876097 28998848 28878420 29794174 29681887 30429182
8094 30429182 32310484 31859771 31240432 32419761 33372305 34488474 35706609 36271894 36939892
8085 36939892 37850797 38853739 39680860 40365853 41345905 42050272 42943193 44436158 45414591
8076 45414591 46691154 47908931 48883223 51042971 53652163 55475720 56599589 58654951
8068 58654951 61071830 63098322 66937911 70800004 74890016 79527660 84863810 90475157
8060 90475157 97231216 104022995 110827207 117115291 121755520 124176197 125266284 126435908
8052 126435908 126916778 126618015 125335323 122904699 118903380 113877496 108737450 103746976
8044 103746976 100392861 97840142 95934455 94565179 93611860 92924345 93167522 93866561 94845952
$$ packed form
8103B8074809N46372l15181J06545M63552J22751j20428R15754j12287P47295
8094C0429182J881302m50713o19339J179329R52544J116169J218135N65285O67998
8085C6939892R10905J002942Q27121O84993R80052P04367Q92921J492965R78433
8076D5414591J276563J217777R74292K159748K609192J823557J123869K055362
8068E8654951K416879K026492L839589L862093M090012M637644N336150N611347
8060I0475157O756059O791779O804212O288084M640229K420677J090087J169624
8052A26435908M80870k98763j282692k430624m001319n025884n140046m990474
8044A03746976l354115k552719j905687j369276r53319o87515K43177O99039R79391
$$ plain form
8035 94845952 97133884 99374713 101370428 104096170 108430411 113135545 118514918 124929413
8027 124929413 132202610 140703666 150913904 162356799 173414334 183569091 192021191
8020 192021191 198562243 203253565 205432726 205155738 203616106 201560723 196572924 189340179
8012 189340179 180408972 170274336 159718233 149230220 138643946 129791125 122446873
8005 122446873 116388717 110677707 106005163 102620495 99164125 96665793 95012774 93649883
7997 93649883 92509860 92062552 90931097 91464738 93512237 94901276 97102877 100720693
7989 100720693 104329994 108057807 113466439 119691706 126458824 133233137 138341301 142441706
7981 142441706 145252328 147174664 148281011 149264921 151339323 151463901 149567138 143978525
$$ packed form
8035I4845952K287932K240829J995715K725742M334241M705134N379373O414495
8027A24929413P273197Q501056J0210238J1442895J1057535J0154757Q452100
8020A92021191O541052M691322K179161k76988j539632k055383m987799p232745
8012A89340179q931207j0134636j0556103j0488013j0586274q852821p344252
8005A22446873o058156n711010m672544l384668l456370k498332j653019j362891
7997I3649883j140023m47308j131455N33641K047499J389039K201601L617816
7989A00720693L609301L727813N408632O225267O767118O774313N108164M100405
7981A42441706K810622J922336J106347R83910K074402J24578j896763n588613
$$ plain form
7973 143978525 134989468 124801509 113218644 102594724 93929934 86635098 80569757 75652899
7965 75652899 71279498 67040689 62274301 59085405 56667416 54097851 52040738 50181288
7957 50181288 48484211 47043815 45238734 44043843 43345281 42128693 40476954 40121614
7949 40121614 39504701 38297268 38179307 37791429 37095291 36290413 35919253 35258878 35443063
7940 35443063 35061567 34645105 34287466 34205173 34067614 33312360 33474941 33157172 33064553 33210861
7930 33210861 32949043 32655059 33180438 33322791 32702656 32561466 33158931 33288004 33839311
7921 33839311 34533091 34088306 34356527 35477031 35752739 36323335 37343791 37631346 37613901
7912 37613901 38541454 39848361 40800119 42153737 42224938 42619584 44081520 45362848 46476109
$$ packed form
7973A43978525q989057j0187959j1582865j0623920q664790p294836o065341m916858
7965G5652899m373401m238809m766388l188896k417989k569565k057113j859450
7957E0181288j697077j440396j805081j194891o98562j216588j651739l55340
7949D0121614o16913j207433j17961l87878o96138q04878l71160o60375J84185
7940C5443063l81496m16462l57639q2293j37559p55254J62581l17769r2619J46308
7930C3210861k61818k93984N25379J42353o20135j41190N97465J29073N51307
7921C3839311O93780m44785K68221J120504K75708N70596J020456K87555j7445
7912C7613901R27553J306907R51758J353618P1201L94646J461936J281328J113261
$$ plain form
7903 46476109 47612597 49171243 51002946 52084286 53017549 55082954 57015490 58949311
7895 58949311 61085459 63323571 66301661 68979893 72216972 76656913 81074747 85837146
7887 85837146 91326248 97804976 105020755 113560745 123142163 132221457 140338150 146651600
7879 146651600 151080143 152992227 153809602 153742864 152301248 149938259 145711587 139155722
7871 139155722 130967691 123308136 116359754 110281851 105612537 102174315 99481150 97230641
7863 97230641 95295057 94606489 95354547 96161281 96555642 97583590 98880705 100226545 102585507
7854 102585507 106374116 110516995 116251233 122357001 128798577 136195481 146137558 157403633
7846 157403633 167725818 178574763 187802028 194318883 198173289 199308642 198498065 196427230
$$ packed form
7903D6476109J136488J558646J831703J081340R33263K065405J932536J933821
7895E8949311K136148K238112K978090K678232L237079M439941M417834M762399
7887H5837146N489102O478728P215779Q539990R581418R079294Q116693O313450
7879A46651600M428543J912084Q17375o6738j441616k362989m226672o555865
7871A39155722q188031p659555o948382o077903m669314l438222k693165k250509
7863I7230641j935584o88568P48058Q06734L94361J027948J297115J345840K358962
7854A02585507L788609M142879N734238O105768O441576P396904R942077J1266075
7846A57403633J0322185J0848945R227265O516855L854406J135353q10577k070835
$$ plain form
7838 196427230 191729608 184666595 175502752 165022850 152697627 139945742 128919708
7831 128919708 119100748 109994130 103142935 97347306 91821380 87855713 83793917 79450955
7823 79450955 76918702 74652166 73081629 72090231 71558870 70926119 69927590 71098125 72241503
7814 72241503 72855352 74616394 77002691 80097047 83229524 86711048 90286897 92859537
7806 92859537 93864104 93394571 92247068 90611775 88981865 85863972 81513257 76471613
7798 76471613 70998927 64686913 58752988 54730466 50566028 47105895 43844224 41018946
7790 41018946 39185775 36867801 35574827 34005117 29913077 28817859 28170513 26686798
7782 26686798 25902138 25038796 23734746 22680183 22306904 21976121 21783820 20989239 20104108
$$ packed form
7838A96427230m697622p063013r163843j0479902j2325223j2751885j1026034
7831A28919708r818960r106618o851195n795629n525926l965667m061796m342962
7823G9450955k532253k266536j570537r91398n31361o32751r98529J170535J143378
7814G2241503O13849J761042K386297L094356L132477L481524L575849K572640
7806I2859537J004567m69533j147503j635293j629910l117893m350715n041644
7798G6471613n472686o312014n933925m022522m164438l460133l261671k825278
7790D1018946j833171k317974j292974j569710m092040j095218o47346j483715
7782B6686798p84660q63342j304050j054563l73279l30783j92301p94581q85131
$$ plain form
7773 20104108 19389878 18591263 17688771 17664761 17195998 16736192 15771167 15928571 15442055 15296505
7763 15296505 14569461 13905385 13919184 13207669 12858545 12428287 12205556 12499232 12022866 11555572
7753 11555572 11203766 11219139 11315917 11124677 11328721 10602036 9979222 9939015 9693027 9637607
7743 9637607 9590461 8884569 9040634 8947561 8816820 8259040 7965908 8359627 8276851 7473962
7733 7473962 7640970 7247715 6937925 7860351 7251791 7565948 7068311 6502640 6511258 6879598
7723 6879598 6805336 6263888 6589748 7075142 6938255 6383256 6019805 5548591 5826059 5896223
7713 5896223 5171658 5470664 5700262 5057560 5100690 4752099 4912191 4994552 5437487 4827468
7703 4827468 3986520 4150969 3923086 3843084 4223896 5004195 4574895 4173181 4701592 5109419
$$ packed form
7773B0104108p14230p98615r02492k4010m68763m59806r65025J57404m86516j45550
7763A5296505p27044o64076J3799p11515l49124m30258k22731K93676m76366m67294
7753A1555572l51806J5373R6778j91240K04044p26685o22814m0207k45988n5420
7743I637607m7146p05892J56065r3073j30741n57780k93132L93719q2776q02889
7733G473962J67008l93255l09790R22426o08560L14157m97637n65671Q618L68340
7723F879598p4262n41448L25860M85394j36887n54999l63451m71214K77468P0164
7713E896223p24565K99006K29598o42702M3130l48591J60092Q2361M42935o10019
7703D827468q40948J64449k27883q0002L80812P80299m29300m01714N28411M07827
$$ plain form
7693 5109419 4520833 4214276 4187959 3863482 3631335 3448766 3307677 3645223 3705355 3404606
7683 3404606 3626609 3401963 3603859 4256013 4419568 3148901 3197408 3318102 3153172 3376844
7673 3376844 3317586 3118045 3119090 3617635 3876164 3596618 3380957 3436234 3259015 3146330
7663 3146330 3500850 3346093 3049648 3329739 2609258 2610172 2864299 3310334 3637639 2830636
7653 2830636 2178381 2375367 2458613 2937377 2654661 2918645 2602919 2484356 2727004 2615856
7643 2615856 3011320 2907315 2513153 2236723 2123395 2396910 2684546 3018262 2788489 2990311
7633 2990311 3341853 3242276 3117659 3155672 3181392 2995042 2716496 2448469 2538628 2989050
7623 2989050 3128179 2545086 2239604 2574224 1982131 2371919 2860534 2483847 2171603 1970344
$$ packed form
7693E109419n88586l06557k6317l24477k32147j82569j41089L37546O0132l00749
7683C404606K22003k24646K01896O52154J63555j270667M8507J20694j64930K23672
7673C376844n9258j99541J045M98545K58529k79546k15661N5277j77219j12685
7663C146330L54520j54757k96445K80091p20481R14K54127M46035L27305q07003
7653B830636o52255J96986Q3246M78764k82716K63984l15726j18563K42648j11148
7643B615856L95464j04005l94162k76430j13328K73515K87636L33716k29773K01822
7633B990311L51542r9577j24617L8013K5720j86350k78546k68027R0159M50422
7623B989050J39129n83093l05482L34620n92093L89788M88615l76687l12244k01259
$$ plain form
7613 1970344 1847647 1325106 2660419 2360279 1800672 1403772 1641066 2192540 2325724
7604 2325724 1615337 1620380 1811537 2013423 1784031 1724482 1746011 1520770 1996007 1532646
7594 1532646 1609173 1437051 1445485 1340405 1314751 1476574 1018495 965561 1752051 2275254
7584 2275254 1569666 1251493 973974 864328 1486494 1357906 969870 1373049 1252095 1491750
7574 1491750 947477 749265 1198684 764579 304344 415197 281032 729435 539453 586925
7564 586925 486182 114884 201463 754083 1558127 842341 501858 645483 277957 340965
7554 340965 311742 563876 750280 887509 1063138 1048057 1408907 1063301 267128 612614
7544 612614 938571 883393 781885 1053040 991016 772556 626821 -257701 -8068 315535
$$ packed form
7613A970344j22697n22541J335313l00140n59607l96900K37294N51474J33184
7604B325724p10387N043J91157K01886k29392n9549K1529k25241M75237m63361
7594A532646P6527j72122Q434j05080k5654J61823m58079n2934P86490N23203
7584B275254p05588l18173k77519j09646O22166j28588l88036M03179j20954K39655
7574A491750n44273j98212M49419m34105m60235J10853j34165M48403j89982M7472
7564E86925j00743l71298Q6579N52620Q04044p15786l40483J43625l67526O3008
7554C40965k9223K52134J86404J37229J75629j5081L60850l45606p96173L45486
7544F12614L25957n5178j01508K71155o2024k18460j45735q84522K49633L23603
$$ plain form
7534 315535 875006 644875 483958 730929 1097772 1176858 1278300 889730 924751 506950
7524 506950 148705 485814 669153 408033 638216 288556 497160 414239 139332 -59012
7514 -59012 536302 1237674 824627 830930 779152 688805 580930 655040 1256858 1310228 1472825
7503 1472825 1725182 966493 -89272 170933 826675 842267 1277191 991582 922967 1475646
7493 1475646 1530434 1311388 1402488 531732 502737 1348340 783544 1175087 1514848 1994834
7483 1994834 1891618 1560170 1327291 1281351 1440468 1114850 962698 819991 668809 579345
7473 579345 942665 890381 1391867 719272 639738 1049111 1020912 916622 840804 1153055
7463 1153055 940019 766371 1231511 1124247 1015850 707313 505921 807633 1097408 1447908
$$ packed form
7534C15535N59471k30131j60917K46971L66843P9086J01442l88570L5021m17801
7524E06950l58245L37109J83339k61120K30183l49660K08604q2921k74907j98344
7514e9012N95314P01372m13047O303n1778r0347j07875P4110O01818N3370J62597
7503A472825K52357p58689j055765K60205O55742J5592M34924k85609o8615N52679
7493A475646N4788k19046R1100q70756k8995Q45603n64796L91543L39761M79986
7483A994834j03216l31448k32879m5940J59117l25618j52152j42707j51182q9464
7473E79345L63320n2284N01486o72595p9534M09373k8199j04290p5818L12251
7463A153055k13036j73648M65140j07264j08397l08537k01392L01712K89775L50500
$$ plain form
7453 1447908 1282449 1229229 1374830 943636 1144246 916843 1092566 938101 638386 659181
7443 659181 654373 848688 818524 533523 526831 603165 -95705 -581444 -639371 -223954 265117
7432 265117 532056 73692 237646 279883 262921 176625 581635 624411 -335594 39513
7422 39513 532728 430030 882095 484450 25946 278753 1201306 461046 451020 716074
7412 716074 511135 600798 1196450 1110153 464270 527251 -83333 -218340 362336 436875
7402 436875 314820 1046734 219126 271992 626397 529478 569930 44039 304704 89690
7392 89690 -101450 506311 180958 96699 194331 111087 -448423 718559 771489 472439
7382 472439 787499 157426 -279092 1000 696681 5447 483954 553587 -789027 -672368
$$ packed form
7453A447908j65459n3220J45601m31194K00610k27403J75723j54465k99715K0795
7443F59181m808J94315l0164k85001o692P6334o98870m85739n7927M15417M89071
7432B65117K66939m58364J63954M2237j6962q6296M05010M2776r60005L75107
7422C9513M93215j02698M52065l97645m58504K52807R22553p40260j0026K65054
7412G16074k04939Q9663N95652q6297o45883O2981o10584j35007N80676P4539
7402D36875j22055P31914q27608N2866L54405r6919M0452n25891K60665k15014
7392H9690j91140O07761l25353q4259R7632q3244n59510J166982N2930k99050
7382D72439L15060o30073m36518K80092O95681o91234M78507O9633j342614J16659
$$ plain form
7372 -672368 -455019 -204347 174324 362107 374148 439721 83893 -86673 -608157 -161239
7362 -161239 387456 -251421 -384382 -351441 -399704 307701 1119647 664037 529377 760909
7352 760909 -58872 -1000229 -139666 -213306 -303058 -437472 -372992 -30210 540837 926956
7342 926956 153370 99293 -4267 -253943 186936 433691 780906 739059 569624 273434
7332 273434 -55763 431256 364816 477333 1067055 951241 96206 -377229 -569301 -739686
7322 -739686 106003 710841 41421 749916 1039088 899979 525972 677951 241314 111729
7312 111729 390680 511481 672230 571710 509235 910190 704047 392548 249118 414148
7302 414148 699381 725398 852052 792051 1301570 678377 223473 161177 199505 491868
$$ packed form
7372f72368K17349K50672L78671J87783J2041O5573l55828j70566n21484M46918
7362a61239N48695o38877j32961L2941m8263P07405Q11946m55610j34660K31532
7352G60909q19781r41357Q60563p3640q9752j34414O4480L42782N71047L86119
7342I26956p73586n4077j03560k49676M40879K46755L47215m1847j69435k96190
7332B73434l29197M87019o6440J12517N89722j15814q55035m73435j92072j70385
7322g39686Q45689O04838o69420P08495K89172j39109l74007J51979m36637j29585
7312A11729K78951J20801J60749j00520o2475M00955k06143l11499j43430J65030
7302D14148K85233K6017J26654o0001N09519o23193m54904o2296L8328K92363
$$ plain form
7292 491868 1445951 895827 769540 98316 -131321 70221 -332949 -245250 664616 212730
7282 212730 -282546 56776 92775 259164 -194690 493711 470464 137580 -473434 -134534
7272 -134534 652794 655807 821087 427512 324806 362365 393340 -194140 289991 87839
7262 87839 -319295 193357 1089269 863307 605716 641517 988559 1456010 1807983 1043970
7252 1043970 686434 715612 824653 542192 379634 253712 194954 708914 302759 548899
7242 548899 591567 552113 667250 607879 487459 81455 139864 402782 393750 870572 736087
7231 736087 821602 365600 460739 878643 602088 792947 634099 457990 422578 262405
7221 262405 905818 682765 878874 867697 262243 643484 592207 963502 974951 1312406
$$ packed form
7292D91868R54083n50124j26287o71224k29637K01542m03170Q7699R09866m51886
7282B12730m95276L39322L5999J66389m53854O88401k3247l32884o11014L38900
7272a34534P87328L013J65280l93575j02706L7559L0975n87480M84131k02152
7262H7839m07134N12652Q95912k25962k57591L5801L47042M67451L51973p64013
7252A043970l57536K9178J09041k82461j62558j25922n8758N13960m06155K46140
7242E48899M2668l9454J15137n9371j20420m06004N8409K62918r032M76822j34485
7231G36087Q5515m56002R5139M17904k76555J90859j58848j76109l5412j60173
7221B62405O43413k23053J96109j1177o05454L81241n1277L71295J1449L37455
$$ plain form
7211 1312406 1055884 322483 457799 -72232 3233 350059 601398 433085 745726 986211
7201 986211 1206132 920497 807906 655839 607491 832312 1148996 660736 893510 1031118
7191 1031118 353953 507602 1369740 1434781 990820 1167319 1029175 866370 910713 515359
7181 515359 399553 884685 1120748 1069439 1665401 1534690 1283686 1243815 956934 686177
7171 686177 414243 959125 561914 202932 328318 536799 545480 1079296 1569379 861853
7161 861853 486838 779794 472969 420266 1554536 1474268 1429020 1321683 819182 853938
7151 853938 687286 359575 861986 1628883 1053181 991341 1586451 1596905 1136989 1001221
7141 1001221 762767 769858 577341 828497 1077457 385782 1198933 1661244 787301 1065509
$$ packed form
7211A312406k56522p33401J35316n30031P5465L46826K51339j68313L12641K40485
7201I86211K19921k85635j12591j52067m8348K24821L16684m88260K32774J37608
7191A031118o77165J53649Q62138O5041m43961J76499j38144j62805M4343l95354
7181E15359j15806M85132K36063n1309N95962j30711k51004l9871k86881k70757
7171F86177k71934N44882l97211l58982J25386K08481Q681N33816M90083p07526
7161H61853l75015K92956l06825n2703J134270q0268m5248j07337n02501L4756
7151H53938j66652l27711N02411P66897n75702o1840N95110J0454m59916j35768
7141A001221k38454P091j92517K51156K48960o91675Q13151M62311q73943K78208
$$ plain form
7131 1065509 1008297 1158481 1607290 1004152 335941 1230961 2176386 1687657 1034707 1575638
7121 1575638 2385138 2125923 2235030 1680289 1437455 1723435 1099443 776651 1218956 1754580
7111 1754580 1170621 953702 848346 1260517 1597044 1783687 1959388 1717487 1403083 1258601
7101 1258601 1484944 2043530 1648646 1357081 1207499 1105326 1352345 1585544 2131751 1399916
7091 1399916 1825190 2049433 2159441 2433697 1708513 1624636 1954213 1732648 1684780 1841615
7081 1841615 2198167 2372117 1545311 1719814 1748477 1488630 2426826 2171536 1779646 2060845
7071 2060845 2248194 1546137 1092978 1351713 1907853 1934770 1616085 1908801 2020618 1797835
7061 1797835 1891598 2587323 2618886 2426531 2176012 2427941 2424319 2328110 1822591 1497070
$$ packed form
7131A065509n7212J50184M48809o03138o68211Q95020R45425m88729o52950N40931
7121A575638Q09500k59215J09107n54741k42834K85980o23992l22792M42305N35624
7111A754580n83959k16919j05356M12171L36527J86643J75701k41901l14404j44482
7101A258601K26343N58586l94884k91565j49582j02173K47019K33199N46207p31835
7091A399916M25274K24243J10008K74256p25184q3877L29577k21565m7868J56835
7081A841615L56552J73950q26806J74503K8663k59847R38196k55290l91890K81199
7071B060845J87349p02057m53159K58735N56140K6917l18685K92716J11817k22783
7061A797835R3763O95725L1563j92355k50519K51929l622r6209n05519l25521
$$ plain form
7051 1497070 1992592 1869875 1857770 1935854 1713202 2235161 1972631 1969935 2331766 2275239
7041 2275239 1940763 2344392 2254116 2171440 3312373 2654616 2223787 2371498 1953118 1547004
7031 1547004 2467559 2472731 2565286 3106544 2987053 2797886 2582710 2351905 1953774 2247641
7021 2247641 2137045 2485326 2322194 2639078 2482408 2448609 1887770 1912298 2942109 2881841
7011 2881841 2751628 2875520 2826997 2921265 3613838 3405671 3375123 2855625 2666282 2633878
7001 2633878 2305782 2586228 2487159 3044351 3728400 3407901 2908401 3089642 3225683 2573078
6991 2573078 3054373 3463978 3299766 3290965 3369743 3791246 3475351 3184322 3433984 3160416
6981 3160416 3118728 3229982 3314125 2996884 3448379 3436586 3005546 2929393 2663856 3406114
$$ packed form
7051A497070M95522j22717j2105P8084k22652N21959k62530k696L61831n6527
7041B275239l34476M03629r0276q2676J140933o57757m30829J47711m18380m06114
7031A547004R20555N172R2555N41258j19491j89167k15176k30805l98131K93867
7021B247641j10596L48281j63132L16884j56670l3799n60839K4528J029811o0268
7011B881841j30213J23892m8523R4268O92573k08167l0548n19498j89343l2404
7001B633878l28096K80446r9069N57192O84049l20499m99500J81241J36041o52605
6991B573078M81295M09605j64212q801P8778M21503l15895k91029K49662k73568
6981C160416m1688J11254Q4143l17241M51495j1793m31040p6153k65537P42258
$$ plain form
6971 3406114 3776788 3210393 3553990 4191112 3949350 3791155 3992994 3366781 3090288 3145760
6961 3145760 3272429 3170256 3023861 3429152 3588318 3817689 3977440 3789189 3422207 3525724
6951 3525724 3252398 3473924 3674886 3828684 4268505 4855368 4779702 4426240 4168595 4522488
6941 4522488 4653206 4028522 4045588 3712807 3273374 3812814 4202200 3997223 4030876 4016869
6931 4016869 4723221 4934296 4827974 5183643 4904910 5061941 5246893 5039164 4451022 4459740
6921 4459740 4889112 5242368 5139870 5052082 5144478 5122154 4711066 4631784 5107291 4814083
6911 4814083 4782444 5095764 5718737 5978999 6033319 6413154 5960048 4974500 5345874 5796797
6901 5796797 5875582 5749104 5097344 4234663 5213838 4921779 4903502 5093773 5179077 4920905
$$ packed form
6971C406114L70674n66395L43597O37122k41762j58195K01839o26213k76493N5472
6961C145760J26669j02173j46395M05291J59166K29371J59751j88251l66982J03517
6951C525724k73326K21526K00962J53798M39821N86863p5666l53462k57645L53893
6941D522488J30718o24684J7066l32781m39433N39440L89386k04977L3653j4007
6931D016869P06352K11075j06322L55669k78733J57031J84952k07729n88142Q718
6921D459740M29372L53256j02498q7788R2396k2324m11088p9282M75507k93208
6911D814083l1639L13320O22973K60262N4320L79835m53106r85548L71374M50923
6901E796797P8785j26478o51760q62681R79175k92059j8277J90271Q5304k58172
$$ plain form
6891 4920905 5585485 6041674 5720806 6874965 5979905 5752097 6925218 6302076 5763332
6882 5763332 6204580 5868929 5574759 6225655 5857732 6177136 6540089 6526859 6924275 6697408
6872 6697408 7045666 6846314 6516227 6501106 7067281 6807560 6870294 7120407 6800300 7073332
6862 7073332 7475167 6941460 7122545 6967282 6740283 7252514 7610653 7111899 6718125 7565522
6852 7565522 7404859 7173391 8025194 7850625 6780549 7112499 7287439 7358863 7929642 8447481
6842 8447481 7886162 7247193 8022193 7796406 7289126 7958816 8156448 7606440 8095851 8041053
6832 8041053 7647633 8737010 8262747 7067155 7971120 8966198 8551881 8916410 9106491
6823 9106491 8620469 8777180 9442051 9197534 8544439 9423779 9219635 9010641 9090736 9689327
$$ packed form
6891D920905O64580M56189l20868J154159q95060k27808J173121o23142n38744
6882E763332M41248l35651k94170O50896l67923L19404L62953j3230L97416k26867
6872F697408L48258j99352l30087j5121N66175k59721O2734K50113l20107K73032
6862G073332M01835n33707J81085j55263k26999N12231L58139m98754l93774Q47397
6852G565522j60663k31468Q51803j74569j070076L31950J74940P1424N70779N17839
6842H447481n61319o38969P75000k25787n07280O69690J97632n50008M89411n4798
6832H041053l93420J089377m74263j195592R03965R95078m14317L64529J90081
6823I106491m86022J56711O64871k44517o53095Q79340k04144k08994Q0095N98591
$$ plain form
6813 9689327 9698679 10972368 10771533 9348628 10143246 10510684 10193523 10411765 10108175 9584836
6803 9584836 10086240 11133128 10855177 10671504 11036125 10484164 10104263 10709902 10301318
6794 10301318 10458988 11389472 11270746 10561174 10745687 11700416 10868149 11335273 11947223
6785 11947223 11627317 12047624 12067207 12339575 12836226 12429260 12007285 11955392 11969728 12412100
6775 12412100 12462924 13227135 13692265 13142998 13262007 13159002 13015808 13614090 13969937 13867458
6765 13867458 14246116 14731658 14679586 14267815 14611627 14077720 14175230 15440387 15869361 15688586
6755 15688586 15919699 15480433 15251108 16188786 16284073 16356015 16463494 16188461 16764131 16523525
6745 16523525 16621657 16807184 17367704 17741710 17405506 17369092 17718929 17884132 18352190 18566310
$$ packed form
6813I689327R352J273689k00835j422905P94618L67438l17161K18242l03590n23339
6803I584836N01404J046888k77951j83673L64621n51961l79901O05639m08584
6794A0301318J57670R30484j18726p09572J84513R54729q32267M67124O11950
6785A1947223l19906M20307J9583K72368M96651m06966m21975n1893J4336M42372
6775A2412100N0824P64211M65130n49267J19009j03005j43194N98282L55847j02479
6765A3867458L78658M85542n2072m11771L43812n33907R7510J265157M28974j80775
6755A5688586K31113m39266k29325R37678R5287P1942J07479k75033N75670k40606
6745A6523525R8132J85527N60520L74006l36204l6414L49837J65203M68058K14120
$$ plain form
6735 18566310 18464495 18129271 17988327 17966444 18516636 18889633 19348627 19433450 19692292 19599698
6725 19599698 19371107 19909792 20350277 20820789 20398291 21190612 22022319 22424007 22944900
6716 22944900 21917012 21780946 21807026 22481785 22554767 22768614 23565226 22898370 22898463 23791122
6706 23791122 24440081 24579600 25018817 25404759 25871602 26303186 26244681 26761625 26933234 26680138
6696 26680138 27478088 27731466 28184740 29227569 29857533 29400638 29551834 29471144 29771197
6687 29771197 30371144 31337863 31410618 31713408 32434203 32085881 32364878 33140258 33341689 34376343
6677 34376343 34860980 35560432 35424400 36046604 36823381 36702904 37583312 38007553 38095267 38343668
6667 38343668 39052437 39151949 39790731 40870286 41176215 41848500 42628494 43139153 43076753 43745657
$$ packed form
6735A8566310j01815l35224j40944k1883N50192L72997M58994Q4823K58842r2594
6725A9599698k28591N38685M40485M70512m22498P92321Q31707M01688N20893
6716B2944900j027888j36066K6080O74759P2982K13847P96612o66856R3Q92659
6706B3791122O48959J39519M39217L85942M66843M31584n8505N16944J71609k53096
6696B6680138P97950K53378M53274J042829O29964m56895J51196q0690L00053
6687B9771197N99947R66719P2755L02790P20795l48322K78997P75380K01431J034654
6677C4376343M84637O99452j36032O22204P76777j20477Q80408M24241Q7714K48401
6667C8343668P08769R9512O38782J079555L05929O72285P79994N10659o2400O68904
$$ plain form
6657 43745657 44466381 45114573 45772891 46520611 46978469 47760571 48496888 48861232 49815315
6648 49815315 51066272 52005845 52166247 52689396 53437731 54415792 55676272 56588411 57037883
6639 57037883 57588361 58199350 59137790 60607171 61669888 62142433 62930084 63849317 65089302
6630 65089302 66561838 68103603 67765280 68182362 69471276 70877983 72456251 74103618
6622 74103618 75260279 77408952 78018927 78472876 79890699 81155487 82966138 84358391
6614 84358391 85284586 87017211 88204900 90031739 91957577 93339734 94149950 94999616 96451626
6605 96451626 98092910 99516711 100707422 102556454 104079279 106200041 107942829 109917813
6597 109917813 112171694 113756913 114935016 116594018 118355765 120652779 122797836 124551278
$$ packed form
6657D3745657P20724O48192O58318P47720M57858P82102P36317L64344R54083
6648D9815315J250957R39573J60402N23149P48335R78061J260480R12139M49472
6639E7037883N50478O10989R38440J469381J062717M72545P87651R19233J239985
6630F5089302J472536J541765l38323M17082J288914J406707J578268J647367
6622G4103618J156661K148673O09975M53949J417823J264788J810651J392253
6614H4358391R26195J732625J187689J826839J925838J382157Q10216Q49666J452010
6605I6451626J641284J423801J190711J849032J522825K120762J742788J974984
6597A09917813K253881J585219J178103J659002J761747K297014K145057J753442
$$ plain form
6589 124551278 126429824 127186097 128731689 130812060 133034412 134787310 136762211 138382750
6581 138382750 139976794 142041821 143360739 145151920 147053705 148881175 150309615 151911181
6573 151911181 153334404 155015573 155760393 157229387 158590499 159568240 161136874 162472863
6565 162472863 163207335 163860325 165267033 165383574 166016634 167380819 167593943 168027965 167854781
6556 167854781 167644044 168416444 168752513 168428685 168363147 168306265 167787576 166663510 166574276 165537886
6546 165537886 164881089 164242332 163430980 161913321 161175266 160168061 158982629 157587912 155956571
6537 155956571 154213658 152305555 150867434 149334307 147708434 146352601 144285434 142845614
6529 142845614 141038414 138871640 137442681 135591600 133724908 131518744 129645586 127472173
$$ packed form
6589A24551278J878546P56273J545592K080371K222352J752898J974901J620539
6581A38382750J594044K065027J318918J791181J901785J827470J428440J601566
6573A51911181J423223J681169P44820J468994J361112R77741J568634J335989
6565A62472863P34472O52990J406708J16541O33060J364185K13124M34022j73184
6556A67854781k10737P72400L36069l23828o5538n6882n18689j124066q9234j036390
6546A65537886o56797o38757q11352j517659p38055j007205j185432j394717j631341
6537A55956571j742913j908103j438121j533127j625873j355833k067167j439820
6529A42845614j807200k166774j428959j851081j866692k206164j873158k173413
$$ plain form
6521 127472173 126279614 123738656 120950458 119071497 117647732 116236385 114813072 112703864
6513 112703864 110783388 109509436 107442945 105482358 103843851 101752230 100263670 98874286
6505 98874286 96735598 94994877 93348881 92199209 91697558 89697471 87332019 85256298
6497 85256298 84595862 83818907 82811339 80808298 79099861 77350993 75950287 75012229 74059939
6488 74059939 72737360 70854500 69402730 68362801 68177588 66814445 65679668 64619986
6480 64619986 64134596 62572954 61622644 61152617 59506087 58444912 57388620 56439447 55934585
6471 55934585 55328003 54774641 53831938 52227292 51156998 50811055 50298961 49287359 48564990
6462 48564990 47780183 47448051 46781588 45044870 44178949 44116294 43335748 42917644 42637055
$$ packed form
6521A27472173j192559k540958k788198j878961j423765j411347j423313k109208
6513A12703864j920476j273952k066491j960587j638507k091621j488560j389384
6505I8874286k138688j740721j645996j149672n01651k000087k365452k075721
6497H5256298o60436p76955j007568k003041j708437j748868j400706r38058r52290
6488G4059939j322579j882860j451770j039929j85213j363143j134777j059682
6480F4619986m85390j561642r50310m70027j646530j061175j056292r49173n04862
6471E5934585o06582n53362r42703j604646j070294l45943n12094j011602p22369
6462D8564990p84807l32132o66463j736718q65921o2655p80546m18104k80589
$$ plain form
6453 42637055 41742350 41280563 41193196 40569206 39866880 39176385 38658433 38185970 37908277 36895559
6443 36895559 35687412 35709442 34788579 34405917 33859482 33162229 33376341 33031938 32856988
6434 32856988 32315317 31955039 31850734 31458443 30597850 30358930 29942114 28865083 28468914
6425 28468914 28726709 27878345 27292980 26984970 26848966 26754495 26123744 25412878 25710012 25549498
6415 25549498 24958062 24268753 24453108 24489735 23886962 23329248 23355814 23160121 22256337 21958026
6405 21958026 22333226 21908276 21279551 21317416 20841915 20859536 20284755 19766626 19585919 19311292
6395 19311292 18918835 18702810 18367953 18260782 18725258 18628044 18209403 18384965 17919022 17159813
6385 17159813 17341920 16960718 16506766 16432302 16312508 16414531 16175775 16100566 15847812 15328181
$$ packed form
6453D2637055q94705m61787q7367o23990p02326o90495n17952m72463k77693j012718
6443C6895559j208147K2030r20863l82662n46435o97253K14112l44403j74950
6434C2856988n41671l60278j04305l92291q60593k38920m16816j077031l96169
6425B8468914K57795q48364n85365l08010j36004r4471o30751p10866K97134j60514
6415B5549498n91436o89309J84355L6627o02773n57714K6566j95693r03784k98311
6405B1958026L75200m24950o28725L7865m75501J7621n74781n18129j80707k74627
6395A9311292l92457k16025l34857j07171M64476r7214m18641J75562m65943p59209
6385A7159813J82107l81202m53952p4464j19794J02023k38756p5209k52754n19631
$$ plain form
6375 15328181 14917626 15033824 14684807 15021939 14713811 14446214 14464381 14057996 14453107 14337554
6365 14337554 14370602 14117404 13536752 13454372 13483492 13311666 13280836 13308186 13090376 12809054
6355 12809054 12370954 12604386 11946021 11147015 11743180 12264604 12098748 12028948 11554440 11908277
6345 11908277 11688476 11145800 10771034 10776863 10929823 11017925 10603843 10322044 10458264 10386421
6335 10386421 10100880 10568889 10065967 9669611 10042924 9905329 9686383 10171747 9723108
6326 9723108 9236646 9009052 9390382 9668982 9329827 9284287 8909007 8280412 8083243 8541645
6316 8541645 8546116 8292537 8752448 8844846 8301223 8664209 8840171 8628061 8590629 7918448
6306 7918448 7849754 7886199 7720936 8378740 7718676 7141784 7404366 7413516 7081792 6709597
$$ packed form
6375A5328181m10555J16198l49017L37132l08128k67597J8167m06385L95111j15553
6365A4337554L3048k53198n80652q2380K9120j71826l0830K7350k17810k81322
6355A2809054m38100K33432o58365p99006N96165N21424j65856o9800m74508L53837
6345A1908277k19801n42676l74766N829J52960Q8102m14082k81799J36220p1843
6335A0386421k85541M68009n02922l96356L73313j37595k18946M85364m48639
6326I723108m86462k27594L81330K78600l39155m5540l75280o28595j97169M58402
6316H541645M471k53579M59911R2398n43623L62986J75962k12110l7432o72181
6306G918448o8694L6445j65263O57804o60064n76892K62582R150l31724l72195
$$ plain form
6296 6709597 6870933 7377322 7082806 7051672 6894158 6715338 6965433 6628955 6620359 6372926
6286 6372926 6834942 7135552 6850916 6755678 6031524 5990407 6367119 6950738 5999240 5118064
6276 5118064 5228051 5037312 4844831 5927187 6145424 6413680 5923104 5855849 6106356 6275994
6266 6275994 5874503 5446011 5322992 5569315 5782217 5572118 5557042 5684734 5301834 4481402
6256 4481402 4669552 5364026 4978517 4902537 4719397 4804258 4892431 5171402 4397509 4183216
6246 4183216 4588886 4441637 3885856 4481769 4950082 4298961 4677740 4945343 4627630 4404343
6236 4404343 4274551 4225516 4804833 4547342 4159551 4132158 3818345 3618009 4159724 4074141
6226 4074141 3951466 4117959 4464069 3934963 3989643 4424571 4403356 3857313 4114190 4646472
$$ packed form
6296F709597J61336N06389k94516l1134j57514j78820K50095l36478q596k47433
6286F372926M62016L00610k84636r5238p24154m1117L76712N83619r51498q81176
6276E118064J09987j90739j92481J082356K18237K68256m90576o7255K50507J69638
6266F275994m01491m28492j23019K46323K12902k10099j5076J27692l82900q20432
6256D481402J88150O94474l85509p5980j83140Q4861Q8173K78971p73893k14293
6246D183216M05670j47249n55781N95913M68313o51121L78779K67603l17713k23287
6236D404343j29792m9035N79317k57491l87791k7393l13813k00336N41715q5583
6226D074141j22675J66493L46110n29106N4680M34928k1215n46043K56877N32282
$$ plain form
6216 4646472 4155372 3582395 3456726 3153555 3535091 3652089 3363462 3599512 3728009 3731255
6206 3731255 3179745 3297891 3341214 3530275 3680785 3683272 3675977 3945859 3366027 2749072
6196 2749072 2876483 2994313 2766623 3114730 4143687 3960543 3830522 4194615 3779786
6187 3779786 3349319 3569970 3561884 2994316 2994164 2964414 2460864 2571336 2989621 3060972 2236188
6176 2236188 2509022 2516152 2849559 3771752 3889920 3438474 3136815 3084093 3211308 3260704
6166 3260704 2890113 2180514 2159501 2607518 2905127 2260394 2485371 2521575 2501912 2123224
6156 2123224 2000700 2436438 2739744 2856425 2778596 2719929 2760486 2434183 2601187 2837031
6146 2837031 3092693 2426634 2553831 2658028 2273637 2701847 2535828 1910065 1923540 2099436
$$ packed form
6216D646472m91100n72977j25669l03171L81536J16998k88627K36050J28497L246
6206C731255n51510J18146M3323J89061J50510K487p295K69882n79832o16955
6196B749072J27411J17830k27690L48107J028957j83144j30021L64093m14829
6187C779786m30467K20651q086n67568j52k9750n03550J10472M18285P1351q24784
6176B236188K72834P130L33407R22193J18168m51446l01659n2722J27215M9396
6166C260704l70591p09599k1013M48017K97609o44733K24977L6204j9663l78688
6156B123224j22524M35738L03306J16681p7829n8667M0557l26303J67004K35844
6146B837031K55662o66059J27197J04197l84391M28210j66019o25763J3475J75896
$$ plain form
6136 2099436 2192235 2680428 2365963 2211412 2075342 1829718 1895956 1844488 1896591 1720694
6126 1720694 1854361 2047566 2396506 3121474 2592007 2009504 1533199 1737367 1739707 2053126
6116 2053126 1703548 2048994 1728048 1953873 2067809 1544152 1771923 2015477 2233493 1586080
6106 1586080 1956320 2020165 2201256 2488740 2346099 1772736 2006697 2058199 1937773 1996654
6096 1996654 2063301 1682583 1327139 1174146 1828833 1852795 1494955 1830251 1556170 1397255
6086 1397255 1553250 1705885 1558275 1917310 1999340 1662089 1398500 1900864 1263074 1408975
6076 1408975 1613789 1496174 952924 834347 527128 638587 858815 977627 1191036 1136767
6066 1136767 1569052 1762605 1442674 1919618 2062536 1844870 2298994 2000871 1695679 1616848
$$ packed form
6136B099436R2799M88193l14465j54551j36070k45624O6238n1468N2103j75897
6126A720694J33667J93205L48940P24968n29467n82503m76305K04168K340L13419
6116B053126l49578L45446l20946K25825J13936n23657K27771K43554K18016o47413
6106A586080L70240O3845J81091K87484j42641n73363K33961N1502j20426N8881
6096A996654O6647l80718l55444j52993O54687K3962l57840L35296k74081j58915
6086A397255J55995J52635j47610L59035Q2030l37251k63589N02364o37790J45901
6076A408975K04814j17615n43250j18577l07219J11459K20228J18812K13409n4269
6066A136767M32285J93553l19931M76944J42918k17666M54124k98123l05192p8831
$$ plain form
6056 1616848 1479709 1188485 1262749 1127967 778406 1689356 2032805 1052952 1005852 1284982
6046 1284982 1301651 1648220 1406454 1014217 1390326 1714452 1547955 1248446 1536401 1244913
6036 1244913 1136908 1557158 1718870 1556791 1321160 825767 996683 1610625 1569948 1455663
6026 1455663 1552655 1038077 527247 1132713 1297050 1163933 745357 1021575 909298 1128728
6016 1128728 1654150 1416124 1403052 1167129 929302 767832 737220 1142920 1157577 977569
6006 977569 926184 900316 999130 1247429 830022 1265152 1441514 1433359 1402251 1131832 1247411
5995 1247411 1078081 1107598 1203592 1224970 840113 473657 519038 1135628 1116093 425295
5985 425295 -18095 416237 853748 735895 345522 391126 702679 518554 -119053 527123
$$ packed form
6056A616848j37139k91224P4264j34782l49561R10950L43449r79853m7100K79130
6046A284982J6669L46569k41766l92237L76109L24126j66497k99509K87955k91488
6036A244913j08005M20250J61712j62079k35631m95393J70916O13942m0677j14285
6026A455663R6992n14578n10830O05466J64337j33117m18576K76218j12277K19430
6016A128728N25422k38026j3072k35923k37827j61470l0612M05700J4657j80008
6006I77569n1385k5868R8814K48299m17407M35130J76362q155l1108k70419J15579
5995A247411j69330K9517R5994K1378l84857l66456M5381O16590j9535o90798
5985D25295m43390M34332M37511j17853l90373M5604L11553j84125o37607O46176
$$ plain form
5975 527123 903560 282198 218551 675960 397326 79661 -583480 -355486 192895 516773
5965 516773 343361 389065 1174749 818835 521831 289892 144263 390750 649389 525751
5955 525751 342271 584733 1133592 845089 5337 611079 612390 256998 531863 221284
5945 221284 -27493 268055 -57383 443482 1025702 765723 313612 519589 788025 -467281
5935 -467281 -322126 506534 452621 811838 550802 109610 -81501 377908 671096 491744
5925 491744 855354 39640 -295723 407852 487213 459966 290799 631532 873084 196586
5915 196586 626877 -394390 -569626 345215 -210094 56984 605014 962994 853794 728087
5905 728087 656453 412929 -231749 -506369 -391912 243221 689394 489592 385169 330926
$$ packed form
5975E27123L76437o21362o3647M57409k78634l17665o63141K27994N48381L23878
5965E16773j73412M5704P85684l55914k97004k31939j45629K46487K58639j23638
5955E25751j83480K42462N48859k88503q39752O05742J311l55392K74865l10579
5945B21284k48777K95548l25438N00865N82220k59979m52111K05977K68436j255306
5935d67281J45155Q28660n3913L59217k61036m41192j91111M59409K93188j79352
5925D91744L63610q15714l35363P03575P9361k7247j69167L40733K41552o76498
5915A96586M30291j021267j75236R14841n55309K67078N48030L57980j09200j25707
5905G28087p1634k43524o44678k74620J14457O35133M46173j99802j04423n4243
$$ plain form
5895 330926 128645 -388418 -368752 -44221 688283 556924 -116601 -55649 -98350 -353455
5885 -353455 -1206 549030 21179 -376874 91872 358013 649103 506117 -146852 -197806
5875 -197806 -34210 133215 243407 216121 83489 147222 345005 450562 62195 462440
5865 462440 112078 285641 77137 -371161 -69713 39273 -126962 456745 206137 -463043
5855 -463043 -183065 -405942 -535138 -693807 -500152 152048 324127 -730610 -384103 364495
5845 364495 160384 -249768 -307995 -160515 530537 73345 -87382 143654 151317 -40170
5835 -40170 -701227 -950808 -621542 -828316 -398949 -439471 -652921 -635096 -477409 -118811
5825 -118811 -1023880 -992119 -206605 -436926 -29802 289041 -591324 -502039 -58652 10048
$$ packed form
5895C30926k02281n17063J9666L24531P32504j31359o73525O0952m2701k55105
5885c53455L52249N50236n27851l98053M68746K66141K91090j42986o52969n0954
5875a97806J63596J67425J10192k7286j32632O3733J97783J05557l88367M00245
5865D62440l50362J73563k08504m48298L01448J08986j66235N83707k50608o69180
5855d63043K79978k22877j29196j58669J93655O52200J72079j054737L46507P48598
5845C64495k04111m10152n8227J47480O91052m57192j60727K31036P663j91487
5835d0170o61057k49581L29266k06774M29367m0522k13450J7825J57687L58598
5825a18811r05069L1761P85514k30321M07124L18843q80365Q9285M43387O8700
$$ plain form
5815 10048 137276 72379 -142917 -376686 -416194 85946 388901 453 -231286 -822173
5805 -822173 -1105452 -1417857 -833559 -709119 -324531 280811 -110943 -386639 -430923 -520837
5795 -520837 -906952 -1088551 -682679 -263776 -661435 -319408 -231631 -525617 -538133 -821043
5785 -821043 -685777 -562420 -358025 -214919 -908343 -849885 -744302 -476765 13853 -694833
5775 -694833 -206849 382184 -492828 -810334 -421350 -1019922 -1484208 -944125 -566444 -785198
5765 -785198 -549161 -749596 -595046 -540784 -1147918 -715398 -302859 -333030 -20972 -349167
5755 -349167 -399039 -326107 -154149 -83132 -418524 -484991 271080 88064 -725997 -325908
5745 -325908 -71931 42316 -433140 -264673 -278514 -31451 -275842 -312007 -107030 -69196
$$ packed form
5815A0048J27228o4897k15296k33769l9508N02140L02955l88448k31739n90887
5805h22173k83279l12405N84298J24440L84588O05342l91754k75696m4284q9914
5795e20837l86115j81599M05872M18903l97659L42027Q7777k93986j2516k82910
5785h21043J35266J23357K04395J43106o93424N8458J05583K67537M90618p08686
5775f94833M87984N89033q75012l17506L88984n98572m64286N40083L77681k18754
5765g85198K36037k00435J54550N4262o07134M32520M12539l0171L12058l28195
5755c49167m9872P2932J71958P1017l35392o6467P56071j83016q14061M00089
5745c25908K53977J14247m75456J68467j3841K47063k44391l6165K04977L7834
$$ plain form
5735 -69196 -318303 304597 361690 321213 316259 218815 -236159 -332069 475762 542079 -209309
5724 -209309 -383089 -154481 -402066 -573290 151951 318671 -71235 -228113 -217792 -48162
5714 -48162 -130341 -1280762 -1288876 -545864 -706460 -908001 -465796 -162105 -744333 -974592
5704 -974592 -777652 -464679 -504895 -153346 -290387 -165722 -62420 -242903 473159 707452
5694 707452 534519 -747288 -170272 406055 -398597 -699627 -918424 -696706 -565361 -689767
5684 -689767 -936161 -996564 -74651 -531685 -499507 -32593 297188 54824 51098 55850 -243978
5673 -243978 -488902 -32951 388087 -126967 -364218 -410916 -917451 -1152276 -850586 -1027060
5663 -1027060 -405378 -250764 -481374 -353492 -102070 -340443 -493824 -435416 -585980 -586519
$$ packed form
5735f9196k49107O22900N7093m0477m954r7444m54974r5910Q07831O6317p51388
5724b09309j73780K28608k47585j71224P25241J66720l89906j56878J0321J69630
5714d8162q2179j150421q114P43012j60596k01541M42205L03691n82228k30259
5704i74592J96940L12973m0216L51549j37041J24665J03302j80483P16062K34293
5694G07452j72933j281807N77016N76327q04652l01030k18797K21718J31345j24406
5684f89767k46394o0403R21913m57034L2178M66914L29781k42364l726M752k99828
5673b43978k44924M55951M21038n15054k37251m6698n06535k34825L01690j76474
5663a027060O21682J54614k30610J27882K51422k38373j53381N8408j50564n39
$$ plain form
5653 -586519 -327497 -325645 -102577 -303005 455664 -855684 -1236980 -374158 368557 391743
5643 391743 181927 -670087 -892189 -684100 -186415 -523840 -923698 -1048093 -1225508 -1182951
5633 -1182951 -956663 -994535 -1160429 -861741 -1006631 -849282 -222484 -376467 336024 60809
5623 60809 -113062 -416995 -537704 53708 -129309 -175755 -41203 -251900 -518490 -353153
5613 -353153 -418719 -404310 -360647 -437765 -292434 -208 -165851 -455156 -45286 -435917
5603 -435917 -1288383 -1520128 -1209316 -784873 -690293 -956878 -1049804 -748474 -156629 -203659
5593 -203659 -578460 -907927 -1255813 -777772 -1138851 -816247 -582667 -984814 -1006258 -311871
5583 -311871 -27974 100086 -8029 -267015 -65475 -324056 -833099 -599684 -551671 -243678
$$ packed form
5653e86519K59022J852K23068k00428P58669j311348l81296Q62822P42715K3186
5643C91743k09816q52014k22102K08089M97685l37425l99858j24395j77415M2557
5633a182951K26288l7872j65894K98688j44890J57349O26798j53983P12491k75215
5623F0809j73871l03933j20709N91412j83017m6446J34552k10697k66590J65337
5613c53153o5566J4409M3663p7118J45331K92226j65643k89305M09870l90631
5603d35917q52466k31745L10812M24443R4580k66585r2926L01330N91845m7030
5593b03659l74801l29467l47886M78041l61079L22604K33580m02147k1444O94387
5583c11871K83897J28060j08115k58986K01540k58581n09043K33415M8013L07993
$$ plain form
5573 -243678 -809502 -550261 -607288 -1033960 -1112231 -884395 -754315 -983537 -1078735 -503251
5563 -503251 -669022 -403579 -488207 -864996 -764069 -358422 -437313 -446484 -140317 -121170 -89661
5552 -89661 145088 -482953 -261516 102051 -237437 -685964 -1170454 -890988 -397984 -234986
5542 -234986 186008 255891 -424663 -700711 -321420 88599 -9130 -143698 1809 319563
5532 319563 -61899 -241083 -148085 78404 -333913 -514165 -513734 -339541 401740 117314
5522 117314 -300750 -193559 -1008779 -656426 -445793 -532149 -560721 -678032 -311383 291241
5512 291241 378098 4402 -507113 -720552 -252330 70516 -381638 -232296 642152 -368260
5502 -368260 -88333 -258826 -314000 596199 354299 -347308 2438 278432 -875609 -146920
$$ packed form
5573b43678n65824K59241n7027m26672p8271K27836J30080k29222r5198N75484
5563e03251j65771K65443q4628l76789J00927M05647p8891r171L06167J9147L1509
5552h9661K34749o28041K21437L63567l39488m48527m84490K79466M93004J62998
5542b34986M20994O9883o80554k76048L79291M10019r7729j34568J45507L17754
5532C19563l81462j79184R2998K26489m12317j80252M31J74193P41281k84426
5522A17314m18064J07191q15220L52353K10633q6356k8572j17311L66649O02624
5512B91241Q6857l73696n11515k13439M68222L22846m52154J49342Q74448j010412
5502c68260K79927j70493n5174R10199k41900p01607L49746K75994j154041P28689
$$ plain form
5492 -146920 250747 14888 158924 -355280 -436299 114971 -363423 -56190 174610 257545
5482 257545 757105 36911 -460991 -395288 89403 26866 -296168 -74805 277923 326265
5472 326265 -178710 -275062 252216 -368042 -281091 406665 -181011 65517 239196 112391
5462 112391 -454312 -894498 -446080 -526720 -369140 -614803 -710459 -506515 -363164 -23091
5452 -23091 -27147 15220 -235714 -183735 -805785 -930798 -415491 319897 356971 145735 -334793
5441 -334793 -243134 -414090 -46705 180961 -162953 42112 3919 -24465 233353 90148
$$ packed form
5492a46920L97667k35859J44036n14204q1019N51270m78394L07233K30800Q2935
5482B57545M99560p20194m97902O5703M84691o2537l23034K21363L52728M8342
5472C26265n04975r6352N27278o20258Q6951O87756n87676K46528J73679j26805
5462A12391n66703m40186M48418q0640J57580k45663r5656K03944J43351L40073
5452b3091m056M2367k50934N1979o22050j25013N15307P35388L7074k11236m80528
5441c34793R1659j70956L67385K27666l43914K05065l8193k8384K57818j43205
$$ [...]
##END NTUPLES=NMR SPECTRUM
##END=
