##TITLE=1H_CA-8801-1
 CDCl3, 8 sc, 
 22.12.2020
##JCAMPDX= 6.0         $$ Bruker NMR JCAMP-DX V2.0
##DATA TYPE= NMR SPECTRUM
##DATA CLASS= NTUPLES
##ORIGIN= UXNMR, Bruker Analytische Messtechnik GmbH
##OWNER= root
$$ XWIN-NMR		Version 3.5
$$ Tue Dec 22 12:04:44 2020 Russian Standard Time (UT+4h)  she@DPX200
##.OBSERVE FREQUENCY= 200.1315066352
##.OBSERVE NUCLEUS= ^1H
##.ACQUISITION MODE= SIMULTANEOUS
##.ACQUISITION SCHEME= undefined
##.AVERAGES= 8
##.DIGITISER RES= 18
##SPECTROMETER/DATA SYSTEM= spect
##.PULSE SEQUENCE= zg30
##.SOLVENT NAME= CDCl3
##.SHIFT REFERENCE= (INTERNAL, CDCl3, 0, 15.972)
##AUDIT TRAIL= $$ (NUMBER, WHEN, WHO, WHERE, WHAT)
$$ ##TITLE= Audit trail, XWIN-NMR		Version 3.5
$$ ##JCAMPDX= 5.01
$$ ##ORIGIN= Bruker BioSpin GmbH
$$ ##OWNER= she
$$ F:/spectra/data/she/nmr/H-F/1/pdata/1/auditp.txt
$$ ##AUDIT TRAIL=  $$ (NUMBER, WHEN, WHO, WHERE, WHAT)
(   1,<2020-12-22 12:03:27.92 +0400>,<she>,<DPX200>,
      <created by zg, POWCHK disabled, PULCHK disabled
       configuration hash MD5:
       00 E9 B6 7A A2 85 ED C7 34 08 36 98 17 FE 4E 26
       data hash MD5: 16K
       75 7F D9 D1 E8 D9 2E BD 8D 03 D0 F2 2D 56 E5 73>)
(   2,<2020-12-22 12:03:31.18 +0400>,<she>,<DPX200>,
      <Start of raw data processing
       efp BC_mod = 2 LB = 0.24 FT_mod = 6 PKNL = 1 PHC0 = -10762.34 PHC1 = 10.20095 SI = 16K 
       data hash MD5: 16K
       A8 35 8A 29 B4 D2 38 11 26 91 4D 47 32 8A CE 19>)
(   3,<2020-12-22 12:03:53.09 +0400>,<she>,<DPX200>,
      <pk PHC0 = -0.4314151 PHC1 = 1.2 
       data hash MD5: 16K
       96 FA CA D8 74 5F 59 03 C8 5A 0C 66 C7 2A B9 24>)
(   4,<2020-12-22 12:03:56.46 +0400>,<she>,<DPX200>,
      <abs ABSG = 5 
       data hash MD5: 16K
       B6 26 9F 1E 53 EE DF 57 65 F5 5B A2 31 7B 2F C2>)
$$ ##END=
$$ 
$$ hash MD5
$$ 99 E1 15 79 47 B8 7B 88 CA BF 01 00 36 2F 67 35
##$RELAX= 
##$RELAX= 
##$RELAX= 
##$RELAX= 
##$RELAX= 
##$RELAX= 
$$ Bruker specific parameters
$$ --------------------------
##$DU= <F:/spectra>
##$EXPNO= 1
##$NAME= <H-F>
##$PROCNO= 1
##$TYPE= <nmr>
##$USER= <she>
##$AMP= (0..31)
100 100 100 100 100 100 100 100 100 100 100 100 100 100 100 100 100 100 
100 100 100 100 100 100 100 100 100 100 100 100 100 100 
##$AQSEQ= 0
##$AQ_mod= 1
##$AUNM= <au_zg>
##$AUTOPOS= <>
##$BF1= 200.13
##$BF2= 200.13
##$BF3= 200.13
##$BF4= 200.13
##$BF5= 200.13
##$BF6= 200.13
##$BF7= 200.13
##$BF8= 200.13
##$BYTORDA= 1
##$CFDGTYP= 0
##$CFRGTYP= 5
##$CHEMSTR= <none>
##$CNST= (0..31)
1 1 145 1 1 1 1 1 1 1 1 1 1 1 1 1 1 1 1 1 1 1 1 1 1 1 1 1 1 1 1 1 
##$CPDPRG= <>
##$CPDPRG1= <>
##$CPDPRG2= <>
##$CPDPRG3= <>
##$CPDPRG4= <mlev>
##$CPDPRG5= <mlev>
##$CPDPRG6= <mlev>
##$CPDPRG7= <mlev>
##$CPDPRG8= <mlev>
##$CPDPRGB= <>
##$CPDPRGT= <>
##$D= (0..31)
0 1.2 0 0 0 0 0 0 0 0.06 0 0.03 0 0 0 0 0.0002 0 0 0 0 0 0 0 0 0 0 0 0 
0 0 0 
##$DATE= 1608624207
##$DBL= (0..7)
120 120 120 120 120 120 120 120 
##$DBP= (0..7)
150 150 150 150 150 150 150 150 
##$DBP07= 0
##$DBPNAM0= <>
##$DBPNAM1= <>
##$DBPNAM2= <>
##$DBPNAM3= <>
##$DBPNAM4= <>
$$ [...]
##$SUBNAM3= <"">
##$SUBNAM4= <"">
##$SUBNAM5= <"">
##$SUBNAM6= <"">
##$SUBNAM7= <"">
##$SUBNAM8= <"">
##$SUBNAM9= <"">
##$SW= 16.9725356469052
##$SWIBOX= (0..15)
0 0 2 0 0 0 0 0 0 0 0 0 0 0 0 0 
##$SW_h= 3396.73913043478
##$TD= 16384
##$TD0= 1
##$TE= 0
##$TE2= 300
##$TE3= 300
##$TEG= 300
##$TL= (0..7)
0 120 120 120 120 120 120 120 
##$TP= (0..7)
150 150 150 150 150 150 150 150 
##$TP07= 0
##$TPNAME0= <>
##$TPNAME1= <>
##$TPNAME2= <>
##$TPNAME3= <>
##$TPNAME4= <>
##$TPNAME5= <>
##$TPNAME6= <>
##$TPNAME7= <>
##$TPOAL= (0..7)
0.5 0.5 0.5 0.5 0.5 0.5 0.5 0.5 
##$TPOFFS= (0..7)
0 0 0 0 0 0 0 0 
##$TUNHIN= 0
##$TUNHOUT= 0
##$TUNXOUT= 0
##$USERA1= <user>
##$USERA2= <user>
##$USERA3= <user>
##$USERA4= <user>
##$USERA5= <user>
##$V9= 5
##$VALIST= <valist>
##$VCLIST= <CCCCCCCCCCCCCCC>
##$VD= 0
##$VDLIST= <DDDDDDDDDDDDDDD>
##$VPLIST= <PPPPPPPPPPPPPPP>
##$VTLIST= <TTTTTTTTTTTTTTT>
##$WBST= 1024
##$WBSW= 4
##$XGAIN= (0..3)
0 0 0 0 
##$XL= 0
##$YL= 0
##$YMAX_a= 108755
##$YMIN_a= -35489
##$ZGOPTNS= <>
##$ZL1= 120
##$ZL2= 120
##$ZL3= 120
##$ZL4= 120
##$ABSF1= 15.96781
##$ABSF2= -1.004852
##$ABSG= 5
##$ABSL= 3
##$ALPHA= 0
##$AQORDER= 0
##$ASSFAC= 0
##$ASSFACI= 0
##$ASSFACX= 0
##$ASSWID= 0
##$AUNMP= <proc_1d>
##$AZFE= 0.1
##$AZFW= 0.1
##$BCFW= 0
##$BC_mod= 2
##$BYTORDP= 0
##$COROFFS= 0
##$CY= -3
##$DATMOD= 1
##$DC= 0
##$DFILT= <>
##$DTYPP= 0
##$F1P= 0
##$F2P= 0
##$FCOR= 1
##$FTSIZE= 16384
##$FT_mod= 6
##$GAMMA= 0
##$GB= 0
##$INTBC= 1
##$INTSCL= 2.992141e-10
##$ISEN= 128
##$LB= 0.24
##$LEV0= 0
##$LPBIN= 0
##$MAXI= 10000
##$MC2= 0
##$MEAN= 0
##$ME_mod= 0
##$MI= 1.114404
##$NCOEF= 0
##$NC_proc= -8
##$NLEV= 6
##$NOISF1= 3.799351
##$NOISF2= 2.8
##$NSP= 0
##$NTH_PI= 0
##$NZP= 0
##$OFFSET= 15.97196
##$PC= 1
##$PHC0= -10762.77
##$PHC1= 11.40095
##$PH_mod= 1
##$PKNL= yes
##$PPARMOD= 0
##$PSCAL= 0
##$PSIGN= 0
##$REVERSE= no
##$SF= 200.130008536892
##$SI= 16384
##$SIGF1= 3
##$SIGF2= 2
##$SINO= 5.538805
##$SIOLD= 16384
##$SREGLST= <1H.CDCl3>
##$SSB= 0
##$STSI= 16384
##$STSR= 0
##$SW_p= 3396.73913043478
##$SYMM= 0
##$S_DEV= 0
##$TDeff= 16384
##$TDoff= 0
##$TI= <>
##$TILT= no
##$TM1= 0
##$TM2= 0
##$TOPLEV= 0
##$USERP1= <user>
##$USERP2= <user>
##$USERP3= <user>
##$USERP4= <user>
##$USERP5= <user>
##$WDW= 1
##$XDIM= 16384
##$YMAX_p= 285966314
##$YMIN_p= -2330698
$$ End of Bruker specific parameters
$$ ---------------------------------
##NTUPLES= NMR SPECTRUM
##VAR_NAME=  FREQUENCY,     SPECTRUM/REAL,   SPECTRUM/IMAG
##SYMBOL=    X,             R,               I
##VAR_TYPE=  INDEPENDENT,   DEPENDENT,       DEPENDENT
##VAR_FORM=  AFFN,          ASDF,            ASDF
##VAR_DIM=   16384,         16384,           16384
##UNITS=     HZ,            ARBITRARY UNITS, ARBITRARY UNITS
##FACTOR=    0.207333158178281, 1,           1
##FIRST=     3196.46850470951, 0,            0
##LAST=      -200.270625725269, 0,           0
##MIN=       -200.270625725269, -2330698,    0
##MAX=       3196.46850470951, 285966314,    0
$$ Real data points
##PAGE= N=1
##DATA TABLE= (X++(R..R)), XYDATA
$$ [...]
11181b18375l97550N97784J31212K46965J37364M09673q51047o53907j02068K22949
11171d77000r0118L99731J62108k52088j42188j19492N64470n91570L50815l3189
11161b28521J93610J81350j078226k4560O94987O2507l61054j6106M74786K04316
11151A03089o44378K10928N93321m01374L71404M69054j77450k45069N9649J15663
11141D54837o91511m11106J02662N15446n437j126338K99483O86455r11074L67263
11131g19320J156760k02486m79382j16210J710780m25105j256924l711N35870
11122B00272j09230L7392p99424O64178K93437k70535M5296R4936j37165n48737
11112e29580k61756m31406J17221L68013J048159n3046k58936K02107J68831m24033
$$ y = [-218375, -615925, -18141, 113071, 360036, 497400, 907073, 56026, -597881, -699949, -477000, -567118, -167387, -5279, -257367, -399555, -519047, 45423, -546147, -195332, -228521, -34911, 146439, -931787, -956347, -261360, -198853, -559907, -576013, -101227, 103089, -541289, -330361, 262960, -138414, 232990, 702044, 524594, 279525, 339174, 454837, -236674, -647780, -545118, -29672, -35109, -1161447, -861964, -175509, -1086583, -719320, 437440, 234954, -244428, -360638, 1350142, 925037, -331887, -335598, 200272, 91042, 128434, -670990, -6812, 286625, 16090, 61386, 156322, 19157, -529580, -791336, -1222742, -1105521, -737508, 310651, 257605, -1331, 200776, 369607, -54426]
11102e4426m84684Q59530M18468J21982p4948n22912K14914n09065q95983N28429
11092c98695J88896m47827l31192M49701M20313L67337N86850r4295m65779j027709
11082g52400l62272J38781M63838M16959Q9097L42448J97250L97585k01264p3707
11072F56315m94065j00374j57965o78625K47580m0360J76575N45629l10344m7885
11062b03519R20338j88736j268041n04252q1309r7821J58592M16172M09036K09339
11052b30201N36661O2229o83515o16170k4060R47260K89805o14444Q2834N04252
11042B54651L4823l18842P53935L09644j318409j95950j15348R8319o2310j88854
11032g48341J001283P67310m91347q29742K84881J1595q45005K5122K91269O08267
$$ y = [-54426, -539110, 320420, 738888, 860870, 785922, 263010, 477924, -31141, -927124, -398695, -209799, -657626, -988818, -539117, -118804, 248533, 835383, 741088, 275309, -752400, -1114672, -975891, -512053, -95094, -5997, 336451, 533701, 931286, 730022, 656315, 162250, 61876, -96089, -774714, -527134, -567494, -390919, 154710, -155634, -203519, 716819, 528083, -739958, -1244210, -1325519, -1423340, -1264748, -848576, -439540, -230201, 306460, 368689, -314826, -930996, -955056, -7796, 282009, -332435, -249601, 254651, 289474, -29368, 724567, 1034211, -284198, -480148, -595496, -497177, -559487, -748341, 252942, 1020252, 528905, -300837, -15956, -4361, -849366, -824244, -532975, 75292]
11022G5292L42819N9092j71864j01380J96485J05914l97882m97614J660713Q34157
11012B105732j63213j160019q62168J41408j93162K70400m95805N9856L68689
11003G1718p09270n85165N48005N59626j39244m602L51117O52426P0487j21178
10993F93920m9535p80809p38737O18334O53397K80277o89901j48498J85314q36824
10983h13062r4426M22646Q04409L66589j128604J30618J02213N8456n18734N44564
10973a25331J191068K19482J32139j05656j039368p45899J87588J15661k58315
10964d28631n93266K13787P33274n49352k30118L07471M03330M12301j1486N5655
10954C12965n13542n20650M85144L15988j85950J21727J79451N56235n81464j647310
$$ y = [75292, 418111, 477203, 305339, 203959, 400444, 506358, 108476, -389138, 1271575, 2105732, 1942519, 782500, -79668, 61740, -131422, 138978, -356827, -296971, 71718, -637552, -1222717, -674712, -115086, -254330, -258932, 92185, 744611, 815098, 693920, 644385, -136424, -875161, -256827, 396570, 676847, -13054, -161552, 23762, -813062, -907488, -484842, 319567, 686156, -442448, -311830, -209617, -151161, -669895, -125331, 1065737, 1285219, 1417358, 1311702, 272334, -473565, -285977, -170316, -428631, -1021897, -808110, -74836, -624188, -854306, -546835, -143505, 268796, 257310, 312965, -200577, -721227, -236083, 79905, -106045, 15682, 195133, 751368, 169904, -1477406]
10944a477406M05589Q20132K74887k10004Q0867O40495m66624k59578Q86442j27711
10934E67089r04866m69001L14671K56608j142312m05833N49774J316979j64707
10925h1598o99240M49066j54714J47269o22925l56833R82400O76453O60250N89256
10915A589384n90124o09520K81403l17406m14454l32405M75952M97460o2895p63666
10905b46271l83253O99727n0853o04936M8253l44005P5200O22168j82772K62792
10895a03950N89812Q9156N69294j332217p41828O8653j07249L85192J19522N32439
10885F8824K66918j07237J12184m09583r10347J20995M31188K03600J43247m96605
10875e76816L50329K05552n9481p3952l82595J062718k2892q76618l08952M64923
$$ y = [-1477406, -1071817, -251685, 23202, -186802, -105935, 534560, 67936, -191642, 694800, 567089, -337777, -806778, -492107, -235499, -1377811, -1783644, -1233870, 83109, -81598, -780838, -331772, -486486, -339217, -962142, -1318975, -336575, 339878, 1000128, 1589384, 999260, 389740, 671143, 353737, -60717, -393122, 82830, 580290, 517395, -246271, -629524, 70203, 19350, -585586, -537333, -881338, -806138, -183970, -366742, -103950, 485862, 575018, 1144312, -187905, -929733, -861080, -968329, -583137, -463615, 68824, 335742, 228505, 340689, -68894, -979241, -858246, -427058, -223458, -80211, -576816, -226487, -20935, -80416, -154368, -536963, 525755, 502863, -373755, -682707, -217784]
10865b17784L2165l86077M42355P70445k89966l85419m58153m80470L33899L20208
10855c18797O16751K55160J2692J38822K61595j131108J57655m36804l8396L61068
10845a21362n76746K02548j08064m59773L30262K47118l83086P1346J36788p6232
10835g37201J14295N89522m64895L21403Q27142p96554L5328o0727J99918l42614
10825c14383j70934j23697Q8194l75594k71988M10703j20581r1933K88285R15878
10815B33950O69807q32740l5444O28921M96873J44951j337142k35627r4630o25688
10805i86769Q8640O83254k02620m44122P60318N25484r18765n40714P74758L06733
10795D6197j30215n6354m07501Q31193L14009K06868o72064j13156M5435k05178
$$ y = [-217784, -185619, -571696, -129341, 641104, 351138, -34281, -492434, -972904, -639005, -318797, 297954, 553114, 565806, 704628, 966223, -164885, -7230, -444034, -482430, -121362, -698108, -495560, -603624, -1063397, -733135, -486017, -869103, -797757, -660969, -737201, -622906, -33384, -498279, -176876, 650266, -146288, -110960, -171687, 28231, -314383, -485317, -609014, -520820, -896414, -1168402, -757699, -878280, -970213, -681928, 233950, 903757, 71017, 35573, 664494, 1161367, 1306318, -30824, -266451, -361081, -986769, -898129, -214875, -417495, -861617, -101299, 424185, -494580, -1035294, -260536, 46197, -84018, -140372, -547873, 283320, 597329, 804197, 132133, 18977, 64412, -140766]
10785a40766q16723m20873j62593n4771M45190K92832j30702J141671L40250n3975
10775D39540k19847L43446J04687p78925j48853P63916K49806J88517l96119p7132
10765D69036k05909J05791q0415k22243p46905p36697K99399N22656N86866m89477
10755d97898L40397P27595j31979j137026k9143K42512L03334j50133L16690j2357
10745b8008J87646J59207k66046l04111L06972j29841n63079J92406J64274J23662
10735a56918n8514M13624n14159p3634R25768L99750K8025m92701j417051M14347
10725e31463L65785p04574O23566J68663Q45959r00228p94536k54350Q04354O07626
10715B30802j40199l92772J75531j70792J85433N64931o9271k11046M54767q7826
$$ y = [-140766, -957489, -1378362, -1540955, -1595726, -1150536, -857704, -988406, 153265, 493515, 439540, 219693, 563139, 667826, -111099, -259952, 503964, 753770, 942287, 546168, 469036, 263127, 368918, 288503, 66260, -680645, -1417342, -1117943, -595287, -8421, -497898, -157501, 570094, 438115, -698911, -728054, -485542, -182208, -332341, -15651, -28008, 159638, 318845, 52799, -251312, 55660, -74181, -637260, -444854, -280580, -156918, -215432, 198192, -315967, -389601, 536167, 935917, 963942, 471241, -945810, -531463, -165678, -870252, -246686, -78023, 767936, -132292, -926828, -1181178, -376824, 230802, 90603, -302169, -126638, -297430, -111997, 452934, 383663, 172617, 627384, 539558]
10705E39558n80478q28838P6820L73145m1469N33505L57012K32336K93557k83193
10695F71955K43659q05046n5226O83554J04931J99435j156542N7310k46258o890
10685c09118n96316M5735J111010j14813p46641l03087k85412L89613L65046J022505
10675E78522m7586N455k69449p6040k33791q23601L13835L70123j54095o96721
10665a033348q0596M87073r8622L63766m79819N15772Q57199l86085O24018p43082
10655B6276l51317L41145j74572P48058j26676n66945l42516L12550k42630O51758
10645B75131r7181P25026M17381j683696k92349j26371P51456K29697j06303M88936
10635E81727r27319m10370M57801n6118J46595o73058M73003O23901n50821q40564
$$ y = [539558, -40920, -869758, -792938, -419793, -461262, 72243, 429255, 661591, 955148, 671955, 915614, 110568, 55342, 738896, 843827, 1043262, -113280, -55970, -302228, -309118, -905434, -859699, 251311, 136498, -610143, -913230, -1198642, -809029, -443983, 578522, 530936, 536391, 266942, 190902, -42889, -866490, -552655, -182532, -336627, -1033348, -1113944, -626871, -725493, -361727, -841546, -325774, 531425, 145340, 769358, 26276, -325041, 16104, -158468, 589590, 462914, -104031, -446547, -133997, -376627, 275131, 177950, 902976, 1320357, -363339, -655688, -782059, -30603, 199094, 92791, 581727, -345592, -755962, -298161, -354279, -207684, -880742, -407739, 216162, -334659, -1175223]
10625a175223K06311N69349O31431o3013L33999Q18454l64808q88546j52551J77753
10615I3156L9462r6257R80635p30981o51022M39979R5378M43594r84045n6103
10605d26204M60281q67902N14639L18210M07845n02127J70501R65596k24523j97082
10595F19234J76516l65383o38705o08157K36860J132711o29993q19711j41782
10586a038410O94696L31522k30163m14350M07583L12553m33562k1877K05398N16344
10576C29734m88606n10433k70993J37522M46224J7589J23160l95097J43356M20954
10566d6590n11163j43816O90190k01492j01536n1160q6274J45616j07810N05892
10556I1857P1769k62300Q79378m25982m73494O52033o28717J15689K2420l32769
$$ y = [-1175223, -968912, -399563, 231868, 168855, 502854, 1321308, 956500, 67954, -84597, 93156, 132618, 36361, 1016996, 286015, -365007, 74972, 170350, 613944, -370101, -426204, 34077, -833825, -319186, -976, 406869, -95258, 75243, 1040839, 816316, 619234, 795750, 430367, -208338, -816495, -579635, 553076, -76917, -896628, -1038410, -343714, -12192, -242355, -656705, -249122, 63431, -370131, -392008, -186610, 329734, -158872, -669305, -940298, -802776, -356552, -338963, -215803, -610900, -467544, -46590, -557753, -701569, -11379, -212871, -314407, -365567, -451841, -306225, -414035, 91857, 163626, -98674, 780704, 354722, -118772, 533261, -95456, 20233, 42653, -290116]
10546b90116J80209J84005j63375k29029n00234K51388J364481l49240l29898
10537A18191l61870j47596n51839O3710L2551L10932N45691L21786L40540k54848
10527D17248o99705k54442O35872q050L01029m6865o44014L05731j88464K85813
10517A04153O29996K78748m44545l09756m07158m36440l51193l07382k53059M53386
10507a043250Q68568J60303k71186j6501R27190j86275n5888k94404N11805n55971
10497D4391k93781q5543J52132P99893Q2572N98026n45468q91051o89153M58104
10487c69878J9745l28438L21872N29434k39417P8193j42638l13593J52188O94203
10477D01671k84690P4087k7004n66213j57050j42615O45147N89641N22512J09811
$$ y = [-290116, -109907, 74098, -89277, -318306, -818540, -567152, 797329, 448089, 118191, -243679, -391275, -943114, -879404, -846853, -535921, 9770, 331556, 672096, 417248, -282457, -536899, 98973, 90923, 391952, 345087, -298927, 6804, -181660, 104153, 734149, 1012897, 568352, 258596, -148562, -585002, -936195, -1243577, -1496636, -1043250, -174682, -14379, -285565, -302066, 625124, 438849, 382961, 88557, 600362, 44391, -249390, -334933, -182801, 617092, 699664, 1297690, 752222, -138829, -827982, -369878, -350133, -678571, -356699, 172735, -66682, 11511, -131127, -444720, -292532, 401671, 116981, 191068, 164064, -402149, -559199, -701814, -56667, 532974, 1055486, 1165297]
10467A165297j066155l35936K25748r5227N86457Q1459J60977j92179m87621n20806
10457d77986m17149k87676J31306J03846N93209J24582k29612m5252M75974K46293
10447B17535m5619O4901N19741o29694o66710o01695K37329J493634J21778j15534
10437E95666N3900r63464O8235o1769K82180M46292L62198n0529p08591j78231
10427a54113J65416M97300J095033J21141j24867N6714j448068n21544p01348
10418a014336j253168R01526Q10106p2341N09115n18405Q17911O72194K81866
10409A134468q4034j77427J54130n76578j57801o73653J87924Q78678J75551l606
10399H57652m50556j155168m62101P70228k69827l89169J26374K97747O10669
$$ y = [1165297, 99142, -236794, -11046, -106273, 480184, 561643, 722620, 530441, 42820, -477986, -895135, -1182811, -1051505, -947659, -354450, -229868, -459480, -504732, -28758, 217535, 171916, 236817, 756558, 126864, -539846, -1141541, -904212, 589422, 711200, 595666, 649566, -313898, -245663, -307432, -25252, 421040, 783238, 732709, 24118, -154113, 11303, 508603, 1603636, 1724777, 1599910, 1656624, 208556, -312988, -1014336, -2267504, -1365978, -555872, -628213, -119098, -637503, 180408, 852602, 1134468, 1050434, 873007, 1027137, 450559, 292758, -380895, -192971, 685707, 861258, 857652, 407096, -748072, -1210173, -439945, -709772, -1098941, -972567, -674820, -64151]
10390f4151m16410J10993K75124m82335J116107J91135N69389m35993o47721k93651
10380g7513o37541L85315J15129O69390N08527q54545p84981o29306M07038P8380
10370h20107K22347J065822K09237m0770k83695R4944n99495k83430l92171P08783
10360a18535R31089K74753j36198n42917P56828N8401j076629r8378m54280m91807
10350h97673l26181m01280K06667L69559Q01300N99619j20991R8224o62534J54412
10340a78878m50026l21079J10575J555028j24330m86947l1398q8606M21267r88600
10330e82994P52148j89387n57104k49669M10169M74638r39617j72635Q93496o0938
10320b21893n04816M7906R77831L15666m14489j75444o68209J35530J9070M33756
$$ y = [-64151, -480561, -369568, -94444, -576779, 539328, 730463, 1299852, 863859, 216138, -77513, -715054, -329739, -214610, 454780, 963307, 108762, -676219, -1305525, -898487, -820107, -597760, 468062, 677299, 636529, 352834, 447778, -151717, -435147, -827318, -118535, 812554, 1087307, 951109, 408192, 1165020, 1223421, 146792, 48414, -405866, -897673, -1223854, -1625134, -1418467, -1048908, -247608, 352011, 231020, 329244, -333290, -178878, -628904, -949983, -839408, 715620, 591290, 104343, 72945, -15661, 405606, -582994, 169154, -20233, -577337, -827006, -416837, 57801, -881816, -1054451, -160955, -221893, -726709, -678803, 299028, 614694, 200205, 24761, -643448, -507918, -488848, -55092]
10310e5092K72493l03851j47425P6763Q43415k19223P48L63876k74470q11119
10300b53885M6582j77638n60083M96620M84521k15869m92284n08377Q85663k75458
10290e70208M39880k4300N37742P61159o24809j62052l49638p19702M32093J201164
10280I21329j22841j086069m47669l45513k82751N097O58598N88168J57711O40262
10270F86322M8077k73986n31206k49235Q46398M15252j97157j14803p13456m61215
10260e45009p28145J39777K03185M65267L87401o2178k3950q45715O56P24200
10250b84511J157299Q7221p80416k27073k34634M00507o66054M71922L16355o14691
10240c74075O59881o83408l47139J71898P0429N12764m6429n93512M89691Q53359
$$ y = [-55092, 217401, -86450, -233875, -157112, 686303, 467080, 467828, 831704, 557234, -253885, -207303, -384941, -945024, -448404, 36117, -179752, -672036, -1180413, -294750, -570208, -130328, -154628, 383114, 1144273, 519464, 357412, 7774, -711928, -279835, 921329, 798488, -287581, -735250, -1080763, -1363514, -1358417, -699819, -111651, 46060, 686322, 734399, 460413, -70793, -320028, 526370, 941622, 744465, 629662, -83794, -545009, -1273154, -1133377, -930192, -464925, -77524, -139702, -163652, -1009367, -1008711, -284511, 872788, 960009, 179593, -47480, -282114, 118393, -547661, -75739, 240616, -374075, 285806, -397602, -744741, -572843, -502414, 10350, -36079, -629591, -139900, 713459]
10230G13459m9707r04666N31779K49322m29465K88724q3166l81506r30452M45047
10220e50631j03170l03816Q06117Q05409j88785p43820k31971k17699j292q3745
10210h13403l31455Q93069P07344k03428J30623n75482p48046K04634O02824L48747
10200B15427n69368N03488P47299n92156n28188K92542L88584Q866p80907k74206
10190e88619Q0691J03309j34489N55591K28179L09528l46842L07347n26099q81601
10180h93005J26673R95998Q36147l64078k04109J13422k28273l3369n83938l79303
10170f13835q09479k10091P40164O16052q35503J37458Q05883J22724o97552J59728
10160e84451J448046P9802n67105r06167k54020O11231L23096J62017l24763p35382
$$ y = [713459, 663752, -240914, 290865, 540187, 110722, 399446, 316280, -65226, -995678, -550631, -653801, -957617, -151500, 653909, 465124, -278696, -510667, -728366, -729658, -813403, -1144858, -251789, 455555, 252127, 382750, -192732, -940778, -736144, -133320, 215427, -353941, 149547, 896846, 304690, -223498, 69044, 457628, 466494, -314413, -588619, -507928, -404619, -539108, 16483, 244662, 554190, 207348, 514695, -11404, -893005, -766332, 229666, 1065813, 701735, 497626, 611048, 382775, 349406, -234532, -613835, -1423314, -1633405, -893241, -277189, -1112692, -975234, -169351, -46627, -744179, -584451, 863595, 943397, 376292, -529875, -783895, -172664, 150432, 312449, -12314, -747696]
10150g47696P79480l89039j65521p68208P28257J389903M06711r55594J71167
10141D49460k25348K0892l32819K98176K16576p97887M11059N82667r86020r4130
10131d57374K11622J63487j24035j265120L13214O99520K45969M58717N51145
10122G97145j7900m44775K01568M11502n97315j013066Q4359M64647R58773n48814
10112B96124O13713O18647q22700j099607N6299M21573O6314m36479L12728J99740
10102B26352r59778J97735M88607J51905k18113n95603N6351k26375l70185P82188
10092d66916n13305J9881L77588J251409K43920m12659j033394o4311O81531L13311
10082C97055j51043J66180n37276k90671k51319j03560O13692K4001q64258N52831
$$ y = [-747696, 31784, -357255, -522776, -1290984, -562727, 827176, 1233887, 278293, 449460, 224112, 245004, -87815, 210361, 426937, -370950, 40109, 622776, -363244, -457374, -245752, -82265, -206300, -1471420, -1158206, -458686, -212717, 246000, 797145, 779245, 334470, 536038, 947540, 350225, -662841, -578482, -113835, 844938, 296124, 909837, 1528484, 705784, -393823, -337524, 84049, 150363, -286116, 26612, 226352, -733426, -535691, -47084, 104821, -113292, -708895, -652544, -878919, -1249104, -466916, -980221, -960340, -582752, 668657, 912577, 499918, -533476, -597787, 83744, 397055, 246012, 412192, -125084, -415755, -667074, -770634, -156942, -132941, -997199, -444368]
10072d44368m62661j09416J408429L02704j63072m87263O41646K8507q74158j20586
10062b80238j06137J34979J58253j40446M85175N04925p3336o73484l22245J14936
10052a97618j78461k06417M45418l33291n52483Q01951K90914m5096K73560K31705
10042E30182M37539p02411l24222l11559J86990n3063m65400P91576o25163p7504
10032f13035N26193M06237j04376o29111L51997Q81344p68625q42033k94493N93376
10022d92526P09013o58204l6106k04421K00688J54908k08837J93356P7388M37150
10012A72409L707j054076k11634Q21348N31100j5305j34964L10675M65852n47497
10002C41615k66790o39234l97980l07905M25128N22212k55506l55169J111824
$$ y = [-444368, -907029, -1016445, 391984, 694688, 531616, 44353, 685999, 714506, -159652, -280238, -386375, -251396, -93143, -233589, 251586, 756511, 683175, 9691, -312554, -197618, -376079, -582496, -137078, -470369, -1022852, -220901, 70013, 24917, 298477, 530182, 967721, 265310, -58912, -370471, -183481, -236544, -701944, 89632, -535531, -613035, -86842, 319395, 215019, -414092, -62095, 819249, 50624, -791409, -1085902, -492526, 216487, -441717, -477823, -682244, -481556, -326648, -535485, -342129, -264741, 172409, 176116, -877960, -1089594, -268246, 262854, 247549, 112585, 423260, 889112, 341615, 74825, -564409, -962389, -1270294, -845166, -322954, -578460, -933629, 178195]
9993A78195J68105j44625j08201l69147K11418r38881q3091L12753M00926K67828
9983a04720p03437N41891P99583n45397K64093m67710n46421J25262K72017M17804
9973E2965J62950m41394P90608k04550p19456m40267O21424M55415o83189r486
9963d14980M16123O27604L25091r38395k81308K34307j02486M03397k82940n86281
9953e99868P68719k30070m02130O76367l60515K48311Q7868k07232j386150Q734
9943a395966Q29456j88667N50767N97192Q445J29359m87824l06002M364Q58836
9933E99960m66537l71752k2690L45467j16144o88362J87809L87798J20769N71746
9923E48064q38797J22130k50664l18059K8077j13664P18950K55888J70692j95802
$$ y = [178195, 346300, 201675, 93474, -275673, -64255, -1003136, -1086227, -773474, -372548, -104720, -808157, -266266, 533317, -12080, 252013, -215697, -762118, -636856, -364839, 52965, 215915, -225479, 565129, 360579, -358877, -799144, -177720, 277695, -405494, -414980, 1143, 628747, 953838, 15443, -265865, -31558, -134044, 269353, -13587, -599868, 168851, -61219, -463349, 213018, -147497, 100814, 188682, -18550, -1404700, -1395966, -566510, -755177, -204410, 392782, 401227, 530586, 42762, -263240, -258876, 599960, 133423, -238329, -261019, 84448, -31696, -720058, -532249, -144451, -23682, 548064, -290733, -168603, -419267, -737326, -709249, -822913, -103963, 151925, 322617, 126815]
9913A26815L7179k42087l88648P9167K17131k79086K54150L73195N1920j300749
9903a071013j33838J161295M35892n33451o25358o8476M15736j65797m88257N57396
9893e15871P31006m92342J75966k48618L88686L1554N78490n6946K22400n74802
9883B39523p4857k21158l60160l86730J79268J018617L96940p88190J98831J47101
9873C49185j145269J67435j71670J279843Q398J77781R17o02183R05004q9837
9863H79604m58548K42622k91080j84389j83613j20692k28172K63037J35104k33171
9853a79298j91557l66248M5729p11937J49369Q55446Q10994L73346n13432J03376
9843C75788q92344l52528J84362j83166N89275k90652j13744L35800K2047l4700
$$ y = [126815, 163994, -78093, -466741, -387574, -170443, -449529, -195379, 177816, 229736, -1071013, -1204851, -43556, 392336, -141115, -766473, -834949, -419213, -585010, -1073267, -515871, 215135, -277207, -101241, -349859, 38827, 70381, 648871, 591925, 814325, 239523, 164666, -56492, -416652, -803382, -624114, 394503, 791443, 3253, 202084, 349185, -796084, -628649, -800319, 479524, 487922, 665703, 666620, 64437, 969441, 879604, 421056, 663678, 372598, 188209, 4596, -116096, -344268, -81231, 53873, -179298, -370855, -737103, -691374, -1403311, -1253942, -398496, 412498, 785844, 272412, 375788, -516556, -869084, -684722, -867888, -278613, -569265, -683009, -347209, -325162, -359862]
9833c59862L68739R88913K07886o22592p94798k54820j52003j36987L8288R03042
9823A85806J40927j4844m00858k53596n07719L41913N28347P44311N02267n60453
9813G06101K12047p98551m17613L41466K22202K81599p80404m94619K14810l86437
9803h99399j31M35089l44675o5484J105567O06659o15264j051087K93533J038087
9793E02895j26850j145727l8172Q61636m63639k50572J82942L90823J21705N4738
9783H9779K09854J08333L3229K37950j46106m179n10275L81776O3544m69471O2032
9772E6466j5193P44085l90721l52325K91597J22658m09091O439M98494m14696
9762A37713K0805q8600N5894j67051j014912M67964K67993k88943n9280p59711
$$ y = [-359862, 8877, 997790, 1205676, 583084, -211714, -466534, -618537, -755524, -717236, 185806, 326733, 311889, -88969, -342565, -850284, -508371, 19976, 764287, 1266554, 706101, 918148, 119597, -298016, 43450, 265652, 547251, -233153, -727772, -512962, -899399, -899530, -464441, -809116, -874600, 230967, 837626, 222362, -828725, -535192, 502895, 376045, -769682, -807854, 53782, -409857, -660429, -477487, -86664, 35041, 89779, 299633, 407966, 441195, 679145, 533039, 528860, 18585, 400361, 463905, -5566, 56466, 41273, 785358, 394637, 42312, 333909, 456567, 47476, 53915, 552409, 137713, 158518, 69918, 125812, -41239, -1056151, -588187, -320194, -609137, -668417, -1428128]
9752a428128M82590N63858j88815J149571R72164o31174q62741K28806Q4984m51486
9742h0371N9935M35389k29384r5591k76453m07952k00639l37312J37979Q47339
9732a47060L0800m71493L07649Q07921j96535K01030P36150J44552r77830J48298
9722E83482k05820j057622o9649J249174k36937R2477J14525j27k55824j134451
9712i20772j002963R08893J098612Q5316J14621O34146J58817j096356O6654L084
9702E0052k48266j56409Q69095l18565r98827m91746R63501J503096j035946q16368
9692f80383K02404N50428m57834n26746L97869j29991P90543M5992k71273l87669
9682d66660K22232O51171l84994l02257M78429O09340m17412m84965k50605K60841
$$ y = [-1428128, -945538, -381680, -570495, 579076, 1551240, 920066, 57325, 286131, 371115, -80371, -20436, 414953, 185569, 89978, -186475, -594427, -795066, -1132378, -994399, -147060, -116260, -587753, -280104, 527817, 331282, 532312, 1268462, 1413014, 435184, 583482, 377662, -679960, -749609, 499565, 262628, 355105, 469630, 469503, 213679, -920772, -1923735, -1014842, 83770, 169086, 283707, 917853, 1076670, -19686, 46968, 50052, -198214, -354623, 514472, 195907, -802920, -1294666, -331165, 1171931, 135985, -680383, -477979, 72449, -385385, -912131, -514262, -644253, 146290, 192282, -78991, -466660, -244428, 406743, 21749, -280508, 197921, 807261, 389849, -95116, -345721, -84880]
9672h4880L51629j105737j04166O12502K11743n40347k15661P18388k14285L47026
9662b3788J022440l4019n28417q14820J126522L56298j092415m85098O98845N80376
9652H05924j149020n55476L88072k83299O03098K32341P3730o98315J95048O57354
9642B69457n11013k29763J12520M38072J84267K14226l03738K0075N3771n32486
9632b84612K12369R8192o42220L73850N22227k1239J8293q20225K32944J66436
9622a43985o5986J34791L8840r0476n72375J70591r0406K87873K6562L70194j46787
9611h1164K38252o66894l39584N49335j22402J33525N43590r1729p35171q872
9601e81114N61066P7699L52300j47708Q219j32840q96646L0398P5048j78232M7552
$$ y = [-84880, 266749, -838988, -943154, -330652, -118909, -659256, -874917, -156529, -370814, -23788, 998652, 964633, 436216, -378604, 747918, 1104216, 11801, -473297, 225548, 805924, -343096, -898572, -510500, -793799, -190701, 41640, 115370, -582945, -387897, 269457, -241556, -471319, -358799, 79273, 263540, 477766, 174028, 194103, 247874, -284612, -72243, 25949, -616271, -242421, 279806, 258567, 276860, -543365, -310421, -143985, -209971, -75180, -36340, -126816, -699191, -528600, -619006, -331133, -304571, 65623, -81164, 157088, -509806, -849390, -300055, -422457, -288932, 254658, 162929, -572242, -581114, -20048, 57651, 409951, 262243, 270462, 137622, -759024, -728626, -653578, -831810, -784258]
9590g84258M21208J13069J6872J78164o2726n20422o06585Q89372R46794l22834
9580B68654o4785M4814m68960K47357P64947L27405j119277q23823O58341l87956
9570e53283K9056L61588J05487L49366j78889m08118K36106P1430k15679K28665
9560B5729n2300K07614o12016J83689M3335p89699k35554Q72932L99682j81715
9550a38303r18182J60810P78300l87455k17205J01250J326195k53272m89439l79804
9540d17105J21096l94260L66059L05630J16402l79622N00190M16916k09918l6128
9530C89260l08812N08198P63444k69172p22167L15592J4556p14230j65053J04554
9520h3830k83796o27458J86736K77071J7525K92903L91810J34041n11776l53549
$$ y = [-784258, -363050, -249981, -233109, -54945, -117671, -638093, -1244678, -355306, 591488, 268654, 203869, 248683, -220277, 27080, 792027, 1119432, 155, -823668, -165327, -553283, -524227, -162639, -57152, 292214, 113325, -294793, -58687, 12743, -202936, 25729, -26571, 181043, -430973, -247284, -203949, -993648, -1229202, -356270, 43412, -138303, -1056485, -895675, -117375, -504830, -722035, -620785, 705410, 452138, -37301, -417105, -296009, -690269, -324210, -18580, 97822, -281800, 218390, 635306, 425388, 389260, 80448, 588646, 1352090, 1082918, 360751, 676343, 690899, -23331, -188384, -83830, -367626, -995084, -808348, -531277, -513752, -220849, 170961, 305002, -206774, -560323]
9510e60323O78520J78222n29884j78239J86554L76801n09992m2440M01924r86946
9500i85803J78604O70952K76547O49960j172504O69550K77128L1408K21535l69873
9490D47504K27901n79784k41650J4946N9743K95251j66816L0359J27570K23106
9480D38130J70723M01515l96354l50045K16243M55005j66108k24784K08225K14252
9470I66802K12584o8564n16528J51002m20287j96243M935J86524l29108N95707
9460E86824K2212K7937o94758q889J215417l87100p21172K21899N70093l92162
9450D40301q07307J42988L29704l6108K4140l64156m3303j68722J59022L65825
9440D2384K12259k49324j92697m13467l91034O17075Q06058q6988J10351K89467
$$ y = [-560323, 118197, 296419, -233465, -411704, -225150, 151651, -358341, -400781, 1143, -985803, -807199, -136247, 140300, 790260, -382244, 287306, 564434, 595842, 817377, 447504, 675405, 95621, -146029, -131083, -71340, 223911, 57095, 87454, 215024, 438130, 608853, 1010368, 614014, 263969, 480212, 935217, 769109, 544325, 752550, 966802, 1179386, 1110822, 594294, 745296, 325009, 128766, 133701, 320225, -8883, 586824, 609036, 636973, -57785, -66674, 1148743, 761643, 40471, 262370, 832463, 440301, -367006, -224018, 105686, 69578, 93718, -270438, -313741, -482463, -323441, 42384, 254643, 5319, -187378, -600845, -991879, -374804, 431254, 344266, 454617, 744084]
9430G44084l9470r09945n829P9042K19614o17856p1482N69026q0211p16654K59843
9419e69838J76295P75875m04168j76876O64400r71121Q9996L19546j99275N68643
9409B73477n15131k41587j18916J56300j76383m49959Q47296P09516O24335k42460
9399H66488q36475j141251L1586J241835p3153j95050K05761L67424l18442l54411
9389b05688J13345O60260l00977J5039K7713L43257j053296o41270J006163j85118
9379b20572M99434K89463l04318m18822p02065r2016N76586o5515k74387L50767
9369c61445O40584l29852k05576k34698M33237M0692J88255J63805R7037m9901
9359C82138r57851j14851k2472M41157Q06688L82879l49132n26793j83510N6174
$$ y = [744084, 704614, -205331, -211160, -132118, 87496, -530360, -601842, -32816, -113027, -829681, -569838, -393543, 382332, -21836, -198712, 465688, -505433, -415437, -95891, -295166, 273477, -241654, -483241, -602157, -445857, -622240, -1072199, -224903, 484613, 1108948, 866488, 30013, -1111238, -1079652, 162183, 89030, -106020, 99741, 467165, 148723, -205688, -92343, 567917, 266940, 281979, 309692, 652949, -400347, -1041617, -35454, -220572, 278862, 568325, 264007, -154815, -856880, -948896, -372310, -437825, -712212, -361445, 279139, -50713, -256289, -490987, -57750, -17058, 171197, 335002, 432039, 382138, -575713, -690564, -713036, -271879, 534809, 917688, 568556, 41763, -141747, -85573]
9349h5573N73371p40477l89085J58811P60360l29110o73135K57473P85439Q4587
9339D02661n4017l38569L6813j60775o8673l61343m82116P07489M92707L23614
9329D97791Q1147j173264K88429O42355J51934j99836J14112R5116o85334p30260
9319i17810l36040k36079M89489N03937M21779L68125j72235n24944M16710J9179
9309C2111k21569Q9703K81397J97029o26371l53756l26727N78640M10903J89287
9299B50647j9377k94372l75621M41307K4328N34305q21336k74645K87765k95648
9289e42647m29798O96292L30028k93262l3122p3622R36210k24089k97002M8542
9279A17530p63378K07781O32958J1911J31958j65178P27506O41219l69294j028925
$$ y = [-85573, 487798, -252679, -641764, -482953, 277407, -51703, -724838, -467365, 318074, 402661, 348644, 10075, 46888, -113887, -182560, -543903, -1026019, -318530, 174177, 497791, 578938, -594326, -305897, 336458, 488392, 288556, 402668, 497784, -187550, -917810, -1253850, -1489929, -1000440, -496503, -74724, 293401, 121166, -403778, 12932, 32111, -189458, -99755, 181642, 378671, -247700, -601456, -928183, -349543, 61360, 250647, 231270, -63102, -438723, 2584, 26912, 561217, -260119, -534764, -246999, -542647, -972445, -276153, 53875, -239387, -272509, -346131, 590079, 365990, 68988, 117530, -645848, -438067, 194891, 206802, 338760, 173582, 901088, 1542307, 1173013, 144088]
9269A44088q47789M41498k21640J30310o8603J1328K73747k61814j2924N72581
9259A60782J49723M29329j31101r97802q05646j29658J054370M18309j48336M56361
9249D56331n05338q4118k8383m59517j94571K33671L37264O91082m4380o02247
9239b00206k34190K35152n24924j83087J525671K17835j27557m28484n56748P452
9229b69086M17705j91404N0818O04796L0459n14414n11913j65780Q3967K90211
9219a74641Q17670j59792k41215R0087R4823r49334m37713N80700R51800n52436
9209A9949j104813L28836L15236M94986r4990L82452J96949m37216j054956q0623
9199a034190L65373l04969J06308Q54556N89868l06697r5873k33773K9838p45349
$$ y = [144088, -703701, -262203, -483843, -353533, -422136, -410808, -137061, -398875, -411799, 160782, 310505, 739834, 608733, -389069, -1194715, -1324373, -270003, 148306, -30, 456331, -49007, -133125, -161508, -621025, -815596, -581925, -244661, 446421, 402041, -200206, -434396, -199244, -724168, -907255, 618416, 836251, 708694, 280210, -276538, -269086, 148619, -42785, 8033, 612829, 643288, 128874, -383039, -548819, -464852, -174641, 643029, 483237, 242022, 332109, 426932, -522402, -960115, -379415, 572385, 19949, -1084864, -756028, -440792, 54194, -40796, 341656, 538605, 101389, -953567, -1034190, -668817, -973786, -867478, -12922, 576946, 270249, 174376, -59397, -29559, -774908]
9189g74908k94826P75295O45114m0770o24221n43675R14913P26499M67346j51256
9179A099511j75668p9788r22644m76615n6778N0570J7106N96516k62894K84195
9169G3511J81716K6617l43309n44110O98848k5172m83444Q80719L4277j052274
9159e52621J57619P57901M48266j93762L04750l62664n30844j26236n48176N6509
9149e89258n7503O67737P3547J52303k94953K28650J29541p2033R9547k66882
9139G0696O84515N6602n76634m66498L48552P99672k06795l15944m38410j027047
9129a071291k01076j38468N79534R78346j08435L68003M1718j073320j49347O20296
9119a54040K18525l40182K53921R63417N65184r52234k87708J05308M01104k37216
$$ y = [-774908, -1069734, -294439, 350675, 309905, -314316, -857991, 56922, 783421, 1250767, 1099511, 923843, 844055, -78589, -555204, -611982, -561412, -544306, 52210, -210684, 73511, 255227, 281844, -61465, -605575, 93273, 68101, -415343, 465376, 499653, -552621, -395002, 362899, 811165, 617403, 922153, 559489, 28645, -97591, -645767, -589258, -646761, 20976, 94523, 246826, -48127, 180523, 310064, 238031, 337578, 70696, 755211, 811813, 235179, -231319, 117233, 916905, 710110, 394166, -44244, -1071291, -1272367, -1410835, -831301, 147045, 38610, 406613, 448331, -624989, -774336, -154040, 64485, -275697, -21776, 941641, 1506825, 554591, 266883, 372191, 773295, 536079]
9109E36079k4986m70820q52767r1689K65669J42234O35971N2970P3443J31919
9099C98023J20196p69464J23246M91039j039051j64007R41641M81187m48528k67448
9089a33166M25970n1454j88152K77615r22m58541J23506L46347N39981k06935
9079F74249o88038Q26360L1903l92518k64225l5690L81557l39827j370590P16022
9069d60797J49338N08288K52906l85902L39116L85073m05114L8252n93022L28166
9059A56304M24733m94400j009055k53771J226320L26371o0952j959l28492K16721
9049B01820Q4834p22969m5122p8026J88145L17308J00595L3781K74404P15104
9039A069874K45954o95931l71908O41867j32675m24280m40434m61306l07112O75227
$$ y = [536079, 511093, 40273, -812494, -904183, -638514, -496280, 139691, 192661, 266104, 398023, 518219, -251245, -127999, 363040, -676011, -840018, 101623, 582810, 134282, -133166, 292804, 241350, 53198, 330813, 329891, -128650, -5144, 341203, 881184, 674249, -13789, 812571, 844474, 451956, 187731, 152041, 533598, 193771, -1176819, -460797, -311459, 196829, 449735, 63833, 402949, 788022, 382908, 421160, -171862, 156304, 581037, 86637, -922418, -1176189, 50131, 376502, 315550, 313591, -14901, 201820, 286654, -436315, -481437, -559463, -371318, -54010, 46585, 80366, 354770, 1069874, 1315828, 619897, 247989, 889856, 757181, 332901, -107533, -568839, -875951, -200724]
9029b00724N0921r64216k1942P02241l51065n03804M45312J70851P29874P31285
9019G88733o38566L24200K07507m72469J10464K2525l03284r01375M71409K92444
9009i8412L15277j98567m92469J85230k21894k92775M11311M53866J3533J20240
8999A95340K89978l16204K35107K19197r5338n12428j94961p29444K94687R1782
8989e22284l0908N73768n73493N4841M16416M82793N60558n67949j023669j53328
8979g83255J01714L22260K60477L56939N73567k39839Q5129L26831r73403k48585
8969b18165L65394J09801n65407l59650N21434N314n09764O61871J17495O01998
8959G30321O14470n6259l55459o12911J39432l55676J25976L61455l57157j139823
$$ y = [-200724, -149803, -1114019, -1135961, -433720, -784785, -1288589, -843277, -672426, 57448, 788733, 150167, 474367, 681874, 209405, 319869, 342394, 39110, -862265, -390856, -98412, 216865, 18298, -474171, -288941, -510835, -803610, -392299, 61567, 75100, 195340, 485318, 169114, 404221, 623418, 528080, 15652, -179309, -908753, -614066, -522284, -553192, 20576, -552917, -498076, -81660, 401133, 961691, 393742, -629927, -783255, -681541, -359281, -98804, 258135, 831702, 591863, 676992, 1003823, 30420, -218165, 147229, 257030, -308377, -668027, -146593, -141279, -651043, 10828, 128323, 730321, 1344791, 1288532, 933073, 320162, 459594, 103918, 229894, 591349, 234192, -905631]
8949i05631J44132P12324L32216p78549P36029l4431j275409L87989Q34858J34581
8939B88109j227083J31910J010294Q72650q88967o45680K44011K95689O46422
8930G27355k50768J55783j266723o58075M09136P64475N70605j23221N83262N00019
8920A411848j499638j125139J171083J145254m18948k91440R77628j13796l16832
8911I40020n9094p158J82907m29494j58245N65389o62746k83666M49984k00642
8901C37255l80154l81556M49702M04503j066575n04089J099261P24752j043982
8892c60883j36611J424313L38618j233037P445R47050k03859j099780M1984L07966
8882C3206j82061n78362N55788J229688j094795o46551Q19525N55286p84744q31060
$$ y = [-905631, -761499, -49175, 283041, -495508, 240521, 206090, -1069319, -681330, 153528, 288109, -938974, -807064, 203230, 1075880, 186913, -458767, -214756, 80933, 727355, 476587, 632370, -634353, -1292428, -883292, -118817, 451788, 328567, 911829, 1411848, -87790, -1212929, -41846, 1103408, 684460, 393020, 1370648, 1256852, 940020, 880926, 873768, 1056675, 627181, 468936, 1034325, 371579, 87913, 537897, 337255, -42899, -424455, 25247, 429750, -636825, -1140914, -41653, 683099, -360883, -497494, 926819, 1265437, 32400, 39845, 986895, 783036, -316744, -274760, 33206, -148855, -727217, -171429, 1058259, -36536, -683087, 136438, 691724, -93020, -924080]
8872i24080O63666O64467k3919P7525M95254m63987n32561j59106L83122l6968
8862A43413n76709P82672O7890l99662L64558J20844J61209n95992j58379M39524
8852C49368L99215K47335r68748k3053J94108n43896j40813L69633M41147q24093
8842d99797O2158J02492P1966k64088O79572K15886j202713j33447L94530Q13002
8832B39561n89993J09507J261371N38025n39920M74990N27106o41644q18140p41610
8822a80747j40205J80641q24720l6555P80159N30909k07560O06564O13219n17780
8812H03925j41038j92623l9914L48617k74494L20166L86089n11657l27563J06737
8802D78245L22875o57419K25681J15104n10176R20383n25792L09414k32622m83509
$$ y = [-924080, -260414, 404053, 380134, 457659, 952913, 488926, -43635, -202741, 180381, 143413, -433296, 349376, 417266, 17604, 382162, 503006, 664215, 68223, -90156, 349368, 748583, 995918, 27170, 4117, 198225, -345671, -486484, -116851, 324296, -499797, -437639, -335147, -263181, -527269, 152303, 368189, -834524, -967971, -573441, 239561, -350432, -240925, 1020446, 1558471, 1018551, 1493541, 2020647, 1379003, 560863, -180747, -320952, -140311, -965031, -1001586, -221427, 309482, 101922, 708486, 1321705, 803925, 662887, 470264, 430350, 778967, 504473, 824639, 1210728, 699071, 371508, 478245, 801120, 143701, 369382, 484486, -25690, 894693, 368901, 678315, 445693, -37816]
8792c7816J29957k99162M65523K81748N26844M68924J24027p34884l29006L62353
8782I58508k78147j045056l01091p06431R6032P05102Q67555R3546j89570P2619
8772B73067O25983n82287r18883N33188J036215m53629R924K36072O46081K01124
8762A606855m01266K47506o91566n25074n93306K7310K30106k1127P4656M33828
8752C87922L70058j95192L42282P07863k45229j010335n11693R75019M04690J94741
8742A420126n7571p31028k01143j98951J88790J51576K26971J005405O4511k78044
8732A590642o26418K80848N4343p85618l28242J62492L72435J40975o22748k20295
8722A8414K78384K01509k15954J07569M9634R2002M94978k14046J69451m8959
$$ y = [-37816, 92141, -207021, 258502, 540250, 1067094, 1536018, 1660045, 925161, 596155, 958508, 680361, -364695, -665786, -1372217, -1276185, -571083, 296472, 390018, 200448, 273067, 899050, 316763, -602120, -68932, 967283, 513654, 523578, 759650, 1405731, 1606855, 1205589, 1453095, 761529, 236455, -356851, -329541, -99435, -120562, -45906, 387922, 757980, 562788, 905070, 1612933, 1367704, 357369, -154324, 820695, 1225385, 1420126, 1362555, 631527, 430384, 231433, 420223, 571799, 798770, 1804175, 1868686, 1590642, 964224, 1245072, 1299415, 513797, 185555, 348047, 720482, 861457, 238709, 18414, 296798, 498307, 282353, 389922, 439556, 531558, 1026536, 812490, 981941, 932982]
8712I32982k93821J109887L08439o16041j55715j36051j53416l63594k68686P04538
8702A068522O64811M0079l3774m32533p40789j44429R56827L30643n73992n0723
8692A084642K85362N85282m43024n987M23170m66558r43284j34627M50563L76699
8682A212238m20507o33477P91691J311119q35032k72646J56966J56718j4873N5188
8672A507385K54465k79120P06599O20837k02508j043235j6596N38747n25521r13470
8662F47583L23622K19714M40138J1947Q71897M00117l66531r5550o02842l65254
8652A484841n88542n64640O89090R44969J79909J131729N16853n29809o28746
8643B635654n59092K84478l55086n91010k8991K33359J87581K14652m22457j47334
$$ y = [932982, 639161, 1749048, 2057487, 1441446, 1285731, 1149680, 996264, 632670, 363984, 1068522, 1733333, 1773412, 1739638, 1307105, 566316, 421887, 1378714, 1709357, 1135365, 1084642, 1370004, 1955286, 1512262, 1506275, 1929445, 1462887, 519603, 384976, 835539, 1212238, 791731, 158254, 949945, 2261064, 1426032, 1153386, 1310352, 1467070, 1452197, 1507385, 1761850, 1482730, 2189329, 2810166, 2607658, 1564423, 1547827, 2086574, 1561053, 647583, 971205, 1190919, 1631057, 1643004, 2514901, 2915018, 2548487, 2452937, 1850095, 1484841, 896299, 331659, 1020749, 1965718, 2145627, 3277356, 3794209, 3264400, 2635654, 2076562, 2361040, 2005954, 1414944, 1385953, 1619312, 1806893, 2021545, 1599088, 1451754]
8633A451754k21943O29239J47170j01378K40800m18602J10790l79621k13086J083623
8623B328746J67258n97801p73860k29855j02329R86817P14683m91881r38209J48774
8613A212343N0846N8974r962Q8915Q51523O33471p63650J49558l804K78997L13921
8602B861132j24367J44160L01786j20301p30303m86483j84521L00840L29628K76513
8592B568084j207313L6335J072035K68191p27857j46004p2983k54349Q574N13526
8582B058239k37195p04193k3450L75337K68326L79297l28658P67218k13310j58107
8572B183504R6584n00753p5641k1194M3377l99249J04938J049205J5372n65877
8562A930266k51130l43424n46904M41358P72442N63401M02278j18398n24830K91394
$$ y = [1451754, 1229811, 1859050, 2006220, 1904842, 2145642, 1727040, 1837830, 1458209, 1245123, 2328746, 2496004, 1898203, 1124343, 894488, 792159, 1778976, 2493659, 2001778, 1063569, 1212343, 1263189, 1322163, 1312201, 1401116, 2252639, 2886110, 2122460, 2272018, 2268214, 2547211, 2861132, 2736765, 2880925, 3182711, 3062410, 2332107, 1845624, 1661103, 1961943, 2291571, 2568084, 1360771, 1397106, 2469141, 2737332, 2009475, 1863471, 1790488, 1536139, 1544713, 2058239, 1821044, 1116851, 1093401, 1468738, 1737064, 2116361, 1787703, 2554921, 2341611, 2183504, 2280088, 1779335, 1703694, 1682500, 1725877, 1326628, 1431566, 2480771, 2496143, 1930266, 1679136, 1335712, 788808, 1230166, 2002608, 2566009, 2968287, 2849889, 2325059, 2616453]
8552B616453J284578j09444k14716L68264m03141q20089n77707J12990J12528
8543B369716q12305J050488R34109n06807p52417n45522J01126k67769L75565
8534A946184L74702O58519J90784p94398P33963Q21858j89693J5055L0880j28668
8524C659186r20668n81165K55976P73937l86337P32631Q73712n8511j376957j092734
8514A879070N10819l22141L20062P70123R2338J38998m68078J041251J7684q35695
8504C144431K62781N70881j39767q86295J27090P12743N21212K2419j16846M01667
8494D620316o32r10602j004957J58269L12323K97891R57945M82184Q3552n61260
8484D435029j18448P9615j16175L79702M45149r7359p5910j090530L82579N77314
$$ y = [2616453, 3901031, 3791587, 3576871, 3945135, 3541994, 2721905, 2144198, 2257188, 2369716, 1557411, 2607899, 3542008, 3035201, 2282784, 1737262, 1838388, 1570619, 1946184, 2320886, 2979405, 3170189, 2375791, 3109754, 3931612, 3741919, 3756974, 3787854, 3659186, 2738518, 2157353, 2413329, 3187266, 2800929, 3533560, 4407272, 4348761, 2971804, 1879070, 2389889, 2067748, 2387810, 3157933, 3250271, 3389269, 2921191, 3962442, 3980126, 3144431, 3407212, 3978093, 3838326, 2952031, 3079121, 3791864, 4313076, 4335495, 4218649, 4620316, 4619684, 3709082, 2704125, 2862394, 3174717, 3472608, 4430553, 4912737, 4996289, 4435029, 4316581, 4396196, 4280021, 4659723, 5104872, 5007513, 4931603, 3841073, 4223652, 4800966]
8474D800966n04257J011432K89206p8628o92976j103328l51215O05088J94244
8465D170532L2251J169721l76848k90915m49583J86539Q430M02769J64656M20058
8455E437610m0092l65847k84053J113190P2304k68438N69924O07834L50663j148301
8445F044794l62021K24398o14081K65045N37049p8481o23112n3128J24933K58507
8435E723903K40639M2379P94638j96155l10642k23304j99805L53354q0524P4936
8425F219419O18946P16076k89365L1777N4338J74920l56793n61319P86224K92436
8415G686659l81089P5733M4900O36225J96574K43397N37678M22882J82583l12669
8405I332873K2459L84174M18813m75022j6533r0280o32172m55445Q94946P3809
$$ y = [4800966, 4296709, 5308141, 5597347, 5518719, 4825743, 3722415, 3371200, 3976288, 4170532, 4202783, 5372504, 4995656, 4704741, 4255158, 4441697, 4450127, 4852896, 5017552, 5437610, 5397518, 5031671, 4747618, 5860808, 5933112, 5664674, 6234598, 6842432, 7193095, 6044794, 5682773, 5907171, 5293090, 5558135, 6095184, 6016703, 5393591, 5340463, 5465396, 5723903, 5964542, 6006921, 6801559, 6605404, 6294762, 6071458, 5871653, 6225007, 6144483, 6219419, 6838365, 7554441, 7265076, 7296853, 7351191, 7526111, 7169318, 6607999, 7394223, 7686659, 7305570, 7381303, 7426203, 8062428, 8259002, 8502399, 9040077, 9462959, 9645542, 9332873, 9355332, 9739506, 10158319, 9683297, 9666764, 9576484, 8944312, 8488867, 9383813, 9457622]
8395I457622m32959M78046O27732P6980l37306L42372J58439l45023J89340L95376
8385A0610619M65593n3396m08855K95986J300376J62835M71756P49454k52224
8376A3342144r42234M56475P50884l169n29956N43025J344046J069198K55634
8367A6286047J87838j37053q4892m34492O89907Q71648l69527j89822Q36981q0402
8357A7576233j76707N60012J575189R91350j049666m67776J661684J250768Q183
8348B1929270L27311J016622P68086M89752P22792Q88437J084253Q31500J408537
8339B9466560J596119K76282l65408J944877K176184J210027N11597J609982J830502
8330D0256722J410621J530504K240932K031833K004362J978763K745540K496487
$$ y = [9457622, 9024663, 9502709, 10130441, 10207421, 9870115, 10212487, 10370926, 10025903, 10215243, 10610619, 11076212, 11022816, 10613961, 10909947, 12210323, 12373158, 12844914, 13594368, 13342144, 12399910, 12856385, 13607269, 13604100, 13074144, 13617169, 14961215, 16030413, 16286047, 16473885, 16336832, 16251940, 15817448, 16507355, 17379003, 17009476, 16819654, 17656635, 17576233, 17399526, 17959538, 19534727, 20526077, 19476411, 19008635, 20670319, 21921087, 21929270, 22256581, 23273203, 24041289, 24531041, 25253833, 26142270, 27226523, 28058023, 29466560, 31062679, 31338961, 30973553, 32918430, 35094614, 36304641, 36816238, 38426220, 40256722, 41667343, 43197847, 45438779, 47470612, 49474974, 51453737, 54199277, 56695764]
8322E6695764K526569L669615M536906N158054N113455O845645P379289R081761
8314A01007058J1515056J3147483J3415730J1329706P498838M963069K702045
8307A65578985j041862j088568O42910k182726p633953r444356j0751394j3320461
8299A20758575j2630734r992261o739892m069101l870846j787179q15245r31696
8291G9921621j03722J039662L33812J092236J906705K830802L017142L029843
8283I3068101M461604N149651N489362N417988P648294J1189746J2271276J3857623
8275A58553645J7457169J6769200J4506293R724484O945360M653695K8454K579707
8267B31218007M513177R31280j871105l176343m829117n618262m577788l717548
$$ y = [56695764, 59222333, 62891948, 67428854, 72586908, 77700363, 84546008, 91925297, 101007058, 112522114, 125669597, 139085327, 150415033, 157913871, 162876940, 165578985, 164537123, 163448555, 164091465, 161908739, 154274786, 144830430, 134079036, 120758575, 108127841, 98135580, 91395688, 87326587, 83455741, 81668562, 80853317, 79921621, 79817899, 80857561, 81191373, 82283609, 84190314, 87021116, 90038258, 93068101, 97529705, 102679356, 108168718, 113586706, 121235000, 132424746, 144696022, 158553645, 176010814, 192780014, 207286307, 217010791, 223956151, 228609846, 228638300, 231218007, 235731184, 236662464, 234791359, 231615016, 226785899, 221167637, 216589849, 212872301]
8259B12872301n001981n158618n201946n336868m583703p567112j0386577j2086776
8251A57548720j3683592j4658961j3106202r594270o675767o754190n407969l592637
8243H4075132k269979k182677k292060r7066N76702n895R43150J085853N14658
8234H0347818J033572K182941K528439L317612M439487O498797P269511Q300681
8226A15918858J0306303J3038595J6331292J6209018J3943143R307960M345918
8219A99401087K379325p36231l974121k613970q226974j2043777j5227063j8848103
8211A40110173j9551075j7080030j3238561j1086660r407111n673740n461107
8204E8611889m677566m813405l146795k168198k856192l539579r31495k132441
$$ y = [212872301, 207870320, 202711702, 197509756, 192172888, 187589185, 180022073, 169635496, 157548720, 143865128, 129206167, 116099965, 106505695, 99829928, 93075738, 87667769, 84075132, 81805153, 79622476, 77330416, 77233350, 77810052, 77804157, 78747307, 79833160, 80347818, 81381390, 83564331, 86092770, 89410382, 93849869, 100348666, 107618177, 115918858, 126225161, 139263756, 155595048, 171804066, 185747209, 195055169, 199401087, 201780412, 201044181, 197070060, 194456090, 186229116, 174185339, 158958276, 140110173, 120559098, 103479068, 90240507, 79153847, 69746736, 64072996, 58611889, 53934323, 49120918, 45974123, 43805925, 40949733, 37410154, 36478659, 34346218]
8196C4346218q84859k820621k889610r659270L077308J4062384k706051k339289
8188C0186210k513365k1627j246909r22690k357898J43263J1061P9964j401307
8179B1956702j860555j91664j80021r43274O4189o18199L64608j28997j188328
8170A7274461m81627q93623L61592M46290K39658m86687p99547P6557r7957q54475
8160A4784642J58570M17093n3451J49163m51389j12036K35635l72864O51543n74882
8150A4832024N97090J8892K81371k06591j112673J35800p0222o87534j28755J60092
8140A3819494K51382J6987q56257j16794L44025M90569M72047m22842N27886j12534
8130A4413963N052J68054k92132q0918j47847M76254M27026n25202K99358J7085
$$ y = [34346218, 33461359, 30640738, 27751128, 18091858, 21169166, 35231550, 32525499, 30186210, 27672845, 27651218, 26404309, 25481619, 23123721, 23266984, 23278045, 23358009, 21956702, 20096147, 19904483, 19724462, 18781188, 18845377, 18227178, 18591786, 18462789, 17274461, 16792834, 15899211, 16260803, 16707093, 16946751, 16460064, 15660517, 15737074, 15639117, 14784642, 14943212, 15360305, 15306854, 15456017, 15004628, 14892592, 15128227, 14755363, 15406906, 14832024, 15429114, 15448006, 15729377, 15522786, 14410113, 14545913, 14475691, 13788157, 13659402, 13819494, 14070876, 14087863, 13231606, 13114812, 13458837, 13949406, 14421453, 13998611, 14526497, 14413963, 14419015, 14587069, 14294937, 14214019, 14066172, 14542426, 14969452, 14444250, 14743608, 14760693]
8120A4760693m94420M7642P07246K27351o8012k22498P3590L43996L76339N63211
8110A6315138m27993j21117j13090J064803O54410j120931l8305O74409O09437
8101A7496761Q56361J98507k10479j11118j5896L04862K59693Q62207O38125J78118
8091B0457141P19805M7866O0514J202006N44601Q37501J005523J207897J006452
8082B7089306j3123R40241O50468O71353Q69989J502082J691403Q34079Q37881
8073C5073679J711261J216539J205016K914593L030068K581718K552333L403211
8065E3688418N009138N460006P236474Q043247Q240297Q132484L491956j164562
8057I8137458k251389m63605J975576J544274K29262n619395r477753p814977
$$ y = [14760693, 14266273, 14313915, 15021161, 15248512, 15180500, 14958002, 15031592, 15375588, 15751927, 16315138, 15887145, 15766028, 15652938, 16717741, 17372151, 16251220, 16212915, 16887324, 17496761, 18353122, 18551629, 18341150, 18230032, 18214136, 18518998, 18778691, 19640898, 20279023, 20457141, 21176946, 21224812, 21285326, 22487332, 23031933, 23869434, 24874957, 26082854, 27089306, 27076183, 28016424, 28666892, 29338245, 30208234, 31710316, 33401719, 34235798, 35073679, 36784940, 38001479, 39206495, 42121088, 45151156, 47732874, 50285207, 53688418, 58697556, 64157562, 71394036, 79437283, 87677580, 95810064, 99302020, 98137458, 95886069, 95422464, 97398040, 98942314, 99171576, 93552181, 84074428, 76259451]
8049G6259451o810680n013800k942151k177688j503130j421701M8263N87562K19799
8040E7245925R33435R78257J336336J552653K374397L004585L387622L629936
8032G4443146N107563N141547O266151Q398787J1359779J3885342J3581039J3663245
8024A51846599J1350632K835050p59101m83365J240794L12447k298034n508750
8016A58536272j1616797j2355021j1439980j2423740j2217448j0534100q168283
8009G9780903o053423n430568m993348l215044k326107j033142m42951r43746
8001E5342574j68245P4247j62379L27793J281486K255084J420822K149985K589315
7992F5110682L042854M838510N943374Q384284Q595024R397791Q464261L515903
$$ y = [76259451, 69448771, 64434971, 61492820, 59315132, 57812002, 56390301, 56438564, 57026126, 57245925, 58179360, 59157617, 60493953, 62046606, 64421003, 67425588, 70813210, 74443146, 79550709, 84692256, 90958407, 99357194, 110716973, 124602315, 138183354, 151846599, 163197231, 166032281, 165273180, 164789815, 166030609, 166343056, 164045022, 158536272, 146919475, 134564454, 123124474, 110700734, 98483286, 87949186, 79780903, 73727480, 68296912, 63303564, 60088520, 57762413, 56729271, 56286320, 55342574, 55174329, 55248576, 55086197, 55413990, 56695476, 58950560, 60371382, 62521367, 65110682, 68153536, 72992046, 78935420, 87319704, 95914728, 105312519, 113776780, 117292683]
7984A17292683j893256l492227k52521L191131M057334L350892P77705k822273
7976A20209468k021534o34885j729483q706846j5131555j3803449j0726910q224882
7968E9229924o586364n682451m195067l656880k666685r03524j369082j794000
7960C2375871k022381j730910r64900n91490l00392k5612j693210j009953o79023
7951B3358000p41547q68157L05625J01110J01494q48008m79309l0122j66652m70716
7941B0261718o10791R11534j63351k79859j63977n23818l12520k69574L08387
7932A9157749k2073p8735J05792k17787J08400K470N0278O42847N94541L94501
7922B0737983P45004o8173l40073l51145P47682R18234L77377L93246O06078K64027
$$ y = [117292683, 115399427, 111907200, 111654679, 114845810, 118903144, 122254036, 123031741, 120209468, 118187934, 117553049, 115823566, 107116720, 91985165, 78181716, 67454806, 59229924, 52643560, 46961109, 42766042, 39109162, 36442477, 35538953, 34169871, 32375871, 30353490, 28622580, 27657680, 27066190, 26765798, 26740186, 25046976, 24037023, 23358000, 22616453, 21748296, 22053921, 22155031, 22256525, 21408517, 20929208, 20899086, 20732434, 20261718, 19650927, 20562461, 20399110, 20119251, 19955274, 19431456, 19118936, 18849362, 19157749, 19135676, 19056941, 19162733, 18944946, 19053346, 19055816, 19106094, 19748941, 20343482, 20737983, 21482987, 21414814, 21074741, 20723596, 21471278, 22389512, 22766889, 23160135, 23766213, 24030240]
7912B4030240J93583N50606R92519J287699J107150P43105J018032J64940J067619
7903C1155493J682989N95647N31746J208926J993708K002031K150674J781498
7895D3102712J606478L175228L014437K988124M085161N197839O070927P826679
7887G7067585R299781J0631246J1318181J0073589O255479k090625m271338j020379
7879A17263519J359963K061598k222853p854770j2549815j2153775p885552o958853
7871G1059462m916629k884844k429632j703050j456084n49767l89242M883L44496
7862E7079593R14091J912611J156537K154963K211075L164481L619234N274677
7854G7487262N940135O960301Q966769J0735271J2787207J4266250J3271310Q468419
$$ y = [24030240, 24223823, 24774429, 25766948, 27054647, 28161797, 28904902, 29922934, 30087874, 31155493, 32838482, 33434129, 33965875, 35174801, 37168509, 39170540, 41321214, 43102712, 44709190, 47884418, 50898855, 53886979, 57972140, 63169979, 69240906, 77067585, 86367366, 96998612, 108316793, 118390382, 124645861, 122555236, 118283898, 117263519, 118623482, 120685080, 118462227, 110607457, 98057642, 85903867, 78018315, 71059462, 66142833, 63257989, 60828357, 59125307, 57669223, 57119456, 56730214, 56735097, 57079593, 57993684, 59906295, 61062832, 63217795, 65428870, 68593351, 72212585, 77487262, 83427397, 90387698, 99354467, 110089738, 122876945, 137143195, 150414505, 158882924]
7846A58882924M768305J069140l464459k874868j462357m075403p854956j1172702
7838A33815624j6014369j6864649j3413034j0166959p568768o791566n395691
7831E7600588l067110k863536l381351j912266j627862q23404j568908q22905
7823D1533246l77385L39386p6135J75404J373231J888138J213307K262571L327892
7814E1659655L597109N572029O036527M663189K903499r86314k931288j702935
7806F8811471m45416o92432j928262n721421q359796p005325m876110m740619
7798C5042090m096274l576314l070473k010287j327168j306310j019703n33918
7790A8101643q05296r92596r90835p04058k18823q98926q40573o37712L33366
$$ y = [158882924, 163651229, 164720369, 161255910, 158381042, 156918685, 152843282, 144988326, 133815624, 117801255, 100936606, 87523572, 77356613, 69787845, 62996279, 57600588, 54533478, 51669942, 48288591, 46376325, 44748463, 43925059, 42356151, 41533246, 41155861, 41495247, 41419112, 41594516, 42967747, 44855885, 46069192, 48331763, 51659655, 55256764, 60828793, 66865320, 71528509, 74432008, 73445694, 70514406, 68811471, 68366055, 67673623, 65745361, 60023940, 51664144, 44658819, 39782709, 35042090, 30945816, 27369502, 24299029, 22288742, 20961574, 19655264, 18635561, 18101643, 17296347, 16303751, 15312916, 14608858, 14390035, 13491109, 12650536, 12012824, 12346190]
7781A2346190J83703j757688l73304m72358K73829j58160p87975m04680j6759
7772H832798q33041l29872J378610L3947j096294k81448p00901n72399O16738
7763G048138L91207P3588r74838k35235j21582J29205p73520l29155n07755m74420
7753D225633O05467M93108n24726j042977R0370j26813K45144k92258N11503j92831
7743C991620k76075o58593l4359J06354K53172R0453k7461r2800o5483o091N06272
7732C787009m06522m66240K07058l63522N0791k7552j24879n581k41277o7097
7722B342188l8943k38383l10828o3403J083717J0709o94459J81792m75374N79959
7712B376975k85370K2510K1195N52883J94968r29525o77252j79743Q37723O05256
$$ y = [12346190, 12529893, 10772205, 10398901, 9926543, 10200372, 10042212, 9254237, 8849557, 8832798, 7999757, 7669885, 9048495, 9082442, 7986148, 7704700, 7003799, 6431400, 7048138, 7439345, 7512933, 6538095, 6302860, 6181278, 6310483, 5536963, 5207808, 4700053, 4225633, 4831100, 5324208, 4799482, 3756505, 3846875, 3720062, 3965206, 3672948, 4184451, 3991620, 3715545, 3056952, 3022593, 3128947, 3382119, 3472572, 3445111, 3352311, 3286828, 3280737, 3787009, 3380487, 2914247, 3121305, 2757783, 2808574, 2781022, 2656143, 2650562, 2409285, 2342188, 2303245, 2064862, 1754034, 1690631, 2774348, 2785057, 2090598, 2272390, 1797016, 2376975, 2091605, 2114115, 2135310, 2688193, 2883161, 1953636, 1276384, 1096641, 1934364, 2539620]
7702B539620l27860l7049j06380m35078M5112N69613m40043n69970N57697k57345
7692A538317l21735q06219k38700J135197J32972o62546k16539R51971J62120
7683A674838n73414k08442p0960O02039M67434n31608n03281K44409L23313Q17492
7673B241820k49560m57557o0367O97876r2825r75006r20549P60815l6787J36443
7663A044303o0418J1710L86122J42811p17544J39313m04525Q35535K56666j39715
7653A494258q21299n67229J040678j95923j61510R1801L35106K57026n94837l49793
7643E28278L48215M1894k77743k6147O85684M1989l79183k1329Q31855o65327
7633A108186q81051N20847J131584j48273m87132N14183j21865k71490j03384
$$ y = [2539620, 2211760, 2174711, 2068331, 1633253, 1678365, 2247978, 1807935, 1237965, 1795662, 1538317, 1216582, 410363, 171663, 1306860, 1439832, 777286, 560747, 1512718, 1674838, 1101424, 892982, 822022, 1424061, 1891495, 1359887, 856606, 1101015, 1424328, 2241820, 1992260, 1534703, 1474336, 2172212, 2079387, 1104381, 183832, 944647, 907860, 1044303, 983885, 995595, 1381717, 1524528, 806984, 946297, 541772, 1377307, 1633973, 1494258, 672959, 105730, 1146408, 950485, 788975, 880776, 1215882, 1472908, 878071, 528278, 876493, 918387, 640644, 614497, 1300181, 1342170, 962987, 941658, 1773513, 1108186, 227135, 747982, 1879566, 1731293, 1244161, 1758344, 1636479, 1364989, 1261605]
7624A261605m9701M96355p99090r25698J71113O93899k75113j91385L50800n1005
7614F81780l29282k32128J098830p6846J89383m92073m2557J37400m59798N88453
7604A063162k88947o1800O7684L98523j70499r25314J85421Q09803p34774m10571
7594f7312M18317j12896j47391P68481P68667L9318j35900m47419j63379m07871
7584E12615p97420k80218O92960O28673r61215M39421K54979o84111P29612j44337
7574C90959j16631r56034n90738J091298O2474r52898J41385J734426Q71553o66747
7564A009047k97303m80448m63827R4016M51897M08145J17775o1083l75223O00566
7554A003562m71769k25251j72676j72060m82325n02168O03839J41504K6062J69520
$$ y = [1261605, 1211904, 1708259, 909169, -16529, 154584, 848483, 573370, 381985, 732785, 681780, 352498, 120370, 1219200, 1142354, 1331737, 839664, 797107, 934507, 474709, 1063162, 774215, 712415, 780099, 1178622, 1008123, 82809, 268230, 1078033, 343259, -67312, 351005, 238109, 90718, 859199, 1627866, 1667184, 1531284, 1083865, 920486, 512615, -284805, -565023, 127937, 756610, -204605, 234816, 489795, -194316, 535296, 390959, 274328, -681706, -1272444, -181146, -118672, -1071570, -930185, 804241, 1675794, 1009047, 711744, 231296, -232531, -138515, 313382, 721527, 839302, 778219, 402996, 1003562, 531793, 306542, 133866, -38194, -520519, -1022687, -418848, -277344, -251282, -81762]
7544h1762o36127M14141Q9902O0523O255p82070L49544P16673K49025j31625l44242
7533h9763N24379N37360p07231j247489R3044Q05642l22092l37809O43937R4591
7523e431M801N04203o15719l13980j96491J06277M62876N67381K1751K24883l23263
7512D37288j99311p51084q5929L14023l24807L46543p03281K48973O90385j3238
7502d0438o59358M04247o742P48117K45009m68996K57132L03631K6379J21020
7492I30001m75413Q4465m58097k43856M05202j98262L85950p83700N69315N4882
7482B70487m51049J99373o72527j5671Q5884K88448J86094L2900K78966O65455
7472H68360o18759j90022N76244J7738P14459m51374r00093R79729l90711J25393
$$ y = [-81762, -717889, -303748, -213846, -153323, -147068, -929138, -579594, 137079, 386104, 254479, -89763, 434616, 971976, 264745, -982744, -889700, -84058, -406150, -743959, -100022, -5431, -630, 503573, -112146, -426126, -622617, -516340, -53464, 513917, 535668, 760551, 437288, 237977, -513107, -599036, -285013, -609820, -263277, -966558, -717585, -27200, -40438, -699796, -295549, -302291, 445826, 690835, 221839, 478971, 782602, 808981, 930001, 454588, 539053, 80956, -162900, 242302, 44040, 429990, -353710, 215605, 270487, -180562, 18811, -653716, -669387, -583503, -295055, -108961, -76061, 202905, 868360, 249601, 59579, 635823, 653561, 1368020, 916646, 16553, 996282, 605571, 730964]
7462G30964P27588p3039K69995q23988J21195l42897k53401L18624K58184l50312
7452E82913L96078m75186m7522L6198K73817Q6375j95598j008794q49202O24164
7442e76757R08232M3779L90334q336K56281J5768n48823J75417n24318j31064
7432E13R71021j02732j241085n49776J259795R01040n83942m61355Q6185m29654
7422a49990P2225k23093k22901n8860P26679J154616N4727k98273k23241p55239
7412G6650n96n91674J43883Q34089M68851k09313m15209j99390o92241K01267
7402c83683m888J39860l42108L92706N80821m47494j04545P8164K19406K51669
7392C79908j99819p85848l19304j42407K2275R22165k45769o3568O020L10987
$$ y = [730964, 1458552, 1385513, 1655508, 831520, 952715, 609818, 356417, 675041, 933225, 582913, 978991, 503805, 456283, 492481, 766298, 852673, 657075, -351719, -1200921, -576757, 331475, 375254, 765588, 757252, 1013533, 1029301, 480478, 655895, 131577, 513, 971534, 868802, -372283, -922059, 337736, 1238776, 654834, 193479, 279664, -149990, -77765, -300858, -523759, -582619, 144060, 1298676, 1353403, 1055130, 831889, 76650, 76054, -515620, -371737, 462352, 931203, 721890, 306681, 107291, -584950, -383683, -388571, -248711, -590819, -198113, 382708, -64786, -169331, -91167, 128239, 379908, 180089, -605759, -925063, -1067470, -1045195, -123030, -368799, -432367, -426347, -115360]
7382a15360m74393k29058K2254N97792M28884j41321J06385L74592n94654o93946
7372g18825r993L9189j64671K14355P37207K36188j20176j12254j64199L13529
7362B50350l96447j26179j10040m95191l85501N21138K44612R43883M40352J68667
7352A055644l84522r63183n72645Q75773O07860O1576O8344l91634k16603n34380
7342c93770L06180K77621k84303l76091j28116M38246k41635k22869K79919L83950
7332C9132K04392K31955o38445p67546J71191k57589K07719N29864l38966K57927
7322c60366P50987l65149o00055P89570K47392k65337j200201q49660Q15699J387789
7312C50669j65781M7751M04392q08797k82692L589L86783p0237L1451M77462L14526
$$ y = [-115360, -589753, -818811, -796557, -198765, 230119, 88798, 195183, 569775, -24879, -718825, -728818, -689629, -854300, -639945, 97262, 333450, 213274, 101020, -63179, 250350, -146097, -272276, -382316, -877507, -1263008, -741870, -497258, 446625, 886977, 1055644, 671122, -292061, -864706, 11067, 618927, 680503, 748847, 357213, 140610, -393770, -87590, 190031, -94272, -470363, -598479, -160233, -401868, -624737, -344818, 39132, 243524, 475479, -162966, -930512, -759321, -1016910, -809191, -279327, -618293, -360366, 390621, 25472, -574583, 214987, 462379, 197042, -1003159, -1852819, -1037120, 350669, 184888, 232639, 637031, -171766, -454458, -450869, -64086, -134323, -102872, 374590, 689116]
7301F89116j212941P4032N81304K18309o66374n09657P25310M31037p17507n38519
7291i25890K73165O19039L49834P8753J15525o01577r46377P38566j17098k40374
7281f56434L87657R44134l91806p81819L90936O46222q82764J48097m47595K92383
7271c50989N28373K18137L78601o34307l76032K37522J97591l29206j104423K61657
7261i73076M74778j79133o83215N39598J216796J76957o21722M28240Q12086n4959
7251A136350j45545k28513n64599o30738L19404J14539l36017m2468L79141J86532
7241A88086L11140j393624l99651Q15757j55295m27878Q40483O51120O8097n14345
7231a6110K14739o01511M55035J61276J3759L15773m69693q48175P05428M88113
$$ y = [689116, -523825, -449793, 131511, 349820, -316554, -826211, -100901, 330136, -387371, -925890, -652725, -33686, 316148, 394901, 510426, -91151, -1037528, -298962, -416060, -656434, -268777, 675357, 283551, -498268, -107332, 538890, -343874, -195777, -643372, -350989, 177384, 395521, 774122, 139815, -236217, 1305, 198896, -130310, -1234733, -973076, -498298, -677431, -1360646, -821048, 395748, 572705, -49017, 379223, 1191309, 1136350, 990805, 762292, 197693, -433045, -113641, 898, -335119, -377587, 1554, 188086, 499226, -894398, -1294049, -478292, -633587, -1061465, -220982, 430138, 498235, -16110, 198629, -402882, 52153, 213429, 227188, 542961, 73268, -774907, -69479, 418634]
7221D18634j068097j91506R8058L64617J9930J051371N89958p75788j22390l70262
7211A4525K57255L14033l74438k22905j08087o07428j68511Q90156L00598p82064
7201d86866K20968k09306l26846k38604R21279N57511J98164m31087M28360P73408
7191A406981n11127l15332n50023m02480L94867L88248m0786K3973j28927j10602
7181A54792j50094k0316q54145p43703R90098R23207k59896p0398N14683M93154
7171I77382q17230n22511Q04755N02878L16695j112709q18358l80674J83510J104257
7161B37995k88014J97457J51175o5162n04598j90936k65795K36865j278N02392
7151A0101K93038l28045P03182k59482q16053M49548l05880K93159l57033q4708
$$ y = [418634, -649463, -840969, -742911, -378294, -358364, 693007, 1282965, 507177, 384787, 14525, 271780, 585813, 211375, -11530, -119617, -727045, -895556, -5400, 295198, -486866, -265898, -475204, -802050, -1040654, -119375, 438136, 636300, 205213, 633573, 1406981, 895854, 580522, 30499, -371981, 22886, 411134, 370348, 394321, 265394, 154792, 4698, -15618, -869763, -1613466, -623368, 299839, 39943, -30455, 484228, 977382, 160152, -362359, 442396, 945274, 1261969, 149260, -669098, -1049772, -866262, 237995, -50019, 147438, 298613, 233451, -271147, -462083, -727878, -491013, -492291, 10101, 303139, -24906, 678276, 418794, -397259, 52289, -253591, 39568, -317465, -402173]
7141d02173L19800q2284O0337R32097o7246L80628o21292j55034r4084L647N12513
7130G86909k86385J20642M54725m16697J96650K37350r22021K6690k71095J55204
7120H1972j88548J63086M16061k04232m76128m74887N30874R88908p19769Q51548
7110I68885l08005j156050n0624Q76237M2757k5951L63879O28264m89203J13698
7100I63887K66695m9110K84347l71137M7449M92365j145077j69620m5558j41232
7090A33009J55011j123504N45005N4236L06837K76166k92645K54670k00591K02721
7080C10915M56577J2601m52390J93582n6117l9757l18327K00771O75344o44252
7070C38947m54792M98668j36995P228n940R01443M61329p44035r5583p13012l6428
$$ y = [-402173, -82373, -164657, -104320, 827777, 760531, 1141159, 519867, 364833, 270749, 274396, 786909, 500524, 621166, 1075891, 659194, 855844, 1093194, 171173, 197863, -73232, 81972, -106576, 56510, 472571, 268339, -207789, -682676, -151802, 837106, 117337, 968885, 660880, -495170, -545794, 330443, 373200, 347249, 711128, 1339392, 850189, 963887, 1230582, 1181472, 1465819, 1094682, 1142131, 1634496, 489419, 319799, 274241, 133009, 288020, -835484, -290479, -236243, 70594, 346760, 54115, 308785, 108194, 310915, 767492, 780093, 327703, 521285, 465168, 425411, 107084, 307855, 983199, 338947, -115845, 382823, 245828, 253056, 247116, 1148559, 1609888, 865853, 770270, 57258, 20830]
7059B0830L46326l8338m24013J46645N13153R97177o23399k67970o17609M453
7049E7255P36435j8708J93971j75014j15821L06736J89862m58308Q01720Q7401
7039A605529j92309k72094n97590o74630q5875J286825o95257n62230N88179j43560
7029B56988l04447M46474p77763J30572M19564P01156K70915m84874N70363l60336
7019H68612m52469j29544m4620K08183Q3393O55128P1490j044193K26404J137163
7009A579547m13183k65048o3588J24054p07757l13284J05063K75908K84258K93832
6999H99802M41502L74784p61966n79765Q57124j27155j76639n82467M06048O69121
6989A420389q88209o59592R37329O83889r56083j99161N80300q7788Q9254L17750
$$ y = [20830, 367156, 328818, -95195, 51450, 564603, 1561780, 938381, 670411, 52802, 57255, 793690, 774982, 968953, 793939, 678118, 984854, 1174716, 716408, 1518128, 1605529, 1413220, 1141126, 543536, -131094, -216969, 1069856, 374599, -187631, 400548, 256988, -47459, 399015, -378748, -248176, 171388, 872544, 1143459, 658585, 1228948, 868612, 416143, 286599, 241979, 450162, 533555, 1188683, 1260173, 215980, 442384, 1579547, 1166364, 901316, 837728, 961782, 254025, -59259, 45804, 321712, 605970, 899802, 1341304, 1716088, 954122, 374357, 1231481, 1104326, 927687, 345220, 751268, 1420389, 532180, -127412, 809917, 1493806, 537723, 338562, 918862, 831074, 920328, 1238078]
6979A238078O16135m64099l30023L84257L41024p22025m57813j32587n5456n28621
6969a11130K61439P96536M10153k34846n16149J86090L66509j62558N61392J05026
6959A662462q11782n4140P62315j15422m08352j179834O17049Q73709o35979J33178
6949H43204J43283J46073o38641K77015J72638m0050l42626J57634J254672p39213
6939A233989q24726K47497J171782K69383j82002K28640o20159l20234r42497
6930B61673o83909R03307O44893l18192K60485O00740q26108n26316K69835P65100
6920A351508L61963P7038N87137k11992q13721j67184N84000j13637o62542O58645
6910A651215K57080j219721Q73728P29633o24294j56812O51665J91456n61384
$$ y = [1238078, 1854213, 1390114, 1060091, 1444348, 1785372, 1063347, 605534, 472947, 417491, -111130, 150309, 946845, 1356998, 1122152, 606003, 792093, 1158602, 996044, 1557436, 1662462, 850680, 796540, 1558855, 1443433, 1035081, -144753, 472296, 1346005, 710026, 843204, 986487, 1132560, 493919, 770934, 943572, 903522, 560896, 718530, 1973202, 1233989, 409263, 656760, 1828542, 2097925, 1915923, 2144563, 1524404, 1204170, 261673, -422236, 481071, 1125964, 807772, 1068257, 1668997, 842889, 316573, 586408, 1351508, 1713471, 1790509, 2377646, 2165654, 1351933, 1184749, 1768749, 1655112, 992570, 1651215, 1908295, 688574, 1562302, 2291935, 1667641, 1510829, 2162494, 2353950, 1792566]
6901A792566o87105K84050l65801n7639M05006P40947N7833o66366m10387N75341
6891A668445R4359P2861J84945j91779j6558k72173m14766P78014M33617n16384
6881A820581n44749K21637J88683k0242j82976J18567k48863O09960K79206L64144
6871B605948m09222j97321M68279n84938Q4195k24498p535o78435P55084P36735
6861B548292j59336p35520J209591M89643j161932k96580N44063P58044k71372
6852B924893j074982k46881k61016l9596L58559M85456L77238r69739k80604P68925
6842B042253p8576o15726P8772O72126p3296l78800j28373J609443K00610p81486
6832B546947n32006K97719K45414K60199L9079o01339m57225M18284L62075j30290
$$ y = [1792566, 1105461, 1389511, 1023710, 966071, 1371077, 2112024, 2169857, 1503491, 1093104, 1668445, 1762804, 1835665, 2020610, 1828831, 1812273, 1540100, 1125334, 1903348, 2336965, 1820581, 1275832, 1497469, 1686152, 1665910, 1482934, 1601501, 1352638, 1962598, 2241804, 2605948, 2196726, 1999405, 2467684, 1882746, 1966941, 1742443, 1734908, 1056473, 1811557, 2548292, 2388956, 1653436, 2863027, 3352670, 2190738, 1894158, 2438221, 3196265, 2924893, 1849911, 1603030, 1342014, 1302418, 1660977, 2146433, 2523671, 1553932, 1273328, 2042253, 1963677, 1347951, 1426723, 2098849, 2025553, 1646753, 1518380, 3127823, 3328433, 2546947, 2014941, 2312660, 2558074, 2818273, 2857352, 2256013, 1798788, 2217072, 2579147, 2448857]
6822B448857o41074k08450O15384K52943r52143p9591M86051R4909K4185O4784
6812B105855J42160o3310m31473m9073O6168N42444L98994Q15767N9879j374297
6802B213114k69077L39685O59142J9392j44850N3012M40318p53883l98871k52221
6792A905761K05051R1192J208089J24327j19386N2337j70564l77387l58469k16684
6782B344267P07585O23070l12299n23941j23824Q8486O27590k60965n58389Q42215
6772C453795M82158j61710m82811j014420R64469Q59402j8741j93434n25463n03880
6762B859365l07495l2963m24922O92381L46851N00965L31348p96894L43397L82465
6752C894498j1410j03455O9944M47567k64731p1196m44372p21837M27497J147182
$$ y = [2448857, 1807783, 1599333, 2214717, 2467660, 1515517, 1435926, 1921977, 2016886, 2041071, 2105855, 2248015, 2184705, 1753232, 1704159, 1770327, 2312771, 2711765, 3527532, 3587411, 2213114, 1944037, 2283722, 2942864, 2962256, 2817406, 2870418, 3310736, 2556853, 2157982, 1905761, 2110812, 2202004, 3410093, 3534420, 3415034, 3467371, 3296807, 2919420, 2560951, 2344267, 3051852, 3674922, 3362623, 2838682, 2714858, 2803344, 3430934, 3169969, 2611580, 3453795, 3935953, 3774243, 3291432, 2277012, 3241481, 4100883, 4082142, 3888708, 3363245, 2859365, 2551870, 2518907, 2093985, 2786366, 3133217, 3634182, 3965530, 3168636, 3512033, 3894498, 3883088, 3779633, 3849577, 4297144, 4032413, 3961217, 3516845, 2795008, 3222505, 4369687]
6742D369687J33031k32278n67184l81953N82306K23792P277K87609L06835k62009
6732D467113p04349N64520l95182j39895L20011J5554j47962m5851j05537n44753
6722C283669K015M61164P9581l9130K97162M4259J1709O19551k13497p06568J56317
6711C996232R95653J026659p44727J64081j35842p92613R5336P94858Q4277P2887
6701E556801j94988P9145k65191m06956m42618J020858J60892m38054M59448L9394
6691E568731Q54864n26184q30680j55982O65951N2675k54378M3450Q7027j269364
6681D236110R69625O62660m40257m15720J42354O29887k54917n41722M82942P26241
6671F197203n84389o59418N39914m19992K46926J59442O95871N94751l93477N73152
$$ y = [4369687, 4502718, 4270440, 3703256, 3321303, 3903609, 4127401, 4134678, 4422287, 4729122, 4467113, 3762764, 4327284, 3932102, 3792207, 4112218, 4127772, 3979810, 3933959, 3828422, 3283669, 3285684, 3746848, 3826429, 3787299, 4084461, 4128720, 4140429, 4759980, 4546483, 3839915, 3996232, 4991885, 6018544, 5273817, 5437898, 5302056, 4509443, 4604779, 5399637, 5483914, 5556801, 5361813, 5440958, 5175767, 4768811, 4326193, 5347051, 5507943, 5069889, 5529337, 5568731, 6423595, 5897411, 5066731, 4910749, 5576700, 5629375, 5374997, 5418447, 5505474, 4236110, 5205735, 5868395, 5428138, 5012418, 5154772, 5784659, 5529742, 4988020, 5470962, 6197203, 5612814, 4953396, 5493310, 5073318, 5320244, 5479686, 6175557, 6770308, 6376831, 6949983]
6661F949983K32361r543o84237k71368J090029J40284m07836j73172P04548K38473
6651G809522l27822m0958L76527l2832q75377L83849k20303l58345r07647N95603
6641F402217J395101o23756l97079O49368L03927K38885l62020r3567K82218M71261
6631H266555K05856K35592O72846p82439j37595J70260l69497k8397n8017Q01486
6621H976650k39210p12613M34737O57666o6056n77156M80241R35301K32577M00187
6611A0522324k64969j220495k48407J428074N119n48680j89846r0611L61453N70005
6601A0323967p12137p2895J108939Q46604n54075o38931J005252Q12266m06296
6592A1712694n22219m96998L33386J81322j010404K78426J10276l20728N56817
$$ y = [6949983, 7182344, 7172801, 6488564, 6217196, 7307225, 7447509, 7039673, 6866501, 7571049, 7809522, 7481700, 7440742, 7817269, 7784437, 6909060, 7292909, 7072606, 6714261, 5806614, 6402217, 7797318, 7173562, 6776483, 7425851, 7729778, 7968663, 7606643, 7513076, 7795294, 8266555, 8472411, 8708003, 9380849, 8598410, 8460815, 8631075, 8261578, 8233181, 8175164, 8976650, 8737440, 8024827, 8459564, 9117230, 9051174, 8474018, 8954259, 9889560, 10122137, 10522324, 10257355, 9036860, 8788453, 10216527, 10221646, 9672966, 9483120, 9392509, 9753962, 10323967, 9611830, 9538935, 10647874, 11494478, 10940403, 10301472, 11306724, 12118990, 11712694, 11190475, 10693477, 11026863, 11208185, 10197781, 10476207, 10586483, 10265755, 10822572]
6583A0822572R20947j63620j100730R85395J704053j24241q05402k2246N40770
6574A2757498j92314K89241P60825J193294o53443n67488Q684k46649m04494R3827
6564A3038981P04262l19593m09778N10028J381297J35911q79333N50670Q47200
6555A5559645m28985j15973L39607R61228l53806m122N71614j72155p09939J69818
6545A5816932j1101J15525M05464P84934K48734m41248M0156P23289M22515J17869
6535A8223069N32326M57754J27274l7877Q1427q9887P91793J26089J75954n8090
6525B0329832o88768J36681O57171M37611L50009J72289M66918J78173J95403
6516B2235319L97313L88364P48837m4569k56906n09751M77415P162l76648O16705
$$ y = [10822572, 11743519, 11579899, 10479169, 11464564, 13168617, 13044376, 12238974, 12216728, 12757498, 12565184, 12854425, 13615250, 14808544, 14155101, 13587613, 13596297, 13349648, 12945154, 13038981, 13743243, 13423650, 13013872, 13523900, 14905197, 15041108, 14161775, 14712445, 15559645, 15130660, 15014687, 15354294, 16315522, 15961716, 15957594, 16529208, 16357053, 15647114, 15816932, 15805831, 15921356, 16326820, 17111754, 17360488, 16919240, 16959396, 17682685, 18105200, 18223069, 18755395, 19213149, 19340423, 19302546, 19383973, 19294086, 20085879, 20211968, 20387922, 20329832, 19641064, 19777745, 20434916, 20872527, 21222536, 21394825, 21861743, 22039916, 22235319, 22632632, 23020996, 23769833, 23725264, 23468358, 22958607, 23436022, 23443184, 23066536, 23683241]
6506B3683241K39584J337036K09764l42314j60184N11650Q23872P73529L68879
6497B7445057L60240P19342j20909M29737L65834k77608N22087L99103K76413
6488C0119296m40532P2908L60560L86815M93730O15755N05038J136532L35898
6479C3586000M85930J79925j64455P63107J042612K51289P1399L23256J17085
6470C6656148N19372J36004L73396K19168O50455P34260J005N882N40837J072439
6460D0908966J143800P03625N51576j21463Q21734K89427n17249J556838R61887
6451D6299141K58432N55145l99255R02456J076342R24337K18256J13061Q58291
6442E0806206M41812L28259K79982P34614P68511R45260J342249K11648O69338
$$ y = [23683241, 23922825, 25259861, 25469625, 25127311, 24967127, 25478777, 26302649, 27076178, 27445057, 27805297, 28524639, 28403730, 28833467, 29199301, 28921693, 29443780, 29842883, 30119296, 29678764, 29751672, 30112232, 30499047, 30992777, 31608532, 32113570, 33250102, 33586000, 34071930, 34251855, 34087400, 34850507, 35893119, 36144408, 36215807, 36539063, 36656148, 37175520, 37311524, 37684920, 37904088, 38554543, 39288803, 39289808, 39295690, 39836527, 40908966, 42052766, 42756391, 43307967, 43186504, 44008238, 44297665, 43780416, 45337254, 46299141, 46557573, 47112718, 46713463, 47615919, 48692261, 49616598, 49834854, 49947915, 50806206, 51248018, 51576277, 51856259, 52590873, 53359384, 54304644, 55646893, 55858541, 56527879]
6433E6527879q0925j42948J002037M09296K66373K417J951049J678995O04642
6424F2218815Q27181M63677O91307J22149M30687N44081K62062M63254N27770
6415F6550983M59039J381184L80022R28181J633806J40363m9946N02649J228991
6406G3155272P35705j23270m58116Q85712J473920l50511l02061O65890Q28033
6397G6510574M58673J169157O47491m96950M05310J014278O01884n42082l51804
6388G9416531R40315J517240l99895j072621N04092P94953m5590r61471M8615
6379H0742169J44813M47133N19950J11418K4474r67674L50979J79988j78656K23228
6369H1597822L94855N13076p77776j272981K73679o8491j061144j166253p23964
$$ y = [56527879, 56446954, 56304006, 57306043, 57715339, 57981712, 57984129, 59935178, 61614173, 62218815, 63045996, 63509673, 64200980, 64323129, 64753816, 65297897, 65559959, 66023213, 66550983, 67010022, 68391206, 68771228, 69699409, 71333215, 71473578, 71423632, 71926281, 73155272, 73890977, 73767707, 73309591, 74195303, 75669223, 75318712, 75016651, 75682541, 76510574, 76969247, 78138404, 78785895, 78288945, 78694255, 79708533, 80310417, 79768335, 79416531, 80356846, 81874086, 81474191, 80401570, 80905662, 81700615, 81655025, 80693554, 80742169, 80886982, 81334115, 81854065, 81965483, 81989957, 81022283, 81373262, 81553250, 81374594, 81597822, 81992677, 82505753, 81727977, 80454996, 80728675, 80660184, 79599040, 78432787, 77708823]
6360G7708823Q17172k46104j91251k88389q4372n29719o35585M92289o25249j399829
6350G5017786r07169L1856q56846p11239n31297P89343m68058j365140j690472
6341F9308764j81292O62492j645422j465992n4579n07594l75010k22523q16265
6332F4702579J89529j348181j34411m12206j501015j223893n05298o57018j060465
6323E8049621o13931J00162J34680r43982j204186n34833n64922l60701k81783
6314E3780125j30866j311179q63406l11248m36205n23838j394163k41840m48022
6305D8119358j19643r11923j355564K28886m09372j343278K58149J18357o87133
6296D3897837j244443q29241Q2704o29221r95905J45877o7988j461344j074454
$$ y = [77708823, 78525995, 78279891, 78088640, 77800251, 77715879, 77186160, 76550575, 77042864, 76417615, 75017786, 74110617, 74142473, 73285627, 72574388, 72043091, 72832434, 72364376, 70999236, 69308764, 69127472, 69789964, 68144542, 66678550, 66623971, 66116377, 65741367, 65518844, 64702579, 64892108, 63543927, 63409516, 62997310, 61496295, 60272402, 59767104, 59110086, 58049621, 57435690, 57535852, 57670532, 56726550, 55522364, 54987531, 54422609, 54061908, 53780125, 53649259, 52338080, 51474674, 51163426, 50727221, 50203383, 48809220, 48567380, 48119358, 47999715, 47087792, 45732228, 45961114, 45551742, 44208464, 44466613, 44584970, 43897837, 42653394, 41824153, 41906857, 41277636, 40281731, 40427608, 40359620, 38898276, 37823822]
6287C7823822P57415L05827j075901o16659n55784l90264N15799j322463j87517
6278C5254275l68036j081484L21109L10256o16717q94992n06606k58700j242119
6269C0916986j040574N38563L58505o08834j253642M27293R17016q03444j089431
6260B8362438K54607m33345q12547l09082j68831m20967j135625j75395Q78538
6251B6039791n32382p64086N99946O46643j163676j773342l94567Q30638p3753
6242B3415212j500348o04896J338365K09702m30159j67969q04438p51144m93191
6233B0211134L32790O88922j467049m56748J397102l65614j243644p073L48878
6224A9438698M45787o74838j783901N07234l3760q85348J088276N65706q46895
$$ y = [37823822, 38581237, 38887064, 37811163, 37194504, 36638720, 36248456, 36764255, 35441792, 35254275, 34886239, 33804755, 34125864, 34436120, 33819403, 32924411, 32417805, 32159105, 30916986, 29876412, 30414975, 30773480, 30164646, 28911004, 29338297, 30255313, 29451869, 28362438, 28617045, 28183700, 27371153, 27062071, 26893240, 26472273, 25336648, 25161253, 26039791, 25507409, 24743323, 25343269, 25989912, 24826236, 23052894, 22658327, 23488965, 23415212, 21914864, 21309968, 22648333, 22858035, 22427876, 22259907, 21455469, 20704325, 20211134, 20543924, 21232846, 19765797, 19309049, 20706151, 20340537, 19096893, 19089820, 19438698, 19884485, 19209647, 17425746, 17932980, 17899220, 17013872, 18102148, 18667854, 17820959]
6215A7820959r55935M58510l43168r19969j122562m3045Q27402n7542l82653J97985
6205A5479982L74j55913j37913N22119k6619p28366j53998m43842k25678n61211
6195A3568935R48551q2686j393p05202m63384J10298l19714q41782L08900L97513
6185A2920036p52062K5011K94638q1448J22080m58366M59895L68696q4155j89033
6175A2625292l89550L69817l79360n90453k14815J1261o91393L78858N54296p41128
6165A0932825r88983L36579l25263J23109m5478K09282L8119m02259k63999m20934
6155I192998P7195l3473L49804L52055k13901j066528Q1747M40796J05404l33733
6145H952364J7004L51457k54411n33313k03816M86748K47376L00289R5744o13440
$$ y = [17820959, 16865024, 17323534, 16980366, 16060397, 14937835, 14894790, 15722192, 15664650, 15281997, 15479982, 15480356, 15324443, 15186530, 15708649, 15682030, 14953664, 14799666, 14355824, 14130146, 13568935, 14517486, 14434800, 14433407, 13728205, 13264821, 13375119, 13055405, 12213623, 12522523, 12920036, 12167974, 12192985, 12487623, 12406175, 12528255, 12069889, 12529784, 12898480, 12814325, 12625292, 12235742, 12605559, 12226199, 11635746, 11420931, 11432192, 10740799, 11119657, 11673953, 10932825, 9943842, 10280421, 9955158, 10078267, 10032789, 10242071, 10280190, 9877931, 9613932, 9192998, 9270193, 9236720, 9586524, 9938579, 9724678, 8658150, 8739897, 9180693, 9286097, 8952364, 8969368, 9320825, 9066414, 8533101, 8329285, 8816033, 9063409, 9363698, 9459442, 8846002]
6135H846002k78374O1832L29602j66862m27555n37483p94262j91235L35474j35829
6125G041310P05665O90168m21573m06953M02514R32099m25824j082070m55029
6116F980307m77947L62376J65304m34877N01570o4528L43215p0272r65506j95210
6106F144432K6318l39420m88603K29097J58016J62856P43291l41556o90174k82459
6096E321798M1646k65883J20222N48033O8086J12497o406J66591K56503o7406
6086F295681M3657o17621M800m74699l90079N66714k36510K1536J75492p0710
6076E318261n46690k27562Q83O561J24279k80404J82762K50756Q2704n22713j39431
6065D249406O3386Q9653R1156k56379l38773l5290N56168J091709l2437k43285
$$ y = [8846002, 8567628, 8629460, 8959062, 8792200, 8364645, 7827162, 7032900, 6841665, 7177139, 7041310, 7746975, 8437143, 8015570, 7608617, 8011131, 8943230, 8517406, 7435336, 6980307, 6502360, 6864736, 7030040, 6595163, 7096733, 7032205, 7375420, 7305148, 6339642, 6144432, 6170750, 5831330, 5342727, 5571824, 5729840, 5892696, 6635987, 6294431, 5604257, 5321798, 5363444, 5097561, 5217783, 5765816, 5833902, 5946399, 5939993, 6106584, 6363087, 6295681, 6339338, 5721717, 5726517, 5251818, 4861739, 5428453, 5191943, 5213479, 5388971, 5318261, 4771571, 4544009, 4544892, 4551453, 4675732, 4395328, 4578090, 4828846, 4911550, 4388837, 4249406, 4312792, 4402445, 4493601, 4237222, 3898449, 3863159, 4419327, 5511036, 5478599, 5235314]
6055E235314O43125K4891o15724j515799m64889P83685m7804K08867K65833n03112
6045D014387P6749l09811J088180l07533m25991K37082k40656n97042L6521M73840
6035D045726M60078L13143n33795P80543n12214l81548n64880M03336M94999n33537
6025C971851J92013j99601j99559J55650j80318L48174P1030k59158L48433J75885
6015D424400l20343m45317M74973k46914l15602q6061P90598m67678n00917q05250
6005B501889p8992O16993n4491k71932m03654M32120k85298M00635p19422k75189
5995A862659M22052L90521O89994J98428m11457l18347J66871k24901l67111P35495
5985C144204M10547r1065m71420n85962J12847j26202m7580J36688L2915m97049
$$ y = [5235314, 5878439, 5903330, 5287606, 3771807, 3306918, 4090603, 4042799, 4251666, 4517499, 4014387, 4091136, 3781325, 4869505, 4561972, 4135981, 4373063, 4132407, 3535365, 3571886, 4045726, 4505804, 4818947, 4285152, 5065695, 4553481, 4171933, 3607053, 4010389, 4505388, 3971851, 4163864, 3964263, 3764704, 3920354, 3740036, 4088210, 4159240, 3900082, 4248515, 4424400, 4104057, 3658740, 4133713, 3886799, 3571197, 3485136, 4275734, 3808056, 3307139, 2501889, 2422897, 3039890, 2985399, 2713467, 2309813, 2741933, 2456635, 2857270, 2137848, 1862659, 2284711, 2675232, 3365226, 3563654, 3152197, 2833850, 3000721, 2775820, 2408709, 3144204, 3554751, 3463686, 2992266, 2406304, 2519151, 2392949, 2345369, 2482057, 2514972, 2017923]
5975B017923L64824N3502j77019J5908O24174M67243r00731K37013j59570j54094
5965B389173N79056R5368o29509m03933P39419K4005k98176n07074o80240j91777
5955A116312N34963P44719N5656K0461Q6188K9604r66107q8712O37583l539q83621
5944A283507m51334J47365N73700P15870M55593n86672k66711M77673M8446p11031
5934A686406n18005Q75395l00503n38366N57912Q57751m2574j047410k24799O6728
5924A372535N9251N19343J33611l23619m8682P40047J70852j76300p63607o58266
5914A025165o83012J085425O0292n59819j69573Q14397K63267j66302q8511j31466
5904A449863O95358K11302l36798j228472O2225J404826N04903o39218n06999
$$ y = [2017923, 2382747, 2436249, 2259230, 2275138, 2899312, 3366555, 2465824, 2702837, 2543267, 2389173, 2968229, 3063597, 2434088, 2030155, 2769574, 2793579, 2495403, 1988329, 1308089, 1116312, 1651275, 2395994, 2451650, 2472111, 2558299, 2587903, 1621796, 1533084, 2170667, 2167128, 1283507, 832173, 979538, 1553238, 2269108, 2724701, 2138029, 1871318, 2348991, 2397437, 1686406, 1168401, 2043796, 1743293, 1204927, 1762839, 2620590, 2578016, 1530606, 1305807, 1372535, 1431786, 1951129, 2084740, 1761121, 1712439, 2452486, 2623338, 2447038, 1683431, 1025165, 342153, 1427578, 1487870, 928051, 758478, 1572875, 1836142, 1669840, 1581329, 1449863, 2145221, 2356523, 2019725, 791253, 853478, 2258304, 2763207, 2123989, 1616990]
5895A616990M13111J32593k21209n81064r03801L18441P94150k81832M13311J45939
5885A846629o57678o0620K55196J48425j23273Q17330p7535n32554j068481l23562
5875B23877J326388J25235l79870n93994M84884M53477k12115j093790p1198J116051
5865A378945k97777K87009O06634K35836k89771q29682l31436J25189O64449J06817
5855A656213p14049p08691j249025K20705L15753M89246L29148M03424M65562
5846A208286m29811q32736L94947M30816P54581m79521M48207L03324m04693j07602
5836A285798l25320m14867l58477L62084L94631q5332q84598m53624M10473p2469
5826a41701R4399O88479J038965k28798q89868J64617M53952J56951p31712k05435
$$ y = [1616990, 2030101, 2162694, 1941485, 1360421, 456620, 775061, 1569211, 1287379, 1700690, 1846629, 1188951, 1128331, 1383527, 1531952, 1408679, 2226009, 2148474, 1615920, 547439, 223877, 1550265, 1675500, 1295630, 701636, 1186520, 1639997, 1427882, 334092, 262894, 1378945, 1081168, 1368177, 1974811, 2210647, 1920876, 1091194, 759758, 884947, 1549396, 1656213, 942164, 233473, -1015552, -794847, -479094, 10152, 339300, 742724, 1208286, 778475, -54261, 340686, 771502, 1526083, 1046562, 1494769, 1798093, 1393400, 1285798, 960478, 545611, 187134, 549218, 943849, 858517, -26081, -479705, -69232, -141701, -47302, 641177, 1680142, 1451344, 561476, 726093, 1180045, 1336996, 605284, 399849]
5816C99849J287965o11055N4388J40120o48032n80691J2755Q39080L54863j247433
5806A809J36168O93420q2399p29209M8983J323674n71624p76664k61631M54777
5796B37304m7612J75806m06615L74512m44534M2483P72034m3398k68461k51306
5786A40213J035421J115694r62367k29993L32378M00411k24223j84003O49378
5777B072909j33579j048588l94456j002889L7071m5950M32420K82739l54603P43907
5767E88981Q93314k58507r75061k89792J42514M72865k39245j47204J93367j41701
5757B39531J43056l0927M39438P3147L56675R07016j018794n02136q14640J18391
5747h9243K53243j235630K91308J479048P57018q54385o11905L61419N33583o39414
$$ y = [399849, 1687814, 1076759, 1131147, 1271267, 623235, 42544, 55299, 894379, 1249242, 1809, 137977, 831397, 748998, 19789, 68772, 1392446, 820822, 44158, -217473, 237304, 189692, 365498, -41117, 333395, -111139, -68656, 703378, 659980, 391519, 140213, 1175634, 2291328, 1328961, 1098968, 1431346, 1831757, 1607534, 1423531, 2072909, 1939330, 890742, 496286, -506603, -469532, -515482, -83062, 199677, -154926, 588981, 1482295, 1223788, 248727, -41065, 101449, 574314, 335069, 187865, 381232, 239531, 382587, 351660, 791098, 864245, 1220920, 2127936, 1109142, 607006, -207634, -89243, 164000, -1071630, -780322, 698726, 1455744, 601359, -10546, 350873, 884456, 245042]
5737B45042j98131K86914r9315K82037k68767k85275O16009q4647O20630n03911
5727F10586j063808K75239O02755L69662o74440j29089O06037J42692N45545k84605
5717A000574L1521J34145n18249k9220J19435o42595K24118M6429n28703l3783
5707a96328j51904Q85675j75931j466907L94169O10984M73628Q60919n56779k73148
5697D04378n75780K55607K93858m30231K36117N54688J65590o0025o14851k10449
5687A8902j31603K43550l21943m9987P04202L94069l6392k45939l10481k65930
5677a552N55448K83282l16331j86255K9604L85894k89773J92855p84536j99228
5667c30592M0969m07183O97376J7704L68272R32236k10016l12245M19044O71714
$$ y = [245042, 46911, 333825, 234510, 516547, 247780, -37495, 578514, 493867, 1114497, 610586, -453222, -177983, 424772, 794434, 119994, -9095, 596942, 739634, 1285179, 1000574, 1032095, 1166240, 647991, 618771, 738206, 95611, 319729, 366158, -162545, -196328, -348232, 537443, 361512, -1105395, -711226, -100242, 373386, 1234305, 677526, 404378, -171402, 84205, 378063, -52168, 183949, 738637, 904227, 844202, 229351, 18902, -112701, 130849, -191094, -241081, 463121, 857190, 820798, 574859, 264378, -1552, 553896, 837178, 520847, 334592, 364196, 750090, 460317, 653172, -131364, -330592, -289623, -696806, 570, 18274, 386546, 1318782, 1108766, 796521, 1215565, 1887279]
5657A887279j267257j342461P70545L78495q0443M00833K29298p38977j96888
5648D0424J41837J43632k56970j300633L88586l15057J46405L53818J15303N52231
5638I576j31496K07137N16930O767j05558j31816m46529j80741J68628J16566
5628B9464N53609n41193m6740k81154j11998M85672l81158p5589L64478m71334
5618d75943j62769L94664Q71073J85379k35898J69576p62640k97828k20912m23738
5608i59036P81998L89729j51785j86060p28706k85689K27771M65608L80574K92923
5598B27327P12622N17655l15507j035653k31236Q87159L43956p12122l89402k54559
5588b49760r57681j70330J91817N81685n08383K74313J09576q3221l6951j42089
$$ y = [1887279, 620022, -722439, 48106, 426601, 346158, 746991, 976289, 237312, 40424, 182261, 325893, 68923, -1231710, -843124, -1158181, -1011776, -657958, -542655, 9576, -121920, 85217, 602147, 608914, 503356, 371540, -74989, -255730, -87102, 29464, 583073, 41880, -4860, -286014, -398012, 87660, -293498, -369087, -4609, -475943, -638712, -244048, 627025, 812404, 576506, 746082, -16558, -314386, -535298, -959036, -177038, 212691, 60906, -125154, -853860, -1139549, -911778, -446170, -65596, 227327, 939949, 1457604, 1142097, 106444, -124792, 762367, 1106323, 394201, 4799, -249760, -1207441, -1377771, -1185954, -604269, -1112652, -838339, -728763, -811984, -848935, -991024]
5578i91024Q936J054440M05418J68193l75080k09177j42325M64262K22020l8316
5568E67347n21650n640l16099r55791m74586K35138M13272L83123m2587K53577
5558d63896Q386R80543p44674m97317J661908Q4030j247325k57582L23334N58370
5548D05777o13486n70106J10450P60530O71152l14016J01704o73183K83254O25723
5538G87799k09912r61705k13081Q79975J063981o05646p10700n67328q8161K11874
5528d12904n01865n6034M2162L65139N72050k96650l37381L18222P17186Q5809
5518D95734p12686l69074J048930N96339J89105o08463m92914j01177j118840
5509a073046l18042L07726k19800M68213O6763O54859N65458l62713l7550M30487
$$ y = [-991024, -982088, 72352, 477770, 645963, 270883, 61706, -80619, 383643, 605663, 567347, 45697, 40057, -276042, -1231833, -1706419, -1471281, -1058009, -674886, -717473, -463896, -455510, 525033, -219641, -716958, 944950, 1028980, -218345, -475927, -152593, 405777, -207709, -777815, -667365, 93165, 764317, 450301, 552005, -121178, 162076, 787799, 577887, -383818, -596899, 283076, 1347057, 741411, 30711, -536617, -624778, -412904, -914769, -970803, -928641, -563502, 8548, -288102, -625483, -307261, 409925, 495734, -216952, -586026, 462904, 1059243, 1248348, 639885, 146971, 45794, -1073046, -1391088, -1083362, -1303162, -834949, -768186, -113327, 452131, 89418, 51868, 482355]
5499D82355o03994p82484l0844J095762N0562l24920J61934m92270m2648Q7159
5489c99388M39203K06693o32799k49209J38020L47899J44091j91776K84956P61259
5479H48949n4583m83335p22871K41964J92665m96773O69297P08348k53769P3799
5469G23691n73658k94020k10193J29086R94614n70502n24129p12766J267060J089805
5459A318988j128814K6298P4901n44408L10571m5179l24211n24052K09950J105875
5449D79919m46631r28264J259599M65561j281236j131699J21779J566884n05184
5440c99272L23139k58417j43004J04238o42296K92625J70770j86374Q47266r12
$$ y = [482355, -121639, -904123, -934967, 160795, 211357, -113563, 48371, -443899, -486547, -399388, 39815, 246508, -386291, -635500, -497480, -149581, -5490, -197266, 87690, 848949, 794366, 311031, -411840, -169876, 22789, -473984, 195313, 903661, 649892, 723691, 150033, -143987, -354180, -225094, 769520, 199018, -325111, -1037877, 229183, 1318988, 190174, 216472, 291373, -253035, 57536, 12357, -311854, -835906, -625956, 479919, 33288, -894976, 364623, 830184, -451052, -1582751, -1460972, 105912, -399272, -76133, -334550, -477554, -373316, -1015612, -722987, -552217, -738591, 108675, 107763]
$$ [...]
##END NTUPLES=NMR SPECTRUM
##END=
