##TITLE=1H_CA-8800-5
 CDCl3, 8 sc, 
 23.12.2020
##JCAMPDX= 6.0         $$ Bruker NMR JCAMP-DX V2.0
##DATA TYPE= NMR SPECTRUM
##DATA CLASS= NTUPLES
##ORIGIN= UXNMR, Bruker Analytische Messtechnik GmbH
##OWNER= root
$$ XWIN-NMR		Version 3.5
$$ Wed Dec 23 10:29:06 2020 Russian Standard Time (UT+4h)  she@DPX200
##.OBSERVE FREQUENCY= 200.1315066352
##.OBSERVE NUCLEUS= ^1H
##.ACQUISITION MODE= SIMULTANEOUS
##.ACQUISITION SCHEME= undefined
##.AVERAGES= 8
##.DIGITISER RES= 18
##SPECTROMETER/DATA SYSTEM= spect
##.PULSE SEQUENCE= zg30
##.SOLVENT NAME= CDCl3
##.SHIFT REFERENCE= (INTERNAL, CDCl3, 0, 15.9968)
##AUDIT TRAIL= $$ (NUMBER, WHEN, WHO, WHERE, WHAT)
$$ ##TITLE= Audit trail, XWIN-NMR		Version 3.5
$$ ##JCAMPDX= 5.01
$$ ##ORIGIN= Bruker BioSpin GmbH
$$ ##OWNER= she
$$ F:/spectra/data/she/nmr/H-F/1/pdata/1/auditp.txt
$$ ##AUDIT TRAIL=  $$ (NUMBER, WHEN, WHO, WHERE, WHAT)
(   1,<2020-12-23 10:27:28.25 +0400>,<she>,<DPX200>,
      <created by zg, POWCHK disabled, PULCHK disabled
       configuration hash MD5:
       00 E9 B6 7A A2 85 ED C7 34 08 36 98 17 FE 4E 26
       data hash MD5: 16K
       DC 3C 24 45 7D E6 73 2C 9C 81 03 54 97 86 17 8F>)
(   2,<2020-12-23 10:27:30.92 +0400>,<she>,<DPX200>,
      <Start of raw data processing
       efp BC_mod = 2 LB = 0.24 FT_mod = 6 PKNL = 1 PHC0 = -10760.61 PHC1 = 9.60095 SI = 16K 
       data hash MD5: 16K
       FE A7 19 DB 79 A1 DB FB E9 C0 B6 FA B3 4B E5 3B>)
(   3,<2020-12-23 10:27:47.82 +0400>,<she>,<DPX200>,
      <pk PHC0 = 1.098235 PHC1 = -2 
       data hash MD5: 16K
       7B 97 68 9B 87 66 57 63 F0 37 BE 57 80 2B C2 25>)
(   4,<2020-12-23 10:27:53.57 +0400>,<she>,<DPX200>,
      <abs ABSG = 5 
       data hash MD5: 16K
       4F FC B1 23 B2 F7 0B 2E 0F 15 55 19 AF E9 AE 26>)
(   5,<2020-12-23 10:28:11.57 +0400>,<she>,<DPX200>,
      <pk PHC0 = -2.075122 PHC1 = 4.399998 
       data hash MD5: 16K
       F7 D5 43 CE 60 04 4F 3C 38 F6 84 AF 34 0B 02 5B>)
(   6,<2020-12-23 10:28:14.59 +0400>,<she>,<DPX200>,
      <abs ABSG = 5 
       data hash MD5: 16K
       61 0F 58 A4 5A 42 A5 85 A5 20 98 D4 89 47 3B 9F>)
$$ ##END=
$$ 
$$ hash MD5
$$ A5 04 D2 C9 3E 95 DC B3 C3 64 99 20 20 17 E7 68
##$RELAX= 
##$RELAX= 
##$RELAX= 
##$RELAX= 
##$RELAX= 
##$RELAX= 
$$ Bruker specific parameters
$$ --------------------------
##$DU= <F:/spectra>
##$EXPNO= 1
##$NAME= <H-F>
##$PROCNO= 1
##$TYPE= <nmr>
##$USER= <she>
##$AMP= (0..31)
100 100 100 100 100 100 100 100 100 100 100 100 100 100 100 100 100 100 
100 100 100 100 100 100 100 100 100 100 100 100 100 100 
##$AQSEQ= 0
##$AQ_mod= 1
##$AUNM= <au_zg>
##$AUTOPOS= <>
##$BF1= 200.13
##$BF2= 200.13
##$BF3= 200.13
##$BF4= 200.13
##$BF5= 200.13
##$BF6= 200.13
##$BF7= 200.13
##$BF8= 200.13
##$BYTORDA= 1
##$CFDGTYP= 0
##$CFRGTYP= 5
##$CHEMSTR= <none>
##$CNST= (0..31)
1 1 145 1 1 1 1 1 1 1 1 1 1 1 1 1 1 1 1 1 1 1 1 1 1 1 1 1 1 1 1 1 
##$CPDPRG= <>
##$CPDPRG1= <>
##$CPDPRG2= <>
##$CPDPRG3= <>
##$CPDPRG4= <mlev>
##$CPDPRG5= <mlev>
##$CPDPRG6= <mlev>
##$CPDPRG7= <mlev>
$$ [...]
##$SUBNAM3= <"">
##$SUBNAM4= <"">
##$SUBNAM5= <"">
##$SUBNAM6= <"">
##$SUBNAM7= <"">
##$SUBNAM8= <"">
##$SUBNAM9= <"">
##$SW= 16.9725356469052
##$SWIBOX= (0..15)
0 0 2 0 0 0 0 0 0 0 0 0 0 0 0 0 
##$SW_h= 3396.73913043478
##$TD= 16384
##$TD0= 1
##$TE= 0
##$TE2= 300
##$TE3= 300
##$TEG= 300
##$TL= (0..7)
0 120 120 120 120 120 120 120 
##$TP= (0..7)
150 150 150 150 150 150 150 150 
##$TP07= 0
##$TPNAME0= <>
##$TPNAME1= <>
##$TPNAME2= <>
##$TPNAME3= <>
##$TPNAME4= <>
##$TPNAME5= <>
##$TPNAME6= <>
##$TPNAME7= <>
##$TPOAL= (0..7)
0.5 0.5 0.5 0.5 0.5 0.5 0.5 0.5 
##$TPOFFS= (0..7)
0 0 0 0 0 0 0 0 
##$TUNHIN= 0
##$TUNHOUT= 0
##$TUNXOUT= 0
##$USERA1= <user>
##$USERA2= <user>
##$USERA3= <user>
##$USERA4= <user>
##$USERA5= <user>
##$V9= 5
##$VALIST= <valist>
##$VCLIST= <CCCCCCCCCCCCCCC>
##$VD= 0
##$VDLIST= <DDDDDDDDDDDDDDD>
##$VPLIST= <PPPPPPPPPPPPPPP>
##$VTLIST= <TTTTTTTTTTTTTTT>
##$WBST= 1024
##$WBSW= 4
##$XGAIN= (0..3)
0 0 0 0 
##$XL= 0
##$YL= 0
##$YMAX_a= 974674
##$YMIN_a= -442221
##$ZGOPTNS= <>
##$ZL1= 120
##$ZL2= 120
##$ZL3= 120
##$ZL4= 120
##$ABSF1= 15.98128
##$ABSF2= -0.9913816
##$ABSG= 5
##$ABSL= 3
##$ALPHA= 0
##$AQORDER= 0
##$ASSFAC= 0
##$ASSFACI= 0
##$ASSFACX= 0
##$ASSWID= 0
##$AUNMP= <proc_1d>
##$AZFE= 0.1
##$AZFW= 0.1
##$BCFW= 0
##$BC_mod= 2
##$BYTORDP= 0
##$COROFFS= 0
##$CY= -3
##$DATMOD= 1
##$DC= 0
##$DFILT= <>
##$DTYPP= 0
##$F1P= 0
##$F2P= 0
##$FCOR= 1
##$FTSIZE= 16384
##$FT_mod= 6
##$GAMMA= 0
##$GB= 0
##$INTBC= 1
##$INTSCL= 2.992141e-10
##$ISEN= 128
##$LB= 0.24
##$LEV0= 0
##$LPBIN= 0
##$MAXI= 10000
##$MC2= 0
##$MEAN= 0
##$ME_mod= 0
##$MI= 1.114404
##$NCOEF= 0
##$NC_proc= -6
##$NLEV= 6
##$NOISF1= 3.799351
##$NOISF2= 2.8
##$NSP= 0
##$NTH_PI= 0
##$NZP= 0
##$OFFSET= 15.99682
##$PC= 1
##$PHC0= -10761.58
##$PHC1= 12.00095
##$PH_mod= 1
##$PKNL= yes
##$PPARMOD= 0
##$PSCAL= 0
##$PSIGN= 0
##$REVERSE= no
##$SF= 200.130003561831
##$SI= 16384
##$SIGF1= 3
##$SIGF2= 2
##$SINO= 5.538805
##$SIOLD= 16384
##$SREGLST= <1H.CDCl3>
##$SSB= 0
##$STSI= 16384
##$STSR= 0
##$SW_p= 3396.73913043478
##$SYMM= 0
##$S_DEV= 0
##$TDeff= 16384
##$TDoff= 0
##$TI= <>
##$TILT= no
##$TM1= 0
##$TM2= 0
##$TOPLEV= 0
##$USERP1= <user>
##$USERP2= <user>
##$USERP3= <user>
##$USERP4= <user>
##$USERP5= <user>
##$WDW= 1
##$XDIM= 16384
##$YMAX_p= 406321891
##$YMIN_p= -746180
$$ End of Bruker specific parameters
$$ ---------------------------------
##NTUPLES= NMR SPECTRUM
##VAR_NAME=  FREQUENCY,     SPECTRUM/REAL,   SPECTRUM/IMAG
##SYMBOL=    X,             R,               I
##VAR_TYPE=  INDEPENDENT,   DEPENDENT,       DEPENDENT
##VAR_FORM=  AFFN,          ASDF,            ASDF
##VAR_DIM=   16384,         16384,           16384
##UNITS=     HZ,            ARBITRARY UNITS, ARBITRARY UNITS
##FACTOR=    0.207333158178281, 1,           1
##FIRST=     3201.44373360227, 0,            0
##LAST=      -195.295396832511, 0,           0
##MIN=       -195.295396832511, -746180,     0
##MAX=       3201.44373360227, 406321891,    0
$$ Real data points
##PAGE= N=1
##DATA TABLE= (X++(R..R)), XYDATA
$$ [...]
$$ plain form
11029 -23062 73051 65134 -45608 -118472 -90618 70889 212328 142389 1474 23576 70192
11018 70192 154823 132150 39683 5124 -2475 17944 -139554 -184668 74959 -5402 29980
11007 29980 179663 134389 48283 159642 20410 -154197 -74931 -7198 -79843 -80290 -36184
10996 -36184 -61776 -91547 -47017 -289675 -152269 -2434 191942 129813 81984 53107 50725
10985 50725 62364 19735 -18996 -81374 -37674 -87969 -187026 -207448 -117544 747 -220454
10974 -220454 -188215 -63822 -70950 67416 58590 24568 -154141 35915 36354 16153 -46272
10963 -46272 -54693 -24628 7256 80901 54261 105849 117272 -6931 -62678 -98094 19674
10952 19674 139876 95389 -57266 -76892 -25346 -16717 65861 31286 78033 179128 74233
$$ packed form
11029b3062R6113p917j10742p2864K7854J61507J41439o9939j40915K2102M6616
11018G0192Q4631k2673r2467l4559p599K0419j57498m5114K59627q0361L5382
11007B9980J49683m5274q6106J11359j39232j74607P9266O7733p2645m47M4106
10996c6184k5592k9771M4530k42658J37406J49835J94376o2129m7829k8877k382
10985E0725J1639m2629l8731o2378M3700n0295r9057k0422Q9904J18291k21201
10974b20454L2239J24393p128J38366q826l4022j78709J90056M39k0201o2425
10963d6272q421L0065L1884P3645k6640N1588J1423j24203n5747l5416J17768
10952A9674J20202m4487j52655j9626N1546Q629Q2578l4575M6747J01095j04895
$$ plain form
10941 74233 -67237 -206812 -85546 -94556 -230064 -255334 -206168 -140666 -69769 -31256 33209
10930 33209 24019 3502 72397 33159 70664 213091 183807 42258 -54003 27834 -56848
10919 -56848 -99935 42130 -68331 -106148 -87930 -107856 -5414 57386 -91784 -49538 232066
10908 232066 221698 111797 77940 121694 -46781 -26527 -110582 26012 52003 49774 -14507
10897 -14507 -2447 146650 111148 24025 -24262 40338 -92372 -216730 -158385 -81006 -85774
10886 -85774 8846 60593 -30232 107524 107959 65392 209490 216870 -24726 -102643 48971
10875 48971 -110666 -154111 -21969 -86275 39125 132216 -112392 -87995 113218 141558 -64701
10864 -64701 68202 18450 -85070 -41451 -33912 -64455 3912 61182 -64963 -49039 59671
$$ packed form
10941G4233j41470j39575J21266r010j35508k5270M9166O5502P0897L8513O4465
10930C3209r190k0517O8895l9238L7505J42427k9284j41549r6261Q1837q4682
10919e6848m3087J42065j10461l7817J8218j9926J02442O2800j49170M2246K81604
10908B32066j0368j09901l3857M3754j68475K0254q4055J36594K5991k229o4281
10897a4507J2060J49097l5502q7123m8287O4600j32710j24358N8345P7379m768
10886h5774R4620N1747r0825J37756M35m2567J44098P380k41596p7917J51614
10875D8971j59637m3445J32142o4306J25400R3091k44608K4397K01213K8340k06259
10864f4701J32903m9752j03520M3619P539l0543O8367N7270j26145J5924J08710
$$ plain form
10853 59671 115774 128380 -49884 -28864 -37984 53011 112430 -42065 -131682 -175447 -33563
10842 -33563 185812 111558 -112863 28635 203524 136770 31534 -16889 209778 118984
10832 118984 -66939 -67008 -97099 -74700 -170828 -104877 -36605 164245 138940 -78282 -117103
10821 -117103 139247 149955 68004 167127 -71416 -155246 -25372 64155 29912 -31999 -29237
10810 -29237 -3013 23777 12719 -107033 -86698 15221 19420 55128 58021 241656 150920
10799 150920 -60494 -27271 6572 121726 -87740 -94141 -27858 58425 115186 24096 -50052
10788 -50052 92243 166928 17042 -90161 -115477 -35431 31404 12032 -56566 -135213 -173860
10777 -173860 -114024 -58983 -31243 -71447 -23764 103962 77499 530 -187232 -198185 -26834
$$ packed form
10853E9671N6103J2606j78264K1020r120R0995N9419j54495q9617m3765J41884
10842c3563K19375p4254k24421J41498J74889o6754j05236m8423K26667r0794
10832A18984j85923o9l0091K2399r6128O5951O8272K00850k5305k17222l8821
10821a17103K56350J0708q1951R9123k38543q3830J29874Q9527l4243o1911K762
10810b9237K6224K6790j1058j19752K0335J01919M199L5708K893J83635r0736
10799A50920k11414L3223L3843J15154k09466o401O6283Q6283N6761r1090p4148
10788e0052J42295P4685j49886j07203k5316Q0046O6835j9372o8598p8647l8647
10777a73860N9836N5041K7740m0204M7683J27726k6463p6969j87762j0953J71351
$$ plain form
10766 -26834 -136197 -314389 -297374 -39196 -104565 -191538 -126028 -10171 85754 21881 67770
10755 67770 110530 269768 128295 -75985 -79169 -72833 19557 -31925 -8396 -60960 -85107
10744 -85107 -9103 108539 154738 98653 104938 194465 139683 -42472 -49374 20780 9966 33147
10732 33147 -30889 -114925 -20325 28165 -115731 180835 417846 284396 95674 7012 -29325
10721 -29325 66331 84299 8933 -142413 -146180 -25932 -23723 86897 43560 285182 207217
10710 207217 115024 87810 28942 74053 30348 -79723 -167822 -90065 -93571 -65830 -15868
10699 -15868 -49809 -168742 -61880 102273 149263 162806 68322 -75671 -93235 27051 9782
10688 9782 -227169 -124250 -138993 -43735 8092 -25431 162746 265600 130910 35042 185522
$$ packed form
10766b6834j09363j78192J7015K58178o5369q6973O5510J15857R5925o3873M5889
10755F7770M2760J59238j41473k04280l184O336R2390n1482K3529n2564k4147
10744h5107P6004J17642M6199n6085O285Q9527n4782j82155o902P0154j0814K3181
10732C3147o4036q4036R4600M8490j43896K96566K37011j33450j88722q8662l6337
10721b9325R5656J7968p5366j51346l767J20248K209J10620m3337K41622p7965
10710B07217r2193k7214n8868M5111m3705j10071q8099P7757l506K7741M9962
10699a5868l3941j18933J06862J64153M6990J3543r4484j43993j7564J20286j7269
10688I782k36951J02919j4743R5258N1827l3523J88177J02854j34690r5868J50480
$$ plain form
10677 185522 294974 142504 -206334 -186111 7390 33615 -65974 -105546 -224645 -176994
10667 -176994 62323 16895 -12840 121726 47840 -131856 -84350 73680 23383 -2585 -40190
10656 -40190 -235628 -220354 7031 -12950 60336 -54593 -97368 39657 188662 66953
10646 66953 94332 203374 -870 -35083 39019 -29124 -159707 -26178 4727 -129853 -38230
10635 -38230 66072 104888 113197 33963 -35551 38875 25796 -199887 -102111 -44881 -18254
10624 -18254 -146618 36164 51905 -125146 -193827 -190751 25351 46200 -74181 45096 -4937
10613 -4937 -164786 -15078 127112 -127948 -358390 -291631 -145118 -78237 -87563 -59656 26838
10602 26838 88735 115259 80078 53560 167494 199069 34955 -81467 60736 99509 10721
$$ packed form
10677A85522J09452j52470l48838K0223J93501K6225r9589l9572j19099M7651
10667a76994K39317m5428k9735J34566p3886j79696M7506J58030n0297k5968l7605
10656d0190j95438J5274K27385j9981P3286j14929m2775J37025J49005j21709
10646F6953K7379J09042k04244l4213P4102o8143j30583J33529L0905j34580R1623
10635c8230J04302L8816Q309p9234o9514P4426j3079k25683R7776N7230K6627
10624a8254j28364J82782J5741j77051o8681L076K16102K0849j20381J19277n0033
10613d937j59849J49708J42190k55060k30442O6759J46513O6881r326K7907Q6494
10602B6838O1897K6524l5181k6518J13934L1575j64114j16422J42203L8773q8788
$$ plain form
10591 10721 -43462 115103 214002 189022 60788 87595 60351 148575 -15363 -182694 -258438
10580 -258438 -142367 77161 -6832 -100628 -30002 945 26251 105502 148622 10710 81427
10569 81427 132231 -98300 -12128 9679 -37839 -48983 21163 10009 -85749 15017 -138005
10558 -138005 -214529 -285290 -165543 68294 97615 138119 -60574 -92483 -3527 -99730 -40443
10547 -40443 148218 134317 98903 136012 96883 131079 47528 23509 -69978 96160 259887
10536 259887 2424 -151630 -59185 34766 -203791 -325386 -198417 -57571 -149923 -76580
10526 -76580 29669 -68667 -42726 -46695 -172601 -29992 -58255 -145641 -19896 148751 -21294
10515 -21294 -54210 36511 127313 15868 -33762 -114090 -70918 89401 -8210 -124932 -98684
$$ packed form
10591A0721n4183J58565R8899k4980j28234K6807k7244Q8224j63938j67331p5744
10580b58438J16071K19528q3993r3796P0626L0947K5306P9251M3120j37912P0717
10569H1427N0804k30531Q6172K1807m7518j1144P0146j1154r5758J00766j53022
10558a38005p6524p0761J19747K33837K9321M0504j98693l1909Q8956r6203N9287
10547d0443J88661j3901l5414L7109l9129L4196q3551k4019r3487J66138J63727
10536B59887k57463j54054R2445R3951k38557j21595J26969J40846r2352P3343
10526g6580J06249r8336K5941l969j25906J42609k8263q7386J25745J68647j70045
10515b1294l2916R0721R0802j11445m9630q0328M3172J60319r7611j16722K6248
$$ plain form
10504 -98684 -46370 -142195 -194666 54748 -54958 -334143 -270705 -51186 148471 82195 70864
10493 70864 31539 31820 59430 67245 145784 265739 88355 -91609 20561 -29006 194
10482 194 -58291 -41520 -91704 -54367 -18409 -130333 -65556 1132 -13934 -49377 -63060 -9952
10470 -9952 -13578 -26709 -89113 48215 78140 42903 102904 152405 223997 43017 35078 131793
10458 131793 72158 -102776 -106360 17599 76262 -85318 -135969 -26583 15239 -20816 22242
10447 22242 43163 47999 -27438 -85572 -35027 73775 83832 301486 185398 31510 -33088
10436 -33088 -24923 -88896 -215082 -227279 -123959 -101973 -34591 -55483 -202718 -214056 -16690
10425 -16690 77201 -50312 -22318 47524 -121829 -117884 -96437 -155523 -51170 -169762 -285466
$$ packed form
10504i8684N2314r5825n2471K49414j09706k79185O3438K19519J99657o6276j1331
10493G0864l9325K81K7610P815P8539J19955j77384j79964J12170m9567K9200
10482A94n8485J6771n0184L7337L5958j11924O4777O6688j5066l5443j3683N3108
10470i952l626j3131o2404J37328K9925l5237O0001M9501P1592j80980p939R6715
10458A31793n9635j74934l584J23959N8663j61580n0651J09386M1822l6055M3058
10447B2242K0921M836p5437n8134N0545J08802J0057K17654j16088j53888o4598
10436c3088Q165o3973j26186j2197J03320K1986O7382k0892j47235j1338J97366
10425a6690R3891j27513K7994O9842j69353L945K1447n9086J04353j18592j15704
$$ plain form
10414 -285466 -112428 -11584 -7756 -68265 -23264 -9024 60306 34538 -90803 -25168 87748
10403 87748 -13808 -108977 -78007 -101086 -59514 -34827 -29325 -47294 -45269 -89245 60447 -5212
10391 -5212 -27138 2833 16005 62009 217818 173993 148940 138393 157153 120009 70416 281084
10379 281084 98655 9724 -24725 -115956 -32196 75107 -120519 -129720 67224 -26345 -209318
10368 -209318 -184504 -159557 -26257 -86989 -102156 -139743 -91180 -16975 -13335 188805 194359
10357 194359 187035 46507 65002 17375 19468 58672 173853 115682 44483 84713 52712
10346 52712 -67667 -83336 -78275 95002 78173 160147 52146 -42207 65271 99905 -109549
10335 -109549 -75957 1351 -89942 12366 39124 -34876 92160 85746 -69079 -15395 93643
$$ packed form
10414b85466J73038J00844L828o0509M5001J4240O9330k5768j25341O5635J12916
10403H7748j01556r5169L0970k3079M1572K4687N502j7969K025m3976J49692o5659
10391e212k1926K9971J3172M6004J55809m3825k5053j0547J8760l7144m9593K10668
10379B81084j82429q8931l4449r1231Q3760J07303j95626r201J96944r3569j82973
10368b09318K4814K4947J33300o0732j5167l7587M8563P4205L640K02140N554
10357A94359p324j40528J8495m7627K093L9204J15181n8171p1199M0230l2001
10346E2712j20379j5669N061J73277j6829Q1974j08001r4353J07478L4634k09454
10335a09549L3592P7308r1293J02308K6758p4000J27036o414j54825N3684J09038
$$ plain form
10324 93643 59656 -106361 -109470 95811 167551 59365 96018 102955 59142 115790 262793
10313 262793 134001 -175287 -158400 -49909 68448 -59534 44788 11723 -120834 -189823
10303 -189823 -34093 294744 179045 52024 34289 60568 15993 117451 42462 -117209
10293 -117209 -143248 -105435 -122681 -97758 -60919 -76279 -114577 -120459 -188994 45740 213308
10282 213308 146730 -37365 -16354 69943 240805 109558 29428 234530 214260 -57199
10272 -57199 -148635 39169 82293 -13450 -17093 -81086 -55198 -72120 -125603 -91266 65717
10261 65717 -13892 -107317 -86022 14873 41388 -98837 -109068 129151 153066 -32551 -16058
10250 -16058 -1822 -95414 45626 -84375 -352159 -229939 94973 -16496 -190423 -18392
$$ packed form
10324I3643l3987j66017l109K05281P1740j08186L6653O937m3813N6648J47003
10313B62793j28792l09288J6887J08491J18357j27982J04322l3065j32557o8989
10303a89823J55730L28837j15699j27021j7735K6279m4575J01458p4989j59671
10293a17209k6039L7813j7246K4923L6839j5360l8298n882o8535K34734J67568
10282B13308o6578j84095K1011Q6297J70862j31247q0130K05102k0270k71459
10272e7199r1436J87804M3124r5743l643o3993K5888j6922n3483L4337J56983
10261F5717p9609r3425K1295J00895K6515j40225j0231K38219K3915j85617J6493
10250a6058J4236r3592J41040j30001k67784J22220L24912j11469j73927J72031
$$ plain form
10240 -18392 -57885 -179341 68719 110721 -174908 -49804 -36245 -31633 38835 14071 -148071
10229 -148071 -235181 -139566 -211893 -168593 -134397 -234776 -224352 -202801 29041 15581 46214
10218 46214 52435 38391 -24053 149387 135530 -118223 -17824 82965 53138 78009 -54722
10207 -54722 -181324 -157946 -86123 -85657 -131208 12791 -131849 -255434 -61627 -78642 -130829
10196 -130829 63999 215113 44134 7810 -19571 -137971 -18043 -114317 -116456 -11144
10186 -11144 29809 -14756 -133009 -38215 -29581 -145933 -235571 -145904 -115098 -156515 -107369
10175 -107369 -194797 -172613 -87664 -69510 -41448 -14519 -14276 -5800 -68694 -47517 -79350 -84574
10163 -84574 -78757 -48975 -63446 72331 142055 -132371 -5547 145364 41196 -90926 -34487
$$ packed form
10240a8392l9493j21456K48060M2002k85629J25104J3559M612P0468k4764j62142
10229a48071q7110R5615p2327M3300L4196j00379J0424K1551K31842j3460L0633
10218D6214O221j4044o2444J73440j3857k53753J00399J00789k9827K4871j32731
10207e4722j26602K3378P1823M66m5551J43999j44640j23585J93807j7015n2187
10196a30829J94828J51114j70979l6324k7381j18400J19928r6274k139J05312
10186a1144M0953m4565j18253R4794Q634j16352q9638Q9667L0806m1417M9146
10175a07369q7428K2184Q4949J8154K8062K6929K43Q476o2894K1177l1833n224
10163h4574N817K9782j4471J35777O9724k74426J26824J50911j04168j32122N6439
$$ plain form
10152 -34487 -82322 -90197 68370 -94364 -54788 98536 -52398 -85240 65205 -729 -114722
10141 -114722 12730 -55495 -206260 -163323 32769 -75660 -13891 91798 -137945 59468
10131 59468 129339 75088 33905 -126297 5244 71065 82599 -152818 -228196 4408 -51720
10120 -51720 -42504 -123048 -135175 -116161 -166074 -143828 42516 56425 -69630 -7014 -154566
10109 -154566 55494 184017 124838 -37662 21795 -48743 -81983 3594 -86494 -300526 -243276
10098 -243276 -111113 -228997 -216753 -113540 -116406 -52787 -26898 55529 71988 46405 12116
10087 12116 -47493 133621 141213 -45664 -105918 -87498 16781 -27330 -154605 -215806 -175893
10076 -175893 9593 -33306 -242671 -89702 -1732 -173634 -3197 49876 38243 -106569
$$ packed form
10152c4487m7835p875J58567j62734L9576J53324j50934l2842J50445o5934j13993
10141a14722J27452o8225j50765M2937J96092j08429O1769J05689k29743J97413
10131E9468O9871n4251m1183j60202J31541O5821J1534k35417p5378K32604n6128
10120e1720R216q0544j2127J9014m9913K2246J86344J3909j26055O2616j47552
10109a54566K10060J28523n9179j62500N9457p0538l3240Q5577r0088k14032N7250
10098b43276J32163j17884J2244J03213k866O3619K5889Q2427J6459k5583l4289
10087A2116n9609J81114P592j86877o0254J8420J04279m4111j27275o1201L9913
10076a75893J85486m2899k09365J52969Q7970j71902J70437N3073j1633j44812
$$ plain form
10066 -106569 -35821 -154142 -102952 -23915 64599 56793 181488 27028 -216194 -314189 -214326
10055 -214326 -150698 -75249 71728 -36923 -53707 28118 16713 70690 44622 -162324 -119520
10044 -119520 -70412 -58728 -174870 -155593 -106524 -136151 -32852 -179143 -135901 -132171 -232276
10033 -232276 -133611 55671 60964 -98722 -145894 22590 80180 -28889 16466 -46527 -189844
10022 -189844 -186177 -141963 -79615 15254 -53546 -182512 -195003 -357729 -400331 -336161 -283121
10011 -283121 -123985 -146747 -169728 -110918 -25798 -92618 -83475 -251547 -91280 13535 -90494
10000 -90494 -296320 -313346 -190267 -222719 -228036 -283362 -297813 -327377 -268212 -136340 -40460
9989 -40460 -107763 24522 -9203 -11231 -16582 88976 -44008 -148211 62933 17923 -66656
$$ packed form
10066a06569P0748j18321N1190P9037Q8514p806J24695j54460k43222r7995R9863
10055b14326O3628P5449J46977j08651j6784Q1825j1405N3977k6068k06946M2804
10044a19520M9108J1684j16142J9277M9069k9627J03299j46291M3242L730j00105
10033b32276R8665J89282N293j59686m7172J68484N7590j09069M5355o2993j43317
10022a89844L667M4214O2348R4869o8800j28966j2491j62726m2602O4170N3040
10011b83121J59136k2762k2981N8810Q5120o6820R143j68072J60267J04815j04029
10000i0494k05826j7026J23079l2452n317n5326j4451k9564N9165J31872R5880
9989d0460o7303J32285l3725k028n351J05558j32984j04203K11144m5010q4579
$$ plain form
9978 -66656 19423 -30557 -138042 -30899 -70595 -205724 -183010 -183576 -202689 -58254 125055
9967 125055 -11279 -121324 -55919 -95385 -106287 -61767 73690 82623 83724 -31520 -119221
9956 -119221 -144134 -11940 -32394 -55813 -121069 -64043 -94428 53117 -44845 -112056 -37153
9945 -37153 33593 -117678 -182934 -185955 -168497 -236752 -155359 -101012 -64024 -204754 -274732 -171896
9933 -171896 -182883 -49630 -188223 -79825 -126654 -81921 74863 84983 -249493 -320629 16636
9922 16636 -20277 -74069 -73857 -72324 -35931 130189 -48692 -39856 46065 -144104 -241606 -290039
9910 -290039 -166506 -150909 -121273 -199393 -203151 -175281 -156026 -111852 -40806 -145595 -115864
9899 -115864 -71163 -5418 -121020 -39667 30109 55655 -62285 -162933 -202458 -147923 -122225
$$ packed form
9978f6656Q6079m9980j07485J07143l9696j35129K2714n66j9113J44435J83309
9967A25055j36334j10045O5405l9466j0902M4520J35457Q933J101j15244q7701
9956a19221k4913J32194k0454k3419o5256N7026l0385J47545r7962o7211P4903
9945c7153P0746j51271o5256l021J7458o8255Q1393N4347L6988j40730o9978J02836
9933a71896j0987J33253j38593J08398m6829M4733J56784J0120l34476p1136L37265
9922A6636l6913n3792K12J533L6393J66120j78881Q836Q5921j90169r7502m8433
9910b90039J23533J5597K9636p8120l758K7870J9255M4174P1046j04789K9731
9899a15864M4701O5745j15602Q1353O9776K5546j17940j00648l9525N4535K5698
$$ plain form
9888 -122225 -215407 -301297 -239660 35623 -2512 -86986 -25670 52667 -7396 -9277 -5379 -154685
9876 -154685 10927 47512 -77970 -117783 -18269 -172191 -225752 -133262 -335820 -256830 -109840
9865 -109840 -183818 -171663 -64333 -93860 -195944 -92823 -72593 -156330 75621 101542 12446
9854 12446 -2188 49876 -126911 -970 -11560 -267405 -140483 -3319 -175682 -236883 -132358
9843 -132358 9208 -111054 -212083 -138785 -9428 31142 -29874 -71100 -134854 19176 -227203
9832 -227203 -439288 -226056 53258 78322 40233 -38573 -207329 -185301 43906 123946 19872
9821 19872 47496 18423 -75845 -79752 52632 -40730 -182701 -30928 -37197 -47942 1925 39271
9809 39271 -75990 -73512 -176380 -116177 -106607 -188055 -268078 -92617 -127074 -259114 -133455
$$ packed form
9888a22225r3182q5890O1637K75283l8135q4474O1316P8337o0063j881L898j49306
9876a54685J65612L6585j25482l9813R9514j53922n3561R2490k02558P8990J46990
9865a09840p3978J2155J07330k9527j02084J03121K0230q3737K31951K5921q9096
9854A2446j4634N2064j76787J25941j0590k55845J26922J37164j72363o1201J04525
9843a32358J41566j20262j01029P3298J29357M0570o1016m1226o3754J54030k46379
9832b27203k12085K13232K79314K5064l8089p8806j68756K2028K29207Q0040j04074
9821A9872K7624k9073r4268l907J32384r3362j41971J51773o269j0745M9867L7346
9809C9271j15261K478j02868O0203R570q1448q0023J75461l4457j32040J25659
$$ plain form
9798 -133455 -168824 -47823 -41840 -110642 29175 79668 -145910 -166449 32982 -6079 -112786
9787 -112786 8398 -106941 -22357 53147 -232917 -344203 -146013 -29788 -135353 -195466
9777 -195466 -167067 -138021 -226754 -302154 -257843 -63007 -121296 -152831 -41771 -14107 40354
9766 40354 -202063 -294356 -257004 -222927 -226941 -163969 -142131 -126369 -140298 -4445 22039 89063
9754 89063 50449 -45222 -185113 -176211 -90257 -28277 158391 83254 16999 -113262 -335912
9743 -335912 -176679 -68801 2162 -66758 94450 163133 -678 9580 39624 54732 2813
9732 2813 -32885 -53655 24755 76595 -106450 -157043 -46331 150668 -62427 -99885 109662
9721 109662 7794 56097 -45402 22071 -59227 -165036 -161764 5188 18151 122472 70453
$$ packed form
9798a33455l5369J21001N983o8802J39817N0493k25578k0539J99431l9061j06707
9787a12786J21184j15339Q4584P5504k86064j11286J98190J16225j05565o0113
9777a95466K8399K9046q8733p5400M4311J94836n8289l1535J11060K7664N4461
9766D0354k42417r2293L7352L4077m014O2972K1838J5762j3929J35853K6484O7024
9754H9063l8614r5671j39891Q902Q5954O1980J86668p5137o6255j30261k22650
9743c35912J59233J07878P0963o8920J61208O8683j63811J0258L0044J5108n1919
9732B813l5698k0770P8410N1840j83045n0593J10712J96999k13095l7458K09547
9721A09662j01868M8303j01499O7473q1298j05809L272J66952J2963J04321n2019
$$ plain form
9710 70453 88763 158024 6570 -112288 63861 -84129 -276047 -225484 -5354 66042 -99411
9699 -99411 -105919 -102214 -153573 -163565 -317800 -412002 -109314 -59858 -36092 -124444 -126979 -72198
9687 -72198 -53986 -49026 -79068 -184599 -221825 -168632 -262032 -251408 -274120 -330296 -295980 -213134
9675 -213134 -224186 -173811 -140986 -123286 34461 38595 -30833 21405 -76207 -160521 -170724 -262054
9663 -262054 -221193 -182393 -163971 -24585 -14255 -141791 -198515 -112214 -51319 -131873 -305529
9652 -305529 -122718 92518 69288 44067 -84309 -103100 -102066 -206434 -100414 40103 -71879
9641 -71879 -163927 -148682 -144576 -204660 -111068 -37180 -187614 -288945 -314104 -118443 -78440
9630 -78440 -140954 -93951 -1652 178696 123932 11670 -102727 -54886 51071 113114 109134
$$ packed form
9710G0453J8310O9261j51454j18858J76149j47990j91918N0563K20130P1396j65453
9699i9411o508L705n1359r992j54235r4202L02688M9456K3766q8352k535N4781
9687g2198J8212M960l0042j05531l7226N3193r3400J0624k2712n6176L4316Q2846
9675b13134j1052N0375L2825J7700J57747M134o9428N2238r7612q4314j0203r1330
9663b62054M0861L8800J8422J39386J0330j27536n6724Q6301O0895q0554j73656
9652c05529J82811K15236k3230k5221j28376j8791J034j04368J06020J40517j11982
9641g1879r2048J5245M106o0084R3592P3888j50434j01331k5159J95661M0003
9630g8440o2514M7003R2299J80348n4764j12262j14397M7841J05957O2043l980
$$ plain form
9619 109134 -12568 -45204 24010 -23493 -110351 -101367 -46520 -314900 -193035 -4798 -123249
9608 -123249 -34238 104702 89371 31206 5078 -53235 -110442 -161072 -312705 -288494 -147291
9597 -147291 -84506 -238703 -163592 60164 36502 -96956 -266463 -315404 -330437 -125151 12495
9586 12495 34412 41433 -70738 -163160 -232195 -26073 70013 -88084 -104145 -101658 -41718 -20189
9574 -20189 20593 -13952 -99083 -250453 -189913 -100356 -100605 -164826 -155854 -120006 -79749 -118274
9562 -118274 -153834 -77271 -106577 -373919 -314697 -214352 -203483 -144786 -170421 -20798 -16766
9551 -16766 -128689 50235 82483 -28899 -98297 -174227 -150478 -78956 -187373 -316011 -409756
9540 -409756 -176336 -57587 -359985 -274459 -188698 -64061 -159168 -296367 -240965 -234153 -474675
$$ packed form
9619A09134j21702l2636O9214m7503q6858Q984N4847k68380J21865J88237j18451
9608a23249Q9011J38940j5331n8165k6128n8313n7207n0630j51633K4211J41203
9597a47291O2785j54197P5111K23756k3662j33458j69507m8941j5033K05286J37646
9586A2495K1917P021j12171r2422o9035K06122R6086j58097j6061K487N9940K1529
9574b0189M0782l4545q5131j51370O0540Q9557k49o4221Q972L5848M0257l8525
9562a18274l5560P6563k9306k67342N9222J00345J0869N8697k5635J49623M032
9551a6766j11923J78924L2248j11382o9398p5930K3749P1522j08417j28638r3745
9540d09756K33420J18749l02398Q5526Q5761J24637r5107j37199N5402O812k40522
$$ plain form
9529 -474675 -372961 -119267 -82903 -132240 -84325 -93657 -106542 -173325 -281070 -186180 -74052
9518 -74052 -60085 -126589 -136231 -129362 -298648 -273656 -157299 -113698 54450 -87496 -274322
9507 -274322 -80102 92856 -49524 -107573 95471 48070 -20435 -136906 -155891 55530
9497 55530 -18623 -63463 -98398 -574 -76620 -65102 -43385 -113018 -181080 -127221 -75813 -83794
9485 -83794 -142315 -166746 -176642 -187403 -169124 -154692 41679 -37596 -79425 40883 19201 -4479
9473 -4479 -4991 -108902 -185624 -126022 -170562 -124120 -103343 -123601 -148042 -225691 -206587 -99290
9461 -99290 -19243 -225262 -227397 -52128 1890 -104298 -310645 -277987 -267686 -246373 -126434
9450 -126434 -103626 -68910 -95978 -132009 -139413 -46902 -51715 -52392 50599 -77770 -113335 -19805
$$ packed form
9529d74675J01714K53694L6364m9337M7915r332j2885o6783j07745R4890J12128
9518g4052J3967o6504r642O869j69286K4992J16357M3601J68148j41946j86826
9507b74322J94220J72958j42380n8049K03044m7401o8505j16471j8985K11421
9497E5530p4153m4840l4935R7824p6046J1518K1717o9633o8062N3859N1408p981
9485h3794n8521k4431r896j0761J8279J4432J96371p9275m1829J20308k1682k3680
9473d479n12j03911p6722N9602m4540M6442K0777k0258k4441p7649J9104J07297
9461i9290Q0047k06019k135J75269N4018j06188k06347L2658J0301K1313J19939
9450a26434K2808L4716k7068l6031p404R2511m813o77J02991j28369l5565R3530
$$ plain form
9438 -19805 -89619 -93633 -34393 -240719 -255846 -115178 -33231 -233298 -407537 -196793 -19310
9427 -19310 -216184 -294109 -107588 -58732 -25018 -117073 -51556 30542 -20119 -326088 -116572
9416 -116572 63735 -135704 -170989 54408 -62861 -319965 -117249 26857 -39572 23933
9406 23933 -63219 -269188 -129246 -15954 -127885 29522 86461 -14366 -44633 -111452 -79778
9395 -79778 -93082 -166460 -210878 -113039 -49460 78201 11319 -152126 -145610 -26982 -58590
9384 -58590 8285 -10444 -125949 -162073 -184477 -86454 -116525 -190175 -137128 20626 -149032
9373 -149032 -251373 -217774 -179074 -54076 -66794 -57360 -91054 37552 131632 8341 -74767
9362 -74767 -106206 -122692 -99862 -167584 -212419 -100822 -134093 -278801 -266985 -125401 -160187
$$ packed form
9438a9805o9814m014N9240k06326j5127J40668Q1947k00067j74239K10744J77483
9427a9310j96874p7925J86521M8856L3714r2055O5517Q2098n0661l05969K09516
9416a16572J80307j99439l5285K25397j17269k57104K02716J44106o6429O3505
9406B3933q7152k05969J39942J13292j11931J57407N6939j00827l0267o6819L1674
9395g9778j3304p3378m4418R7839O3579J27661o6882j63445O516J18628l1608
9384e8590O6875j8729j15505l6124k2404R8023l0071p3650N3047J57754j69658
9373a49032j02341L3599L8700J24998j2718R434l3694J28606R4080j23291q3108
9362g4767l1439j6486K2830o7722m4835J11597l3271j44708J1816J41584l4786
$$ plain form
9351 -160187 -261226 -145081 -72199 -59863 -129877 97477 161415 -6589 -133519 -225543 -122724
9340 -122724 -117920 -119045 -107896 -182914 -238315 -169185 -91868 48909 84263 -17797 -208557
9329 -208557 -319722 -308898 -221373 -77494 -93651 -104011 -73468 -6202 39791 90204 -49408
9318 -49408 -10398 14680 447 -43238 60685 130683 3043 -81605 -9274 59644 18790
9307 18790 -24757 -91785 -96224 17766 -80069 -170374 -215962 -116585 -114169 -174603 -111616 -16459
9295 -16459 16364 -40120 6491 -80267 -168646 -217951 -179909 -96935 -87438 -44381 -11809 -82225
9283 -82225 -154250 -268390 -132829 -90516 28324 -62503 -34311 23076 -3991 137838 98245
9272 98245 179048 174397 44889 37982 -48229 -70303 -102883 -9587 -129490 -268821 -285157 -244122
$$ packed form
9351a60187j01039J16145P2882J2336p0014K27354O3938j68004j26930r2024J02819
9340a22724M804j125J1149p5018n5401O9130P7317J40777L5354j02060j90760
9329b08557j11165J0824Q7525J43879j6157j0360L0543O7266M5993N0413j39612
9318d9408L9010K5078j4233m3685J03923O9998j27640q4648P2331O8918m0854
9307A8790m3547o7028m439J13990r7835r0305m5588R9377K416o0434O2987R5157
9295a6459L2823n6484M6611q6758q8379m9305L8042Q2974R497M3057L2572p0416
9283h2225p2025j14140J35561M2313J18840r0827K8192N7387k7067J41829l9593
9272I8245Q0803m651j29508o907q6211k2074l2580R3296j19903j39331j6336M1035
$$ plain form
9260 -244122 -218238 -100672 -97169 13598 80900 -591 -155742 -165139 121129 30991 -92386
9249 -92386 -147573 -91903 92573 35452 48597 90177 -20671 -37375 -62842 -33119 -3079
9238 -3079 -12306 54472 58417 -78312 -256332 -40786 -10989 -45902 166813 17618 -60417
9227 -60417 169574 184179 -191716 -304439 -105451 -147095 -200206 -65214 -110845 -126107 -13618
9216 -13618 -100716 -145975 -14494 -58635 5173 66683 70663 -35650 9320 -55409 -101668 48343
9204 48343 -101765 -239891 -312044 -174047 -194362 -326555 -255236 5698 5558 40796 36412
9193 36412 88119 61369 54531 -10473 -72186 113811 97529 21655 30998 124450 -6022 -91316
9181 -91316 -150150 -116304 -144489 -74971 -221942 -208071 -19007 33191 -133840 -223069 -268176
$$ packed form
9260b44122K5884J17566L503J10767O7302q1491j55151r397K86268r0138j23377
9249i2386n5187N5670J84476n7121J3145M1580j10848j6704k5467K9723L0040
9238c079r227O6778L945j36729j78020K15546K9797l4913K12715j49195p8035
9227f0417K29991J4605l75895j12723J98988m1644n3111J34992m5631j5262J12489
9216a3618q7098m5259J31481m4141O3808O1510L980j06313M4970o4729m6259J50011
9204D8343j50108j38126p2153J37997k0315j32193P1319K60934j40L5238m384
9193C6412N1707k6750o838o5004o1713J85997j6282p5874R343R3452j30472q5294
9181i1316n8834L3846k8185O9518j46971J3871J89064N2198j67031q9229m5107
$$ plain form
9170 -268176 -427183 -315731 -162927 -196489 -161226 -105822 -112254 -88049 -99787 -92551 -1375
9159 -1375 -48546 -158007 -229152 -165083 -111071 -21563 -32978 -38516 -64703 -42842 -97957 -39141
9147 -39141 -35639 37777 9448 7010 -147586 -218463 6860 75129 122303 -67314 -154707 -23763
9135 -23763 163736 8900 -42104 92980 118289 51041 -26819 -29368 -122953 -187105 -326837
9124 -326837 -329787 -109171 61413 186594 89199 81055 88434 -43562 -11153 2409 -22767
9113 -22767 73751 38249 134998 -113011 -135974 -90535 -25149 88177 36717 -5858 91167
9102 91167 108325 46018 78452 120786 95306 669 10218 -81552 -56053 -34066 -54932 54303
9090 54303 69402 28256 -93013 -93421 13071 -931 -10971 26807 -25798 -5537 -62141 10849
$$ packed form
9170b68176j59007J11452J52804l3562L5263N5404o432K4205j1738P236R1176
9159a375m7171j09461p1145O4069N4012Q9508j1415n538k6187K1861n5115N8816
9147c9141L502P3416k8329k438j54596p0877K25323O8269M7174j89617q7393J30944
9135b3763J87499j54836n1004J35084K5309o7248p7860k549r3585o4152j39732
9124c26837k950K20616J70584J25181r7395q144P379j31996L2409J3562k5176
9113b2767R6518l5502R6749k48009k2963M5439O5386J13326n1460m2575R7025
9102I1167J7158o2307L2434M2334k5480r4637R549r1770K5499K1987k0866J09235
9090E4303J5099m1146j21269m08J06492j4002j0040L7778n2605K0261n6604P2990
$$ plain form
9078 10849 79942 -7614 -274700 -187497 43343 -18884 -143921 -159798 43650 200926 145620
9067 145620 -105456 -199503 -150855 -48504 -77199 -7432 133227 59588 -78561 -151791 -209469
9056 -209469 -82844 11163 -38040 -138146 -50249 87492 -18845 -74797 -35174 -110220 -73365
9045 -73365 189837 70629 -118316 -13335 7633 -92609 33109 101181 89230 266902
9035 266902 89792 -93332 -75014 56037 113985 98440 85533 82256 121847 -15608 -111410
9024 -111410 8516 67453 -43405 -16954 52656 -56131 -159832 -83178 9164 -87296 -72645
9013 -72645 -65007 -16061 -13769 15849 21793 -98770 -62434 -117908 -367616 -187006 127618 42066
9001 42066 68479 78636 6100 -56897 -93173 -178676 -38809 97777 15599 -117167 30210
$$ packed form
9078A0849O9093q7556k67086Q7203K30840o2227j25037j5877K03448J57276n5306
9067A45620k51076r4047M8648J02351k8695O9767J40659p3639j38149p3230n7678
9056b09469J26625R4007m9203j00106Q7897J37741j06337n5952L9623p5046L6855
9045g3365K63202j19208j88945J04981K0968j00242J25718O8072j1951J77672
9035B66902j77110j83124J8318J31051N7948j5545j2907l277L9591j37455r5802
9024a11410J19926N8937j10858K6451O9610j08787j03701P6654R2342r6460J4651
9013g2645P638M8946K292K9618N944j20563L6336n5474k49708J80610L14624q5552
9001D2066K6413J0157p2536o2997l6276q5503J39867J36586q2178j32766J47377
$$ plain form
8990 30210 292151 104216 -61692 131734 180375 142548 131191 -58597 -84828 115113 120003
8979 120003 49721 166377 999 -68450 -11706 85242 124538 66834 -29879 -17626 85745
8968 85745 57399 26766 208619 222569 48486 -108632 28109 148364 40978 19553 50859
8957 50859 147958 98253 -109053 -74328 50805 165934 126757 13362 -13346 -30009 15458
8946 15458 -15635 147679 145106 136953 80691 123325 121495 -390 173590 229747 156557 -2236
8934 -2236 -75336 60112 46129 12860 65753 67193 133739 102064 88469 57915 -12116 148852
8922 148852 3147 -155871 150186 106933 31715 23794 73429 80824 34044 200903 146987
8911 146987 87951 147473 86272 153833 179223 37825 52834 92955 105757 196399 32981
$$ packed form
8990C0210K61941j87935j65908J93426M8641l7827j1357j89788k6231J99941M890
8979A20003p0282J16656j65378o9449N6744R6948L9296n7704r6713J2253J03371
8968H5745k8346l0633J81853J3950j74083j57118J36741J20255j07386k1425L1306
8957E0859R7099m9705k07306L4725J25133J15129l9177j13395k6708j6663M5467
8946A5458l1093J63314k573q153n6262M2634j830j21885J73980N6157p3190j58793
8934b236p3100J35448j3983l3269N2893J440O6546l1675j3595l0554p0031J60968
8922A48852j45705j59018L06057m3253p5218p921M9635P395m6780J66859n3916
8911A46987n9036N9522o1201O7561K5390j41398J5009M0121J2802R0642j63418
$$ plain form
8900 32981 -8861 173493 216254 176901 113092 298528 268483 241897 162627 201219 234654
8889 234654 88061 19660 78616 135717 165532 35883 -66803 7196 156451 304779 201795
8878 201795 -27237 113789 160442 200377 104387 -118760 46363 111270 32443 32190 183
8867 183 -74701 -118229 26829 177468 106233 1750 127013 132117 75589 129176 93102 115322
8855 115322 35489 -41683 -18630 -55687 12154 73452 197276 211918 298533 355909 155788
8844 155788 97985 198754 273928 224685 77100 180128 177011 84338 198257 135236 134753
8833 134753 239345 258789 200273 276015 286741 373123 292058 325397 354933 347983 206219
8822 206219 190323 261980 447901 431498 395471 386731 378864 469200 558190 469632 323384 174761
$$ packed form
8900C2981m1842J82354M2761l9353o3809J85436l0045k6586p9270L8592L3435
8889B34654j46593o8401N8956N7101K9815j29649j02686P3999J49255J48328j02984
8878B01795k29032J41026M6653L9935r5990k23147J65123O4907p8827k53l2007
8867A83p4884m3528J45058J50639p1235j04483J25263N104n6528N3587l6074K2220
8855A15322p9833p7172K3053l7057O7841O1298J23824J4642Q6615N7376k00121
8844A55788n7803J00769P5174m9243j47585J03028l117r2673J13919o3021m83
8833A34753J04592J9444n8516P5742J0726Q6382q1065L3339K9536o950j41764
8822B06219j5896P1657J85921j6403l6027q740p867R0336Q8990q8558j46248j48623
$$ plain form
8810 174761 370631 519889 384188 363783 476173 454049 384791 266269 226377 383818
8800 383818 278577 352127 324321 391552 302372 375192 482049 473807 386865 469546 445872
8789 445872 382319 453062 437966 522745 461412 416157 402259 412988 543674 590452 262713
8778 262713 331137 456817 426800 262005 220588 447198 637147 596674 479622 523386 687305
8767 687305 895207 622012 497378 583946 674971 517528 480825 718485 654163 609044 626473
8756 626473 547593 615470 713811 756477 574418 589943 630672 615803 678217 701583 591956
8745 591956 555591 810757 856283 753571 658411 809554 879606 865723 947456 780735 895555
8734 895555 1077223 1032555 951847 1028099 988849 756358 969006 1198259 1203239 1108772 1140078
$$ packed form
8810A74761J95870J49258j35701k0405J12390k2124o9258j18522l9892J57441
8800C83818j05241P3550k7806O7231q9180P2820J06857q242q6942Q2681k3674
8789D45872o3553P0743j5096Q4779o1333m5255j3898J0729J30686M6778l27739
8778B62713O8424J25680l0017j64795m1417K26610J89949m0473j17052M3764J63919
8767F87305K07902k73195j24634Q6568R1025j57443l6703K37660o4322m5119J7429
8756F26473p8880O7877R8341M2666j82059J5525M0729j4869O2414K3366j09627
8745E91956l6365K55166M5526j02712r5160J51143P0052j3883Q1733j66721J14820
8734H95555J81668m4668q0708P6252l9250k32491K12648K29253M980r4467L1306
$$ plain form
8723 1140078 1093536 1168942 1034169 850620 1039474 1040713 986988 1063617 1278982 1231811 1203323
8712 1203323 1222841 1260053 1332415 1419974 1186696 1107887 1510969 1424077 1245778 1235561 1207886
8701 1207886 1322901 1388357 1576419 1751206 1786033 1724756 1665656 1773714 2022768 2104649
8691 2104649 2071754 2077669 2120292 2074652 1954230 1980353 1938064 2020019 2100056 2183001 2355252
8680 2355252 2458389 2460358 2502921 2552532 2487950 2358158 2441964 2565591 2440082 2384774 2531498
8669 2531498 2549630 2611734 2661070 2730518 2629845 2657591 2813722 2800385 2814045 2754989 2833314
8658 2833314 2971167 3067747 3008326 3119796 3117675 3043829 3019464 3029435 3153578 3158814 3247410
8647 3247410 2981123 2923438 3180042 3336368 3325656 3242353 3356673 3526444 3538714 3386285
$$ packed form
8723A140078m6542P5406j34773j83549J88854J239n3725P6629K15365m7171k8488
8712A203323J9518L7212P2362Q7559k33278p8809M03082q6892j78299j0217k7675
8701A207886J15015O5456J88062J74787L4827o1277n9100J08058K49054Q1881
8691B104649l2895N915M2623m5640j20422K6123m2289Q1955Q0037Q2945J72251
8680B355252J03137J969M2563M9611o4582j29792Q3806J23627j25509n5308J46724
8669B531498J8132O2104M9336O9448j00673K7746J56131j3337J3660n9056P8325
8658B833314J37853R6580n9421J11470k121p3846k4365R971J24143N236Q8596
8647C247410k66287n7685K56604J56326j0712q3303J14320J69771J2270j52429
$$ plain form
8637 3386285 3597550 3940697 3931672 3852357 3743263 3823814 3938517 3928937 3931804 4156279 4128328
8626 4128328 3984647 4047415 4092231 3996403 4052012 4274451 4390342 4422584 4416942 4565952 4563864
8615 4563864 4706806 4721080 4668696 4719694 4960441 4898240 4896139 5000199 5075757 5187491 5192684
8604 5192684 5256121 5417859 5518663 5714016 5912161 5878744 6153607 6329233 6481446 6860192
8594 6860192 7006849 7120454 7683016 8326748 8715998 9009596 9031362 8910740 9112195 9587463
8584 9587463 9981002 10199681 10083093 9554946 9357077 9156340 8765838 8247877 8157096 8134262
8574 8134262 8077947 8008881 7858927 7652823 7388265 7385579 7333077 7328951 7269354 7208731 7158538
8563 7158538 7261735 7242500 7413995 7583477 7804459 8149602 8515200 8767043 9042398 9240293
$$ packed form
8637C386285K11265L43147r025p9315j09094Q0551J14703r580K867K24475k7951
8626D128328j43681O2768M4816r5828N5609K22439J15891L2242n642J49010k088
8615D563864J42942J4274n2384N0998K40747o2201k101J04060P5558J11734N193
8604E192684O3437J61738J00804J95353J98145l3417K74863J75626J52213L78746
8594F860192J46657J13605N62562O43732L89250K93598K1766j20622K01455M75268
8584I587463L93539K18679j16588n28147j97869k00737l90502n17961r0781k2834
8574H134262n6315o9066j49954k06104k64558k686n2502m126n9597o0623n0193
8563G158538J03197j9235J71495J69482K20982L45143L65598K51843K75355J97895
$$ plain form
8553 9240293 9555119 9816701 10026280 10418881 10679496 10983210 11283540 11472544 11557376 11525760
8543 11525760 11307972 11114700 10980832 10531931 9879213 9121765 8641962 8326514 8138560
8534 8138560 7992320 7823494 7764423 7581051 7219174 7060599 6861096 6729132 6594755 6532354
8524 6532354 6209789 6091284 6201185 6134027 6020779 5942486 5982594 5976385 5963702 5886915 5946443
8513 5946443 6035249 6065074 5948852 6099944 6045629 6021655 5891179 5959598 5856858 5606177
8503 5606177 5635990 5701759 5612885 5666162 5486721 5445028 5488239 5636325 5423263 5374936 5530768
8492 5530768 5611643 5479072 5478408 5527452 5454696 5455830 5367631 5227296 5244016 5145230 5191117 5528452
8480 5528452 5647531 5657313 5815011 5809905 5738870 5613443 5526037 5377299 5156298 5277499 5267281
$$ packed form
8553I240293L14826K61582K09579L92601K60615L03714L00330J89004Q4832l1616
8543A1525760k17788j93272j33868m48901o52718p57448m79803l15448j87954
8534H138560j46240j68826n9071j83372l61877j58575j99503j31964j34377o2401
8524F532354l22565j18505J09901o7158j13248p8293M0108o209j2683p6787N9528
8513E946443Q8806K9825j16222J51092n4315k3974j30476O8419j02740k50681
8503E606177K9813O5769q8874N3277j79441m1693M3211J48086k13062m8327J55832
8492E530768Q0875j32571o64M9044p2756J134q8199j40335J6720r8786M5887L37335
8480E528452J19079R782J57698n106p1035j25427q7406j48738k21001J21201j0218
$$ plain form
8469 5267281 5214431 5276365 5159033 5033066 5242569 5379364 5223820 5122333 5204262 5148621
8459 5148621 5250434 5438658 5389985 5225822 5231483 5282963 5331947 5357486 5440986 5322860 5508249
8448 5508249 5699065 5710514 5618188 5638040 5704693 5610346 5703497 5759506 5617572 5720458 6003396
8437 6003396 5764689 5665727 5979323 5945501 6010386 6159298 6122251 5922216 6359971 6306495
8427 6306495 6167924 6226310 6253831 6247269 6427971 6575467 6772855 6864842 6929030 7120821 7206344
8416 7206344 7448030 7803048 8053120 8341214 8373126 8623878 9053775 9547848 9845067 10117885
8406 10117885 10675257 10916114 11218315 11476490 11677522 12037878 12453919 12847673 12864102 12910111
8396 12910111 12996915 12811320 12616036 12653385 12630676 12494308 12598098 12774326 12974344 13027807
$$ packed form
8469E267281n2850O1934j17332j25967K09503J36795j55544j01487Q1929n5641
8459E148621J01813J88224m8673j64163N661N1480M8984K5539Q3500j18126J85389
8448E508249J90816J1449r2326J9852O6653r4347R3151N6009j41934J02886K82938
8437F003396k38707r8962L13596l3822O4885J48912l7047k00035M37755n3476
8427F306495j38571N8386K7521o562J80702J47496J97388R1987O4188J91791Q5523
8416G206344K41686L55018K50072K88094L1912K50752M29897M94073K97219K72818
8406A0117885N57372K40857L02201K58175K01032L60356M16041L93754J6429M6009
8396A2910111Q6804j85595j95284L7349k2709j36368J03790J76228K00018N3463
$$ plain form
8386 13027807 13086725 13127570 13203987 13203629 13205935 13344450 13582641 13527293 13759199 14188235 14400099
8375 14400099 14676019 14928429 15227415 15705886 16023669 16307496 16538736 17052462 17215484
8366 17215484 17781471 18067946 18442006 19033707 19188634 19448807 19851674 20177948 20401770
8357 20401770 20476447 20540209 20272835 20028356 20127186 20319457 20361397 20447326 20297688 20254205
8347 20254205 20692294 20774341 20900214 21234914 21582570 21671435 21857791 22222603 22731310 23010786
8337 23010786 23182185 23328976 23452694 23400155 23125781 22828380 22871190 22792988 22454960 22251653
8327 22251653 22330737 22338105 21964175 21817203 21779085 21828474 21841363 21789867 21997115 22243027 22288177
8316 22288177 22159761 22141219 22457931 22548955 22688721 22725094 22602168 22840575 22990754 22972031
$$ packed form
8386A3027807N8918M0845P6417l58K306J38515K38191n5348K31906M29036K11864
8375A4400099K75920K52410K98986M78471L17783K83827K31240N13726J63022
8366A7215484N65987K86475L74060N91701J54927K60173M02867L26274K23822
8357B0401770P4677O3762k67374k44479R8830J92271M1940Q5929j49638m3483
8347B0254205M38089Q2047J25873L34700L47656Q8865J86356L64812N08707K79476
8337B3010786J71399J46791J23718n2539k74374k97401M2810p8202l38028k03307
8327B2251653P9084P368l73930j46972l8118M9389J2889n1496K07248K45912M5150
8316B2288177j28416j8542L16712R1024J39766L6373j22926K38407J50179j8723
$$ plain form
8306 22972031 23057033 23271695 23584918 23946153 24336743 24718408 24960475 25143811 25257636 25280104
8296 25280104 25141544 25020382 24945062 24664262 24420547 24033650 23755549 23617992 23379921 23078992
8286 23078992 22728554 22601869 22399727 22188751 22213250 22204470 21983416 21917472 21907071 21936412
8276 21936412 22049923 21814154 21700383 21597138 21460244 21320645 21235603 21154068 21224586 21136119
8266 21136119 20936371 20943121 20880972 20819240 20942317 20933401 20922336 20956574 20920493 20856693 21013470
8255 21013470 21110794 20970813 21036643 21033654 21072034 20994005 20964478 20935894 21089948 21199972 21071741
8244 21071741 21362998 21596393 21670833 21752950 21829447 22148346 22462083 22726563 22734791 22881523
8234 22881523 23219117 23689449 23845127 24095656 24605257 25112000 25263683 25692256 26279740
$$ packed form
8306B2972031Q5002K14662L13223L61235L90590L81665K42067J83336J13825K2468
8296B5280104j38560j21162p5320k80800k43715l86897k78101j37557k38071l00929
8286B3078992l50438j26685k02142k10976K4499q780k21054o5944j0401K9341
8276B1936412J13511k35769j13771j03245j36894j39599q5042q1535P0518q8467
8266B1136119j99748O750o2149o1732J23077q916j1065L4238l6081o3800J56777
8255B1013470R7324j39981O5830k989L8380p8029k9527k8584J54054J10024j28231
8244B1071741K91257K33395P4440Q2117P6497L18899L13737K64480Q228J46732
8234B2881523L37594M70332J55678K50529N09601N06743J51683M28573N87484
$$ plain form
8225 26279740 26613290 27037960 27610983 28291757 28759361 29164989 29663589 30064462 30692363
8216 30692363 31355725 32141290 32856239 33346547 34033849 34874899 35842781 36714289 37623697
8207 37623697 38662540 39680897 41079527 42541299 44218721 45968595 48154519 50846048
8199 50846048 53312599 55982877 59523565 62867274 66407716 69948092 73127770 74467004
8191 74467004 75031590 76657258 79029378 82715853 86461384 89150486 89908497 88693894
8183 88693894 86328307 83978028 82122530 80854410 80293030 80641702 81094554 81997662 82962531
8174 82962531 83793868 84503228 85428515 86458602 87879466 89725673 92210245 94833798 96890002
8165 96890002 98774932 101169680 104203597 107907947 112320144 117080323 121391523 124675253
$$ packed form
8225B6279740L33550M24670N73023O80774M67604M05628M98600M00873O27901
8216C0692363O63362P85565P14949M90308O87302Q41050R67882Q71508R09408
8207C7623697J038843J018357J398630J461772J677422J749874K185924K691529
8199E0846048K466551K670278L540688L343709L540442L540376L179678J339234
8191G4467004N64586J625668K372120L686475L745531K689102P58011j214603
8183H8693894k365587k350279j855498j268120n61380L48672M52852R03108R64869
8174H2962531Q31337P09360R25287J030087J420864J846207K484572K623553K056204
8165I6890002J884930K394748L033917L704350M412197M760179M311200L283730
$$ plain form
8157 124675253 127009002 129375797 132499168 135844692 140146336 145182910 148925438 150777192
8149 150777192 151849129 152665721 153091179 152813805 150999512 147328473 143007723 139272254
8141 139272254 136774912 135583949 135595402 136397677 137919786 139231516 140185180 141457556 143447180
8132 143447180 145826188 147970891 149358603 149615961 149588327 150057964 151139696 152105669 152159790
8123 152159790 151357248 150364643 149290670 148534614 147618272 146604277 145231800 143839920 143017890
8114 143017890 142502193 142037990 141668009 141455494 141608447 142154098 143095828 144227537 145526988
8105 145526988 146827405 148274542 150134904 152293637 154769981 157966008 161563295 165801506
8097 165801506 169998011 172835433 174384805 175015090 175695569 175968014 176151530 176571164 177532509
$$ packed form
8157A24675253K333749K366795L123371L345524M301644N036574L742528J851754
8149A50777192J071937Q16592M25458k77374j814293l671039m320750l735469
8141A39272254k497342j190963J1453Q02275J522109J311730R53664J272376J989624
8132A43447180K379008K144703J387712K57358k7634M69637J081732R65973N4121
8123A52159790q02542r92605j073973p56056r16342j013995j372477j391880q22030
8114A43017890n15697m64203l69981k12515J52953N45651R41730J131709J299451
8105A45526988J300417J447137J860362K158733K476344L196027L597287M238211
8097A65801506M196505K837422J549372O30285O80479K72445J83516M19634R61345
$$ plain form
8088 177532509 178683696 179876401 181137724 181899142 181699207 180344858 178542975 176410027
8080 176410027 174044632 171266149 168784578 166834620 164980634 163327116 162202502 161517706
8072 161517706 161122536 161070527 161530770 162307456 163499527 164946507 166533249 168415819 170858997
8063 170858997 173484288 176082072 178791438 181224423 183466572 185366211 186921649 188367011
8055 188367011 189614751 190826635 192691241 195358478 198186775 200301850 201590143 202629195
8047 202629195 203688366 205236808 208056088 211950516 216148622 219259883 220751829 220228106
8039 220228106 217799326 214871098 212854747 212707716 213966212 216324114 219555648 223921711
8031 223921711 229409085 234980062 240521959 245492280 249897117 253753496 256156481 256627691
$$ packed form
8088A77532509J151187J192705J261323P61418j99935j354349j801883k132948
8080A76410027k365395k778483k481571j949958j853986j653518j124614o84796
8072A61517706l95170n2009M60243P76686J192071J446980J586742J882570K443178
8063A70858997K625291K597784K709366K432985K242149J899639J555438J445362
8055A88367011J247740J211884J864606K667237K828297K115075J288293J039052
8047B02629195J059171J548442K819280L894428M198106L111261J491946n23723
8039B20228106k428780k928228k016351j47031J258496K357902L231534M366063
8031B23921711N487374N570977N541897M970321M404837L856379K402985M71210
$$ plain form
8023 256627691 255215745 252203278 248543897 244767235 241589898 239720687 239219434 239616921
8015 239616921 240431747 241342568 242381623 243766308 245932902 248698189 251657800 254580077
8007 254580077 256743649 257467851 257602938 258363998 259664026 260601619 261535809 262059144 261774138
7998 261774138 261292561 261851407 263823409 267264639 271598897 276180674 280395337 283676657
7990 283676657 284711044 283461036 280495893 277355442 275918814 277113332 280145269 285008580
7982 285008580 291032271 298591519 307142056 317187793 329893732 347202473 369884503
7975 369884503 397285202 406321891 385976374 355263250 327153418 305890747 288111575
7968 288111575 273058104 259710559 248329159 238590929 231066387 225053070 220052653 215627400
$$ packed form
8023B56627691j411946l012467l659381l776662l177337j869211n01253L97487
8015B39616921Q14826R10821J039055J384685K166594K765287K959611K922277
8007B54580077K163572P24202J35087P61060J300028R37593R34190N23335k85006
7998B61774138m81577N58846J972002L441230M334258M581777M214663L281320
7990B83676657J034387j250008k965143l140451j436628J194518L031937M863311
7982B85008580O023691P559248Q550537J0045737J2705939J7308741K2682030
7975C69884503K7400699R036689k0345517l0713124k8109832k1262671j7779172
7968B88111575j5053471j3347545j1381400r738230p524542o013317n000417m425253
$$ plain form
7960 215627400 211750757 207666653 203910205 200887829 198876150 198043912 197879993 196953989
7952 196953989 194728500 191415913 187757516 183610409 179678770 176260451 173001688 169682615
7944 169682615 166665146 164152160 162375077 161043270 159512627 157094252 153627640 149209996
7936 149209996 144319059 139387591 134852980 130641672 126698500 122954588 119285369 115814071
7928 115814071 112562613 109392274 106727538 104670557 103224484 102363308 102205970 102288695 101885928
7919 101885928 100909434 100205016 99812981 100129610 100977190 101248019 100352838 98227554 95591570
7910 95591570 93239888 91838862 90484009 89094466 87000358 83979464 80933241 78295389
7902 78295389 76111124 74153137 72331670 70768942 69245180 68186700 67233679 66533770
$$ packed form
7960B15627400l876643m084104l756448l022376k011679q32238j63919r26004
7952A96953989k225489l312587l658397m147107l931639l418319l258763l319073
7944A69682615l017469k512986j777083j331807j530643k418375l466612m417644
7936A49209996m890937m931468m534611m211308l943172l743912l669219l471298
7928A15814071l251458l170339k664736k056981j446073q61176j57338Q2725m02767
7919A01885928r76494p04418l92035L16629Q47580K70829q95181k125284k635984
7910I5591570k351682j401026j354853j389543k094108l020894l046223k637852
7902G8295389k184265j957987j821467j562728j523762j058480r53021o99909
$$ plain form
7894 66533770 66173355 66254188 66528513 66411235 65766955 64986612 64362616 63913367 63832095 64369448
7884 64369448 65127328 66501082 68215836 69729545 71124154 71248891 69493146 66906441
7876 66906441 64015345 61084298 58450176 56415155 54512216 52839869 51596063 50250925
7868 50250925 48999323 48316000 47710471 46954278 46276611 45490370 44387115 43280526 42346126
7859 42346126 41523762 41013763 40471830 39805788 39469043 38985084 38507422 38302796 38331692 38073573
7849 38073573 37393849 36960501 36731122 36750117 36712124 36322889 35626663 34827512 33897807 32998083
7839 32998083 32382111 31872440 31352127 30581423 29831759 28898682 27934308 27338230 26901775
7830 26901775 26507379 26272486 26082465 25340239 24757338 24421534 23812506 23068376 22580828
$$ packed form
7894F6533770l60415Q0833K74325j17278o44280p80343o23996m49249q1272N37353
7884F4369448P57880J373754J714754J513709J394609J24737j755745k586705
7876F6906441k891096k931047k634122k035021j902939j672347j243806j345138
7868E0250925j251602o83323o05529p56193o77667p86241j103255j106589r34400
7859D2346126q22364n09999n41933o66042l36745m83959m77662k04626K8896k58119
7849C8073573o79724m33348k29379J8995l7993l89235o96226p99151r29705q99724
7839C2998083o15972n09671n20313p70704p49664r33077r64374n96078m36455
7830B6901775l94396k34893j90021p42226n82901l35804o09028p44130m87548
$$ plain form
7821 22580828 21988243 21462014 21211838 20890593 20280241 19695080 19342263 18758031 18331082
7812 18331082 17951727 17705845 17411014 17136068 16633136 16263659 16226095 16012792 15667269 15610342
7802 15610342 15433390 15345491 15332764 15014456 14782679 14733319 14590001 14296216 14027851 13981842
7792 13981842 13939159 13668184 13220553 12843238 12751971 12626976 12480493 11983847 11512161 11676731
7782 11676731 11579276 11424136 11291957 10985487 10751698 10501826 10506621 10397842 10266421 10099297
7772 10099297 9918666 9757649 9499733 9338025 9434926 9398729 9295256 9026139 9000722 8917275
7762 8917275 8705556 8525321 8378126 8408832 8326735 8066032 7798125 7940237 7960739 7870902
7752 7870902 7753393 7476788 7509764 7619385 7445893 7075963 7015640 7109445 6924956 6833861
$$ packed form
7821B2580828n92585n26229k50176l21245o10352n85161l52817n84232m26949
7812A8331082l79355k45882k94831k74946n02932l69477l7564k13303l45523n6927
7802A5610342j76952q7899j2727l18308k31777m9360j43318k93785k68365m6009
7792A3981842m2683k70975m47631l77315r1267j24995j46483m96646m71686J64570
7782A1676731r7455j55140j32179l06470k33789k49872M795j08779j31421j67124
7772A0099297j80631j61017k57916j61708R6901l6197j03473k69117k5417q3447
7762H917275k11719j80235j47195L0706q2097k60703k67907J42112K0502q9837
7752G870902j17509k76605L2976J09621j73492l69930o0323R3805j84489r1095
$$ plain form
7742 6833861 6819253 6805323 6658763 6643624 6468167 6391921 6444903 6573368 6541271 6271747 6267193
7731 6267193 6146121 5913178 5965524 5898494 5677378 5743084 5892044 5780439 5657213 5593015
7721 5593015 5539314 5513239 5343297 5190161 5285431 5300601 5013127 4900871 4894733 4914472 4884788
7710 4884788 4826626 4759060 4689575 4512781 4763739 4747224 4668799 4568327 4474215 4321111 4508037
7699 4508037 4541984 4458782 4275709 4163297 4223743 4256818 4219794 4090571 4224245 4187312 4035808
7688 4035808 4108509 4140214 4015781 3773211 3708479 3758681 3915498 3752274 3584391 3604137
7678 3604137 3563658 3603195 3543072 3501135 3364586 3211847 3255705 3357152 3390792 3349760 3221754
7667 3221754 3085444 3278915 3373446 3202417 3101287 3077047 3198912 3076910 3124428 3077280
$$ packed form
7742F833861j4608j3930j46560j5139j75457p6246N2982J28465l2097k69524m554
7731F267193j21072k32943N2346o7030k21116O5706J48960j11605j23226o4198
7721E593015n3701k6075j69942j53136R5270J5170k87474j12256o138J9739k9684
7710D884788n8162o7566o9485j76794K50958j6515p8425j00472r4112j53104J86926
7699D508037L3947q3202j83073j12412O0446L3075l7024j29223J33674l6933j51504
7688D035808P2701L1705j24433k42570o4732N0202J56817j63224j67883J9746
7678C604137m0479L9537o0123m1937j36549j52739M3858J01447L3640m1032j28006
7667C221754j36310J93471R4531j71029j01130k4240J21865j22002M7518m7148
$$ plain form
7657 3077280 3152332 3141517 3086861 3062005 3134538 2999601 2787289 2831827 2963538 2914802 2936318
7646 2936318 2921804 2784086 2793189 2836812 2786783 2757093 2722645 2748338 2838873 2903926 2869934
7635 2869934 2806507 2700426 2700108 2637739 2609450 2574230 2475724 2409069 2381028 2435387 2591911
7624 2591911 2658984 2676188 2531051 2354537 2517401 2597544 2484534 2570503 2528374 2572915 2474543
7613 2474543 2378874 2538105 2519447 2444576 2354178 2357423 2348117 2458337 2508015 2478105 2526169
7602 2526169 2387293 2331703 2336277 2252303 2200885 2254697 2249660 2280744 2311629 2377044 2334226 2403111
7590 2403111 2401398 2179016 2360896 2499422 2435541 2118855 1966685 1875665 2033977 2264754
7580 2264754 2005419 2074732 2211930 2022873 1916554 1913413 1993283 1932130 1853326 1742713 1748294
$$ packed form
7657C077280P5052j0815n4656k4856P2533j34937k12312M4538J31711m8736K1516
7646B936318j4514j37718R103M3623n0029k9690l4448K5693R0535O5053l3992
7635B869934o3427j06081l18o2369k8289l5220r8506o6655k8041N4359J56524
7624B591911O7073J7204j45137j76514J62864Q0143j13010Q5969m2129M4541r8372
7613B474543r5669J59231j8658p4871r0398L245r306J10220M9678k9910M8064
7602B526169j38876n5590M574q3974n1418N3812n037L1084L0885O5415m2818O8885
7590B403111j713k22382J81880J38526o3881l16686j52170r1020J58312K30777
7580B264754k59335O9313J37198j89057j06319l141P9870o1153p8804j10613N581
$$ plain form
7569 1748294 1786575 1777631 1614133 1640863 1803591 1764100 1737582 1798553 1753746 1659522 1575255
7558 1575255 1742826 1681955 1556634 1628452 1595588 1536711 1684379 1623225 1436812 1486082 1443962
7547 1443962 1337344 1360663 1370647 1279889 1313443 1363046 1293488 1205929 1205702 1149841 1066061 994374
7535 994374 1052938 957964 957325 995010 1027733 977381 1136192 1013230 927283 943326 1177501
7524 1177501 1003860 757004 775173 815847 773438 824911 1011636 984031 1034102 983895 1028322
7513 1028322 1006472 970226 962889 1019180 952050 842474 792931 851423 870466 784775 611194
7502 611194 760328 820924 887049 1031899 1034670 787120 767242 756992 759552 689839 772454
7491 772454 740897 666175 639904 682166 756988 672795 669994 636288 760930 725276 608530
$$ packed form
7569A748294L8281q944j63498K6730J62728l9491k6518O0971m4807r4224q4267
7558A575255J67571o0871j25321P1818l2864n8877J47668o1154j86413M9270m2120
7547A443962j06618K3319R984r0758L3554M9603o9558q7559k27n5861q3780p1687
7535I94374N8564r4974o39L7685L2723n0352J58811j22962q5947J6043K34175
7524A177501j73641k46856J8169M0674m2409N1473J86725k7605N0071n0207M4427
7513A028322k1850l6246p337N6291o7130j09576m9543N8492J9043q5691j73581
7502F11194J49134O0596O6125J44850K771k47550j9878j0250K560o9713Q2615
7491G72454l1557p4722k6271M2262P4822q4193k801l3706J24642l5654j16746
$$ plain form
7480 608530 768048 809542 494212 500785 583443 545058 724098 801779 570088 619040 681739
7469 681739 738301 984081 1283873 1228398 1143319 1186848 975042 870018 841618 587601 652026
7458 652026 821096 600511 418505 434174 583226 404116 472367 560483 552945 417734 435256
7447 435256 471085 511014 410267 350787 325802 145279 277824 217542 162912 250275 280963
7436 280963 98530 153518 242166 238200 256583 193383 180250 120425 147219 -27007 120530
7425 120530 220908 21505 -8460 187248 444163 255353 123856 114915 90802 156312 -14931
7414 -14931 -168277 38410 276896 -23156 -210177 -47368 8582 47361 31670 48651 -74488
7403 -74488 -162903 -92639 -198510 -64360 28571 -51532 -39241 -96567 -123216 -220483 -221079 -261517
$$ packed form
7480F08530J59518M1494l15330O573Q2658l8385J79040P7681k31691M8952O2699
7469F81739N6562K45780K99792n5475q5079M3529k11806j05024k8400k54017O4425
7458F52026J69070k20585j82006J5669J49052j79110O8251Q8116p538j35211J7522
7447D35256L5829L9929j00747n9480k4985j80523J32545o0282n4630Q7363L0688
7436B80963j82433N4988Q8648l966J8383o3200j3133n9825K6794j74226J47537
7425A20530J00378j99403k9965J95708K56915j88810j31497q941k4113O5510j71243
7414a4931j53346K06687K38486l00052j87021J62809N5950L8779j5691J6981j23139
7403g4488q8415P0264j05871J34150R2931q0103J2291n7326k6649r7267n96m0438
$$ plain form
7391 -261517 -157776 -128405 -4671 -55098 -159882 -138786 -94630 -96326 25080 -53673 -184079
7380 -184079 -186720 -84320 -216785 -282343 -93277 -66108 -262172 -59309 -169599 -123247 33871
7369 33871 -38022 -52333 48935 -18562 -192155 -104943 -117027 -164142 -296739 -264489 -256250
7358 -256250 -120325 -193531 -205999 -191150 -254625 -338946 -330454 -182626 -168823 -222103 -266907
7347 -266907 -231952 -40773 -76591 -203517 -128710 -71223 -148788 -315973 -340902 -110066 -118453
7336 -118453 -355984 -553758 -241967 -105324 -312251 -246941 -195516 -221484 -159363 -217942 -348510
7325 -348510 -150542 14723 -239985 -459787 -220664 -213304 -419590 -375621 -354241 -408770 -378971
7314 -378971 -396486 -424725 -350119 -408529 -477183 -303679 -273381 -356575 -375630 -297545 -210979
$$ packed form
7391b61517J03741K9371J23734n0427j04784K1096M4156j696J21406p8753j30406
7380a84079k641J02400j32465o5558J89066K7169j96064K02863j10290M6352J57118
7369C3871p1893j4311J01268o7497j73593Q7212j2084m7115j32597L2250Q239
7358b56250J35925p3206j2468J4849o3475q4321Q492J47828J3803n3280m4804
7347b66907L4955J91179l5818j26926P4807N7487p7565j67185k4929K30836q387
7336a18453k37531j97774L11791J36643k06927O5310N1425k5968O2121n8579j30568
7325c48510J97968J65265k54708k19802K39123P360k06286M3969K1380n4529K9799
7314c78971j7515k8239P4606n8410o8654J73504L0298q3194j9055P8085Q6566
$$ plain form
7303 -210979 -302728 -352761 -401355 -441091 -392371 -197674 -155336 -440511 -478743 -398509 -496715
7292 -496715 -486632 -340218 -370070 -524784 -436601 -399680 -377069 -303536 -287628 -148790 -19775
7281 -19775 -257915 -390742 -400585 -270182 -274221 -296480 -232922 -280758 -426125 -454387 -447901 -458615
7269 -458615 -447052 -346899 -339390 -320789 -285289 -309854 -485961 -525679 -482091 -562452 -525987
7258 -525987 -474449 -611801 -572536 -527851 -589390 -567119 -659006 -588556 -580746 -362984 -556023
7247 -556023 -507212 -236502 -274056 -549092 -490230 -403247 -428686 -545932 -572706 -606086 -490969
7236 -490969 -227271 -434199 -519742 -430291 -378899 -468104 -522393 -638581 -640849 -556940 -459501
7225 -459501 -474084 -462098 -360624 -313228 -467938 -347139 -385304 -454104 -524338 -583875 -508748
$$ packed form
7303b10979r1749n0033m8594l9736M8720J94697M2338k85175l8232Q0234r8206
7292d96715J0083J46414k9852j54714Q8183L6921K2611P3533J5908J38838J29015
7281a9775k38140j32827r843J30403m039k2259O3558m7836j45367k8262O486j0714
7269d58615J1563J00153P509J8601L5500k4565j76107l9718M3588q0361L6465
7258e25987N1538j37352L9265M4685o1539K2271r1887P0450P810K17762j93039
7247e56023M8811K70710l7554k75036N8862Q6983k5439j17246k6774l3380J15117
7236d90969K63698k06928q5543Q9451N1392q9205n4289j16188k268Q3909R7439
7225d59501j4583J1986J01474M7396j54710J20799l8165o8800p0234n9537P5127
$$ plain form
7214 -508748 -647987 -725860 -549067 -450606 -562435 -582782 -594203 -414566 -328212 -462577 -543774
7203 -543774 -475337 -356983 -401992 -427663 -347357 -308628 -315023 -437984 -438183 -308793 -454754
7192 -454754 -531052 -433930 -528406 -568572 -602738 -556798 -506706 -498120 -493436 -418259 -293274 -305821
7180 -305821 -240328 -320719 -433054 -423188 -346283 -459245 -651849 -511321 -487890 -431574 -327058
7169 -327058 -590214 -665885 -633867 -477327 -384970 -407231 -486562 -609507 -390404 -313624 -382295
7158 -382295 -405790 -340336 -347609 -292311 -265749 -299638 -374974 -497156 -614939 -468959 -473577
7147 -473577 -423590 -317017 -400475 -396593 -390859 -454906 -417154 -539561 -676615 -518127 -456594
7136 -456594 -472850 -545720 -497625 -568456 -542379 -494005 -533164 -540992 -550465 -449466 -640813 -626835
$$ packed form
7214e08748j39239p7873J76793R8461j11829k0347j1421J79637Q6354j34365q1197
7203e43774O8437J18354m5009k5671Q0306L8729o395j22961j99J29390j45961
7192d54754p6298R7122r4476m0166l4166M5940N0092Q586M684P5177J24985j2547
7180c05821O5493q0391j12335R866P6905j12962j92604J40528K3431N6316J04516
7169c27058k63156p5671L2018J56540R2357k2261p9331j22945K19103P6780o8671
7158c82295k3495O5454p273N5298K6562l3889p5336j22182j17783J45980m618
7147d73577M9987J06573q3458L882N734o4047L7752j22407j37054J58488O1533
7136d56594j6256p2870M8095p0831K6077M8374l9159p828r473J00999j91347J3978
$$ plain form
7124 -626835 -482298 -420983 -396963 -401408 -601517 -511348 -248709 -313352 -375111 -362670 -354412
7113 -354412 -349900 -421358 -429530 -456329 -469260 -319751 -352182 -464990 -449109 -467144 -477348 -481656
7101 -481656 -335155 -407696 -422048 -269531 -417932 -310906 -398622 -426705 -303549 -266740 -337252
7090 -337252 -424930 -414803 -461973 -543115 -496306 -479900 -504948 -501887 -438507 -425837 -357155 -591469
7078 -591469 -730234 -688892 -582911 -439637 -575611 -676983 -477354 -445511 -521339 -466333
7068 -466333 -618995 -544575 -452180 -506558 -463537 -344279 -348549 -398979 -516237 -690389 -427732
7057 -427732 -293471 -373448 -433551 -334101 -305968 -279820 -205741 -147573 -290231 -470419 -482649
7046 -482649 -481175 -559068 -648494 -565246 -493890 -400798 -427476 -383784 -363747 -420988 -555412 -498824
$$ packed form
7124f26835J44537O1315K4020m445k00109R0169K62639o4643o1759J2441Q258
7113c54412M512p1458q172k6799j2931J49509l2431j12808J5881j8035j0204m308
7101d81656J46501p2541j4352J52517j48401J07026q7716k8083J23156L6809p0512
7090c37252q7678J0127m7170q1142M6809J6406k5048L061O3380J2670O8682k34314
7078e91469j38765M1342J05981J43274j35974j01372J99629L1843p5828N5006
7068d66333j52662P4420R2395n4378M3021J19258m270n0430j17258j74152K62657
7057d27732J34261p9977o0103R9450K8133K6148P4079N8168j42658j80188j2230
7046d82649J474p7893q9426Q3248P1356R3092k6678M3692K0037n7241j34424N6588
$$ plain form
7034 -498824 -275376 -289742 -461408 -463902 -409566 -438822 -466751 -310617 -273468 -276193 -250133
7023 -250133 -255903 -273123 -253532 -241123 -275560 -370142 -305500 -247237 -372882 -285444 -188669 -86853
7011 -86853 -142031 -106493 184058 -48599 -209694 -185190 -69459 -58300 -258515 -351628 -315512
7000 -315512 -257227 -430241 -435341 -286174 -162767 -175497 -100645 -18336 -135862 -16958 -74356
6989 -74356 -12540 37162 116005 147998 -45554 21281 182512 167047 -13774 58028 118629
6978 118629 114483 79447 147710 291652 121593 -147477 76815 190713 106196 86680 283404
6967 283404 267946 84056 8792 -79743 112485 303917 194061 88929 132929 116650 61916
6956 61916 143760 40506 48129 -71116 -91624 76707 218286 203354 137784 108659 274950
$$ packed form
7034d98824K23448j4366j71666k494N4336k9256k7929J56134L7149k725K6060
7023b50133n770j7220J9591J2409l4437r4582O4642N8263j25645Q7438R6775J01816
7011h6853n5178L5538K90551k32657j61095K4504J15731J1159k00215r3113L6116
7000c15512N8285j73014n100J49167J23407j2730P4852Q2309j17526J18904n7398
6989g4356O1816M9702P8843L1993j93552O6835J61231j5465j80821P1802O0601
6978A18629m146l5036O8263J43942j70059k69070K24292J13898q4517j9516J96724
6967B83404j5458j83890p5264q8535J92228J91432j09856j05132M4000j6279n4734
6956F1916Q1844j03254P623j19245k0508J68331J41579j4932o5570k9125J66291
$$ plain form
6945 274950 277860 234549 222603 412013 204495 -11124 228001 297660 73663 -127443 -47146
6934 -47146 20003 31286 -52673 -34405 66055 193344 -96299 -81406 209676 391156 48909
6923 48909 61211 320264 262672 180898 94919 80626 180885 185781 205404 196730 245955 224428
6911 224428 171673 197336 273831 54263 -16906 141345 163097 183562 179310 53377 107291
6900 107291 192362 198304 331182 481663 509948 339365 287018 332580 373767 183683 52811
6889 52811 18418 209994 272548 387050 292785 223982 368739 296892 267170 316804 322182
6878 322182 178325 183155 269216 267489 307707 327447 221844 292013 407998 348486 276253
6867 276253 502439 470342 454192 638297 685525 413419 305643 536117 501634 370744
$$ packed form
6945B74950K910m3311j1946J89410k07518k15619K39125O9659k23997k01106Q0297
6934d7146O7149J1283q3959J8268J00460J27289k89643J4893K91082J81480l42247
6923D8909J2302K59053n7592q1774q5979j4293J00259M896J9623q674M9225k1527
6911B24428n2755K5663P6495k19568p1169J58251K1752K0465m252j25933N3914
6900A07291Q5071N942J32878J50481K8285j70583n2347M5562M1187j90084j30872
6889E2811l4393J91576O2554J14502r4265o8803J44757p1847k9722M9634N378
6878C22182j43857M830Q6061j727M0218J9740j05603P0169J15985n9512p2233
6867B76253K26186l2097j6150J84105M7228k72106j07776K30474l4483j30890
$$ plain form
6857 370744 479830 529002 577013 577650 612594 667928 742892 721228 610460 613997 666424 568821
6845 568821 435589 506823 692677 571632 594198 808052 714420 622034 846956 840269 617604
6834 617604 720338 641203 482454 590544 666689 554854 776386 841295 598921 609588
6824 609588 690825 652564 728239 894103 768865 756229 984142 848757 787648 878312 852632
6813 852632 758860 756325 745951 753114 803143 897385 896941 984410 1077636 1051463 1065446 1151181
6801 1151181 1204987 1135719 967759 978946 1035081 986810 923607 999004 1070661 1106359 1228027
6790 1228027 1188136 1111565 1132679 1215291 1286836 1189279 1100077 991511 1074474 1056595 1079069
6779 1079069 1139238 1214855 1330052 1285935 1200690 1193876 1309741 1244175 1254849 1406797 1324813
$$ packed form
6857C70744J09086M9172M8011O37L4944N5334P4964k1664j10768L537N2427r7603
6845E68821j33232P1234J85854j21045K2566K13854r3632r2386K24922o687k22665
6834F17604J02734p9135j58749J08090P6145j11835K21532O4909k42374J0667
6824F09588Q1237l8261P5675J65864j25238j2636K27913j35385o1109R0664k5680
6813H52632r3772k535j0374P163N0029R4242m44Q7469R3226k6173J3983Q5735
6801A151181N3806o9268j67960J1187N6135m8271o3203P5397P1657L5698J21668
6790A228027l9891p6571K1114Q2612P1545r7557q9202j08566Q2963j7879K2474
6779A079069O0169P5617J15197m4117q5245o814J15865o5566J0674J51948q1984
$$ plain form
6768 1324813 1090426 1070176 1092806 1151386 1431920 1370934 1367023 1448246 1547655 1430902 1462882
6757 1462882 1574713 1490609 1396976 1481284 1412404 1382422 1528840 1435682 1555791 1700792 1608932
6746 1608932 1472846 1548653 1554499 1540066 1625130 1596617 1627650 1673341 1659616 1602059 1543933
6735 1543933 1831907 1873078 1718090 1770561 1935243 1885074 1813538 1787737 1869345 1890369 2032775
6724 2032775 2100558 2041673 2080708 2134736 2147388 2145929 2118009 2122834 2277437 2320616 2318636 2446821
6712 2446821 2586246 2680057 2760846 2695757 2788123 2834354 2818573 2815193 2886722 3235797 3106365
6701 3106365 3073658 3271871 3391997 3345171 3442750 3481785 3536586 3727257 3786332 3820200 3951330
6690 3951330 4073116 3957824 4097678 4119673 4101032 4052758 4286589 4362573 4382692 4544416
$$ packed form
6768A324813k34387k0250K2630N8580K80534o0986l911Q1223R9409j16753L1980
6757A462882J11831q4104r3633Q4308o8880k9982J46418r3158J20109J45001r1860
6746A608932j36086P5807N846j4433Q5064k8513L1033M5691j3725n7557n8126
6735A543933K87974M1171j54988N2471J64682n0169p1536k5801Q1608K1024J42406
6724B032775O7783n8885L9035N4028J2652j459k7920M825J54603M3179j980J28185
6712B446821J39425R3811Q0789o5089R2366M6231j5781l380P1529L49075j29432
6701C106365l2707J98213J20126m6826R7579L9035N4801J90671N9075L3868J31130
6690C951330J21786j15292J39854K1995j8641m8274K33831P5984K0119J61724
$$ plain form
6680 4544416 4659202 4617318 4753225 4839612 5048638 5168433 5204414 5242249 5253175 5473519
6670 5473519 5527135 5632971 5706072 5931005 6081207 6257227 6311803 6488032 6742889 6983851
6660 6983851 7064846 7130553 7311675 7600577 7703030 7972155 8305349 8428054 8615910 9060596
6650 9060596 9108589 9364084 9639652 9829469 10273581 10467665 10671077 11106296 11480369 11762326
6640 11762326 11899550 12474453 13102437 13425637 13712598 13995815 14469016 15082595 15321644
6631 15321644 15697813 16187139 16609147 16984244 17275466 17684243 18035897 18424155 18784717
6622 18784717 19170746 19498590 19632525 19803915 20043969 20239240 20416760 20514401 20373828 20404870
6612 20404870 20566676 20577940 20647293 20715734 20843438 20831985 20998138 21114923 21178532 21183916 21128990
$$ packed form
6680D544416J14786m1884J35907Q6387K09026J19795L5981L7835J0926K20344
6670E473519N3616J05836P3101K24933J50202J76020N4576J76229K54857K40962
6660F983851Q0995O5707J81122K88902J02453K69125L33194J22705J87856M44686
6650I060596M7993K55495K75568J89817M44112J94084K03412M35219L74073K81957
6640A1762326J37224N74903O27984L23200K86961K83217M73201O13579K39049
6631A5321644L76169M89326M22008L75097K91222M08777L51654L88258L60562
6622A8784717L86029L27844J33935J71390K40054J95271J77520R7641j40573L1042
6612B0404870J61806J1264O9353O8441J27704j1453J66153J16785O3609N384n4926
$$ plain form
6601 21128990 21071393 21394172 21376185 21083789 21051972 21059649 20904844 20687505 20624570 20524239
6591 20524239 20250497 20022721 19827530 19703943 19351067 19027023 18746362 18376430 18207945
6582 18207945 17995779 17568571 17453130 17273002 17190486 16906730 16671926 16355832 16132448 15988873
6572 15988873 15921676 15907840 15663537 15574387 15557322 15500977 15279281 15112033 15486418 15413048
6562 15413048 15320399 15361696 15409508 15324225 15179433 15170747 14951770 15025819 14915789 14928633 14987264
6551 14987264 14927061 15050423 15051086 15033454 14962291 14932612 15031145 15002510 14853679 14900595 15188920
6540 15188920 15080169 14870022 14866662 14919086 15046080 15176822 15212695 15106522 15027813 14933702
6530 14933702 15070442 15173658 15187769 15077747 15094590 15171937 15046363 15094249 15004496 14775443
$$ packed form
6601B1128990n7597L22779j7987k92396l1817P677j54805k17339o2935j00331
6591B0524239k73742k27776j95191j23587l52876l24044k80661l69932j68485
6582A8207945k12166m27208j15441j80128q2516k83756k34804l16094k23384j43575
6572A5988873o7197j3836k44303q9150j7065n6345k21696j67248L74385p3370
6562A5413048r2649M1297M7812q5283j44792q686k18977P4049j10030J2844N8631
6551A4987264o0203J23362O63j7632p1163k9679R8533k8635j48831M6916K88325
6540A5188920j08751k10147l360N2424J26994J30742L5873j06173p8709r4111
6530A4933702J36740J03216J4111j10022J6843P7347j25574M7886q9753k29053
$$ plain form
6520 14775443 14735229 14862389 14755103 14790009 14653281 14418089 14399885 14335616 14238205 14268456
6510 14268456 14139099 14163403 14121540 14056370 13970488 13803675 13655236 13506064 13345138 13169653
6500 13169653 13007787 12945716 12908916 12627995 12427371 12318340 12091611 12070177 11873796 11610485
6490 11610485 11294067 11135704 10859853 10527712 10487940 10306769 10083421 9988958 9790065 9613320
6480 9613320 9478698 9114499 8760706 8593254 8250870 7981411 7728016 7498872 7371230 7391069
6470 7391069 7204167 7115495 6915789 6685121 6713012 6655179 6402090 6352228 6264453 6042981
6460 6042981 5880686 5905491 5744822 5494795 5565421 5316562 5089934 5111000 5147236 5058661
6450 5058661 4972490 4811698 4731710 4810234 4704145 4562825 4456446 4381081 4307424 4348573 4535920
$$ packed form
6520A4775443m0214J27160j07286L4906j36728k35192j8204o4269r7411L0251
6510A4268456j29357K4304m1863o5170q5882j66813j48439j49172j60926j75485
6500A3169653j61866o2071l6800k80921k00624j09031k26729k1434j96381k63311
6490A1610485l16418j58363k75851l32141l9772j81171k23348r4463j98893j76745
6480I613320j34622l64199l53793j67452l42384k69459k53395k29144j27642J9839
6470G391069j86902q8672j99706k30668K7891n7833k53089m9862q7775k21472
6460F042981j62295K4805j60669k50027P0626k48859k26628K1066L6236q8575
6450E058661q6171j60792p9988P8524j06089j41320j06379p5365p3657M1149J87347
$$ plain form
6439 4535920 4303565 4245626 4256632 4274460 4073674 4151776 4126344 4001491 4069331 4005646 3952178
6428 3952178 3921012 4042695 3931181 3854581 4024307 3947163 3784726 3789620 3882362 3903129 3863143
6417 3863143 3672030 3662197 3791181 3882579 3862009 3794575 3855251 3857870 3650398 3576203 3641723
6406 3641723 3720965 3713973 3656197 3640996 3563045 3540072 3526515 3576304 3626842 3588351 3638759 3670051
6394 3670051 3554100 3581598 3753398 3930805 4060503 4041545 3940873 4034047 4308315 4373154
6384 4373154 4244197 4303464 4381483 4539359 4597363 4588959 4721787 4907757 5001071 4920346 5003000
6373 5003000 5099137 4922907 4892399 4830833 4917999 5141798 5428068 5532775 5765079 5963587
6363 5963587 6122780 6476353 6802661 7116400 7351945 7669852 7800908 7862243 7958583 7968885
$$ packed form
6439D535920k32355n7939J1006J7828k00786P8102k5432j24853O7840o3685n3468
6428C952178l1166J21683j11514p6600J69726p7144j62437M894R2742K0767l9986
6417C863143j91113r833J28984R1398k0570o7434O0676K619k07472p4195O5520
6406C641723P9242o992n7776j5201p7951k2973j3557M9789N0538l8491N0408L1292
6394C670051j15951K7498J71800J77407J29698j8958j00672R3174K74268O4839
6384D373154j28957N9267P8019J57876N8004q404J32828J85970R3314q0725Q2654
6373E003000R6137j76230l0508o1566Q7166K23799K86270J04707K32304J98508
6363E963587J59193L53573L26308L13739K35545L17907J31056O1335R6340J0302
$$ plain form
6353 7968885 7886986 7770498 7713940 7535600 7359784 7127771 6871350 6591091 6209126 5970433
6343 5970433 5658033 5609351 5464138 5108803 4845749 4886309 4952047 4888553 4736234 4355437
6333 4355437 4179708 4369785 4268370 4147679 4158304 4239658 4194729 4088967 4085786 4200863
6323 4200863 4165585 4226833 4154488 4172005 4377196 4370194 4283785 4384174 4381139 4341611 4359891
6312 4359891 4387906 4371900 4557421 4592413 4492039 4688885 4885219 4888903 4815114 4939941 4866627
6301 4866627 4996913 5202082 5177421 5287679 5345842 5335001 5387918 5610844 5736569 5754144
6291 5754144 5924804 5854959 5778241 5851096 5994781 5907696 5953594 6158739 6175163 6328851 6467211
6280 6467211 6529330 6608292 6729828 6919739 7141980 7569097 7779086 7916209 8154821 8378911
$$ packed form
6353G968885q1899j16488n6558j78340j75816k32013k56421k80259l81965k38693
6343E970433l12400m8682j45213l55335k63054M0560O5738o3494j52319l80797
6333D355437j75729J90077j01415j20691J0625Q1354m4929j05762l181J15077
6323D200863l5278O1248p2345J7517K05191p002q6409J00389l035l9528J8280
6312D359891K8015j6006J85521L4992j00374J96846J96334L684p3789J24827p3314
6301D866627J30286K05169k4661J10258N8163j0841N2917K22926J25725J7575
6291E754144J70660o9845p6718P2855J43685q7085M5898K05145J6424J53688J38360
6280F467211O2119P8962J21536J89911K22241M27117K09989J37123K38612K24090
$$ plain form
6270 8378911 8450999 8465314 8244174 7963358 7633082 7602060 7704381 7657659 7686707 7811386
6260 7811386 7693988 7655925 7649374 7436676 7339710 7400117 7172926 6972872 6971023 6877816 6776531
6249 6776531 6772504 6770366 6755331 6927452 6812804 6734589 7012566 7246505 7390389 7554093 7638008
6238 7638008 7615067 7809986 7948766 8031786 8133594 8239885 8464116 8454872 8677754 8921169
6228 8921169 9047392 9208929 9385277 9304196 9157381 8889907 8714230 8682360 8410150 8254596
6218 8254596 8309712 8403286 8532876 8623582 8628762 8831872 8738703 8699604 8942159 9164947 9264527
6207 9264527 9632877 9759857 10035002 10558773 11109413 11647502 12213229 12464526 12413321 12257028
6197 12257028 12210540 12155763 11976804 11963325 11827019 12018795 12203514 12259441 12450796 12816338
$$ packed form
6270H378911P2088J4315k21140k80816l30276l1022J02321m6722K9048J24679
6260G811386j17398l8063o551k12698r6966O0407k27191k00054j849r3207j01285
6249F776531m027k138j5035J72121j14648p8215K77977K33939J43884J63704Q3915
6238G638008k2941J94919J38780Q3020J01808J06291K24231r244K22882K43415
6228H921169J26223J61537J76348q1081j46815k67474j75677l1870k72210j55554
6218H254596N5116R3574J29590R0706N180K03110r3169l9099K42555K22788R9580
6207I264527L68350J26980K75145N23771N50640N38089N65727K51297n1205j56293
6197A2257028m6488n4777j78959j3479j36306J91776J84719N5927J91355L65542
$$ plain form
6187 12816338 13145214 13546649 14112972 14835289 15435270 16169561 17171170 18188208 19503450
6178 19503450 21111733 23050922 25369097 28119954 31052414 34342667 37982124 41675032
6170 41675032 45109092 47975054 49747800 50631341 51294731 51398396 50452680 48377307 45882092
6161 45882092 43152951 40304636 37528703 34951113 32206826 29635120 27074743 24649213
6153 24649213 22555267 20717441 18942413 17316699 16328915 15290027 14142067 13400403
6145 13400403 12652712 12012263 11565560 11020254 10519713 10152548 9988147 9698605 9422645
6136 9422645 9296329 9116126 9202949 8998846 8724844 8738924 8714515 8624685 8445129 8398428
6126 8398428 8406352 8411173 8322124 8277088 8210036 8216226 8312944 8271806 8277312 8216050 8314391 8218657
$$ packed form
6187A2816338L28876M01435N66323P22317N99981P34291J001609J017038J315242
6178A9503450J608283J939189K318175K750857K932460L290253L639457L692908
6170D1675032L434060K865962J772746Q83541O63390J03665r45716k075373k495215
6161D5882092k729141k848315k775933k577590k744287k571706k560377k425530
6153B4649213k093946j837826j775028j625714r87784j038888j147960p41664
6145A3400403p47691o40449m46703n45306n00541l67165j64401k89542k75960
6136I422645j26316j80203Q6823k04103k74002J4080k4409q9830j79556m6701
6126H398428P924M821q9049m5036o7052O190R6718m1138N506o1262R8341r5734
$$ plain form
6114 8218657 8289439 8287676 8340571 8475007 8413220 8319760 8294884 8413143 8562045 8577392 8525249
6103 8525249 8533445 8773052 8937527 9136380 9204996 9301269 9557588 9712471 9697215 9867960
6093 9867960 10276614 10589584 10743320 10949092 11242055 11638793 11858336 12188091 12546026 12960765
6083 12960765 13560711 14029440 14428708 14912740 15450486 16072981 16715620 17305560 18212841
6074 18212841 19067543 19993394 21219167 22593006 23976839 25796178 27951007 30368966
6066 30368966 33080711 36569787 40675402 45780141 51989825 59716146 68560428 76472516
6058 76472516 81090295 80987249 76609842 69447082 61233652 53890993 47772413 42980494
6050 42980494 38775808 35093750 32187029 29863248 27741504 25872198 24349291 23075313
$$ packed form
6114H218657P0782j763N2895J34436o1787r3460k4876J18259J48902J5347n2143
6103H525249Q196K39607J64475J98853O8616R6273K56319J54883j5256J70745
6093I867960M08654L12970J53736K05772K92963L96738K19543L29755L57935M14739
6083A2960765N99946M68729L99268M84032N37746O22495O42639N89940R07281
6074A8212841Q54702R25851J225773J373839J383833J819339K154829K417959
6066C0368966K711745L489076M105615N104739O209684P726321Q844282P912088
6058G6472516M617779j03046m377407p162760q213430p342659o118580m791919
6050D2980494m204686l682058k906721k323781k121744j869306j522907j273978
$$ plain form
6042 23075313 22009178 21162536 20474628 19854718 19328520 18975188 18829703 18737043 18528897
6033 18528897 18292828 18032525 17916090 18008723 17812768 17422990 17106443 16919405 16643491 16208545
6023 16208545 15862817 15679247 15390666 15020784 14765166 14776217 14804572 14517389 14543651 14767233
6013 14767233 15037091 15011242 14920241 14809925 14707119 14465434 14305807 14194925 14009915 14010271
6003 14010271 13924851 13853284 13705931 13484389 13478021 13486855 13517389 13738541 13774349 13920500 13906535
5992 13906535 13900285 14236166 14655270 15052252 15319220 15317787 15577425 16089293 16475529 16691068
5982 16691068 17298342 17934780 18645234 19331022 19980428 20728251 21889725 22960670 23956395
5973 23956395 25234307 26447190 27637176 28880142 30362192 32044445 33865738 36084700
$$ packed form
6042B3075313j066135q46642o87908o19910n26198l53332j45485r2660k08146
6033A8528897k36069k60303j16435R2633j95955l89778l16547j87038k75914m34946
6023A6208545l45728j83570k88581l69882k55618J1051K8355k87183K6262K23582
6013A4767233K69858k5849r1001j10316j02806k41685j59627j10882j85010L56
6003A4010271q5420p1567j47353k21542o368Q834L0534K21152L5808J46151j3965
5992A3906535o250L35881M19104L96982K66968j433K59638N11868L86236K15539
5982A6691068O07274O36438P10454O85788O49406P47823J161474J070945R95725
5973B3956395J277912J212883J189986J242966J482050J682253J821293K218962
$$ plain form
5965 36084700 38407684 41150465 44423586 48326294 52949849 58333513 64691160 71839907
5957 71839907 79936402 88801870 97469180 104691350 109920073 112557568 113377719 112202725
5949 112202725 108609882 102728565 95623184 88046005 80245916 73039862 66505528 60189640
5941 60189640 54105169 48912046 44282698 40168631 36480945 33536748 30889971 28518212
5933 28518212 26347133 24529353 22929136 21693757 20570001 19443444 18531676 17626488
5925 17626488 16980847 16345662 15928478 15472122 15087635 14748356 14362069 14029705 13585423
5916 13585423 13224616 12941139 12633013 12307881 11876206 11560671 11116595 10620972 10291006
5907 10291006 9990746 9599776 9275777 8947679 8613535 8283387 8167143 7973526 7693152
$$ packed form
5965C6084700K322984K742781L273121L902708M623555N383664O357647P148747
5957G1839907Q096495Q865468Q667310P222170N228723K637495Q20151j174994
5949A12202725l592843n881317p105381p577179p800089p206054o534334o315888
5941F0189640o084471n193123m629348m114067l687686k944197k646777k371759
5933B8518212k171079j817780j600217j235379j123756j126557r11768r05188
5925A7626488o45641o35185m17184m56356l84487l39279l86287l32364m44282
5916A3585423l60807k83477l08126l25132m31675l15535m44076m95623l29966
5907A0291006l00260l90970l23999l28098l34144l30148j16244j93617k80374
$$ plain form
5898 7693152 7496546 7249038 7160559 7002413 6905268 6741774 6678341 6532430 6387071 6497363
5888 6497363 6524766 6348691 6251680 6145925 6013457 5896499 5797446 5693608 5589915 5501235
5878 5501235 5513874 5310990 5260840 5187298 4949568 4945220 4926844 4823501 4821314 4634813 4485781
5867 4485781 4383314 4375679 4417062 4274533 4206542 4071628 4104000 4134397 4112616 3888743 3771901
5856 3771901 3701337 3653424 3675507 3607773 3448860 3406530 3333641 3355805 3278634 3177250 3028720
5845 3028720 2951412 3003030 2933690 3005762 3063747 2878551 2651109 2622020 2674238 2737947 2771091
5834 2771091 2677762 2674941 2583055 2479558 2537212 2301842 2188619 2387246 2223046 2154862 2190833
5823 2190833 2282443 2154803 2114194 2156807 2159088 2353435 2212635 2183609 2024147 1890503 1927898
$$ packed form
5898G693152j96606k47508q8479j58146r7145j63494o3433j45911j45359J10292
5888F497363K7403j76075r7011j05755j32468j16958r9053j03838j03693q8680
5878E501235J2639k02884n0150p3542k37730m348j8376j03343k187j86501j49032
5867D485781j02467p635M1383j42529o7991j34914L2372L0397k1781k23873j16842
5856C771901p0564m7913K2083o7734j58913m2330p2889K2164p7171j01384j48530
5845C028720p7308N1618o9340P2072N7985j85196k27442k9089N2218O3709L3144
5834B771091r3329k821r1886j03497N7654k35370j13223J98627j64200o8184L5971
5823B190833R1610j27640m0609M2613K281J94347j40800k9026j59462j33644L7395
$$ plain form
5812 1927898 1970701 1941380 1912630 2086379 1923362 2011571 2130739 2049549 1920075 1804956
5802 1804956 1866859 2045215 2106336 2110714 2062970 2001475 1913625 1857602 1844616 1810733 1770529
5791 1770529 1781491 1860401 1848127 1830923 1991449 1996555 2063114 1934680 1757201 1852168 1928599
5780 1928599 1755763 1657280 1760730 1710003 1731416 1737831 1720159 1655961 1637606 1565910 1571688
5769 1571688 1426428 1461223 1469096 1588810 1556513 1436784 1431123 1490431 1400131 1317486 1439678
5758 1439678 1426754 1392996 1544775 1363395 1394663 1513517 1470328 1501423 1500009 1605330 1472769
5747 1472769 1244884 1270052 1471724 1528340 1356849 1290116 1414503 1458005 1430855 1480066 1654714
5736 1654714 1572394 1417490 1385025 1304238 1330854 1437795 1542091 1503934 1309960 1303600 1320119
$$ packed form
5812A927898M2803k9321k8750J73749j63017Q8209J19168q1190j29474j15119
5802A804956O1903J78356O1121M378m7744o1495q7850n6023j2986l3883m0204
5791A770529J0962P8910j2274j7204J60526N106O6559j28434j77479R4967P6431
5780A928599j72836r8483J03450n0727K1413O415j7672o4198j8355p1696N778
5769A571688j45260L4795P873J19714l2297j19729n661N9308r0300q2645J22192
5758A439678j2924l3758J51779j81380L1268J18854m3189L1095j414J05321j32561
5747A472769k27885K5168K01672N6616j71491o6733J24387M3502k7150M9211J74648
5736A654714q2320j54904l2465q0787K6616J06941J04296l8157j93974o360J6519
$$ plain form
5725 1320119 1330158 1572992 1540792 1371932 1212123 1274634 1135297 1123263 1288755 1228442
5715 1228442 1092825 1056825 1136811 1250285 1244059 1025869 993618 1055376 1076539 1046737 1012369
5704 1012369 1189529 1166493 1184722 1174080 1078633 1242154 1180172 1164064 1267443 1298935 1295334
5693 1295334 1371636 1342865 1331375 1381831 1448058 1370910 1329578 1166457 1247814 1306039 1363034
5682 1363034 1421946 1367683 1235318 1299845 1348152 1371511 1387272 1611865 1495558 1226021 1328394
5671 1328394 1313612 1130715 1289706 1261500 1292871 1446237 1375489 1288625 1491993 1487498 1465260
5660 1465260 1381991 1251214 1235307 1263178 1370483 1210712 1333852 1298166 1197481 1065034
5650 1065034 1031105 1151448 1279289 1158348 1097009 1256674 1307466 1288909 1291495 1209549 1232940
$$ packed form
5725A320119J0039K42834l2200j68860j59809O2511j39337j2034J65492o0313
5715A228442j35617l6000P9986J13474o226k18190l2251O1758K1163k9802l4368
5704A012369J77160k3036J8229j0642r5447J63521o1982j6108J03379L1492l601
5693A295334P6302k8771j1490N0456O6227p7148m1332j63121Q1357N8225N6995
5682A363034N8912n4263j32365O4527M8307K3359J5761K24593j16307k69537J02373
5671A328394j4782j82897J58991k8206L1371J53366p0748q6864K03368m495k2238
5660A465260q3269j30777j5907K7871J07305j59771J23140l5686j00685j32447
5650A065034l3929J20343J27841j20941o1339J59665N0792j8557K586q1946K3391
$$ plain form
5639 1232940 1258297 1247176 1098236 1201189 1143450 1185297 1245793 1321217 1109010 1238197 1212767
5628 1212767 1068275 1083150 1079230 990628 1026420 1104522 1022323 1037724 1150920 1035453 908465
5617 908465 831715 939539 929592 973304 938195 930931 1112901 1022790 926413 914883 924592 849395
5605 849395 1013256 922527 1052544 1067884 1142723 1132398 938704 1000104 952968 940652 932697
5594 932697 878656 1020499 921259 790808 821633 884345 950565 993397 1033184 1151071 1088527
5583 1088527 974967 894070 1017594 860913 736785 789904 770628 780324 875115 868814 848842
5572 848842 812877 766625 821595 840468 810658 864032 890303 915486 990194 987337 885448 915101
5560 915101 856528 790257 656501 728449 837174 819120 781617 795957 758437 754151 634226
$$ packed form
5639A232940K5357j1121j48940J02953n7739M1847O0496P5424k12207J29187k5430
5628A212767j44492J4875l920q8602L5792P8102q2199J5401J13196j15467j26988
5617I08465p6750J07824r947M3712l5109p264J81970r0111r6377j1530R709p5197
5605H49395J63861r0729J30017J5340P4839j0325j93694O1400m7136j2316p955
5594I32697n4041J41843r9240j30451L0825O2712O6220M2832L9787J17887o2544
5583A088527j13560q0897J23524j56681j24128N3119j9276R696R4791o301j9972
5572H48842l5965m6252N4970J8873k9810N3374K6271K5183P4708k857j01889K9653
5560I15101n8573o6271j33756P1948J08725j8054l7503J4340l7520m286j19925
$$ plain form
5549 634226 555312 651363 641877 695729 723124 742639 700726 784609 714626 731215 776506 742496
5537 742496 787968 793082 612895 719153 767088 634638 663410 763698 671419 594528 918862
5526 918862 1045633 713526 771476 1006595 1037094 1079876 1125249 1022998 991508 1216089 1089668
5515 1089668 1148825 1157761 992916 966415 1096863 1088730 1003179 1160280 1149465 1179700 1109263
5504 1109263 1122106 762127 771392 1042949 945778 1005540 920150 902567 926476 902719 1011321
5493 1011321 929635 1066482 1259451 1123286 1301378 1215461 967999 952540 1207264 1197591
5483 1197591 932418 1035820 1029057 851741 892692 997508 1025806 1048658 1127157 1055282 1125779
5472 1125779 1152051 862950 859201 951456 885213 912799 1098325 1050296 1267863 1316783 1042945
$$ packed form
5549F34226p8914R6051r486N3852K7395J9515m1913Q3883o9983J6589M5291l4010
5537G42496M5472N114j80187J06258M7935j32450K8772J00288r2279p6891L24334
5526I18862J26771l32107N7950K35119L0499M2782M5373j02251l1490K24581j26421
5515A089668N9157Q936j64845k6501J30448q133q5551J57101j0815L0235p0437
5504A109263J2843l59979R265K71557r7171N9762q5390j7583K3909k3757J08602
5493A011321q1686J36847J92969j36165J78092q5917k47462j5459K54724r673
5483A197591k65173J03402o763j77316M0951J04816K8298K2852P8499p1875P0497
5472A125779K6272k89101l749R2255o6243K7586J85526m8029K17567M8920k73838
$$ plain form
5461 1042945 866802 948853 1043159 912691 931432 1068463 986225 937551 1072253 1223524
5451 1223524 1088532 1071050 991776 1045497 1071896 997957 1010395 903191 1135256 1232005 1303027
5440 1303027 1455402 1230067 1240465 1452473 1184711 1221358 1463654 1444305 1466940 1662319
5430 1662319 1716288 1496141 1438095 1414166 1521036 1677330 1577824 1509133 1747238 1785293 1657672
5419 1657672 1860178 2029630 2012968 1882745 2001342 2084949 1947957 1896632 1925256 1978779
5409 1978779 2146568 2190507 2054627 2094185 2119083 2229997 2320137 2331077 2356519 2380085 2364242
5398 2364242 2563268 2526822 2616317 2614866 2515978 2734210 2737714 2786662 2768833 3030847 3166591
5387 3166591 3019671 3148818 3328614 3379785 3544660 3730816 3853282 3983035 3837057 3761479
$$ packed form
5461A042945j76143Q2051R4306j30468J8741J37031q2238m8674J34702J51271
5451A223524j34992j7482p9274N3721K6399p3939J2438j07204K32065R6749P1022
5440A303027J52375k25335J0398K12008k67762L6647K42296j9349K2635J95379
5430A662319N3969k20147n8046k3929J06870J56294r9506o8691K38105L8055j27621
5419A657672K02506J69452j6662j30223J18597Q3607j36992n1325K8624N3523
5409A978779J67789M3939j35880L9558K4898J10914R0140J0940K5442K3566j5843
5398B364242J99026l6446Q9495j451r8888K18232L504M8948j7829K62014J35744
5387C166591j46920J29147J79796N1171J64875J86156J22466J29753j45978p5578
$$ plain form
5377 3761479 3901276 3917435 3763531 3576937 3785822 3792016 3907418 3938977 3834839 3939959
5367 3939959 4178348 4132793 4060014 4218547 4161085 4191354 4186349 4216067 4272499 4066312 4021583
5356 4021583 3928969 4085085 4126298 4153792 4288594 4297632 4269727 4311616 4451154 4435069 4310757
5345 4310757 4200423 4315662 4517341 4398643 4221487 4351755 4610302 4510525 4350815 4365973
5335 4365973 4453022 4499327 4414252 4492475 4586898 4676108 4554337 4431473 4406619 4382453 4417668
5324 4417668 4207674 4198881 4347821 4221119 4035473 4068399 3947927 3866614 3938876 3844420 3908705
5313 3908705 3872090 3840843 3817263 3975312 3930570 3665533 3706734 3791137 3703909 3622726 3549913
5302 3549913 3655819 3752569 3695102 3632361 3733877 3932421 3940653 3901458 4140335 4220065 4229462
$$ packed form
5377C761479J39797J6159j53904j86594K08885O194J15402L1559j04138J05120
5367C939959K38389m5555p2779J58533n7462L0269n005K9718N6432k06187m4729
5356D021583r2614J56116M1213K7494J34802R038k7905M1889J39538j6085j24312
5345D310757j10334J15239K01679j18698j77156J30268K58547r9777j59710J5158
5335D365973Q7049M6305q5075P8223R4423Q9210j21771j22864k4854k4166L5215
5324D417668k09994q793J48940j26702j85646L2926j20472q1313P2262r4456O4285
5313C908705l6615l1247k3580J58049m4742k65037M1201Q4403q7228q1183p2813
5302C549913J05906R6750n7467o2741J01516J98544Q232l9195K38877P9730R397
$$ plain form
5291 4229462 4158385 4094319 4028808 3916690 3693763 3689701 3675727 3720544 3685673 3678868 3725873
5280 3725873 3653209 3573004 3606784 3708031 3680863 3584822 3674953 3843629 3795419 3636843 3456658
5269 3456658 3446857 3577420 3516419 3355990 3516699 3706369 3567109 3416770 3485541 3443250
5259 3443250 3687078 3812631 3869989 3936069 3967416 3959749 3855599 3940650 4095043 4235012 4285854
5248 4285854 4278247 4345544 4266857 4225769 4113313 4296764 4282670 4229206 4204437 4228791 4376835
5237 4376835 4401067 4304101 4295208 4393889 4311091 4340210 4379205 4342590 4417327 4293736 4387406
5226 4387406 4450852 4325002 4372913 4475192 4455369 4366642 4339340 4285460 4406761 4467769 4632797
5215 4632797 4634374 4681139 4824193 4859889 4764532 4803949 4797360 4651387 4648987 4782744 4850626
$$ packed form
5291D229462p1077o4066o5511j12118k22927m062j3974M4817l4871o805M7005
5280C725873p2664q0205L3780J01247k7168r6041R0131J68676m8210j58576j80185
5269C456658r801J30563o1001j60429J60709J89670j39260j50339O8771m2291
5259C443250K43828J25553N7358O6080L1347p667j04150Q5051J54393J39969N0842
5248D285854p607O7297p8687m1088j12456J83451j4094n3464k4769K4354J48044
5237D376835K4232r6966q893R8681q2798K9119L8995l6615P4737j23591R3670
5226D387406O3446j25850M7911J02279j9823q8727k7302n3880J21301O1008J65028
5215D632797J577M6765J43054L5696r5357L9417o589j45973k400J33757O7882
$$ plain form
5204 4850626 4843596 4792349 4860678 4795073 4755381 4866390 4888835 4888447 4812277 4629772 4670559 4674345
5192 4674345 4619915 4523853 4574142 4359342 4303420 4381158 4370567 4200814 4163467 4136051 4061281
5181 4061281 4219561 4315655 4297791 4261946 4328534 4324431 4267028 4147017 4290134 4483273 4523243
5170 4523243 4465303 4383261 4487196 4573483 4404232 4400197 4381580 4309794 4272165 4402006 4389174
5159 4389174 4293071 4320995 4205735 4074511 4104182 3927264 3727732 3754298 3800311 3732676 3745106
5148 3745106 3662427 3613822 3516296 3585082 3567139 3509583 3560874 3408003 3398443 3454954 3602520
5137 3602520 3690784 3642435 3777309 3691564 3629839 3597352 3609465 3571974 3756025 3710211 3699369
5126 3699369 4123343 3962609 3746044 4007254 4188331 4295049 4289753 4364248 4396666 4650280
$$ packed form
5204D850626p030n1247O8329o5605l9692J11009K2445l88p6170j82505M0787L786
5192D674345n4430r6062N0289k14800n5922P7738j0591j69753l7347k7416p4770
5181D061281J58280R6094j7864l5845O6588m103n7403j20011J43117J93139L9970
5170D523243n7940q2042J03935Q6287j69251m035j8617p1786l7629J29841j2832
5159D389174r6103K7924j15260j31224K9671j76918j99532K6566M6013o7635J2430
5148C745106q2679m8605r7526O8786j7943n7556N1291j52871r560N6511J47566
5137C602520Q8264m8349J34874q5745o1725l2487J2113l7491J84051m5814j0842
5126C699369M23974j60734k16565K61210J81077J06718n296P4495L2418K53614
$$ plain form
5116 4650280 4858228 4749314 4611843 4576680 4297325 4169303 4533047 4511886 4465035 4622420
5106 4622420 4764011 4743890 5037237 5061255 5037789 5113754 5239559 5243521 5235091 5329038 5405223
5095 5405223 5584102 5928510 6272432 6428964 6485415 6390506 6152921 5912489 5742615 5549274
5085 5549274 5448263 5246938 4982856 4917362 5061822 4919031 4815476 4810628 4614642 4609481
5075 4609481 4749989 4755619 4818325 4974670 5010189 4861472 4957247 5237585 5176258 5122286 5184158
5064 5184158 5325667 5449415 5554675 5416499 5550684 5783286 5977281 6396846 6673344 6984558
5054 6984558 7219638 7681792 8267842 8505957 8654626 8816796 8819529 8434485 7860461 7440756
5044 7440756 7222833 6871400 6545708 6461589 6430720 6148834 5952423 5853660 5678363 5759525
$$ packed form
5116D650280K07948j08914j37471l5163k79355j28022L63744k1161m6851J57385
5106D622420J41591k0121K93347K4018k3466P5965J25805L962q430R3947P6185
5095E405223J78879L44408L43922J56532N6451r4909k37585k40432j69874j93341
5085E549274j01011k01325k64082o5494J44460j42791j03555m848j95986n161
5075D609481J40508N630O2706J56345L5519j48717R5775K80338o1327n3972O1872
5064E184158J41509J23748J05260j38176J34185K32602J93995M19565K76498L11214
5054F984558K35080M62154N86050K38115J48669J62170K733l85044n74024m19705
5044G440756k17923l51433l25692q4119l0869k81886j96411r8763j75297Q1162
$$ plain form
5034 5759525 5748107 5638722 5679491 5849714 5974625 6036822 6048970 6118551 6132564 6046751 5991129
5023 5991129 6048697 6224560 6182875 6097952 6178773 6178269 6070306 6315891 6300920 6518621 6870252
5012 6870252 7060567 7279647 7591352 7776300 7737065 7643091 7656775 7517841 7330563 7068593
5002 7068593 6936034 6888965 6681438 6701402 6608897 6620689 6524247 6388457 6443959 6495872 6404956
4991 6404956 6228582 6187099 6245065 6266228 6331356 6489137 6531698 6609381 6506939 6470940 6591390
4980 6591390 6672691 6533088 6435477 6468367 6431523 6661306 6736181 6623164 6550141 6793791 6768311
$$ packed form
5034E759525j1418j09385M0769J70223J24911O2197J2148O9581J4013q5813n5622
5023E991129N7568J75863m1685q4923Q0821n04j07963K45585j4971K17701L51631
5012F870252J90315K19080L11705J84948l9235r3974J3684j38934j87278k61970
5002G068593j32559m7069k07527J9964r2505J1792r6442j35790N5502N1913r0916
4991F404956j76374m1483N7966K1163O5128J57781M2561P7683j02442l5999J20450
4980F591390Q1301j39603r7611L2890l6844K29783P4875j13017p3023K43650k5480
$$ [...]
##END NTUPLES=NMR SPECTRUM
##END=
