##TITLE=1H_CA-8800-4
 CDCl3, 8 sc, 
 22.12.2020
##JCAMPDX= 6.0         $$ Bruker NMR JCAMP-DX V2.0
##DATA TYPE= NMR SPECTRUM
##DATA CLASS= NTUPLES
##ORIGIN= UXNMR, Bruker Analytische Messtechnik GmbH
##OWNER= root
$$ XWIN-NMR		Version 3.5
$$ Tue Dec 22 10:18:51 2020 Russian Standard Time (UT+4h)  she@DPX200
##.OBSERVE FREQUENCY= 200.1315066352
##.OBSERVE NUCLEUS= ^1H
##.ACQUISITION MODE= SIMULTANEOUS
##.ACQUISITION SCHEME= undefined
##.AVERAGES= 8
##.DIGITISER RES= 18
##SPECTROMETER/DATA SYSTEM= spect
##.PULSE SEQUENCE= zg30
##.SOLVENT NAME= CDCl3
##.SHIFT REFERENCE= (INTERNAL, CDCl3, 0, 15.9958)
##AUDIT TRAIL= $$ (NUMBER, WHEN, WHO, WHERE, WHAT)
$$ ##TITLE= Audit trail, XWIN-NMR		Version 3.5
$$ ##JCAMPDX= 5.01
$$ ##ORIGIN= Bruker BioSpin GmbH
$$ ##OWNER= she
$$ F:/spectra/data/she/nmr/H-F/1/pdata/1/auditp.txt
$$ ##AUDIT TRAIL=  $$ (NUMBER, WHEN, WHO, WHERE, WHAT)
(   1,<2020-12-22 10:17:33.56 +0400>,<she>,<DPX200>,
      <created by zg, POWCHK disabled, PULCHK disabled
       configuration hash MD5:
       00 E9 B6 7A A2 85 ED C7 34 08 36 98 17 FE 4E 26
       data hash MD5: 16K
       53 FF 04 F1 A5 CE 5A E7 32 AD CF 4A B8 0F E4 98>)
(   2,<2020-12-22 10:17:35.75 +0400>,<she>,<DPX200>,
      <Start of raw data processing
       efp BC_mod = 2 LB = 0.24 FT_mod = 6 PKNL = 1 PHC0 = -10762.4 PHC1 = 13.20095 SI = 16K 
       data hash MD5: 16K
       13 9D B6 2E 1D 07 C6 3E 25 10 92 B4 97 C3 3E FF>)
(   3,<2020-12-22 10:18:03.26 +0400>,<she>,<DPX200>,
      <pk PHC0 = 2.305417 PHC1 = -5.8 
       data hash MD5: 16K
       29 41 78 57 85 E3 A9 CB D7 EE 33 A9 5E DD AA F1>)
(   4,<2020-12-22 10:18:06.32 +0400>,<she>,<DPX200>,
      <abs ABSG = 5 
       data hash MD5: 16K
       81 19 B7 6F BC 5B 83 22 51 AD 28 C8 2B 9F 17 B4>)
$$ ##END=
$$ 
$$ hash MD5
$$ C1 03 9A CD 34 3B 64 BB F0 FA 92 06 A1 78 90 F1
##$RELAX= 
##$RELAX= 
##$RELAX= 
##$RELAX= 
##$RELAX= 
##$RELAX= 
$$ Bruker specific parameters
$$ --------------------------
##$DU= <F:/spectra>
##$EXPNO= 1
##$NAME= <H-F>
##$PROCNO= 1
##$TYPE= <nmr>
##$USER= <she>
##$AMP= (0..31)
100 100 100 100 100 100 100 100 100 100 100 100 100 100 100 100 100 100 
100 100 100 100 100 100 100 100 100 100 100 100 100 100 
##$AQSEQ= 0
##$AQ_mod= 1
##$AUNM= <au_zg>
##$AUTOPOS= <>
##$BF1= 200.13
##$BF2= 200.13
##$BF3= 200.13
##$BF4= 200.13
##$BF5= 200.13
##$BF6= 200.13
##$BF7= 200.13
##$BF8= 200.13
##$BYTORDA= 1
##$CFDGTYP= 0
##$CFRGTYP= 5
##$CHEMSTR= <none>
##$CNST= (0..31)
1 1 145 1 1 1 1 1 1 1 1 1 1 1 1 1 1 1 1 1 1 1 1 1 1 1 1 1 1 1 1 1 
##$CPDPRG= <>
##$CPDPRG1= <>
##$CPDPRG2= <>
##$CPDPRG3= <>
##$CPDPRG4= <mlev>
##$CPDPRG5= <mlev>
##$CPDPRG6= <mlev>
##$CPDPRG7= <mlev>
##$CPDPRG8= <mlev>
##$CPDPRGB= <>
##$CPDPRGT= <>
##$D= (0..31)
0 1.2 0 0 0 0 0 0 0 0.06 0 0.03 0 0 0 0 0.0002 0 0 0 0 0 0 0 0 0 0 0 0 
0 0 0 
##$DATE= 1608617852
##$DBL= (0..7)
120 120 120 120 120 120 120 120 
##$DBP= (0..7)
150 150 150 150 150 150 150 150 
##$DBP07= 0
##$DBPNAM0= <>
##$DBPNAM1= <>
##$DBPNAM2= <>
##$DBPNAM3= <>
##$DBPNAM4= <>
$$ [...]
##$SUBNAM3= <"">
##$SUBNAM4= <"">
##$SUBNAM5= <"">
##$SUBNAM6= <"">
##$SUBNAM7= <"">
##$SUBNAM8= <"">
##$SUBNAM9= <"">
##$SW= 16.9725356469052
##$SWIBOX= (0..15)
0 0 2 0 0 0 0 0 0 0 0 0 0 0 0 0 
##$SW_h= 3396.73913043478
##$TD= 16384
##$TD0= 1
##$TE= 0
##$TE2= 300
##$TE3= 300
##$TEG= 300
##$TL= (0..7)
0 120 120 120 120 120 120 120 
##$TP= (0..7)
150 150 150 150 150 150 150 150 
##$TP07= 0
##$TPNAME0= <>
##$TPNAME1= <>
##$TPNAME2= <>
##$TPNAME3= <>
##$TPNAME4= <>
##$TPNAME5= <>
##$TPNAME6= <>
##$TPNAME7= <>
##$TPOAL= (0..7)
0.5 0.5 0.5 0.5 0.5 0.5 0.5 0.5 
##$TPOFFS= (0..7)
0 0 0 0 0 0 0 0 
##$TUNHIN= 0
##$TUNHOUT= 0
##$TUNXOUT= 0
##$USERA1= <user>
##$USERA2= <user>
##$USERA3= <user>
##$USERA4= <user>
##$USERA5= <user>
##$V9= 5
##$VALIST= <valist>
##$VCLIST= <CCCCCCCCCCCCCCC>
##$VD= 0
##$VDLIST= <DDDDDDDDDDDDDDD>
##$VPLIST= <PPPPPPPPPPPPPPP>
##$VTLIST= <TTTTTTTTTTTTTTT>
##$WBST= 1024
##$WBSW= 4
##$XGAIN= (0..3)
0 0 0 0 
##$XL= 0
##$YL= 0
##$YMAX_a= 873440
##$YMIN_a= -401020
##$ZGOPTNS= <>
##$ZL1= 120
##$ZL2= 120
##$ZL3= 120
##$ZL4= 120
##$ABSF1= 15.97713
##$ABSF2= -0.995532
##$ABSG= 5
##$ABSL= 3
##$ALPHA= 0
##$AQORDER= 0
##$ASSFAC= 0
##$ASSFACI= 0
##$ASSFACX= 0
##$ASSWID= 0
##$AUNMP= <proc_1d>
##$AZFE= 0.1
##$AZFW= 0.1
##$BCFW= 0
##$BC_mod= 2
##$BYTORDP= 0
##$COROFFS= 0
##$CY= -3
##$DATMOD= 1
##$DC= 0
##$DFILT= <>
##$DTYPP= 0
##$F1P= 0
##$F2P= 0
##$FCOR= 1
##$FTSIZE= 16384
##$FT_mod= 6
##$GAMMA= 0
##$GB= 0
##$INTBC= 1
##$INTSCL= 2.992141e-10
##$ISEN= 128
##$LB= 0.24
##$LEV0= 0
##$LPBIN= 0
##$MAXI= 10000
##$MC2= 0
##$MEAN= 0
##$ME_mod= 0
##$MI= 1.114404
##$NCOEF= 0
##$NC_proc= -6
##$NLEV= 6
##$NOISF1= 3.799351
##$NOISF2= 2.8
##$NSP= 0
##$NTH_PI= 0
##$NZP= 0
##$OFFSET= 15.99578
##$PC= 1
##$PHC0= -10760.09
##$PHC1= 7.400949
##$PH_mod= 1
##$PKNL= yes
##$PPARMOD= 0
##$PSCAL= 0
##$PSIGN= 0
##$REVERSE= no
##$SF= 200.130003768015
##$SI= 16384
##$SIGF1= 3
##$SIGF2= 2
##$SINO= 5.538805
##$SIOLD= 16384
##$SREGLST= <1H.CDCl3>
##$SSB= 0
##$STSI= 16384
##$STSR= 0
##$SW_p= 3396.73913043478
##$SYMM= 0
##$S_DEV= 0
##$TDeff= 16384
##$TDoff= 0
##$TI= <>
##$TILT= no
##$TM1= 0
##$TM2= 0
##$TOPLEV= 0
##$USERP1= <user>
##$USERP2= <user>
##$USERP3= <user>
##$USERP4= <user>
##$USERP5= <user>
##$WDW= 1
##$XDIM= 16384
##$YMAX_p= 511309942
##$YMIN_p= -529785
$$ End of Bruker specific parameters
$$ ---------------------------------
##NTUPLES= NMR SPECTRUM
##VAR_NAME=  FREQUENCY,     SPECTRUM/REAL,   SPECTRUM/IMAG
##SYMBOL=    X,             R,               I
##VAR_TYPE=  INDEPENDENT,   DEPENDENT,       DEPENDENT
##VAR_FORM=  AFFN,          ASDF,            ASDF
##VAR_DIM=   16384,         16384,           16384
##UNITS=     HZ,            ARBITRARY UNITS, ARBITRARY UNITS
##FACTOR=    0.207333158178281, 1,           1
##FIRST=     3201.23550990117, 0,            0
##LAST=      -195.503620533611, 0,           0
##MIN=       -195.503620533611, -529785,     0
##MAX=       3201.23550990117, 511309942,    0
$$ Real data points
##PAGE= N=1
##DATA TABLE= (X++(R..R)), XYDATA
$$ [...]
5950I13657R9239L3584q5541L5789K0615k146k609M601m6865R9978j47943P0252
5938I92611j68922O2771m5770p6423j14312j30875k7247R05O9628n799J93842
5927G50409m5285j42449J88471K45048O2477O597k09171p3947P3677m5168m3006
5916G67653J53811M8851o1857j8700j49982O5876L5792N1735j3844J37425n8278
5905I58482Q0168m3160Q3480J18164k13452J11340J46560j29792p3784R5067k39472
5894H93601j4402n1849n2103J48799P7089j13250r2648O4433J27145O1045j07192
5883I40668o6857R5656j2448P0639J14729J9946J84659N9874J62176j4979q5756
5872A468307n3792q9346k6802l3932P1750j97434j1007O8057j44814p2131n4955
$$ plain form
5950 913657 1012896 1046480 960939 996728 1017343 1015197 1012588 1017189 970324 1070302 922359 992611
5938 992611 823689 886460 840690 764267 649955 519080 491833 492738 562366 556567 750409
5927 750409 705124 562675 751146 996194 1058671 1065268 856097 782150 855827 810659 767653
5916 767653 921464 970315 908458 889758 739776 805652 841444 893179 879335 1016760 958482
5905 958482 1038650 995490 1078970 1197134 983682 1095022 1241582 1111790 1038006 1133073 893601
5894 893601 879199 827350 775247 924046 1001135 887885 795237 859670 986815 1047860 940668
5883 940668 873811 969467 957019 1027658 1142387 1162333 1346992 1406866 1569042 1554063 1468307
5872 1468307 1414515 1325169 1298367 1264435 1336185 1138751 1127744 1195801 1050987 978856 923901
5861I23901J31229j52556R53J60783L3018k9664n6909k1769Q341l0907r1269J01790
5849I76941O1930o2499j03378n064n7413m0384L6452J02015J394J6487J30326
5838A056807j9790R4110J30655P1666j91433r6198O4175L7023j07881j11093N2261
5827I80302K2983P3210j958R045l8979k78283j13087J43067R9173o534k3929R520
5815H74530l6477n316P4352J42656k79485J27689K00118j50235l7265Q285J36363
5804A055215Q070o4812N7363J13719j12234q7099q0918n1238J46145k9983j6404
5793I37824K1867j5923j76467J46040o6302K344O7346L5243J00216O433J4323
5782A072944N636k0480j78666J22262m4641J51719J33360j49388p2251J38601
$$ plain form
5861 923901 1055130 902574 903527 1064310 1097328 1067664 1010755 988986 997327 966420 875151 976941
5849 976941 1038871 976372 872994 867930 810517 770133 806585 908600 909994 926481 1056807
5838 1056807 1037017 1131127 1261782 1333448 1142015 1045817 1109992 1147015 1039134 928041 980302
5827 980302 1003285 1076495 1074537 1083582 1044603 766320 653233 796300 895473 888939 865010 874530
5815 874530 838053 832737 907089 1049745 770260 897949 1098067 947832 910567 918852 1055215
5804 1055215 1063285 998473 1055836 1169555 1057321 970222 889304 838066 984211 954228 937824
5793 937824 959691 943768 767301 913341 847039 849383 916729 951972 1052188 1058621 1072944
5782 1072944 1078580 1058100 879434 1001696 957055 1108774 1242134 1092746 1020495 1159096
5772A159096l9189p1297R1484K1371R7555J30373J21043j47121j84354J43319
5762A322280J25543M5909m348J53629J24732J32313j19843K10224J54835M8050
5752B193324N4925j49304Q8812L9045P9259J24562M3872K4808N359L6361J77351
5741B718374M8466J74083J41108J90953L4109j0374J00504J37508k51869j4646
5731C268216M6106O9803L8177m2191L690q1304O9413L18926J55289Q7557p7479
5720C856203J89959K63558j6370J92826P5528o1273M751J15340M8492J7038P8956
5709D765008K84162O6547K05037L45572K16952j2844L0387q7421j31078L0996
5699E713318M5218L1460J19844L20679L12986J44399J96509J67844K97844R2262
$$ plain form
5772 1159096 1119907 1048610 1140094 1161465 1259020 1389393 1510436 1363315 1178961 1322280
5762 1322280 1447823 1493732 1489384 1643013 1767745 1900058 1780215 1990439 2145274 2193324
5752 2193324 2248249 2098945 2187757 2226802 2306061 2430623 2474495 2499303 2504662 2541023 2718374
5741 2718374 2766840 2940923 3082031 3272984 3307093 3296719 3397223 3534731 3282862 3268216
5731 3268216 3314322 3384125 3422302 3380111 3383801 3302497 3371910 3690836 3846125 3933682 3856203
5720 3856203 4046162 4309720 4293350 4486176 4561704 4500431 4505182 4620522 4669014 4686052 4765008
5709 4765008 5049170 5115717 5320754 5666326 5883278 5870434 5900821 5813400 5682322 5713318
5699 5713318 5758536 5789996 5909840 6230519 6543505 6687904 6884413 7052257 7350101 7442363
5689G442363l2764j35194p1535J26894n9661P1385Q9328Q9496K17633L73395K04022
5678H315362J34543K47402O1920R0230L3768k10167j16484j81036n7706k4229
5668H293603J94506J85226O8567q7579N0515j1128k12851j63563j58318l3622
5658H125356k37986k8424J622Q5925j46731k15109O5651N3360m5860R075k11825
5647G455054j95191k06640k35950k80899n2019j80414k70039k25252K8866q6321
5637E751195p1854l1550m9196j10190k74996o5325k42871k14451j28393j22106
5627D440263j72269j07697j16738j18571j99753m2411j76830o8249o4778q6000
5617C286967k74017j35550K7249j0840M4244j34703j36612k6936P8707N0531p9520
$$ plain form
5689 7442363 7409599 7274405 7202870 7329764 7270103 7341488 7430816 7520312 7737945 8111340 8315362
5678 8315362 8449905 8697307 8759227 8849457 8883225 8673058 8556574 8375538 8317832 8293603
5668 8293603 8488109 8673335 8741902 8654323 8704838 8693710 8480859 8317296 8158978 8125356
5658 8125356 7887370 7858946 7860568 7946493 7799762 7584653 7650304 7703664 7657804 7666879 7455054
5647 7455054 7259863 7053223 6817273 6536374 6484355 6303941 6033902 5808650 5837516 5751195
5637 5751195 5679341 5647791 5598595 5488405 5213409 5148084 4905213 4690762 4562369 4440263
5627 4440263 4267994 4160297 4043559 3924988 3725235 3682824 3505994 3437745 3372967 3286967
5617 3286967 3012950 2877400 2904649 2893809 2938053 2803350 2666738 2639802 2718509 2769040 2689520
5606B689520p8993N6891j36166K3243q0180K6980j6326p4119j40641r8754J08423
5595B279878J29771q8744j72942j6218q7504Q1537N6603Q3055j04424J18036j46183
5584B132865J18211k5416L2986N2149P2309K2034j35050P429j79103j6851K45803
5573B327366Q0225j06211j71728m213q0032j0196L307m3413J59691R1800N0947
5562B297543M4053K6919k4294K06511p0543o2901J89072K464j70298Q8547N6416
5551B583489R2460l6302J13364P2348N7410J0j40602J21090k6949J1176J39315
5540B986809j84382M5610J68290J69076P6416N7182j0654K9445J6913J27714O4884
5529C547303k7693R5058J10814P6522J3948J11779j04728J34358J37208k3575
$$ plain form
5606 2689520 2610527 2667418 2531252 2554495 2474315 2501295 2484969 2410850 2270209 2171455 2279878
5595 2279878 2409649 2320905 2147963 2131745 2044241 2125778 2182381 2265436 2161012 2279048 2132865
5584 2132865 2251076 2225660 2258646 2310795 2383104 2405138 2270088 2277517 2098414 2081563 2327366
5573 2327366 2407591 2301380 2129652 2125439 2045407 2035211 2038518 1995105 2154796 2246596 2297543
5562 2297543 2341596 2368515 2344221 2550732 2480189 2417288 2606360 2608824 2438526 2527073 2583489
5551 2583489 2675949 2639647 2753011 2825359 2882769 2882779 2742177 2863267 2836318 2847494 2986809
5540 2986809 2802427 2848037 3016327 3185403 3261819 3319001 3308347 3337792 3354705 3482419 3547303
5529 3547303 3519610 3614668 3725482 3802004 3815952 3927731 3823003 3957361 4094569 4070994
5519D070994Q4455J31829J91054N1210M6804Q5747J04841L7473M8793N4251K6441
5508D933892K35552R0578O6063R5400K1209m627m3679K18636J52875P5321J13526
5497E954746j7609o2643J16511K46121J1517J94050K47948K01310K7484j8574
5487F900861J29428K78771R2965J64677N0775q7140R7438O7224J30455n4012j8525
5476G752917J01133K4538J11810J81281M3921R9399L5188j45198k05684p7708
5466G921597K5574N6620m6008m1645P3240p6568k49583j31487j95065k70282j18534
5455F947859j760j78584l00870p4413r2789j92307k73394r6622j06590j21871
5445E508659k36407j13759L4216j50176l29397j93553k1250L6660j29512k97641
$$ plain form
5519 4070994 4155449 4287278 4478332 4529542 4576346 4662093 4766934 4804407 4853200 4907451 4933892
5508 4933892 5169444 5260022 5326085 5421485 5442694 5438067 5394388 5613024 5765899 5841220 5954746
5497 5954746 5937137 5874494 5991005 6237126 6248643 6442693 6690641 6891951 6919435 6900861
5487 6900861 7030289 7309060 7402025 7566702 7617477 7530337 7627775 7694999 7825454 7771442 7752917
5476 7752917 7854050 7878588 7990398 8171679 8215600 8314999 8350187 8204989 7999305 7921597
5466 7921597 7947171 8003791 7957783 7916138 7989378 7912810 7663227 7531740 7336675 7066393 6947859
5455 6947859 6946099 6767515 6466645 6392232 6299443 6107136 5833742 5737120 5630530 5508659
5445 5508659 5272252 5158493 5192709 5042533 4713136 4519583 4498333 4534993 4405481 4107840
5435D107840j84981o0937j20414o0530j27399j10633L7933j95370j08666l4941
5425C141902j45422j8236j75773n4924n4208o249p3080M599O045j71160M270k01857
5413B255907J6272N2515j4450j46808n8287J05623P2709r4745j11346K7314p662
5402B097042M0367L2909r0730o5084k6023l7443j15904j8858Q5154R3184J24054
5391B118668m3271j18764l7268N7529o2395m9697P5182N4073L3995o4449j06188
5380A857415p5509J94991o8307m9948J0104Q00k51501J4326k7115j44791k8869
5369A431596M1403k1410K4254J26923N5606j39231q5062K35346Q355N6755J49744
5358A884279m0443j05823k0072p8505L102O3166l2780m4211o3694j15486n9289
$$ plain form
5435 4107840 3922859 3861922 3741508 3680978 3553579 3442946 3480879 3285509 3176843 3141902
5425 3141902 2996480 2978244 2802471 2747547 2693339 2687090 2614010 2618609 2624654 2453494 2457764 2255907
5413 2255907 2272179 2324694 2310244 2163436 2105149 2210772 2283481 2188736 2077390 2104704 2097042
5402 2097042 2137409 2170318 2079588 2014504 1988481 1951038 1835134 1816276 1901430 1994614 2118668
5391 2118668 2075397 1956633 1919365 1976894 1914499 1864802 1939984 1994057 2028052 1963603 1857415
5380 1857415 1781906 1976897 1908590 1858642 1868746 1869546 1618045 1632371 1605256 1460465 1431596
5369 1431596 1472999 1451589 1475843 1602766 1658372 1519141 1434079 1669425 1677780 1734535 1884279
5358 1884279 1843836 1738013 1717941 1639436 1642538 1705704 1672924 1628713 1565019 1449533 1390244
5347A390244P6769P3549m2858l7010J42912J89561Q004P7672m5870J67833J8238
5336B019044n2673N9056K7020q6873o2918L7901P6202j21419K3454n6619k7617
5325A834558R8602Q6714M8005n6053l1058J35510J36078N7057J97318J81468O7593
5314B755792l0400J24259p1957q7705Q3166J35495Q0325R8985n1468J32453J15497
5303C284442J4184K15061n9041p085J01218J38483O0199K15929n5591K9596J66614
5292D104009K38921J13577J36404L77455J58466J87523J74464K69651L43899K78861
5282F383230M61907K59987k7930k07031l40088k01151k14906j16328J35863n8767
5272F074786k4809j1450n1672J21653R4829K14089j2963N5376J24489N0031O0860
$$ plain form
5347 1390244 1467013 1540562 1497704 1460694 1603606 1793167 1801171 1878843 1832973 2000806 2019044
5336 2019044 1966371 2025427 2052447 1965574 1902656 1940557 2016759 1895340 1918794 1862175 1834558
5325 1834558 1933160 2019874 2067879 2011826 1980768 2116278 2252356 2309413 2506731 2688199 2755792
5314 2755792 2725392 2849651 2777694 2689989 2773155 2908650 2988975 3087960 3036492 3168945 3284442
5303 3284442 3298626 3513687 3454646 3447561 3548779 3687262 3747461 3963390 3907799 3937395 4104009
5292 4104009 4342930 4456507 4592911 4970366 5128832 5316355 5490819 5760470 6104369 6383230
5282 6383230 6845137 7105124 7077194 6870163 6530075 6328924 6114018 5997690 6133553 6074786
5272 6074786 6049977 6038527 5986855 6108508 6203337 6417426 6404463 6459839 6584328 6634359 6695219
5261F695219n4367j84879J19881o9131q2189l2228L9849J11071K36948J44880
5251F925054J25356J95521K42955K02626L55347L03005N21985Q08506N77959O53074
5241A0911388P75621O16823Q8482m82981o38297p43874p86400m99177n35436l09566
5231H396583j59244k41064k45940q7459n3588j14100p0259k73745m1299j7568
5221G092317l0880M5976O829J4890n3985J85119J2402j5971K43451Q1843O5573
5210G647564M6869l6015K69504m4767M1156J12184K08203K86914N13641K38863
5200I284116J80217M62386K23783m7661j52113l44530m09939k81560m37881j77673
5190H299145k4970N6883j80439j30555j64048n1407p031j62152N8185M1993P7132
$$ plain form
5261 6695219 6640852 6455973 6575854 6506723 6424534 6392306 6432155 6543226 6780174 6925054
5251 6925054 7050410 7245931 7488886 7691512 8046859 8349864 8871849 9680355 10258314 10911388
5241 10911388 11687009 12303832 12392314 11909333 11271036 10527162 9740762 9241585 8706149 8396583
5231 8396583 8237339 7996275 7750335 7662876 7609288 7495188 7424929 7151184 7109885 7092317
5221 7092317 7061437 7107413 7114242 7129132 7075147 7260266 7272668 7256697 7500148 7581991 7647564
5210 7647564 7694433 7658418 7927922 7883155 7924311 8036495 8244698 8531612 9045253 9284116
5200 9284116 9464333 9926719 10150502 10102841 9950728 9606198 9196259 8914699 8476818 8299145
5190 8299145 8274175 8331058 8150619 8020064 7856016 7804609 7797578 7635426 7693611 7735604 7812736
5179G812736O4669L1115m3502O79K26080J24821L3169Q4860J22348K7332R6149
5168H580456K1871j36628J16472Q7890m3008j20992J04375R3755R7934R0176j12689
5157H779612K19314K15326K14029J77813J05731M9557J6989J43393O4510K43662
5147A0229936L77442K66067J83274J30219J79660K50461K29031K11558K24763
5138A2282411K73084K62312K54089J03398J46953K35865K57219K74512J80011
5129A4269854K75857L89746L64628L51382M46843O18164N82061N99725O29645
5120A8527905N51839Q94502J049357R20143R63530J093403P60140L07642K01739
5111B5270200K76705J79717M32923M24880N74923P95328O04503O15094O50657
$$ plain form
5179 7812736 7877405 7908520 7865018 7865697 8091777 8216598 8249767 8334627 8456975 8484307 8580456
5168 8580456 8602327 8465699 8582171 8670061 8627053 8506061 8610436 8704191 8802125 8892301 8779612
5157 8779612 8998926 9214252 9428281 9606094 9711825 9761382 9778371 9921764 9986274 10229936
5147 10229936 10607378 10873445 11056719 11186938 11366598 11617059 11846090 12057648 12282411
5138 12282411 12555495 12817807 13071896 13175294 13322247 13558112 13815331 14089843 14269854
5129 14269854 14545711 14935457 15300085 15651467 16098310 16716474 17298535 17898260 18527905
5120 18527905 19079744 19974246 21023603 21943746 22907276 24000679 24760819 25068461 25270200
5111 25270200 25546905 25726622 26159545 26584425 27159348 27954676 28559179 29174273 29824930
5102B9824930O02022O66143P42380O65956N83096O74640O43275O20823R22407
5093C5945672R14176R52960J090663J111945R82804R25170Q04642L73071P5912
5084D3177015m92208m81075k06809l51765j13522l1599O611p7185p5448k7347
5074D1326668R3471j35553k07688p29255j190892j072906q06726q87283q25499
5065C5564337o70573o77613o18639o15231n13613o82280p69429p50697n20211
5056B9746051p22993n17619o40254m56318k33833k96235k83907k66547j27366
5047B6200979k11083k6138n4815n05416o86143m75554l40374l67681j70132J3421
5037B3377064j8123J04965K74489K84906K18244j1681m25584o71591m26150l39660
$$ plain form
5102 29824930 30426952 31093095 31835475 32501431 33084527 33759167 34402442 35023265 35945672
5093 35945672 36859848 37812808 38903471 40015416 40998220 41923390 42728032 43101103 43177015
5084 43177015 42684807 42203732 41996923 41645158 41531636 41500037 41506648 41429463 41354015 41326668
5074 41326668 41420139 41284586 41076898 40347643 39156751 38083845 37277119 36389836 35564337
5065 35564337 34893764 34216151 33597512 32982281 32468668 31786388 31016959 30266262 29746051
5056 29746051 29023058 28505439 27865185 27408867 27175034 26878799 26594892 26328345 26200979
5047 26200979 25989896 25963758 25908943 25403527 24717384 24241830 23901456 23533775 23363643 23377064
5037 23377064 23358941 23463906 23738395 24023301 24241545 24229864 23804280 23132689 22706539 22366879
5027B2366879j20203N6830j23283n8313J05205L08884K44649K38868K59569m8809
5017B3230276l76716n35245n33213n75411n29829k85459j09133j07908j02913
5008B0074449J58228M4455N9309P155J0033J00883Q7817J32473K74708K12413
4998B1161923J59062J21584Q1958K83877K57971J62310K77083K95836K28127p283
4988B3022448J19219L12404M85043M23768L44122L98991N06771N35067N16410
4979B6664243N66431N41332N23347N70751M50372N67173O17269L17719L34421
4970C1153058N04421O71324P51001N80419N66797O62670P05501Q12054P42343
4961C7149588P83670P72809Q39765P70245O27763N61509P24123R44874J059469
$$ plain form
5027 22366879 22246676 22303506 22180223 22121910 22227115 22535999 22780648 23019516 23279085 23230276
5017 23230276 22853560 22318315 21785102 21209691 20679862 20394403 20285270 20177362 20074449
5008 20074449 20232677 20277132 20336441 20343596 20353629 20454512 20542329 20674802 20949510 21161923
4998 21161923 21320985 21442569 21524527 21808404 22066375 22228685 22505768 22801604 23029731 23022448
4988 23022448 23141667 23454071 23939114 24362882 24707004 25105995 25612766 26147833 26664243
4979 26664243 27230674 27772006 28295353 28866104 29316476 29883649 30500918 30818637 31153058
4970 31153058 31657479 32328803 33079804 33660223 34227020 34889690 35595191 36407245 37149588
4961 37149588 37933258 38706067 39545832 40316077 40943840 41505349 42229472 43174346 44233815
4952D4233815O99917J091880J277509J240356J415499J256635J241839J406322
4944E3863772J354525J686401J627326J719127J786425J813705K315883K412130
4936F8579294K616578L100217K979256L413344L724400M195290M783896N093504
4928I8485779N614961O157342O912376P160573P934445Q330105Q989750R488699
4920A59074030R500497R106408Q446356P240797N797888L924854J408135o23655
4912B03875310k258342k872329k517622k071002j681617j606905j910641l040478
4904A85916374m349800n211619n424220n148162m803380l980620l317390l004046
4896A50677137l055064l434828m347977n302524o227268o704306o636582o668041
$$ plain form
4952 44233815 44933732 46025612 47303121 48543477 49958976 51215611 52457450 53863772
4944 53863772 55218297 56904698 58532024 60251151 62037576 63851281 66167164 68579294
4936 68579294 71195872 74296089 77275345 80688689 84413089 88608379 93392275 98485779
4928 98485779 104100740 110258082 117170458 124331031 132265476 140595581 149585331 159074030
4920 159074030 168574527 177680935 186127291 193368088 199165976 203090830 204498965 203875310
4912 203875310 201616968 198744639 196227017 194156015 192474398 190867493 188956852 185916374
4904 185916374 181566574 176354955 170930735 165782573 160979193 156998573 153681183 150677137
4896 150677137 147622073 144187245 139839268 134536744 128309476 121605170 114968588 108300547
4888A08300547o462327o053202n306373m828693m116348l743507l273871k695927
4880G1820299k091818j906569j642430j140808q95086n59784n85136o00359o69295
4871F1729014r46441j135319j247967j425475j509791j411860j368190j746220
4863E0937751j773813j788140j798744j566038j550788j398145j285939j503842
4855C8272302j415137j191927j138004j078781q88236p27020o93754n85116o49931
4846B9904396r19071r37020p52251r78395r12333m90039o11953n46001o96426
4837B3060907n79764m88934m67705m26549l88476l62843m03311m57799m48979
4828A9036547m89172l50450l77847k57687k84622l09971k97793m05666l44759
$$ plain form
4888 108300547 101838220 95785018 90478645 85649952 81533604 77790097 74516226 71820299
4880 71820299 69728481 67821912 66179482 65038674 64143588 63583804 62998668 62398309 61729014
4871 61729014 60782573 59647254 58399287 56973812 55464021 54052161 52683971 50937751
4863 50937751 49163938 47375798 45577054 44011016 42460228 41062083 39776144 38272302
4855 38272302 36857165 35665238 34527234 33448453 32560217 31833197 31139443 30554327 29904396
4846 29904396 28985325 28048305 27296054 26317659 25405326 24915287 24303334 23757333 23060907
4837 23060907 22481143 21992209 21524504 21097955 20709479 20346636 19943325 19485526 19036547
4828 19036547 18547375 18196925 17819078 17561391 17276769 16966798 16669005 16263339 15918580
4819A5918580k40319j40168j36314k35556j81201j84164j41880n1161j01396j72497
4809A4333924j2369j9644k61169q9833j52078l09707l23623j64367j45308j72612
4799A2683214k35500k68339j71237j7809j68369r6098l6058j2917o5042j65813
4789A1446032p7404m1694k4264j37881o5350l7501l1663l8306j79569j35555j2616
4778A0664229R9801j48763J2996o1053k63871k17147o2425J0208J87845j50733
4768A0071087k94866l7550Q1924k13706j51577J0643Q8696N459j35565m1491n8553
4757I324501m3081J85631J38647J75581M3651J5573J8446k9643j87011j92786
4747I449509k5483o9775N9905j01710j49413j34755q0742q2140K1499j60222K8990
$$ plain form
4819 15918580 15678261 15538093 15401779 15166223 14985022 14800858 14658978 14607817 14506421 14333924
4809 14333924 14321555 14301911 14040742 13950909 13798831 13489124 13165501 13001134 12855826 12683214
4799 12683214 12447714 12179375 12008138 11990329 11821960 11725862 11689804 11676887 11611845 11446032
4789 11446032 11368628 11326934 11302670 11164789 11099439 11061938 11030275 10991969 10812400 10676845 10664229
4778 10664229 10764030 10615267 10628263 10567210 10303339 10086192 10023767 10033975 10221820 10071087
4768 10071087 9776221 9738671 9820595 9606889 9455312 9465955 9554651 9560110 9424545 9383054 9324501
4757 9324501 9281420 9467051 9605698 9781279 9824930 9840503 9858949 9829306 9642295 9449509
4747 9449509 9424026 9354251 9414156 9312446 9163033 9028278 8947536 8865396 8886895 8726673 8755663
4736H755663j25154k04790q2246o1194j7810k30048k72093L407J26016j08677
4726G783074k26062k8030P0309J75737j2069k8764j40658j80151l5336n7139q6079
4715G234832J00857N8790q2348J12335K25460L4451M0554J72533K35589J21638
4705H254691N4446J63138J34088J09691J75627k614n3587J69296J19085j23661
4695I000200J8724K0562N4327J7399k0196J96079K3819J81597Q0839P0774L4701
4684I678825p8510J68573J23819J8038K7054Q7843n7327p3781r001K47838P5910
4673A0209281J57548K12878K09901J81254J50473J44842L95641L67148J96228
4664A2225194K80308K36350L23877N32084O51018M00256N79535L54756M08806
$$ plain form
4736 8755663 8630509 8425719 8343473 8282279 8264469 8034421 7762328 7765735 7891751 7783074
4726 7783074 7557012 7528982 7599291 7775028 7762959 7734195 7593537 7413386 7378050 7320911 7234832
4715 7234832 7335689 7394479 7312131 7424466 7649926 7684377 7724931 7897464 8133053 8254691
4705 8254691 8309137 8472275 8606363 8716054 8891681 8889067 8835480 9004776 9123861 9000200
4695 9000200 9018924 9039486 9093813 9111212 9091016 9287095 9310914 9492511 9573350 9644124 9678825
4684 9678825 9600315 9768888 9892707 9910745 9937799 10025642 9968315 9894534 9885533 10133371 10209281
4673 10209281 10366829 10579707 10789608 10970862 11121335 11266177 11661818 12028966 12225194
4664 12225194 12505502 12741852 13065729 13597813 14248831 14649087 15228622 15583378 15992184
4655A5992184N51047P38733P34411R49698J075771J298805J396593J638165J998730
4646B6374137K390393L048128L484835L519089K990606J852368L7803j535272
4638D2162087k507816k733532k191129j562180p97925j11840K70869J006273J602702
4629C5137509K129514K925773L076587K529489J076819j068063k950688l857983
4621C8998957l768547l110515k462739k062482j546811j523973j177137j008877
4613B2337876q94484p01685n01886k25331l02268n73297m18314j27761j84560
4604A8408290j54627k6224j924j08280l97025l49207l3361J22797K45342N0647
4594A7756428J48467L38909K02322R0052K50238K88159N01232N98922M36874M44101
$$ plain form
4655 15992184 16543231 17281964 18016375 18966073 20041844 21340649 22737242 24375407 26374137
4646 26374137 28764530 31812658 35297493 38816582 41807188 43659556 43697359 42162087
4638 42162087 39654271 36920739 34729610 33167430 32369505 32257665 32528534 33534807 35137509
4629 35137509 37267023 40192796 43269383 45798872 46875691 45807628 42856940 38998957
4621 38998957 35230410 32119895 29657156 27594674 26047863 24523890 23346753 22337876
4613 22337876 21443392 20741707 20239821 20014490 19712222 19138925 18720611 18592850 18408290
4604 18408290 18253663 18227439 18225515 18117235 17720210 17371003 17337642 17460439 17705781 17756428
4594 17756428 17904895 18243804 18446126 18536178 18786416 19074575 19575807 20174729 20611603 21055704
4584B1055704O91432M25244N47578Q32061P57284J001822J017442J131248J450902
4575B8910717J477895J835282K305515K759824L339586L913256M683787N368349
4567E4594211O076449N683038M066199J552371j383379l468751m816354m416654
4559E7887130l352221k298054r89940m355R25230J797489K786241L593232L999738
4550F4344490L762675K313935l85441l213181n445233o387760n980033m939444
4542D4070008l995854l330199k642716k356650k073583j764547j703215j484311
4534B4718933j348000j166925r14485o01886o07328o62887n51864n68920o10139
4525A7686499m83406n31849k87841l29132k71522l72906m35447l96364j88602
$$ plain form
4584 21055704 21747136 22172380 22719958 23552019 24309303 25311125 26328567 27459815 28910717
4575 28910717 30388612 32223894 34529409 37289233 40628819 44542075 49225862 54594211
4567 54594211 60670660 66353698 70419897 71972268 70588889 67120138 62303784 57887130
4559 57887130 54534909 52236855 51246915 51242560 52167790 53965279 56751520 60344752 64344490
4550 64344490 68107165 70421100 70035659 66822478 61377245 54989485 49009452 44070008
4542 44070008 40074154 36743955 34101239 31744589 29671006 27906459 26203244 24718933
4534 24718933 23370933 22204008 21289523 20687637 20080309 19417422 18865558 18296638 17686499
4525 17686499 17203093 16671244 16383403 16054271 15782749 15409843 14974396 14578032 14389430
4516A4389430j04791j08311O344k76025j99449l26649k08965p7307K1701k37484
4506A2878494j82989k35283l11678q4193r0913k7266r4810p9173M8295l6392p8702
4495A1705390l73300j01851k8161k15767N6169K6968l2553q6935p1976Q4240k0202
4484A0942022N2822K18540o1304j96388j25393j29056o0976l7028k72471n5408
4474A0275360k26064K7872J1569j73748R911J2090J7221K10572K22902j45347
4464A0242338j5510Q3751K10940J90295J22677Q5179J0641q1325k62432j62426
4454A0424128k55075L331O9441J01194m4471j16505J173l1258R598Q0865N4081
4443A0296502j8001L60788J13260o2974K08029K65155J67294K27278K06396K18455
$$ plain form
4516 14389430 14284639 14176328 14182672 13906647 13707198 13380549 13171584 13094277 13115978 12878494
4506 12878494 12695505 12460222 12148544 12064351 11973438 11946172 11851362 11772189 11820484 11784092 11705390
4495 11705390 11332090 11230239 11202078 10986311 11042480 11069448 11036895 10949960 10877984 10962224 10942022
4484 10942022 10994844 11213384 11152080 10955692 10830299 10701243 10640267 10603239 10330768 10275360
4474 10275360 10049296 10077168 10088737 9914989 9924900 9936990 9954211 10164783 10387685 10242338
4464 10242338 10226828 10310579 10521519 10711814 10834491 10919670 10930311 10848986 10586554 10424128
4454 10424128 10169053 10172384 10241825 10343019 10298548 10182043 10183216 10151958 10161556 10242421 10296502
4443 10296502 10278501 10639289 10752549 10689575 10897604 11162759 11330053 11557331 11763727 11982182
4433A1982182K43075N4139Q1268J81582J10617J28089K80504Q0756J92354l1315
4423A3303251J00996K23286J73884L65010K24990J24731j6405K66213L94918M83378
4413A5644252L43912N22739Q33462J010792Q76125J205767J187905R96872O80085
4404B3301911O23264P26644N77433O96931R66937J167934R91814J084740N57659
4395C0695267M40887K81679r7393k34344k87167j78913j53268j10576J14982K18516
4385C0689670L91326N64611P85296J101080R17131J069104J076144J136104J402570
4376C9133036J787480K021396K330451K798565L478838L947682M274582M553673
4368F4325703M031809K127119j150469m225529n828036n792004m994755l890816
$$ plain form
4433 11982182 12225257 12279396 12360664 12542246 12652863 12780952 13061456 13142212 13334566 13303251
4423 13303251 13404247 13627533 13801417 14166427 14391417 14516148 14499743 14765956 15160874 15644252
4413 15644252 15988164 16510903 17344365 18355157 19231282 20437049 21624954 22621826 23301911
4404 23301911 23925175 24651819 25229252 25926183 26893120 28061054 29052868 30137608 30695267
4395 30695267 31136154 31417833 31320440 31086096 30798929 30620016 30466748 30356172 30471154 30689670
4385 30689670 31080996 31645607 32430903 33531983 34449114 35518218 36594362 37730466 39133036
4376 39133036 40920516 42941912 45272363 48070928 51549766 55497448 59772030 64325703
4368 64325703 68357512 70484631 69334162 65108633 59280597 53488593 48493838 44603022
4360D4603022k902433k199552j793099j599644j202393r14631o39656m41226l36821
4351C2573567k50573j447L05631M12568Q56205J242741J547669J867174K556782
4342D1110317L051684L770502M633520N283219N119581L661197L81874k947682
4334F4064212n489710n918499n491760m650597l453503k855481k310033k145148
4326C1749481j791645j795294j464463j395102j079719r60812q76956n78779n85325
4317B1221386n57767l07501l94810m57433l49917l14152k41284j77622r3399M064
4307A8331565l7146Q7961K85027L83127L09801L76780N87063P09448Q55661J081569
4297B2970856J548395J593302K037946K587306L010901L308354K605168Q27734
$$ plain form
4360 44603022 41700589 39501037 37707938 36108294 34905901 33991270 33351614 32910388 32573567
4351 32573567 32322994 32321547 32627178 33039746 33895951 35138692 36686361 38553535 41110317
4342 41110317 44162001 47932503 52566023 57849242 62968823 66630020 67011894 64064212
4334 64064212 58574502 52656003 47164243 42513646 39060143 36204662 33894629 31749481
4326 31749481 29957836 28162542 26698079 25302977 24223258 23262446 22385490 21806711 21221386
4317 21221386 20663619 20356118 19961308 19503875 19153958 18839806 18598522 18420900 18327501 18331565
4307 18331565 18294419 18382380 18667407 19050534 19360335 19737115 20324178 21033626 21889287 22970856
4297 22970856 24519251 26112553 28150499 30737805 33748706 37057060 39662228 40489962
4289D0489962j469056k695563l111900k798714k319847j786625j336016j106312
4281B3865929r26552q31872q53799n86104m68046j51315J98748J21148K25997
4272B0594134L25180N53009P76543J079962J132690J097989J680199K108327K380636
4263C1728669K995144L313506K878416J289258o78311k990989l957133l995803
4255C0582757l406829k656177j986590j482295j214485j246884j581832r33462
4247A6074203p73508q19896n99733o19934m61076m05339l08857k98915k44800
4238A1542145l27691k16595k21321j9431k10779j55486J9822r7545k08331l02811
4228I801977j52374j49874j17080r9133M4687j12354P9892J1379j9891j11872
$$ plain form
4289 40489962 39020906 36325343 33213443 30414729 28094882 26308257 24972241 23865929
4281 23865929 22939377 22107505 21253706 20667602 20199556 20048241 20246989 20368137 20594134
4272 20594134 20919314 21472323 22248866 23328828 24461518 25559507 27239706 29348033 31728669
4263 31728669 34723813 38037319 40915735 42204993 41526682 38535693 34578560 30582757
4255 30582757 27175928 24519751 22533161 21050866 19836381 18589497 17007665 16074203
4247 16074203 15300695 14480799 13881066 13261132 12800056 12394717 12085860 11786945 11542145
4238 11542145 11214454 10997859 10776538 10757107 10546328 10390842 10410664 10313119 10104788 9801977
4228 9801977 9649603 9499729 9382649 9283516 9328203 9215849 9295741 9307120 9287229 9175357
4218I175357M7520k31486k70689m78023m53219k69111j76153j55251r0613j62644
4208F935688j73983k53795l10107j31857k17901K3581o9241L8712l05346k62557
4198E273194R0212N5456p3281j00544j43017J56767p0719K1553L944J27852J34503
4187E475920q2619n5830O6998J66020J98457K32852J99075k774M0681j95355l97761
4176E645664r0282l71568l3786J6023k27275o5723o974M930K7673m4000m941k07178
4164D642563j22284K475j4710n1945j622j74001k4139K42898j6218j17099K3720
4153D389638K9379o6239P0780N0153q9784j11451q5679l7769o2842q0826r8410
4142C906950j71757p9381j19546O9259k2530j27332L7732m2975k5132N2895j37282
$$ plain form
4218 9175357 9222877 8991391 8720702 8242679 7789460 7520349 7344196 7188945 7098332 6935688
4208 6935688 6761705 6507910 6197803 6065946 5848045 5871626 5802385 5841097 5535751 5273194
4198 5273194 5363406 5418862 5345581 5245037 5102020 5258787 5188068 5209621 5213565 5341417 5475920
4187 5475920 5393301 5337471 5404469 5570489 5768946 6001798 6200873 6198099 6238780 6043425 5645664
4176 5645664 5555382 5183814 5150028 5166051 4938776 4873053 4866079 4871009 4898682 4854682 4849741 4642563
4164 4642563 4520279 4522754 4508044 4456099 4454477 4280476 4256337 4499235 4483017 4365918 4389638
4153 4389638 4419017 4352778 4423558 4473711 4383927 4272476 4186797 4149028 4086186 4005360 3906950
4142 3906950 3735193 3655812 3536266 3605525 3582995 3455663 3493395 3450420 3425288 3478183 3340901
4131C340901J29729J68410n5347J73350o0446n2879k22409j67157j70015O8172
4121C152309L3289j80356r3775M8103j31006l4784J19768j93401j20732J4623
4111B614038R8588p918n0586Q2547j29986K7297J9183l5348J092L2827Q708M4671
4099B705113K43840K8363J02366J11821n7207Q5479l1740k47639k05730j03628
4089B631038J7571N650j3080j27989q1029J46157N9163J3517J61509j7852M0823
4078B835478k1858n403J16674K54348Q8889m7245j18470J2534L4043L9030j93889
4067B994131j7925L0724j41713n8986k08501j39481l8773l1123N6952j9560N6696
4056B482441n881q5900k792L930R4210J56130P136N0983M5819J2558L2888k92231
$$ plain form
4131 3340901 3470630 3639040 3583693 3757043 3696597 3643718 3421309 3254152 3084137 3152309
4121 3152309 3185598 3005242 2911467 2959570 2828564 2793780 2913548 2720147 2599415 2614038
4111 2614038 2712626 2704708 2654122 2736669 2606683 2633980 2653163 2617815 2618907 2651734 2660442 2705113
4099 2705113 2948953 2977316 3079682 3191503 3134296 3219775 3188035 2940396 2734666 2631038
4089 2631038 2648609 2654259 2641179 2513190 2432161 2578318 2637481 2650998 2812507 2794655 2835478
4078 2835478 2813620 2808217 2924891 3179239 3268128 3220883 3102413 3114947 3148990 3188020 2994131
4067 2994131 2976206 3006930 2865217 2806231 2597730 2458249 2419476 2388353 2445305 2425745 2482441
4056 2482441 2476560 2390660 2387868 2391798 2486008 2642138 2649274 2700257 2746076 2758634 2791522 2499291
4044B499291p8427j78477o904Q2022k9714M2136N9323k2986r0443J01825l9339
4033B338307j18977M3184k6335M2931Q7686R1840N2329N6678l7783J9519O1230
4022B610609j37198n265R1382r99J88092P5326j89324J11116P5371Q3860M6191
4011B949161M4814j5595K42065L9028o7107Q0317M4680J127m1775J50176R6183
4000C523074J45409O28m0071J75127K06333L5273Q7433r5931k7945O8504j60322
3989C917512O2437P0331k6237J15215k7091P4324Q2988j61518Q2897J32308O1657
3978D384823n487J40525O3531j45751n1582R5607P6533l0355l4370O1295j50553
3967D404216o8756J07223m1408M4575n3638K4684O8503O7766j89983j38880l8111
$$ plain form
4044 2499291 2420864 2242387 2235483 2317505 2287791 2329927 2389250 2366264 2275821 2377646 2338307
4033 2338307 2219330 2262514 2236179 2279110 2366796 2458636 2510965 2567643 2529860 2549379 2610609
4022 2610609 2473411 2468146 2559528 2558529 2746621 2821947 2632623 2743739 2819110 2902970 2949161
4011 2949161 2993975 2978380 3220445 3259473 3192366 3272683 3317363 3318490 3276715 3426891 3523074
4000 3523074 3668483 3669111 3629040 3804167 4010500 4045773 4133206 4037275 4009330 4077834 3917512
3989 3917512 3979949 4050280 4024043 4139258 4112167 4186491 4269479 4107961 4190858 4323166 4384823
3978 4384823 4379336 4519861 4583392 4437641 4386059 4481666 4558199 4527844 4493474 4554769 4404216
3967 4404216 4335460 4442683 4401275 4445850 4392212 4416896 4485399 4553165 4363182 4224302 4186191
3956D186191J28807J17582m9701m3546N2532j55359L3598k15M3296N1586M931
3945D369702N436j38426n3251K8592R8370J3569L5909o944k7292o2611k8654O4813
3933D299213M9430j485L7332o6788m1456j3887k3923Q2741O2403o8413R6341M7076
3921D458584j30362l1942j8337O7J45321m217Q7092P8058p6572n4941P511O3096
3909D523358N2104r5729r397j6152n7479k7464j44197o7384j43425O5842M1197
3898D121274K3777p1084j86160k4078J4553J61129J81342j26002M761j47421j20944
3887C831147j35216r2699J75684N868l8885r6342K1607k09078J00764j22691k13328
3876C226831j071o6807n5342l5848q1481k3690l4704k331L5085N7716N5308P0266
$$ plain form
3956 4186191 4314998 4432580 4382879 4339333 4391865 4236506 4270104 4269889 4313185 4364771 4369702
3945 4369702 4375138 4236712 4183461 4212053 4310423 4323992 4359901 4352957 4325665 4263054 4234400 4299213
3933 4299213 4348643 4347158 4384490 4317702 4276246 4262359 4238436 4321177 4383580 4315167 4411508 4458584
3921 4458584 4328222 4296280 4277943 4278010 4423331 4419114 4506206 4584264 4507692 4452751 4460262 4523358
3909 4523358 4575462 4479733 4470336 4454184 4396705 4369241 4225044 4157660 4014235 4080077 4121274
3898 4121274 4145051 4073967 3887807 3863729 3878282 4039411 4220753 4094751 4099512 3952091 3831147
3887 3831147 3695931 3603232 3778916 3784784 3745899 3649557 3671164 3462086 3562850 3440159 3226831
3876 3226831 3225760 3158953 3103611 3067763 2986282 2962592 2927888 2925557 2960642 3018358 3073666 3143932
3864C143932r6986j03367o0693J4751K59127j55759j64346j46068r6044o6210
3854B528337O746J66634M2236r4351M5265O5554n7821p4375O82J2004O622M5631
3842B693164l6461M9411o9404K5620O7473j01725j00726r5966J28137j12306j95098
3831B252119p6483M5464N1554K5340J42433J02486N8732L7357J16466P4543J42378
3820B972389J61777m5126n4595o6048k1786K168j89021k6982R0510J8965P2316
3809B914567q8870j16034P3624J32120P6010J24763J7410J03837Q522N553Q9729
3798C341231j74263L0825J75109l1036o7563K04511O3606o8580q9236J49075O1861
3787C595540K732n0506k5660K27404J63344j18931M7117J66609Q6353L9729J96132
$$ plain form
3864 3143932 3046946 2943579 2882886 2897637 3156764 3001005 2836659 2690591 2594547 2528337
3854 2528337 2535083 2701717 2743953 2649602 2694867 2760421 2702600 2628225 2628907 2640911 2647533 2693164
3842 2693164 2656703 2706114 2636710 2662330 2729803 2628078 2527352 2431386 2559523 2447217 2252119
3831 2252119 2175636 2221100 2272654 2297994 2440427 2542913 2601645 2639002 2755468 2830011 2972389
3820 2972389 3134166 3089040 3034445 2968397 2946611 2948779 2759758 2732776 2823286 2842251 2914567
3809 2914567 2825697 2709663 2783287 2915407 2991417 3116180 3133590 3237427 3245949 3251502 3341231
3798 3341231 3166968 3197793 3372902 3341866 3274303 3478814 3542420 3473840 3384604 3533679 3595540
3787 3595540 3598272 3547766 3522106 3749510 3912854 3793923 3841040 4007649 4094002 4133731 4329863
3776D329863J53719N5459k7123l9057K49317J48433P4079O8908m1718j40994K08366
3765E039252J20771K2340J2071J56624J43515J43371J2665P6721J29689J21265
3755E978284Q8103L52697K51861P2271M4478P1749L02538K26276J97747K75986
3745G861990L10208J34240K80630L63682L21952L81476L54429L15105L97798L45270
3735A1066780M78622M69291N20146P47962O82070P06212O50152P07322P70202
3726A6798759R23025J142643J338357J395955J523619J419628Q48578J89651j69975
3717B5410240Q4744K19362O12805J030675J352318J599060K067662K557149K831903
3708C7765918K696814J969673J522487Q43540N48973J88696K13366J75124l41643
$$ plain form
3776 4329863 4483582 4539041 4511918 4472861 4722178 4870611 4944690 5013598 4971880 4830886 5039252
3765 5039252 5160023 5182363 5194434 5351058 5494573 5637944 5650609 5727330 5857019 5978284
3755 5978284 6066387 6419084 6670945 6743216 6787694 6859443 7161981 7388257 7586004 7861990
3745 7861990 8172198 8306438 8587068 8950750 9272702 9654178 10008607 10323712 10721510 11066780
3735 11066780 11545402 12014693 12534839 13282801 13964871 14671083 15321235 16028557 16798759
3726 16798759 17721784 18864427 20202784 21598739 23122358 24541986 25390564 25580215 25410240
3717 25410240 25494984 25714346 26327151 27357826 28710144 30309204 32376866 34934015 37765918
3708 37765918 40462732 42432405 43954892 44798432 45347405 45536101 45749467 45924591 45582948
3699D5582948q71022m88475L17157Q87122J616407K298410K927731K867181K250817
3690E7388276J347083N06132m97055j033540j069989j028283j413850j572215
3682E2626559j103007k62696M58461J220571J594035J488178Q17032Q14213Q95564
3673E8548910M50530l49912j361053k251176l058005l041355k126736j034399
3665D5776804m58341J31940Q87569R48906M52631L2281J56079q2646p65649j268494
3655D5811080j698139k216395k502265k383410j754232j510077j003618o28006
3647C2114938k71550n4403J10041K75745J17896m10954j409937j844706j904088
3638B6722982j708528j269688r04797o64277m99945n45422l63227k35629l40983
$$ plain form
3699 45582948 44711926 44223451 44540608 45427730 47044137 49342547 52270278 55137459 57388276
3690 57388276 58735359 59241491 58744436 57710896 56640907 55612624 54198774 52626559
3682 52626559 51523552 51260856 51719317 52939888 54533923 56022101 56839133 57653346 58548910
3673 58548910 58999440 58649528 57288475 55037299 51979294 48937939 46811203 45776804
3665 45776804 45318463 45450403 46337972 47286878 47739509 47771790 47927869 47845223 47079574 45811080
3655 45811080 44112941 41896546 39394281 37010871 35256639 33746562 32742944 32114938
3647 32114938 31843388 31788985 31899026 32174771 32292667 31881713 30471776 28627070 26722982
3638 26722982 25014454 23744766 22839969 22175692 21675747 21130325 20767098 20531469 20190486
3629B0190486l32211j14973k98286j21005j29292j6820j07314j45290j06800K916
3619A8821411O2115J9809J24754J11882L05914L56035K38837M01514L72913L32537
3609B1147721O02645O37757N95848O38346Q22449Q39162M50047P28015J022256
3600B7484246J190014J197281J168704J382265J316974R48898N82868M44916J91369
3591C5907535q63P0733o9073l5382J67206J08073K19660K56430N1906J19157J20559
3580C6915941M4329p1212n13359o10983l41746k55567j36219J63414n0254k29838
3570C4914506l63302p28357p20046r33520r70187p88923q21670o47995n90487
3561B8350019o61767m60852p94834p45346m89309k37031m17640l35574k99174
$$ plain form
3629 20190486 19858275 19743302 19445016 19324011 19194719 19177899 19070585 18925295 18818495 18821411
3619 18821411 18883526 18903335 19028089 19139971 19445885 19801920 20040757 20442271 20815184 21147721
3609 21147721 21750366 22388123 22983971 23622317 24444766 25283928 25733975 26461990 27484246
3600 27484246 28674260 29871541 31040245 32422510 33739484 34688382 35271250 35716166 35907535
3591 35907535 35906672 35977405 35908332 35872950 36040156 36148229 36367889 36624319 36676225 36795382 36915941
3580 36915941 36960270 36889058 36375699 35764716 35422970 35167403 35031184 35194598 35144344 34914506
3570 34914506 34551204 33822847 33102801 32169281 31199094 30410171 29588501 28940506 28350019
3561 28350019 27688252 27227400 26432566 25687220 25197911 24960880 24543240 24207666 23908492
3552B3908492r9998N2973j8341J66028O9827j8913j50799K3915J24073J84285
3542B4241542M62157N48803N30949N95432O79026Q12149Q64878R19641R22458
3533C0577035J183876J417925J624605J614091J983775K295567K445665K876236
3525D6018775K866143K756732K552532J996930J551806O80556K99264K64502L54237
3516E9341477N63854J091473J513193K018504K452456L320704M314021N198120
3508G9813802O022939O823571O807857M480737o41557m962573n461911m034377
3500H8848488l052662k429620j584312j247095q79848p81162m90578K9640P97783
3491G9210634J955395L347298M815519O369827P582877P861326N855477J897337
$$ plain form
3552 23908492 23808494 23861467 23843126 24009154 24078981 24060068 23909269 23933184 24057257 24241542
3542 24241542 24703699 25252502 25783451 26378883 27057909 27870058 28734936 29654577 30577035
3533 30577035 31760911 33178836 34803441 36417532 38401307 40696874 43142539 46018775
3525 46018775 48884918 51641650 54194182 56191112 57742918 58423474 58722738 58987240 59341477
3516 59341477 59905331 60996804 62509997 64528501 66980957 70301661 74615682 79813802
3508 79813802 85836741 92660312 99468169 103948906 103307349 98344776 92882865 88848488
3500 88848488 85795826 83366206 81781894 80534799 79654951 78873789 78383211 78412851 79210634
3491 79210634 81166029 84513327 89328846 95698673 103281550 111142876 116998353 118895690
3483A18895690j050832m190178q875194j0867291r413665p298017n320351m109269
3475F7770893k974670k556995k038117j355353q84903k01806M98498J138106K203785
3466F1599438L204491L889308L708731K387242j824424o493084p427358o158831
3458E2885513m538080l250580k368919j844129j592342j307297j209766j240535
3450C5533865j168457j115479j170140r68924q02907j158066q53514q07864o25785
3441B6862729o56462m62969n50719m98955m15318n92166o00606l40551n79872
3432B2165111j74425m094r6747N095P6712p944Q4138J282J0667j596m23510l66989
3420B1267700q0557o3817l0308M9116k9692J43540j29553k26038m29275k83483
$$ plain form
3483 118895690 117844858 113654680 104779486 93912195 84498530 77200513 71880162 67770893
3475 67770893 64796223 62239228 60201111 58845758 57960855 57759049 58257547 59395653 61599438
3466 61599438 64803929 68693237 72401968 74789210 72964786 66471702 59044344 52885513
3458 52885513 48347433 45096853 42727934 40883805 39291463 37984166 36774400 35533865
3450 35533865 34365408 33249929 32079789 31110865 30307958 29149892 28296378 27488514 26862729
3441 26862729 26206267 25743298 25192579 24693624 24278306 23686140 23085534 22744983 22165111
3432 22165111 21990686 21986592 21889845 21894940 21971652 21963708 22047846 22049128 22059795 22058199 21634689 21267700
3420 21267700 21187143 21123326 21093018 21142134 21112442 21255982 21126429 20900391 20471116 20187633
3410B0187633l27438k73415p1246J5668p0231j31166o3056n1537j38207M767J91957
3399A9273729N9543q8594q6613L4223r1557j46806R1372O2916J30306j33982j31831
3388A8972706k14178L6617l2367K39110J66497o8406l971P456R3385J6686O6637
3377A9280172j3866m9126r0086n4057j52526j12037M8138K26060m088R5459j4284
3366A9159759j7843K25235L26368L91167L90698K54438M88135L98349L08640K28433
3356B2153379O82802N33254O90383J197033J251606J115714J296829J559438J973152
3347C2453590J920209J918877J991871J383575P48211L92447K07534R7132P2455
3338D1185901p6270J01056L75267M24370M57854N65846P25765O91460Q18493P46328
$$ plain form
3410 20187633 19860195 19586780 19515534 19531202 19460971 19329805 19266749 19215212 19077005 19081772 19273729
3399 19273729 19333272 19244678 19158065 19192288 19100731 18953925 19045297 19108213 19238519 19104537 18972706
3388 18972706 18758528 18795145 18762778 19001888 19168385 19099979 19096008 19103464 19196849 19213535 19280172
3377 19280172 19266306 19217180 19127094 19073037 18920511 18808474 18856612 19082672 19078584 19174043 19159759
3366 19159759 19141916 19367151 19693519 20084686 20475384 20729822 21217957 21616306 21924946 22153379
3356 22153379 22836181 23369435 24059818 25256851 26508457 27624171 28921000 30480438 32453590
3347 32453590 34373799 36292676 38284547 39668122 40416333 40808780 41016314 41113446 41185901
3338 41185901 41109631 41210687 41585954 42010324 42468178 43034024 43759789 44451249 45269742 46016070
3328D6016070L64160J26337p0295l83822m34488k12784k98983j73876r3211r1964
3318D4747144k73398k18674o35221r02248j343466j514225j556757j725324j531912
3309C5045919j563221j479425j208478r78603p79770p33654o17660n11386l71318
3300B6802404k88816l39285p4401j75111j78367j87900n3304j36509j33633K19878
3290B5454956J56282J07686J24939K25241N749L83801M53881M78194N39610O31680
3280B8562019O07923O19555O73841P15314P80522J162854J146399J240445J344785
3271C6853657J016433Q39783O14423K79293Q5832k15391m23499m55783l87108
3262C8207640m49563n9527L3852q4506O4117O7649j36076P8762K62972L16683
$$ plain form
3328 46016070 46380230 46506567 46436272 46052450 45617962 45405178 45106195 44932319 44839108 44747144
3318 44747144 44473746 44255072 43619851 42717603 41374137 39859912 38303155 36577831 35045919
3309 35045919 33482698 32003273 30794795 29816192 29036422 28302768 27685108 27173722 26802404
3300 26802404 26513588 26174303 26099902 25924791 25746424 25558524 25505220 25368711 25235078 25454956
3290 25454956 25611238 25718924 25843863 26069104 26074853 26458654 26912535 27390729 27930339 28562019
3280 28562019 29169942 29789497 30463338 31178652 31959174 33122028 34268427 35508872 36853657
3271 36853657 37870090 38709873 39324296 39603589 39689421 39474030 39050531 38594748 38207640
3262 38207640 37758077 37698550 37732402 37647896 37712013 37779662 37643586 37722348 37985320 38302003
3252C8302003N30877M99998L98258K12998n7551j51008l16252l70608m32126l94355
3242C8222234o46953q33073p13811j063680j028671r58932o08305n81069o62189
3233C1125551n87438p34549o20442m53889j13184L3719M215O8755j18719j0312
3223B8593707J52117J47604L21850M15371M82224L60217M95000N02460M27492
3214C1898042N31888O10554O82235O24037Q00611O08921Q37457R10845J112145
3205C8616735J198621J272182J457866J455984J566143J879971J995246K440069
3197E1882817K671053L376547L511733L790033M531299N120479O078219O900567
3189H7862747P564208O106074J726507k743638m167335k741521j081881M84317
$$ plain form
3252 38302003 38832880 39332878 39731136 39944134 39886583 39735575 39419323 39048715 38616589 38222234
3242 38222234 37575281 36742208 36028397 34964717 33936046 32977114 32368809 31787740 31125551
3233 31125551 30538113 29803564 29183122 28729233 28616049 28649768 28653983 28722738 28604019 28593707
3223 28593707 28745824 28893428 29215278 29630649 30112873 30473090 30968090 31470550 31898042
3214 31898042 32429930 33040484 33722719 34346756 35147367 35756288 36593745 37504590 38616735
3205 38616735 39815356 41087538 42545404 44001388 45567531 47447502 49442748 51882817
3197 51882817 54553870 57930417 61442150 65232183 69763482 74883961 80962180 87862747
3189 87862747 95426955 101533029 103259536 100515898 96348563 93607042 92525161 93009478
3181I3009478J833525K874410M132840N384101O318996O170426L590839p61677
3173A22552938l451395k856223r22366J006758K679860M549690N854565N957874
3165A35371701L980836J50049k465233k133504m61586J387093L201931M831701
3157A43862988O100814P547212Q797457R766799R624301P468334N048381N563777
3149B03780063Q574833J2792044J7142050K2345303K7489985L3065919L8566572
3142C63756769M4142157M7290567M1326463J4793986q158193j0122184q019264
3135D85010301k2906175m7852862n3274641m4878806l4261087k6192337j9611042
3128B36033351j4960852j1329945r031350o945807m928486k817806q97235J451875
$$ plain form
3181 93009478 94843003 97717413 101850253 107234354 113553350 119723776 123314615 122552938
3173 122552938 119101543 116245320 115322954 116329712 119009572 123559262 129413827 135371701
3165 135371701 139352537 139502586 137037353 134903849 134442263 135829356 139031287 143862988
3157 143862988 149963802 157511014 166308471 176075270 185699571 193167905 198216286 203780063
3149 203780063 212354896 225146940 242288990 264634293 292124278 325190197 363756769
3142 363756769 407898926 455189493 496515956 511309942 503151749 493029565 485010301
3135 485010301 462104126 414251264 360976623 316097817 281836730 255644393 236033351
3128 236033351 221072499 209742554 200711204 193765397 188836911 186019105 185121870 186573745
3120A86573745L584564M757761M596398L123628J271496J088386K587202M160652
3112B11743832J818000k790760p181488r167462p857243n535649l756086j569467
3104A75703677P24470K786904M514786M935305J616217m783173j1441176j5189245
3096A58867765j4692141j2338849j0239207q311063o702411n860842n308384m702922
3088I0711946m305943l653058l028527k774376k464388k160341k033976j836292
3080F8455045j541210j378598r08270q84576p88840r37782r38755j006759j205821
3071E8864434j156980r26498j041291r60414p91265n17809n16238n64877l50793
3062E2038269k54446J4659k26061j89878j01269O8297K14898K69038O45961O08098
$$ plain form
3120 186573745 190158309 194916070 199512468 202636096 203907592 204995978 207583180 211743832
3112 211743832 213561832 210771072 203589584 194422122 186564879 181029230 177273144 175703677
3104 175703677 176428147 179215051 183729837 188665142 190281359 185498186 174057010 158867765
3096 158867765 144175624 131836775 121597568 113286505 106584094 100723252 95414868 90711946
3088 90711946 86406003 82752945 79724418 76950042 74485654 72325313 70291337 68455045
3080 68455045 66913835 65535237 64626967 63742391 62953551 62015769 61077014 60070255 58864434
3071 58864434 57707454 56780956 55739665 54779251 53987986 53470177 52953939 52389062 52038269
3062 52038269 51783823 51798482 51572421 51382543 51281274 51349571 51564469 51833507 52479468 53087566
3052E3087566R53232R18161J356613J708313J897058K799288L508620L498614
3044F9727465L199208J241019j015365j565154j023303j62912O24136J028846
3036G2053940J395109J778605K055155K538661K944058L636934L890593M304669
3028I4597724N255899O278340P617030R474403J1764206J4357866J7345658K1260091
3020A87951217K6023470L1749948L8900687M4498802M5055769L2631263j055607
3013D05755549l8024841n2034932m7181843l6939139k9013952k3156500j8800959
3006A60603383j6188327j4650341j3044143j0790145q940697p555181o461049
2999H2973500n504435m816956m546618m058673l469859l098468k592057k485733
$$ plain form
3052 53087566 54040798 54958959 56315572 58023885 59920943 62720231 66228851 69727465
3044 69727465 72926673 74167692 73152327 71587173 70563870 70400958 71025094 72053940
3036 72053940 73449049 75227654 77282809 79821470 82765528 86402462 90293055 94597724
3028 94597724 99853623 106131963 113748993 123223396 134987602 149345468 166691126 187951217
3020 187951217 213974687 245724635 284625322 329124124 374179893 406811156 405755549
3013 405755549 367730708 315695776 268513933 231574794 202560842 179404342 160603383
3006 160603383 144415056 129764715 116720572 105930427 96989730 89434549 82973500
2999 82973500 77469065 72652109 68105491 64046818 60576959 57478491 54886434 52400701
2991E2400701k466010k032599j924617j691898j593429j408456j433132j166489
2983C8684071j173587q41838r17027j132731j075024j088421r29085j004950q76925
2974B9644483p49733n99876n98462p01731p23813n26601n48311l18402j98060
2965B4679494r3934l07851k03693k38665l78119m14670l53002o74656p99360o53125
2955B0562419m67723n90974m82729k90223k72078j82808k59629n01699l42298
2946A7172258k74985m00894k10483k09487j42138j35833r7392j19265q7803j94293
2936A5299685j64506l8949j2417K23319j28944j10812J58661N8888R6525M83432
2926A5864882N13030O38556N97396M69948N09761O09820O33371P59369P25479
$$ plain form
2991 52400701 49934691 47902092 45977475 44285577 42692148 41283692 39850560 38684071
2983 38684071 37510484 36668646 35751619 34618888 33543864 32455443 31526358 30521408 29644483
2974 29644483 28894750 28294874 27696412 26994681 26270868 25744267 25195956 24877554 24679494
2965 24679494 24585560 24277709 24074016 23835351 23457232 23042562 22689560 22014904 21215544 20562419
2955 20562419 20094696 19503722 19020993 18730770 18458692 18275884 18016255 17514556 17172258
2946 17172258 16897273 16496379 16285896 16076409 15934271 15798438 15701046 15581781 15493978 15299685
2936 15299685 15135179 15096230 15083813 15307132 15178188 15067376 15226037 15284925 15381450 15864882
2926 15864882 16377912 17016468 17613864 18083812 18593573 19203393 19836764 20596133 21321612
2917B1321612M2411l45531j151301j336891j221932j096979j049215p10442o73361
2908A3778371o68082n96714o08045j92397l35801k73921j72166Q0942k56804k04068
2898A0551315j97210k865j53852j24388N7557N1446j9716R0089J67856L32765
2888A0752997L20978O15258M90533L37572O29791L92266j76855n98956m65941
2879A2297643p47841p85824n73204n35584l89149k28462j48521j75845j23914
2870H589299K8121J0004k10241m792j73371P0751J46537J51562K16337J82498
2860I006705J43838J47429L75660M22998N45331Q08361P79883K88536K47772k68687
2850A2497826o74155p10054o32776n21005k76799k15588j96413m65540j30778
$$ plain form
2917 21321612 21364023 21018492 19867191 18530300 17308368 16211389 15162174 14451732 13778371
2908 13778371 13110289 12513575 11905530 11713133 11377332 11103411 10931245 11012187 10755383 10551315
2898 10551315 10354105 10351240 10197388 10073000 10130557 10182003 10162287 10252376 10420232 10752997
2888 10752997 11073975 11689233 12179766 12517338 13147129 13539395 13362540 12763584 12297643
2879 12297643 11549802 10763978 10190774 9655190 9266041 9037579 8889058 8713213 8589299
2870 8589299 8617420 8627424 8417183 8412391 8239020 8309771 8456308 8607870 8824207 9006705
2860 9006705 9150543 9297972 9673632 10096630 10641961 11450322 12230205 12518741 12766513 12497826
2850 12497826 11823671 11113617 10480841 9959836 9683037 9467449 9271036 8805496 8674718
2841H674718N718P38J89554n2020k9812O3609m9884l6418J67436M04170M72878
2830I810687L59302N70068O83533O94669Q39630O94831O12527J45265m02957r26674
2820A3080881j021915r78562p37190n20589m29697k79664j45053l77644l08901
2811H281666m58105j89210n3918j0025q0072k27533P4743j67199k02813q1015
2801F886519Q7480Q2953M1542J24478J0775J49435J59526R9104R7096K02407K88083
2790H229398K66491K76212K43498J91304N08478O45098Q52700J076517J291599
2781A3581295J336365J847208K483436K821064K700113J759880j082522l159948
2773B2286891l112991k460656j868237j342838o47800m60079n50575q19211r36786
$$ plain form
2841 8674718 8680436 8681174 8870728 8818708 8788896 8852505 8802621 8766203 8933639 9337809 9810687
2830 9810687 10169989 10740057 11423590 12118259 12957889 13652720 14265247 14410512 14007555 13080881
2820 13080881 12058966 11080404 10343214 9822625 9392928 9113264 8968211 8590567 8281666
2811 8281666 7823561 7634351 7580433 7570408 7490336 7262803 7337546 7170347 6967534 6886519
2801 6886519 6973999 7056952 7098494 7222972 7233747 7383182 7542708 7641812 7738908 7941315 8229398
2790 8229398 8495889 8772101 9015599 9206903 9715381 10360479 11213179 12289696 13581295
2781 13581295 14917660 16764868 19248304 22069368 24769481 26529361 25446839 22286891
2773 22286891 19173900 16713244 14845007 13502169 12854369 12394290 11843715 11024504 10087718
2764A0087718r41228m98756l96703m64573l99978k82465l36685j29194l41148
2755F296988l13595j50542j41279K744J0405O0818o1293R1068O7449m6311n4239
2744E762213j72795k26111j64326j32281l78374j54289j26962n3320N0197q8289
2734D315663k07576n1772J2609j248k4076L977J09600J85004j345J33008K41057
2723D714901J14712r9000k58231l54674l4039n0382n5405q4415N8191N7182M4090
2712D052930j70034J7697K47365J81550J58544K02310K28472m1315m3326j38743
2702D695450M9853o7560k31261j83169l73302m01035k09329l4672j08319k42513
2692B894143j52402k32380p3497j70208j42948K2666j94972r2949l8853j43382
$$ plain form
2764 10087718 9146490 8647734 8251031 7786458 7386480 7104015 6767330 6638136 6296988
2755 6296988 5983393 5832851 5691572 5694316 5704721 5765539 5704246 5795314 5862763 5816452 5762213
2744 5762213 5589418 5363307 5198981 5066700 4688326 4534037 4407075 4353755 4403952 4315663
2734 4315663 4108087 4056315 4068924 4067676 4043600 4047577 4157177 4342181 4340836 4473844 4714901
2723 4714901 4829613 4730613 4472382 4117708 4083669 4033287 3977882 3893467 3951658 4008840 4052930
2712 4052930 3882896 3900593 4147958 4329508 4488052 4690362 4918834 4877519 4834193 4695450
2702 4695450 4745303 4677743 4446482 4263313 3890011 3488976 3279647 3244975 3136656 2894143
2692 2894143 2741741 2509361 2435864 2265656 2122708 2145374 1950402 1857453 1818600 1675218
2682A675218j14144M0635O7674M7796R1543N7733l342K012J1559n6511p0512j08167
2670A641494k68284n5565J39837j16877l303J77246n1702j99343j34262M8769
2660A178010m6340n7913L786p7838Q5942P5381J01134j9763J04223k5012r4675
2649A226935j06501N3379o0644o1852J09688j45559j541o5591l5004K058j04683
2638H10685l4852l4483l3375p478l7083L0664P493o8468l4461j02219J26256J11811
2626G34490O6135q1562l805K31607m0317j44581p1097N3474l800j46349j89254
2615D04941M4717N121r4616O7451J14177N8407j72397J37J47084Q5160k9517P1775
2603G02440j37320n4741J49709K5270k052j16065O2864l2293K308k7901r0945
$$ plain form
2682 1675218 1561074 1601709 1669383 1717179 1808722 1866455 1863113 1865125 1876684 1820173 1749661 1641494
2670 1641494 1373210 1317645 1457482 1340605 1337302 1514548 1462846 1263503 1129241 1178010
2660 1178010 1131670 1073757 1077543 999705 1085647 1161028 1262162 1242399 1346622 1321610 1226935
2649 1226935 1120434 1173813 1113169 1051317 1161005 1015446 1013905 948314 913310 915368 810685
2638 810685 775833 741350 707975 700497 663414 694078 701571 633103 598642 496423 622679 734490
2626 734490 800625 719063 715258 946865 906548 761967 690870 744344 740544 594195 404941
2615 404941 449658 454779 360163 427614 541791 600198 427801 427938 575022 660182 630665 702440
2603 702440 565120 510379 660088 685358 683306 567241 630105 597812 600120 572219 481274
2592D81274m3478J75353j8875Q717Q1042r8683K3963L9916k2023j03604M4190
2581E67792J29928J08009l1763L6814L1768p1835j60525M0859P1963R3600R9216
2570I15826P115J3971j15504j50662j4732L8207j42771K9112Q2910k4390J32251
2559G71333n6929k870J51467M1858r1262j08672p8226j02284L6210O1975q7781
2548E34819J07707j43735N7417O0062J2701m3727R3414R8226k8667P0279l7443
2537G81053n5460k9173o1639J02066j2096j50191r9619j95685P1467J29865L2493
2526E13081J67791L2845o8311O9421K7462K9729j08143j17836o8354J36700j3242
2515F01143n8651r9973K36745j04161P3806P2260M0987m2387o552N8681o1757
$$ plain form
2592 481274 437796 613149 594274 602991 684033 585350 609313 649229 627206 523602 567792
2581 567792 697720 805729 773966 810780 842548 770713 610188 651047 723010 816610 915826
2570 915826 922941 936912 821408 670746 656014 694221 551450 580562 663472 639082 771333
2559 771333 714404 711534 863001 904859 813597 704925 626699 524415 560625 622600 534819
2548 534819 642526 498791 556208 616270 628971 585244 678658 776884 748217 818496 781053
2537 781053 725593 696420 634781 736847 724751 574560 474941 279256 350723 480588 513081
2526 513081 680872 713717 645406 714827 742289 772018 663875 546039 477685 614385 601143
2515 601143 542492 442519 679264 575103 648909 721169 762156 719769 713217 771898 710141
2504G10141r1814j66003j57526O7139J95411J6992R3981j20040R7408n3315p8054
2493E14320n4966o3728r8354L0226R6759m1141j22717n2041J1562j66032O9868
2482A23756J64127K5872k6622M0571j23119J20608O2124L4088p3872J5053J7528
2471C80114j56237r9568r1764J87961J13377p9004k5903J2867P792O0711o1070
2460B49276k9529N8096Q7046j3826P5984k2765q4079R1469Q5336l4822r1412J39969
2448E10743J84290M6369j49684M6181j57216j87905j5366k1598l8468k0341O178
2437B03183J3106r5813N2679L2100k1918J30203n3684m5297m6126N7698Q347l2727
2425B01751k9378L0629P0906K1188j75489J8258J48053q23l2811J7460J6040n4737
$$ plain form
2504 710141 618327 452324 294798 361937 557348 574340 668321 548281 645689 592374 514320
2493 514320 459354 395626 297272 327498 424257 383116 260399 208358 219920 53888 123756
2482 123756 287883 313755 287133 327704 204585 325193 387317 421405 347533 362586 380114
2471 380114 223877 124309 32545 220506 333883 254879 228976 241843 249635 310346 249276
2460 249276 219747 277843 364889 351063 427047 404282 320203 411672 497008 462186 370774 510743
2448 510743 695033 741402 591718 637899 480683 292778 277412 255814 217346 197005 203183
2437 203183 216289 120476 173155 205255 183337 313540 259856 214559 168433 226131 234478 201751
2425 201751 172373 203002 273908 295096 119607 137865 285918 285095 252284 269744 285784 231047
2413B31047m9022P6404j50209J9638J78305j0801m3754R5734m411q631J0588j29197
2401B15691O834J70403j14978j37987l3920l2514p6610r3543P0064R4277J87562
2390B55279j10346n5990l8996J6829o498L2415O9552j2939O5694j08109k9352
2379G7539k4209K001K02256J7149j93167j58411L4513P6968l7590P6811j15886
2368d2026M8096P926Q5502j15074J35430J58502j5613m2763j15143K24594j19613
2357B09818j11411O1042q2049M3214N3111Q7616P0635p0470j57107N2015r7062
2346E9352K4367p014j42737R198n3213O7019P0257J848j727J55633p5044L7623
2334A45562k5928M8536J04765M8161K5226p9091M405r0573N0839q3378r1354J57609
$$ plain form
2413 231047 182025 258429 108220 127858 306163 295362 251608 347342 342931 334300 344888 215691
2401 215691 222525 392928 277950 139963 106043 73529 -3081 -96624 -26560 67717 255279
2390 255279 144933 88943 49947 66776 60278 92693 162245 149306 215000 106891 77539
2379 77539 53330 55331 257587 274736 81569 -76842 -42329 34639 -2951 73860 -42026
2368 -42026 6070 13996 99498 -15576 119854 278356 262743 219980 104837 329431 209818
2357 209818 98407 159449 77400 120614 173725 261341 331976 261506 104399 156414 59352
2346 59352 83719 76705 -66032 -56834 -110047 -43028 27229 29077 27350 182983 107939 145562
2334 145562 119634 168170 272935 321096 346322 267231 271636 181063 231902 148524 57170 214779
2322B14779P6212j01465M1865n4905n980K6826J51629M7379q1677j9748j71370
2311A23545Q5508P2975j6592K6735R4931p9057j24267J8110J32151M9963m8114
2300C35888O2345N5148M5291p6384j86460P2326q3232j31163R0781J47422K1227
2289C53189P3511J7386Q249k6853O6281J52700o6829q0105M2785J7408K3853m5566
2277E36009j34923j61323k2538J45097Q6132j38908k2400J8740m4706r2247J07831
2266B76764K0692J54090J30000p7691n7393j34939L45K90519Q7421J31116j81183
2255F39741j69246l1426O6560Q6607Q3121K29243p6727j88548Q8495K4692n1911
2244G00601j39712Q6768J63534K2572J70213j1606j28006m8029J27006o7987J22090
$$ plain form
2322 214779 290991 189526 231391 176486 170506 197332 348961 396340 314663 294915 123545
2311 123545 209053 282028 265436 292171 387102 308045 183778 201888 334039 384002 335888
2300 335888 398233 453381 498672 422288 235828 308154 224922 93759 184540 331962 353189
2289 353189 426700 444086 452335 425482 491763 644463 577634 497529 540314 557722 581575 536009
2277 536009 401086 239763 217225 362322 448454 309546 287146 305886 261180 168933 276764
2266 276764 297456 451546 581546 503855 446462 311523 311868 602387 689808 820924 639741
2255 639741 470495 439069 505629 592236 675357 904600 827873 639325 727820 752512 700601
2244 700601 560889 647657 811191 833763 1003976 992370 864364 816335 943341 875354 997444
2233I97444K06638L5186p1856m7641P474M9663P7366K15637L0308J8250m9873
2222A468596n1313m0685K4920J65973J37299R913L4238o1915j64890o9900K38266
2211A690502K23433K60332J26751j06985p7747J5207o4510R9815M5216J18581
2201B330595l2576J9046k3394k4133k6836o9217K8894K42496K27924J53102P9894
2190B905795r9911O2862J23590O1250J46394J48669K60688K12326k1275M4318
2180C844706J44560M76915J70408K74191K25693J64485K25964J81538L04045J43839
2170F156344K77341L00765M12090M49023N09695N35010O89766P06752Q47354J070871
2160A1955011J039455R77467J096777R68642O34690K8421j001471j398503j449609
$$ plain form
2233 997444 1204082 1239268 1167412 1119771 1127245 1176908 1254274 1469911 1500219 1518469 1468596
2222 1468596 1417283 1376598 1401518 1567491 1704790 1714703 1748941 1687026 1522136 1452236 1690502
2211 1690502 1913935 2174267 2301018 2194033 2116286 2131493 2066983 2166798 2212014 2330595
2201 2330595 2298019 2317065 2293671 2269538 2242702 2173485 2202379 2444875 2672799 2825901 2905795
2190 2905795 2805884 2868746 2992336 3053586 3199980 3348649 3609337 3821663 3800388 3844706
2180 3844706 3989266 4466181 4636589 4910780 5136473 5300958 5526922 5708460 6012505 6156344
2170 6156344 6433685 6734450 7146540 7595563 8105258 8640268 9330034 10036786 10884140 11955011
2160 11955011 12994466 13971933 15068710 16037352 16672042 16700463 15698992 14300489 12850880
2151A2850880j219318j229828q08412p28519p32035n63544m70196k31592l94602
2142F472834l73164l19069l32522l86287j87625r8545k11114k81729l27583k16184
2132C739012j45356j82938j51564k094j82794k8064m8747j24243n5660r2240Q7926
2121B813238j4897j06566l895o9701j37742k09915J18045K30100K06770l6509
2111B788928j04240P3516o0464j34478j13448k20553j76273k40800j49127k0226
2101A642835r1762K3745n1781Q989K2608p7631J3828Q9680J29713o8777j24605
2090A516842N8038K38829j35711j17165p1958j35274J09572J22451J27333j39030
2080A573927Q601J72109J97549J54795J94317L00612J1081m51552k65971j47497
$$ plain form
2151 12850880 11631562 10401734 9593322 8864803 8132768 7569224 7099028 6867436 6472834
2142 6472834 6099670 5780601 5448079 5061792 4874167 4775622 4564508 4282779 3955196 3739012
2132 3739012 3593656 3410718 3259154 3257060 3074266 3046202 2997455 2873212 2817552 2725312 2813238
2121 2813238 2798341 2691775 2687880 2618179 2480437 2270522 2388567 2618667 2825437 2788928
2111 2788928 2684688 2758204 2697740 2563262 2449814 2229261 2052988 1812188 1663061 1642835
2101 1642835 1551073 1574818 1523037 1532026 1554634 1477003 1490831 1580511 1710224 1641447 1516842
2090 1516842 1574880 1813709 1677998 1560833 1488875 1353601 1463173 1585624 1712957 1573927
2080 1573927 1582528 1754637 1952186 2106981 2301298 2601910 2612991 2161439 1895468 1747971
2070A747971j83720n5323l18654n6831L0195J05958q3327l7840L8390q6699n5266
2059A044854k4196O6650j41722l9100o0622l6112o1494j32766R3279J01479m4659
2048G65591J8798P9699K66339K6866l7269J1318O2559J74029m0040j06690q3424
2037A137776j57807q9293N3055j44977j01166o9236J0669j82746j95103j8172
2027B43000j9590q6864J1839K51623l2225r9135q5440n652L0939J78092J21540
2016E08127j77209J40751K8268r6601O6564p1248M3792j22976N954l3904j39289
2005A52229j48292R5603l9958J827K0119J0214J8269j44968J92167M834j1916
1994A50128J37779P0009K2137j225l2129j10180J4076P9139M3292j23474j56744
$$ plain form
2070 1747971 1564251 1508928 1190274 1133443 1163638 1269596 1186269 1148429 1186819 1100120 1044854
2059 1044854 1020658 1087308 945586 906486 845864 809752 748258 615492 708771 810250 765591
2048 765591 784389 864088 1130427 1157293 1120024 1131342 1193901 1367930 1327890 1221200 1137776
2037 1137776 979969 890676 943731 798754 697588 628352 639021 456275 261172 243000
2027 243000 223410 136546 148385 400008 367783 268648 183208 177556 208495 386587 508127
2016 508127 330918 471669 499937 403336 469900 398652 442444 319468 325422 291518 152229
2005 152229 3937 99540 59582 61409 81528 91742 110011 -34957 157210 162044 150128
1994 150128 287907 357916 380053 378828 346699 236519 250595 329734 373026 249552 92808
1983I2808L525K8937q2877M3266j8603j7957L1909n3411K4639j36430j02926R8573
1971h8547J43144P1021J17495J7244r5324l7394n0472P5718n5116r3960Q7843
1960I1652k9957q4072j42440R8319K3386j33247M6917O6755J661n4588Q4915K2008
1948h691M0496J10523n3570L4953K4589J3000p7615j17045J8620P1048m3084o3660
1936e0436k5412P0356n9350o0978m7204j08079J32687J30035O0290j59108P2705
1925d4494n3649j32558o7098J28349J98588L0897N4763m086o5260k03190J52579
1914e159K34607P297p2571p5969j68552j31712q966J51548n0829J21889l5477
1903c3894j05551R0965j32041O2350K16329n1583N7518p4383r6540N2654L579
$$ plain form
1983 92808 96333 125270 42393 85659 67056 49099 81008 27597 52236 -84194 -187120 -88547
1971 -88547 54597 125618 243113 260357 165033 127639 77167 152885 97769 3809 91652
1960 91652 61695 -22377 -164817 -66498 -43112 -176359 -129442 -62687 -61026 -115614 -30699 -8691
1948 -8691 31805 142328 88758 123711 148300 161300 83685 -33360 -14740 56308 13224 -50436
1936 -50436 -75848 -5492 -64842 -125820 -173024 -281103 -148416 -18381 41909 -117199 -44494
1925 -44494 -98143 -230701 -297799 -169450 29138 60035 114798 110712 45452 -157738 -5159
1914 -5159 229448 236745 164174 88205 -80347 -212059 -221025 -69477 -120306 1583 -33894
1903 -33894 -139445 -48480 -180521 -118171 98158 46575 104093 29710 -66830 -14176 -10597
1892a0597l4893o5024q2313J79099K73309m4440k42201o6600m3763R0335J41786
1881I4698p6205J71138R9710o6174j86580j34309K03533J08478j75498J42911
1871A81702J45405j92148j16914q5405l6808K05221J59414K7113j50457N054n184
1860A36993j18192N7158L4010P1190j32987m0N9743J1158J29217n0682Q5392m7591
1848B35369K5378r2828m1368l0187M691K14907Q1777K0042J5489p1085q0364R73
1836B82794J28476o4644J27980J52487j15901p0316J06548J21033Q5492K200l5193
1825G20956m9435m3793J04318m7762k7204o0578N0340R3502J84831j9697l1513
1814H73965K9602j52806L0133R5101K01081J5872q2479K7119n9703O2951P6259
$$ plain form
1892 -10597 -45490 -110514 -192827 -13728 259581 215141 -27060 -93660 -137423 -47088 94698
1881 94698 18493 189631 289341 223167 36587 -97722 105811 214289 38791 181702
1871 181702 327107 134959 18045 -67360 -104168 101053 260467 287580 137123 142177 136993
1860 136993 18801 75959 109969 181159 48172 48132 107875 119033 248250 197568 282960 235369
1848 235369 260747 167919 126551 96364 101055 315962 397739 417781 433270 362185 281821 282794
1836 282794 411270 346626 474606 627093 511192 440876 547424 668457 753949 756149 720956
1825 720956 671521 627728 732046 684284 657080 596502 646842 740344 925175 905478 873965
1814 873965 903567 750761 780894 875995 1077076 1092948 1010469 1037588 977885 1040836 1117095
1803A117095j49885q8100j8705M2762J67749J7042p8853K2940J86800J16406r9700
1792A235551p9165K24865k1787j4498L2435P3114N1060q7784j47118q4424j17686
1781A064563q2022L1038j88041J01304l6395j1057N5293l3446M1731l8813L8718
1770I42873k5095K5091n2637K9908J37787M1484J08523N7277o2389j38231j11808
1759I52783p1542O0221N7102J3685m1512j11766n370Q3617r6035L9041j44392
1748G35832p4745J69942l4867M9007j67458l5404K2210m0480J08253P0693j26745
1737F76238j26481o4472j5234J14762k5619l8382k304j85372j39445k2413K2868
1726A94146j17982K4997q701K5054J43827l6509n195j46185J01719k1556P8008
$$ plain form
1803 1117095 967210 879110 860405 903167 1070916 1087958 1009105 1032045 1218845 1335251 1235551
1792 1235551 1156386 1381251 1359464 1344966 1377401 1450515 1501575 1413791 1266673 1182249 1064563
1781 1064563 982541 1013579 825538 926842 890447 879390 934683 901237 942968 904155 942873
1770 942873 917778 942869 890232 920140 1057927 1099411 1207934 1265211 1202822 1064591 952783
1759 952783 881241 941462 998564 1012249 970737 858971 853601 937218 841183 880224 735832
1748 735832 661087 831029 796162 845169 677711 642307 664517 624037 732290 802983 676238
1737 676238 549757 485285 470051 584813 559194 520812 518508 333136 193691 171278 194146
1726 194146 76164 101161 92460 117514 261341 224832 219637 73452 175171 153615 231623
1715B31623R7434j52974L1351q5682m9001M1534o7748R5363M8516n1283p5941
1704F3192j16063L1516L527o0899j9220K4902n4399l678j48047m8853J52073J34285
1692d1664J33827o6284j71329r7629L7600K9449J25658J30512j6669n9652o8631
1681f4812O4037j22072j12882L8915l8548N6911K2953o9401J26012J19678l2562
1670a1771k4161n8110K5238p773k02031j36500L0160J39152J58795l5038m8869
1659a70908o5189o1590J11203R3473q4788k9068J48211M3174n7827j14345p205
1648a94859J1687P0054R0851l8221o5311K00140q3845J4441m4328j54580M281
1637a89690O1026O3863j94662j2068J05483n4676o3452R3539P3994P928n2291
$$ plain form
1715 231623 329057 176083 207434 121752 72751 114285 46537 141900 190416 139133 63192
1704 63192 -52871 -21355 -17828 -78727 -97947 -73045 -127444 -131122 -279169 -328022 -175949 -41664
1692 -41664 92163 25879 -145450 -243079 -205479 -176030 -50372 80140 63471 3819 -64812
1681 -64812 -775 -122847 -235729 -196814 -235362 -178451 -155498 -224899 -98887 20791 -11771
1670 -11771 -35932 -94042 -68804 -76577 -278608 -415108 -384948 -245796 -87001 -122039 -170908
1659 -170908 -236097 -297687 -186484 -93011 -177799 -206867 -58656 -15482 -73309 -187654 -194859
1648 -194859 -183172 -113118 -22267 -60488 -125799 74341 -9504 4937 -39391 -193971 -189690
1637 -189690 -128664 -64801 -259463 -271531 -166048 -220724 -284176 -190637 -116643 -108715 -161006
1626a61006N0386J0735q3830o4834J01028k5158p946o1423j18713r5844J98473
1615b58132J41363Q5539j45339j45180J02514m6613l5554p345m471l9714j0734
1604c63666N8834n6484m1655j3510K11642k7402P4158Q7423j044m9189j55571
1593b76464J03932L3006N2234o2998j8439j6889q6014j01127K7051N7895R7138
1582a90675p5548M6093J38208q3695k14255P0854L9698M212J02859O7538j39848
1571b34559L6362o0103n0486K1079L2983J91639k00091P4695N5961n9448r0225
1560b82193M8275L1179J4277q3394r9887l9856k3670R1912M0029L3880l3192O0406
1548b42234k6828J04367J6409n7412J06316J05798K7187j04684N5555M7897j35045
$$ plain form
1626 -161006 -110620 -99885 -183715 -248549 -147521 -172679 -180625 -242048 -360761 -456605 -258132
1615 -258132 -116769 -31230 -176569 -321749 -219235 -265848 -301402 -308747 -313218 -352932 -363666
1604 -363666 -304832 -361316 -402971 -416481 -204839 -232241 -158083 -70660 -71704 -120893 -276464
1593 -276464 -172532 -139526 -87292 -150290 -168729 -185618 -271632 -372759 -345708 -287813 -190675
1582 -190675 -266223 -220130 -81922 -165617 -379872 -309018 -269320 -265108 -162249 -94711 -234559
1571 -234559 -198197 -258300 -308786 -287707 -254724 -63085 -263176 -188481 -132520 -191968 -282193
1560 -282193 -233918 -202739 -188462 -271856 -371743 -411599 -435269 -343357 -303328 -269448 -302640 -242234
1548 -242234 -269062 -164695 -148286 -205698 -99382 6416 33603 -71081 -15526 32371 -102674
1537a02674j53673J0846l0388L2305O6799o3435j73255l1023Q9023l3099J77635
1526b10939k8667l5678M2535J17327J46213o8424m3234J07304J7842p3085n8737
1515h7543j63820r3598M4529k6918L3774n7944M1394k17352O4535J14383j3162
1504c61722J2833j01941J54909J6818J22603q8156j18956L0453J29928P7350j2292
1493a38173M7520J4490j92600o7038P5463j3483J8625P9089J4549J6166L2429
1482a12963p527l1288j36002J21619q1761o7651J12344O6422J035k2175J8030
1471a39917q7373J15466P9800l2310j55837n5833O2926J53939j35438m9559R8121
1460a46015k38569N243J32335k5241o1191r5289J25218R3225j8084K4016j22591
$$ plain form
1537 -102674 -256347 -245501 -275889 -243584 -176785 -240220 -413475 -444498 -355475 -388574 -210939
1526 -210939 -239606 -275284 -232749 -115422 30791 -37633 -80867 26437 44279 -28806 -87543
1515 -87543 -251363 -344961 -300432 -327350 -293576 -351520 -310126 -527478 -462943 -348560 -361722
1504 -361722 -348889 -450830 -295921 -279103 -156500 -244656 -363612 -333159 -203231 -125881 -138173
1493 -138173 -90653 -76163 -268763 -335801 -260338 -273821 -255196 -176107 -161558 -145392 -112963
1482 -112963 -120490 -151778 -287780 -166161 -247922 -315573 -203229 -136807 -135772 -157947 -139917
1471 -139917 -227290 -111824 -32024 -64334 -220171 -276004 -213078 -59139 -194577 -244136 -146015
1460 -146015 -384584 -379341 -247006 -272247 -333438 -428727 -303509 -210284 -228368 -204352 -326943
1449c26943l9079R4619k933O7361J9119j00830q2284j6890O2898l2906Q5744j1430
1437b83554J5651J09411O9012n3712j08720q2189J86725J27039l8450r9006j25017
1426b82810l8561l300Q8366L4213J16592q3118n0626p1770J6373M6940l1464m79
1414b59644k7793J24460p9258j8186J6957p1687p3985K2317J33787O6255J52646
1403a4131k00090j4422n5633l3421R5645J92522O4416p3216j28079j2636m4630
1392b23675q3974J00226J1527Q266j22766k5430R0581l1135j62202J62015J4148
1381b62419n334R8139j956r5674m2368r506J45861J38349O8470p789j48658j50670
1369b73555j5829j45428m139L47981N313r8210o8302k02509j1289K5881J35548
$$ plain form
1449 -326943 -366022 -271403 -274336 -206975 -187856 -288686 -370970 -387860 -324962 -357868 -272124 -283554
1437 -283554 -267903 -158492 -89480 -143192 -251912 -334101 -147376 -20337 -58787 -157793 -282810
1426 -282810 -321371 -324671 -236305 -202092 -85500 -168618 -219244 -291014 -274641 -227701 -259165 -259644
1414 -259644 -287437 -162977 -242235 -260421 -243464 -315151 -389136 -366819 -233032 -166777 -14131
1403 -14131 -214221 -228643 -284276 -317697 -222052 -29530 34886 -38330 -166409 -179045 -223675
1392 -223675 -307649 -207423 -195896 -187630 -310396 -335826 -245245 -276380 -438582 -276567 -262419
1381 -262419 -267753 -169614 -171570 -267244 -309612 -319118 -173257 -34908 33562 25773 -122885 -273555
1369 -273555 -289384 -434812 -438951 -90970 -85657 -183867 -252169 -454678 -465967 -440086 -304538
1358c04538K22143j30017J5338Q7631L195j4876q2285N7305N2302M5277k8380
1347g6905L0450n9066j38248k4549o899M0628K5620K3899j0432m6238j86381K9440
1335c98681J48811J97587l9751k37655R7421J2256K6280J9870n2437J08644Q133
1324a09522j5763r333J631N6708N1759j47795j26372n699P9721k1199l8575j49008
1312d33447K3216J05432P0641K15766m2859n2864l196L4551j77438j65768R7278
1301c28688L3903J54531N6962j01780O9522N2245L8178N613J12941m4046k4755
1290B4626k00879r8473P880M1521J04608K9643J19346j28021k65500j42278P9720
1279d27807K36397k8004O2675J7304j74865J71273N255j00645O5084M2718J21337
$$ plain form
1358 -304538 -82395 -212412 -197074 -109443 -106248 -121124 -203409 -146104 -93802 -48525 -76905
1347 -76905 -46455 -105521 -243769 -268318 -275217 -234589 -208969 -185070 -195502 -241740 -428121 -398681
1335 -398681 -249870 -52283 -92034 -329689 -232268 -220012 -193732 -173862 -226299 -117655 -109522
1324 -109522 -125285 -134618 -132987 -76279 -24520 -172315 -298687 -304386 -224665 -245864 -284439 -433447
1312 -433447 -410231 -304799 -234158 -18392 -61251 -114115 -117311 -82760 -260198 -425966 -328688
1301 -328688 -294785 -140254 -83292 -185072 -115550 -63305 -25127 -19514 93427 49381 24626
1290 24626 -176253 -274726 -266846 -225325 -120717 -91074 28272 -99749 -365249 -507527 -427807
1279 -427807 -191410 -219414 -156739 -139435 -314300 -143027 -137772 -238417 -173333 -130615 -9278
1268i278m2849j11047l2780J50980P8097n251j64127q105k7310N6793n0690j64866
1256c30433J37895J50865j03694j19337L9239k8981O8812Q2988J09721O4031q4181
1245a3075o8348J0240m2318k7107o5153R1670J00160Q83M6934k7178j51122K6120
1233a18294o035K3620R9779J10035m2762j5047J02347R5776o8631L0342O876l4699
1221A83307r4362j39717L5809J98166j17328j6252J01912j43181m7803m0212J13817
1210C4156j04393q7204R4128m5614k8029J06215r4160j62891J74465J11283Q7335
1199H5291j8099k2406p6527j4417k9658K5173O459j42529R0407P7339n8546k1062
1187i8575q8466N147k2505P5685J64229N7370j68154Q2954r7735j12122l130P0397
$$ plain form
1268 -9278 -52127 -163174 -195954 -44974 33123 27872 -136255 -144360 -171670 -114877 -165567 -330433
1256 -330433 -192538 -41673 -145367 -264704 -225465 -254446 -185634 -102646 7075 71106 -13075
1245 -13075 -81423 -71183 -113501 -140608 -205761 -114091 -13931 -13048 33886 6708 -144414 -118294
1233 -118294 -124329 -100709 -930 109105 66343 51296 153643 249419 180788 211130 218006 183307
1221 183307 88945 -50772 -14963 183203 65875 49623 151535 8354 -39449 -79661 34156
1210 34156 -70237 -157441 -63313 -108927 -136956 -30741 -124901 -287792 -113327 -2044 85291
1199 85291 67192 44786 -31741 -46158 -75816 -50643 -44184 -186713 -96306 -18967 -77513 -98575
1187 -98575 -187041 -181894 -204399 -128714 35515 92885 -75269 7685 -90050 -202172 -205302 -134905
1175a34905J16038k5626M0412N702j1531o6089q3943o362J53363k4213j4166j31063
1163a82383q9875K0812O8817k4550J21741J40990l3908o4734J6100n3666K6196
1152e4460P8746k7995o4256n7784o5062k1555l7549J15838J24035m3160m8383
1141a01585j9302o1556P6410j13411J96988J41579p4010L2528r7527m3480O4616
1130A250r4107P4947O3926q7203m366J8798p0688N9019N295k3131J2442k6014
1118f9832n169M9288l4111R4133O4919k2896J7260L5684j31460p7855k8521p931
1106a16491J30064L2445m3598o9285M3506K5919j43612q977K62623l2783l828
1095G5983j25984J35721n4689n460j1376J63636j1020q6585J6649k8716M5915
$$ plain form
1175 -134905 -18867 -44493 -4081 1621 -9910 -75999 -159942 -166304 -12941 -37154 -51320 -182383
1163 -182383 -272258 -251446 -182629 -207179 -85438 55552 21644 -43090 -26990 -80656 -54460
1152 -54460 24286 -3709 -67965 -125749 -190811 -212366 -249915 -134077 -10042 -53202 -101585
1141 -101585 -120887 -182443 -106033 -219444 -22456 119123 45113 77641 -19886 -63366 1250
1130 1250 -92857 -17910 46016 -41187 -45553 -26755 -97443 -38424 -33129 -56260 -43818 -69832
1118 -69832 -75001 -25713 -59824 34309 99228 76332 93592 129276 -2184 -80039 -108560 -116491
1106 -116491 13573 46018 2420 -66865 -23359 2560 -141052 -150029 112594 79811 75983
1095 75983 -50001 85720 31031 25571 14195 177831 166811 80226 96875 68159 114074
1084A14074J80329q6490q0934Q3759J7815k00183p7829k8952R9803O6849K9737
1073A17978P7183M3562O1620r6134J9881R803L6497J53880k9448j57584Q1679
1062C18917P410q9747j21679k2408J79901J04488p0988j52379k82253R0690l7798
1051g5846J38053R0825J75330Q2606K487Q77J1641P598n5102N6023R1980l890
1039E22582n2720N9152m8339M2280L6996K1813L3878L0488K3553p5282J7770q2175
1027E29996J26860l5532K5015R6661K1155q7500j04868J00629P8192r0338R4848
1016G55118J81251m1616k3224k4205j110K11186N2406j8728P0855n5169M384q5141
1004A026007n9050J78423J71400j11428K32367j56716j31101P4925K379p8465
$$ plain form
1084 114074 294403 207913 126979 210738 228553 28370 -49459 -78411 21392 88241 117978
1073 117978 195161 238723 300343 204209 224090 233893 270390 424270 394822 237238 318917
1062 318917 326327 236580 114901 92493 272394 376882 305894 153515 -128738 -38048 -75846
1051 -75846 62207 153032 328362 410968 413455 414332 425973 433571 378469 434492 526472 522582
1039 522582 469862 529014 480675 522955 559951 581764 615642 646130 669683 594401 612171 529996
1027 529996 656856 621324 646339 743000 764155 676655 571787 672416 750608 660270 755118
1016 755118 936369 894753 871529 847324 846214 1057400 1109806 1091078 1161933 1106764 1111148 1026007
1004 1026007 966957 1145380 1316780 1205352 1437719 1281003 1149902 1224827 1227206 1148741
994A148741K50887J45462L7388k8669K9733J1197j25142L29584J63078J33005
984B095264K7783J94392J00403k8921J38932J73800J21097J76026O7651J38038
974C204465J26816J87507M06633J9268O7535K74773K64790K41914L05302J92073
964E291076L38643M53687O08243P12409N85769P31614O05286N24868M71047P61544
954A1084186Q07740R83569J290540J545154K011014K758176L255317L800611M761861
945C2298168O535875Q346853J0148609R134650k908740j2770506j1810870p659756
937C1314283m947340l346822k634318k335363k133919j928480j499812j066350
929A1421879p94302o39171n52212n30206o54533r43015p60003m75889m32572l74539
$$ plain form
994 1148741 1399628 1545090 1582478 1553809 1583542 1594739 1469597 1799181 1962259 2095264
984 2095264 2123047 2317439 2417842 2388921 2527853 2701653 2822750 2998776 3066427 3204465
974 3204465 3331281 3518788 3925421 3944689 4012224 4286997 4551787 4793701 5099003 5291076
964 5291076 5629719 6083406 6691649 7404058 7989827 8721441 9326727 9851595 10322642 11084186
954 11084186 11891926 12875495 14166035 15711189 17722203 20480379 23735696 27536307 32298168
945 32298168 38834043 47180896 57329505 66464155 63555415 50784909 38974039 31314283
937 31314283 26366943 23020121 20385803 18050440 15916521 13988041 12488229 11421879
929 11421879 10627577 9988406 9436194 8905988 8251455 7308440 6548437 6072548 5639976 5265437
919E265437m87872l25555j44912k53784k35006j92817j29r3269j51893k19889
909C160311q0508K9371q2545j47407j7317j05582j63620j07988j97665j49877
899B137173r470k12586q510k78495j3097L8144J5760o5644p7915J33329p2567
888A586122k30230j85320K9617N4244M0138Q5094j37823o5530p8124j01076K0792
877A017904l2112k40885R49J24225R3027k16297M3352k5977k0773J5649j72861
866E86201j49594P1302J99192L0855l8117l2047M480j04452J28158J0548l4186
855F72340K1741m7460n9676M5904K9365k11422L5804j8448r2789r027l5992J26888
843D57228l1353O9440o7991j32113j66918J17047J08692K7597J62713Q4477j72858
$$ plain form
919 5265437 4777565 4452010 4307098 4053314 3818308 3625491 3625362 3532093 3380200 3160311
909 3160311 3079803 3109174 3026629 2879222 2861905 2756323 2592703 2484715 2287050 2137173
899 2137173 2127703 1915117 1906607 1628112 1615015 1653159 1668919 1603275 1525360 1658689 1586122
888 1586122 1355892 1170572 1200189 1254433 1294571 1379665 1241842 1176312 1098188 997112 1017904
877 1017904 985792 744907 745856 870081 963108 746811 790163 764186 743413 759062 586201
866 586201 436607 507909 707101 737956 699839 667792 672272 567820 695978 706526 672340
855 672340 694081 646621 586945 632849 662214 450792 486596 468148 375359 366332 330340 457228
843 457228 425875 495315 427324 295211 128293 245340 354032 381629 544342 628819 455961
832D55961j83460L9122L5167L8790K8166M5900k8209N6386j16584j33199Q4338
821C22378k0896p196Q9758j35989p9992j6331m3531j74726J10848J58757P266
810B10346k3404m5227Q0696J1472N6922l4063j320n9798o2333j05353R3946R3481
798B15365J22853o4580n0614R1342L7654r3314j11059J07299j65259j4094N9282
787A34875l4824J73000p3432P1258l2171j97760R617J10230P1231k5624r6911
776A09489L4682r3503P542J70532K6399j41055o7175o6202Q0507j42436p89J7794
764f4215r951R7149m4216J09653J36089q2745l7700J26385r8995o1656L6673n6926
752D9545M3951m5054J1860q3484j87398p2576J65331K73167p6444j16158Q0l7066
$$ plain form
832 455961 272501 311623 346790 385580 413746 459646 431437 487823 371239 238040 322378
821 322378 301482 294286 384044 248055 168063 151732 108201 -66525 44323 203080 210346
810 210346 186942 141715 222411 233883 290805 256742 255422 195624 133291 27938 121884 215365
798 215365 338218 273638 223024 314366 352020 258706 147647 254946 89687 75593 134875
787 134875 100051 273051 199619 270877 238706 40946 50563 160793 232024 206400 109489
776 109489 144171 50668 58210 228742 255141 114086 46911 -19291 61216 -81220 -82009 -64215
764 -64215 -74166 22983 -21233 88420 224509 141764 104064 230449 131454 69798 106471 49545
752 49545 93496 48442 60302 -23182 -210580 -283156 -117825 155342 78898 -37260 -37180 -74246
740g4246O8874K18509p6797k5487P7770p1425J3923J4670j0271p2335O2846j71463
728d5432q3933j2254N99j8116J5038R0481j02022J46757N2973K1639q8663J4993
716g940N5646q2952M9033Q0248Q330J5125j21059r3301N579J93759j80570n1098
704a29200Q6746n2849n22O7240j06400J00617P5762j16287n4518J19244J6628
693F461k3652J03953J8393n7247M6351k3302P2629K3480j65453K8311q56L4723
681F3791K3460M7237r5605k0453M9807M0933j31093p2287M3309l7478J43822q9814
669c4371j50113O8397R0367j9550m0046J46474J45903j18245N9722J8042J57931
658C24511J90454L7642N1629p0372q5647r6324j10113j46091r4377Q4330j9852
$$ plain form
740 -74246 -5372 213137 136340 110853 188623 117198 131121 145791 135520 63185 126031 -45432
728 -45432 -129365 -141619 -141020 -159136 -144098 -53617 -155639 -8882 44091 65730 -22933 -7940
716 -7940 47706 -35246 13787 94035 102365 117490 -3569 -96870 -91291 102468 -78102 -129200
704 -129200 -42454 -95303 -95825 -28585 -134985 -34368 41394 -74893 -129411 -10167 6461
693 6461 -17191 86762 105155 47908 94259 70957 143586 167066 1613 29924 29068 63791
681 63791 87251 134488 38883 18430 68237 109170 -21923 -94210 -50901 -88379 55443 -34371
669 -34371 -184484 -116087 -25720 -45270 -85316 61158 207061 88816 148538 166580 324511
658 324511 514965 552607 604236 533864 448217 351893 241780 95689 1312 85642 65790
647F5790L5162k5863j15794q2207N0262R6223j28m1572n3391k6659J84757J49333
635B35913j5570j785P7063p8870O0307o8759l2977J7877k45733j8947M2076k7187
623e6592K8524m715k07601K8726J12873M3207l47L1203O4786K16526m1021j3665
611B01904l6556L6472l7177K4863l2810o1035o1653m7236j14209M1375n8447M3874
599a00635M2176p2520j36229Q9775L4767J6561J92059J32201J8031K6302K82669
588E25157j35339j27245L8496p0755k34219l5459j9151R7224l9294r6113P4065
577b2633o1532j6442N478J03898l6967o1233j7477J00290P2807k6921o060K929
565C6137J18690L4579J1078r3147n1344L8344l3546j39352K0351p2261m7032P5982
$$ plain form
647 65790 100952 75089 -40705 -122912 -72650 23573 23445 -18127 -71518 -98177 86580 235913
635 235913 220343 218558 295621 216751 277058 208299 175322 193199 -52534 -71481 -29405 -56592
623 -56592 -28068 -32783 -240384 -211658 -98785 -55578 -55925 -24722 40064 256590 215569 201904
611 201904 165348 201820 164643 189506 156696 95661 34008 -13228 -127437 -86062 -144509 -100635
599 -100635 -58459 -130979 -267208 -177433 -142666 -126105 65954 198155 216186 242488 525157
588 525157 389818 262573 301069 230314 -3905 -39364 -58515 38709 -585 -96698 -22633
577 -22633 -84165 -100607 -95129 8769 -28198 -89431 -106908 -6618 66189 39268 33208 36137
565 36137 154827 189406 200484 107337 55993 94337 60791 -78561 -58210 -130471 -177503 -101521
553a01521L192l7360l0493N4831j9524J34027J2343j673K964n950j34675Q7842
541c5997J24363o4082J6800R256q0309L3311r94k0033P4868o4945o2374j6674
529h6810N2457j19024l2550J95161J35493j77900o4666o3105M6860N8324J34124
518G8364O1314o3849J6966L7520j14207m6267Q7679r7663R4054R2316m4380l2023
506F9824K5062m6513r1450P7972j03968K1870Q6601J4295L1653k94297l3577P9508
494a63020J35867L1711J6899N2963J36439j15813j54717K07226J17661r6550o9329
483I9337J20813J22432k54499k76612O8683P7848O3549N8352K5011M517R2813
472B02244k8817n3049j21482J17727N4082L5557p1393M6435j04951q2351m0440
$$ plain form
553 -101521 -98329 -135689 -166182 -111351 -130875 3152 15495 13822 16786 10836 -123839 -35997
541 -35997 88366 24284 41084 50340 -29969 3342 2348 -17685 57183 -7762 -70136 -86810
529 -86810 -34353 -153377 -185927 9234 144727 -33173 -97839 -160944 -114084 -55760 78364
518 78364 139678 75829 92795 130315 16108 -30159 57520 -40143 53911 146227 101847 69824
506 69824 94886 48373 -43077 34895 -69073 -47203 39398 53693 85346 -208951 -242528 -163020
494 -163020 -27153 4558 21457 74420 210859 95046 -59671 147555 265216 168666 99337
483 99337 220150 342582 88083 -188529 -119846 -41998 21551 79903 104914 109431 202244
472 202244 173427 120378 -1104 116623 170705 206262 134869 181304 76353 -5998 -46438
461d6438n4628L0162l9940Q3610q4765K3666N8974q558J7613J14183m8578M3279
449H8580Q095n9307J1626K56097K9812o1676n3587j89817j13607q8887R1775M7271
437c3625P1461P4243j5890q9025k1090k0964R305j14730K59927J45552J33213
426C98377r9058j09462p773j18602L030R2445O7875r475j12872j17757j5474q4617
414a13363l1062J64375J33084j48798m1472J55457Q9341j31881J10512N2215O279
403B44687r5566o3221P4043P1591j0365q5099K2300k4756L0742o666K566j2498
391A47758n323k6030p679j7930j04998P1261m0529r0109L4952M1800M8970J08686
379A60829m8557p6855N9547K5472k6033q662J6317m8424q3177Q4621Q7838j41914
$$ plain form
461 -46438 -101066 -70904 -110844 -27234 -111999 -88333 -29359 -37917 -20304 93879 45301 88580
449 88580 96675 37368 48994 305091 334903 273227 219640 29823 -83784 -172671 -80896 -33625
437 -33625 37836 112079 96189 7164 -13926 -34890 -25585 -140315 119612 265164 398377
426 398377 299319 189857 182084 63482 66512 158957 226832 217357 104485 -13272 -28746 -113363
414 -113363 -144425 19950 153034 4236 -37236 118221 207562 75681 186193 238408 244687
403 244687 149121 85900 159943 231534 221169 136070 158370 133614 164356 157690 160256 147758
391 147758 142435 116405 108726 90796 -14202 57059 16530 -73579 -38627 3173 52143 160829
379 160829 112272 35417 94964 120436 94403 85741 102058 53634 -29543 55078 142916 1002
367A002j19694J28228J31282M2255J4294r5437P5304L6099r3077N861R0011R8118
355C14246j04443m2452J3001q7728n3309N365l8999Q9111O206P5330J9049k12601
343a7224j00168J91215M4312O0843Q5401Q2304k1760k93018M5953J13821k9647
332A62032J04233Q6892j86855k02322J20153K09k4677o5889R4558L7454j08683
321A7105O5046J8490m1973J3111J16548M6039p6471n9383K5667M611m7808K7170
309A08152J36826q6735k8750J3909M8591n5628j16150l6203J55282J39337l0590
298B48041k8216Q5608K9839r3743r7638m7711J34465l9289m939o3168p324r8384
286A7541R0771n9728N8662j2663n7073K3090m8201m6210Q4507L3432k16370L5088
$$ plain form
367 1002 -118692 9536 140818 183073 197367 101930 177234 213333 120256 126117 216128 314246
355 314246 209803 167351 180352 92624 39315 44680 5681 94792 100998 176328 195377 -17224
343 -17224 -117392 73823 118135 178978 264379 346683 324923 31905 77858 191679 162032
332 162032 266265 353157 166302 -36020 84133 84342 59665 -6224 88334 125788 17105
321 17105 82151 100641 58668 71779 188327 234366 157895 98512 124179 128790 80982 108152
309 108152 244978 158243 129493 143402 191993 136365 20215 -15988 139294 278631 248041
298 248041 219825 305433 335272 241529 143891 96180 230645 191356 186417 123249 115925 17541
286 17541 108312 48584 107246 94583 37510 60600 12399 -33811 50696 84128 -132242 -97154
274i7154Q7732m7162p183K0590J31058K7266j1152q0796K9601J66919l5513J00459
262B84665l7505o7465k0497J15017j74445j5221q6865j2774P5704j3481p365p6044
250c6276J48922R6135P5537O2487n6842j16752J19252J02970j5755j25904j53481
239A00293M004K1863M3048L7636P4634j55610j59305j98247J21520R3026J02607
228H5469m4945j04908J34355J39925n5883N2858k8134o162M4269o2100j56890
217b146J18060k4133p0718l9353M6943l297P2173o5906j99979K3918Q1692O2873
205A27O9721R200J52191N0786p2374q4519p252o4856j59022K4954K10459J15374
193B44789p5302J7592n0180q1450n8404J65662M9957j08365j6341j0061j375J19122
$$ plain form
274 -97154 -9422 -56584 -63767 -43177 87881 115147 103995 23199 52800 219719 184206 284665
262 284665 247160 179695 159198 274215 99770 84549 -2316 -15090 60614 47133 39768 -36276
250 -36276 112646 208781 284318 346805 289963 173211 292463 395433 379678 253774 100293
239 100293 104297 126160 169208 206844 281478 125868 -33437 -231684 -110164 -17138 85469
228 85469 40524 -64384 69971 209896 154013 206871 178737 172575 216844 154744 -2146
217 -2146 115914 91781 21063 -18290 28653 25356 97529 31623 -168356 -144438 -62746 127
205 127 69848 79048 231239 282025 209651 125132 117880 53024 -105998 -81044 129415 244789
193 244789 169487 187079 136899 55449 -2955 162707 212664 104299 87958 77897 76522 195644
181A95644N4507l8302j31900P8763m8929m2493K4323J50099l1149J9946j22834
170A07675L5210Q802j40898j91541j026J08538J54879l2469J38838J54743k96856
159D5895k6375n4322J47188J42004o7738p6988M8360O2446k19852P3182k9915
148D3885R1363o8274m5883p3192p721O488L9099O397K7773J15250K0347O3697
136B19229m3992n8223k5552J5164Q2127o5425o1137P4781r0874j31572l5950K01659
124H0235M1297m2135J4184N5053O0279j49133k1216P0010J7078P8814l4190m0342
112A29934m7570O0477j3538j1761n539J07475P1294m7867n6120j63930N9442M282
100H6579j3346J31081R2687k574r4188p1103m3520l7025L8496L3460j1146j73359
$$ plain form
181 195644 250151 211849 79949 158712 109783 67290 91613 241712 210563 230509 107675
170 107675 142885 151687 10789 -180752 -181778 -73240 81639 49170 188008 342751 45895
159 45895 19520 -34802 112386 254390 186652 109664 158024 220470 618 73800 43885
148 43885 135248 66974 21091 -52101 -59822 -53334 -14235 -7838 19935 135185 155532 219229
136 219229 175237 117014 91462 106626 188753 123328 62191 136972 46098 -85474 -121424 80235
124 80235 121532 79397 93581 148634 208913 59780 38564 108574 125652 204466 170276 129934
112 129934 82364 142841 129303 117542 112003 219478 290772 242905 186785 22855 82297 86579
100 86579 73233 204314 297001 294427 200239 129136 85616 48591 87087 120547 109401 -63958
88f3958K2940P1248j27999J02242J6089k7940J45356p8870o9942p242N433Q1080
76F8437J16417k7414K2275J4786j47455Q523J27156N9577p8769N8068P5943o8792
64B28752j43845p0317K5914R9842n9928J1558N1205J5538k2730M5158K8340o7696
52A41791p8493Q4482p3535J6797M605M2012R6973j04686j11799k1240L7338K3300
40E7545q826K5424k8438n2233J3425J35676j23018j6818O3335M1945K0480j19483
$$ plain form
88 -63958 -41018 30230 -97769 4473 20562 -7378 137978 59108 -10834 -18076 -12643 68437
76 68437 184854 157440 179715 194501 47046 55569 182725 242302 163533 221601 297544 228752
64 228752 84907 14590 40504 140346 80418 91976 143181 158719 135989 181147 209487 141791
52 141791 63298 147780 74245 91042 95647 137659 234632 129946 18147 -3093 34245 57545
40 57545 48719 74143 45705 -6528 6897 142573 19555 2737 66072 108017 128497 9014
$$ [...]
##END NTUPLES=NMR SPECTRUM
##END=
