##TITLE=1H_CA-8800-3
 CDCl3, 8 sc, 
 22.12.2020
##JCAMPDX= 6.0         $$ Bruker NMR JCAMP-DX V2.0
##DATA TYPE= NMR SPECTRUM
##DATA CLASS= NTUPLES
##ORIGIN= UXNMR, Bruker Analytische Messtechnik GmbH
##OWNER= root
$$ XWIN-NMR		Version 3.5
$$ Tue Dec 22 10:35:02 2020 Russian Standard Time (UT+4h)  she@DPX200
##.OBSERVE FREQUENCY= 200.1315066352
##.OBSERVE NUCLEUS= ^1H
##.ACQUISITION MODE= SIMULTANEOUS
##.ACQUISITION SCHEME= undefined
##.AVERAGES= 8
##.DIGITISER RES= 18
##SPECTROMETER/DATA SYSTEM= spect
##.PULSE SEQUENCE= zg30
##.SOLVENT NAME= CDCl3
##.SHIFT REFERENCE= (INTERNAL, CDCl3, 0, 15.9802)
##AUDIT TRAIL= $$ (NUMBER, WHEN, WHO, WHERE, WHAT)
$$ ##TITLE= Audit trail, XWIN-NMR		Version 3.5
$$ ##JCAMPDX= 5.01
$$ ##ORIGIN= Bruker BioSpin GmbH
$$ ##OWNER= she
$$ F:/spectra/data/she/nmr/H-F/1/pdata/1/auditp.txt
$$ ##AUDIT TRAIL=  $$ (NUMBER, WHEN, WHO, WHERE, WHAT)
(   1,<2020-12-22 10:33:21.98 +0400>,<she>,<DPX200>,
      <created by zg, POWCHK disabled, PULCHK disabled
       configuration hash MD5:
       00 E9 B6 7A A2 85 ED C7 34 08 36 98 17 FE 4E 26
       data hash MD5: 16K
       B4 E5 E2 F7 94 4B 52 DF 09 C5 31 75 8C 79 8E 3B>)
(   2,<2020-12-22 10:33:24.79 +0400>,<she>,<DPX200>,
      <Start of raw data processing
       efp BC_mod = 2 LB = 0.24 FT_mod = 6 PKNL = 1 PHC0 = -10762.79 PHC1 = 10.80095 SI = 16K 
       data hash MD5: 16K
       5F 35 64 E8 4D 63 0D 60 EF B4 36 16 FA B1 D7 30>)
(   3,<2020-12-22 10:33:45.04 +0400>,<she>,<DPX200>,
      <pk PHC0 = 0.7375976 PHC1 = -0.6 
       data hash MD5: 16K
       EF 9D 7B C6 A8 47 7C 3B 5E 81 E1 A7 39 D3 03 4A>)
(   4,<2020-12-22 10:33:48.28 +0400>,<she>,<DPX200>,
      <abs ABSG = 5 
       data hash MD5: 16K
       EF DA C7 BF 8E F3 98 C9 0D 94 E4 5A D4 29 EC 8E>)
$$ ##END=
$$ 
$$ hash MD5
$$ E4 15 57 36 EF B1 B7 21 55 A6 85 0B B0 B8 73 86
##$RELAX= 
##$RELAX= 
##$RELAX= 
##$RELAX= 
##$RELAX= 
##$RELAX= 
$$ Bruker specific parameters
$$ --------------------------
##$DU= <F:/spectra>
##$EXPNO= 1
##$NAME= <H-F>
##$PROCNO= 1
##$TYPE= <nmr>
##$USER= <she>
##$AMP= (0..31)
100 100 100 100 100 100 100 100 100 100 100 100 100 100 100 100 100 100 
100 100 100 100 100 100 100 100 100 100 100 100 100 100 
##$AQSEQ= 0
##$AQ_mod= 1
##$AUNM= <au_zg>
##$AUTOPOS= <>
##$BF1= 200.13
##$BF2= 200.13
##$BF3= 200.13
##$BF4= 200.13
##$BF5= 200.13
##$BF6= 200.13
##$BF7= 200.13
##$BF8= 200.13
##$BYTORDA= 1
##$CFDGTYP= 0
##$CFRGTYP= 5
##$CHEMSTR= <none>
##$CNST= (0..31)
1 1 145 1 1 1 1 1 1 1 1 1 1 1 1 1 1 1 1 1 1 1 1 1 1 1 1 1 1 1 1 1 
##$CPDPRG= <>
##$CPDPRG1= <>
##$CPDPRG2= <>
##$CPDPRG3= <>
##$CPDPRG4= <mlev>
##$CPDPRG5= <mlev>
##$CPDPRG6= <mlev>
##$CPDPRG7= <mlev>
##$CPDPRG8= <mlev>
##$CPDPRGB= <>
##$CPDPRGT= <>
##$D= (0..31)
0 1.2 0 0 0 0 0 0 0 0.06 0 0.03 0 0 0 0 0.0002 0 0 0 0 0 0 0 0 0 0 0 0 
0 0 0 
##$DATE= 1608618801
##$DBL= (0..7)
120 120 120 120 120 120 120 120 
##$DBP= (0..7)
150 150 150 150 150 150 150 150 
##$DBP07= 0
##$DBPNAM0= <>
##$DBPNAM1= <>
##$DBPNAM2= <>
##$DBPNAM3= <>
##$DBPNAM4= <>
$$ [...]
##$SUBNAM3= <"">
##$SUBNAM4= <"">
##$SUBNAM5= <"">
##$SUBNAM6= <"">
##$SUBNAM7= <"">
##$SUBNAM8= <"">
##$SUBNAM9= <"">
##$SW= 16.9725356469052
##$SWIBOX= (0..15)
0 0 2 0 0 0 0 0 0 0 0 0 0 0 0 0 
##$SW_h= 3396.73913043478
##$TD= 16384
##$TD0= 1
##$TE= 0
##$TE2= 300
##$TE3= 300
##$TEG= 300
##$TL= (0..7)
0 120 120 120 120 120 120 120 
##$TP= (0..7)
150 150 150 150 150 150 150 150 
##$TP07= 0
##$TPNAME0= <>
##$TPNAME1= <>
##$TPNAME2= <>
##$TPNAME3= <>
##$TPNAME4= <>
##$TPNAME5= <>
##$TPNAME6= <>
##$TPNAME7= <>
##$TPOAL= (0..7)
0.5 0.5 0.5 0.5 0.5 0.5 0.5 0.5 
##$TPOFFS= (0..7)
0 0 0 0 0 0 0 0 
##$TUNHIN= 0
##$TUNHOUT= 0
##$TUNXOUT= 0
##$USERA1= <user>
##$USERA2= <user>
##$USERA3= <user>
##$USERA4= <user>
##$USERA5= <user>
##$V9= 5
##$VALIST= <valist>
##$VCLIST= <CCCCCCCCCCCCCCC>
##$VD= 0
##$VDLIST= <DDDDDDDDDDDDDDD>
##$VPLIST= <PPPPPPPPPPPPPPP>
##$VTLIST= <TTTTTTTTTTTTTTT>
##$WBST= 1024
##$WBSW= 4
##$XGAIN= (0..3)
0 0 0 0 
##$XL= 0
##$YL= 0
##$YMAX_a= 751126
##$YMIN_a= -287571
##$ZGOPTNS= <>
##$ZL1= 120
##$ZL2= 120
##$ZL3= 120
##$ZL4= 120
##$ABSF1= 15.98335
##$ABSF2= -0.9893122
##$ABSG= 5
##$ABSL= 3
##$ALPHA= 0
##$AQORDER= 0
##$ASSFAC= 0
##$ASSFACI= 0
##$ASSFACX= 0
##$ASSWID= 0
##$AUNMP= <proc_1d>
##$AZFE= 0.1
##$AZFW= 0.1
##$BCFW= 0
##$BC_mod= 2
##$BYTORDP= 0
##$COROFFS= 0
##$CY= -3
##$DATMOD= 1
##$DC= 0
##$DFILT= <>
##$DTYPP= 0
##$F1P= 0
##$F2P= 0
##$FCOR= 1
##$FTSIZE= 16384
##$FT_mod= 6
##$GAMMA= 0
##$GB= 0
##$INTBC= 1
##$INTSCL= 2.992141e-10
##$ISEN= 128
##$LB= 0.24
##$LEV0= 0
##$LPBIN= 0
##$MAXI= 10000
##$MC2= 0
##$MEAN= 0
##$ME_mod= 0
##$MI= 1.114404
##$NCOEF= 0
##$NC_proc= -5
##$NLEV= 6
##$NOISF1= 3.799351
##$NOISF2= 2.8
##$NSP= 0
##$NTH_PI= 0
##$NZP= 0
##$OFFSET= 15.98024
##$PC= 1
##$PHC0= -10762.05
##$PHC1= 10.20095
##$PH_mod= 1
##$PKNL= yes
##$PPARMOD= 0
##$PSCAL= 0
##$PSIGN= 0
##$REVERSE= no
##$SF= 200.130006879191
##$SI= 16384
##$SIGF1= 3
##$SIGF2= 2
##$SINO= 5.538805
##$SIOLD= 16384
##$SREGLST= <1H.CDCl3>
##$SSB= 0
##$STSI= 16384
##$STSR= 0
##$SW_p= 3396.73913043478
##$SYMM= 0
##$S_DEV= 0
##$TDeff= 16384
##$TDoff= 0
##$TI= <>
##$TILT= no
##$TM1= 0
##$TM2= 0
##$TOPLEV= 0
##$USERP1= <user>
##$USERP2= <user>
##$USERP3= <user>
##$USERP4= <user>
##$USERP5= <user>
##$WDW= 1
##$XDIM= 16384
##$YMAX_p= 351542302
##$YMIN_p= -340333
$$ End of Bruker specific parameters
$$ ---------------------------------
##NTUPLES= NMR SPECTRUM
##VAR_NAME=  FREQUENCY,     SPECTRUM/REAL,   SPECTRUM/IMAG
##SYMBOL=    X,             R,               I
##VAR_TYPE=  INDEPENDENT,   DEPENDENT,       DEPENDENT
##VAR_FORM=  AFFN,          ASDF,            ASDF
##VAR_DIM=   16384,         16384,           16384
##UNITS=     HZ,            ARBITRARY UNITS, ARBITRARY UNITS
##FACTOR=    0.207333158178281, 1,           1
##FIRST=     3198.1255147468, 0,             0
##LAST=      -198.613615687984, 0,           0
##MIN=       -198.613615687984, -340333,     0
##MAX=       3198.1255147468, 351542302,     0
$$ Real data points
##PAGE= N=1
##DATA TABLE= (X++(R..R)), XYDATA
$$ [...]
$$ plain form
6076 755965 742035 801106 817209 864289 778828 705081 738525 739490 723594 767024 687553 628903
6064 628903 617618 661681 642266 585687 544899 572265 576277 545625 570174 596223 539629 579292
6052 579292 605154 502861 554118 572034 518303 473797 523506 614935 640227 611190 539622
6041 539622 486864 539362 556179 502930 528176 512842 506057 533436 414849 433705 559634
6030 559634 552282 436511 530341 494723 442645 470153 457479 447731 416765 432266 471656 424604
6018 424604 417584 417480 461764 418242 385225 399087 395753 362331 369388 342272 307843 369714 403416
6005 403416 352861 273048 357556 376059 352248 359051 419899 374149 363821 379147 380123 359947
5993 359947 257428 235917 210627 246760 312996 302591 254239 292199 282150 213356 262529
$$ packed form
6076G55965j3930N9071J6103M7080q5461p3747L3444R65j5896M3430p9471n8650
6064F28903j1285M4063j9415n6579m0788K7366M012l0652K4549K6049n6594L9663
6052E79292K5862j02293N1257J7916n3731m4506M9709R1429K5292k9037p1568
6041E39622n2758N2498J6817n3249K5246j5334o785K7379j18587J8856J25929
6030E59634p352j15771R3830l5618n2078K7508j2674r748l0966J5501L9390m7052
6018D24604p020j04M4284m3522l3017J3862l334l3422P057k7116l4429O1871L3702
6005D03416n0555p9813Q4508J8503k3811O803O0848m5750j0328J5326R76k0176
5993C59947j02519k1511k5290L6133O6236j0405m8352L7960j0049o8794M9173
$$ plain form
5982 262529 291803 286710 325910 316458 280863 352728 356320 292656 209668 184585 277433 340553
5970 340553 260025 233904 279891 221787 181614 225814 306688 364468 301363 202849 174890 184761
5958 184761 182004 147246 207022 212788 198096 237760 199553 271023 277713 235653 165712 193845
5946 193845 220798 180265 229815 273880 244632 281648 291588 311624 281414 192974 197979 203571
5934 203571 258448 266290 295341 234501 210637 247952 245975 254671 237141 239277 235480 225143 257617
5921 257617 309114 235047 237362 246621 239309 268048 278935 323377 314415 269814 312638 375276
5909 375276 299649 177192 283375 377869 339957 333562 349167 440031 384534 285338 363540
5898 363540 318545 266812 292881 287697 361669 380575 326133 298050 265004 241293 254643 276017
$$ packed form
5982B62529K9274n093L9200r452l5595P1865L592o3664q2988k5083R2848O3120
5970C40553q0528k6121M5987n8104m0173M4200Q0874N7780o3105r8514k7959R871
5958A84761k757l4758N9776N766j4692L9664l8207P1470O690m2060o9941K8133
5946A93845K6953m0533M9550M4065k9248L7016R940K0036l0210q8440N005N592
5934B03571N4877P842K9051o0840k3864L7315j977Q696j7530K136l797j0337L2474
5921B57617N1497p4067K315R259p312K8739J0887M4442q962m4601M2824O2638
5909C75276p5627j22457J06183R4494l7912o395J5605R0864n5497r9196P8202
5898C63540m4995n1733K6069n184P3972J8906n4442k8083l3046k3711J3350K1374
$$ plain form
5886 276017 226510 208574 318124 403210 426313 361250 338622 356509 393814 320250 340520
5875 340520 380625 387458 307042 366314 394946 334353 312782 347202 387254 356569 352164 330096
5863 330096 382564 473807 459273 482578 475599 479117 431466 396560 405134 383726 433393 505819
5851 505819 561034 601234 649410 661794 607165 505284 475136 515656 485050 441589 469738
5840 469738 499887 491088 451880 392669 430719 438435 433508 453682 467359 447954 437516 449974
5828 449974 427000 396681 333277 344723 271248 344696 384473 356990 371667 384086 338901 401197
5816 401197 420928 419695 376728 342361 390174 399664 338647 378096 389852 330667 361312 406173
5804 406173 413769 420960 342126 320760 407791 452030 447106 468427 517896 551284 547000 598132
$$ packed form
5886B76017m9507j7936J09550Q5086K3103o5063k2628J7887L7305p3564K0270
5875C40520M0105O833q0416N9272K8632o0593k1571L4420M0052l0685m405k2068
5863C30096N2468R1243j4534K3305o979L518m7651l4906Q574k1408M9667P2426
5851E05819N5215M0200M8176J2384n4629j01881l0148M0520l0606m3461K8149
5840D69738L0149q799l9208n9211L8050P716m927K0174J3677j9405j0438J2458
5828D49974k2974l0319o3404J1446p3475P3448L9777k7483J4677J2419m5185O2296
5816D01197J9731j233m2967l4367M7813R490o1017L9449J1756n9185L0645M4861
5804D06173P596P191p8834k1366Q7031M4239m924K1321M9469L3388m284N1132
$$ plain form
5792 598132 616057 637622 658294 627403 645729 670094 609588 634771 698619 705218 682318 590884
5780 590884 618229 687204 688236 638852 568058 487646 540885 629808 611685 606453 638718 686265
5768 686265 716446 638987 605321 609172 618789 634293 650179 671660 696420 764499 781398 830792
5756 830792 858083 935623 1019022 1006106 1095808 1168797 1172208 1161054 1168197 1174735 1218714 1177178
5744 1177178 1171635 1119761 1177359 1265392 1270280 1411936 1522651 1635812 1626413 1678474 1782082
5733 1782082 1786825 1793188 1774078 1743930 1770798 1796968 1855434 1915532 2028793 2208981 2262956
5722 2262956 2348285 2482502 2625879 2747281 2873556 2994068 2964993 2736112 2663069 2662911 2703804
5711 2703804 2701023 2750614 2921659 2992113 2987433 3014030 2965556 2966469 3063673 3135962 3227305 3408332
$$ packed form
5792E98132J7925K1565K0672l0891J8326K4365o0506K5183O3848O599k2900r1434
5780E90884K7345O8975J032m9384p0794q0412N3239Q8923j8123n232L2265M7547
5768F86265L0181p7459l3666L851R617J5504J5886K1481K4760O8079J6899M9394
5756H30792K7291P7540Q3399j2916Q9702P2989L411j1154P143O538M3979m1536
5744A177178n543n1874N7598Q8033M888J41656J10715J13161r399N2061J03608
5733A782082M743O363j9110l0148K6868K6170N8466O0098J13261J80188N3975
5722B262956Q5329J34217J43377J21402J26275J20512k9075k28881p3043j58M0893
5711B703804k781M9591J71045P0454m680K6597m8474R13R7204P2289R1343J81027
$$ plain form
5699 3408332 3716579 4029538 4050087 4000157 4106725 4309731 4557076 4871252 4999667 5018970
5689 5018970 4876116 4456247 4047888 3822060 3823021 3818043 3874173 4035834 4241620 4476927 4716637
5678 4716637 4858892 4868069 4735882 4662536 4793505 4996414 5230921 5397367 5370083 5175389
5668 5175389 4981873 4910372 4868606 4997925 5041478 5069251 4814996 4664283 4736520 4876994
5658 4876994 4952583 4724362 4557752 4512491 4697387 5034936 5223340 5373486 5325949 5019835
5648 5019835 4588119 4264087 4162474 4163794 4189884 3900754 3577064 3359717 3201308 3145111
5638 3145111 3173926 3144511 3352329 3651929 4001743 4470396 4611319 4576389 4239967 3844109
5628 3844109 3599498 3480881 3499300 3491326 3499524 3318324 2895584 2485172 2271222 2118265
$$ packed form
5699C408332L08247L12959K0549m9930J06568K03006K47345L14176J28415J9303
5689E018970j42854m19869m08359k25828R61m978N6130J61661K05786K35307K39710
5678D716637J42255R177j32187p3346J30969K02909K34507J66446k7284j94694
5668E175389j93516p1501m1766J29319M3553K7773k54255j50713P2237J40474
5658D876994P5589k28221j66610m5261J84896L37549J88404J50146m7537l06114
5648E019835m31716l24032j01613J320K6090k89130l23690k17347j58409n6197
5638C145111K8815k9415K07818K99600L49814M68653J40923l4930l36422l95858
5628C844109k44611j18617J8419p974Q198j81200m22740m10412k13950j52957
$$ plain form
5618 2118265 2063904 1934239 1797233 1820142 1753666 1691527 1727457 1702763 1817088 1858073 1945520
5607 1945520 2122124 2263888 2454696 2396294 2027098 1694194 1594575 1543298 1388416 1190158
5597 1190158 1081566 1025823 974706 969709 967498 909412 874110 811927 868183 925935 867055 889041
5585 889041 836926 766041 805232 761919 690527 683131 656259 663295 674971 751424 796060 780057
5573 780057 739640 659835 737538 714588 701583 734711 701110 638560 725855 713508 772299 727119
5561 727119 759356 733203 686963 717435 715442 641433 633434 635823 612539 596851 627892 712521
5549 712521 695797 690601 684195 676540 610365 630228 665731 675619 635957 674208 728386 680298
5537 680298 584706 604296 624500 615777 640288 630340 590650 621235 599736 610208 671588 753904
$$ packed form
5618B118265n4361j29665j37006K2909o6476o2139L5930k4694J14325M0985Q7447
5607A945520J76604J41764J90808n8402l69196l32904r9619n1277j54882j98258
5597A190158j08592n5743n1117m997k211n8086l5302o2183N6256N7752n8880K1986
5585H89041n2115p0885L9191m3313p1392p396k6872P036J1676P6453M4636j6003
5573G80057m0417p9805P7703k2950j3005L3128l3601o2550Q7295j2347N8791m5180
5561G27119L2237k6153m6240L0472j993p4009p999K389k3284j5688L1041Q4629
5549G12521j6724n196o406p655o6175J9863L5503R888l9662L8251N4178m8088
5537F80298r5592J9590K0204q723K4511r948l9690L0585k1499J0472O1380Q2316
$$ plain form
5525 753904 766466 809486 750004 728731 734826 787802 882023 838777 779439 791490 752132 718899
5513 718899 694110 776693 736438 709733 783503 794305 773921 708644 684693 688714 708184 747623
5501 747623 815388 723838 667000 634922 578621 594127 648264 639194 586373 562423 596687 582350
5489 582350 502349 542031 546092 518875 547421 563728 531833 528901 637357 644161 593987 557387
5477 557387 595257 658218 642066 613218 655525 781544 727853 692557 677609 629626 663164
5466 663164 680203 649953 627459 649427 693767 658311 651828 714336 762695 688684 667998 745086
5454 745086 750133 707865 725550 733990 602286 561430 578172 599697 632650 658950 690155 616245
5442 616245 677436 722649 686336 578728 552285 687529 645283 602588 642623 600781 618151
$$ packed form
5525G53904J2562M3020n9482k1273O095N2976R4221m3246n9338J2051l9358l3233
5513G18899k4789Q2583m0255k6705P3770J0802k0384o5277k3951M021J9470L9439
5501G47623O7765r1550n6838l2078n6301J5506N4137r070n2821k3950L4264j4337
5489E82350q0001L9682M061k7217K8546J6307l1895k932J08456O804n0174l6600
5477E57387L7870O2961j6152k8848M2307J26019n3691l5296j4948m7983L3538
5466F63164J7039l0250k2494K1968M4340l5456o483O2508M8359p4011k0686P7088
5454G45086N047m2268J7685Q440j31704m0856J6742K1525L2953K6300L1205p3910
5442F16245O1191M5213l6313j07608k6443J35244m2246m2695M0035m1842J7370
$$ plain form
5431 618151 623324 565703 574890 608864 645576 558072 586385 662444 715636 691237 763525 853795
5419 853795 807601 747711 748881 764055 801963 807249 807381 856513 843865 788302 803102 744707
5407 744707 718017 803487 813897 831504 855328 871240 878182 859064 869342 855212 939197 946706
5395 946706 913793 941341 831557 876004 972900 914938 896534 939689 1003793 986341 1000522
5384 1000522 1041900 1024881 1003353 1082686 1154589 1157936 1203684 1177107 1142344 1192892 1167650 1200530
5372 1200530 1163627 1246885 1290719 1298694 1408988 1507718 1585174 1544656 1627152 1702579 1817998
5361 1817998 1915971 2049739 2142971 2218154 2255612 2267086 2284690 2254702 2202331 2248204 2265559
5350 2265559 2227945 2335835 2351496 2399778 2580462 2740343 2820520 3019600 3192692 3325479
$$ packed form
5431F18151N173n7621R187L3974L6712q7504K8313P6059N3192k4399P2288R0270
5419H53795m6194n9890J170J5174L7908N286J32M9132j2648n5563J4800n8395
5407G44707k6690Q5470J0410J7607K3824J5912O942j9118J0278j4130Q3985P509
5395I46706l2913K7548j09784M4447R6896n7962j8404M3155O4104j7452J4181
5384A000522M1378j7019k1528P9333P1903L347M5748k6577l4763N0548k5242L2880
5372A200530l6903Q3258M3834P975J10294R8730P7456m0518Q2496P5427J15419
5361A817998R7973J33768R3232P5183L7458J1474J7604k9988n2371M5873J7355
5350B265559l7614J07890J5661M8282J80684J59881Q0177J99080J73092J32787
$$ plain form
5340 3325479 3596610 3934957 4460731 5032421 5708752 6384861 6606885 5979572 5089274 4476743
5330 4476743 4069026 3781634 3528869 3434539 3308752 3273548 3231847 3324423 3402089 3394575 3430814
5319 3430814 3536299 3600032 3695475 3836936 4175127 4459262 4495487 4500222 4365518 4363231 4295580
5308 4295580 4276616 4486226 4665942 4824578 5120932 5299335 5488579 5779676 6202989 6733247
5298 6733247 7448577 8406357 9634753 10666964 11378609 11849680 12213444 11691992 10136867
5289 10136867 8657968 7593711 6892102 6382759 5968730 5726384 5499156 5393734 5287530
5280 5287530 5181616 5234885 5286103 5471546 5636705 5841273 6213254 6691846 6961045 6925388
5270 6925388 6558786 6116247 5816598 5585731 5485975 5474064 5420883 5412215 5474031 5513224 5688348
$$ packed form
5340C325479K71131L38347N25774N71690O76331O76109K22024o27313q90298o12531
5330D476743m07717k87392k52765r4330j25787l5204m1701R2576P7666p514L6239
5319C430814J05485O3733R5443J41461L38191K84135L6225M735j34704k287o7651
5308D295580j8964K09610J79716J58636K96354J78403J89244K91097M23313N30258
5298F733247P15330R57780J228396J032211P11645M71071L63764n21452j555125
5289A0136867j478899j064257p01609n09343m14029k42346k27228j05422j06204
5280E287530j05914N3269N1218J85443J65159K04568L71981M78592K69199l5657
5270F925388l66602m42539k99649k30867r9756j1911n3181q668O1816L9193J75124
$$ plain form
5259 5688348 5849005 6185690 6659794 7241126 7976976 8859916 9759081 9990779 9059038 7867983
5249 7867983 6992564 6314071 5930607 5657751 5503985 5321773 5176130 5057428 4984858 5036072
5239 5036072 5118942 5170963 5123846 5157251 5264662 5348472 5551138 5753813 5822308 5849035 5704791
5228 5704791 5398241 5128856 4980766 4891988 4773283 4733358 4793957 4799188 4759216 4797236 4789826
5217 4789826 4834158 4867240 4942896 5026149 4948224 4974718 5033062 5102552 5200987 5233209 5339084
5206 5339084 5460848 5550801 5697824 5851954 5960912 6040223 6175635 6376394 6559773 6719459
5196 6719459 6836862 7044043 7190024 7373038 7634111 7979308 8266616 8636172 9049756 9436117
5186 9436117 9846045 10363576 10986255 11737739 12587414 13730224 14989520 16474773 18423034
$$ packed form
5259E688348J60657L36685M74104N81332P35850Q82940Q99165K31698r31741j191055
5249G867983q75419o78493l83464k72856j53766j82212j45643j18702p2570N1214
5239E036072Q2870N2021m7117L3405J07411Q3810K02666K02675O8495K6727j44244
5228E704791l06550k69385j48090q8778j18705l9925O0599N231l9972L8020p410
5217D789826M4332L3082P5656Q3253p7925K6494N8344O9490R8435L2222J05875
5206E339084J21764Q9953J47023J54130J08958P9311J35412K00759J83379J59686
5196F719459J17403K07181J45981J83014K61073L45197K87308L69556M13584L86361
5186I436117M09928N17531O22679P51484Q49675J142810J259296J485253J948261
$$ plain form
5177 18423034 20884587 23868219 27125053 29327453 29483908 28201397 27010830 26677948
5169 26677948 26473845 25508384 24393744 23859292 24113779 25207061 27070225 29134102 29973184
5160 29973184 28688804 25734387 22899146 20917566 19692607 18750348 17853509 16962512 16170980
5151 16170980 15630223 15271490 15152493 15195300 15276538 15600400 16048679 16709076 17532402 18478342
5141 18478342 18962927 18300782 17196470 16388277 15948414 15799753 15860345 16070504 16354691
5132 16354691 16883668 17637540 18688885 19949193 21553405 23094705 24112193 24557169 25331655
5123 25331655 26785446 29124223 32334209 35551446 36926477 35461132 32357821 29418031
5115 29418031 27630940 26778219 26636993 26756471 27114844 28002842 29658676 32115386 34655128
$$ packed form
5177A8423034K461553K983632L256834K202400J56455j282511j190567l32882
5169B6677948k04103r65461j114640n34452K54487J093282J863164K063877Q39082
5160B9973184j284380k954417k835241j981580j224959r42259q96839q90997p91532
5151A6170980n40757l58733j18997M2807Q1238L23862M48279O60397Q23326R45940
5141A8478342M84585o62145j104312q08193m39863j48661O0592K10159K84187
5132A6354691N28977P53872J051345J260308J604212J541300J017488M44976P74486
5123B5331655J453791K338777L209986L217237J375031j465345l103311k939790
5115B9418031j787091q52721j41226J19478L58373Q87998J655834K456710K539742
$$ plain form
5106 34655128 35165513 32855568 28784439 25062372 22574759 20941114 19998044 19342098 18318686
5097 18318686 16823022 15243825 13883473 12933905 12189844 11529134 10888585 10541079 10332095
5088 10332095 10180257 10018213 9909719 9774137 9506270 9175395 8899089 8715622 8421227
5079 8421227 8245275 8063291 7873117 7742077 7609810 7544678 7451199 7440850 7389625 7302985
5069 7302985 7325741 7392344 7502525 7552948 7684961 7845728 7994284 8142369 8454446 8733120
5059 8733120 8840194 8758286 8564559 8248223 8099155 8012397 7945277 7889790 7879588 7917712 7966025
5048 7966025 8180612 8383096 8670259 8844496 8982726 8965434 8745604 8412354 8315194 8310256
5038 8310256 8244299 8308202 8378764 8387944 8487533 8506857 8511285 8502261 8519352 8528392 8535224 8502521
$$ packed form
5106C4655128N10385k309945m071129l722067k487613j633645r43070o55946j023412
5097A8318686j495664j579197j360352r49568p44061o60710o40549l47506k08984
5088A0332095j51838j62044j08494j35582k67867l30875k76306j83467k94395
5079H421227j75952j81984j90174j31040j32267o5132r3479j0349n1225q6640
5069G302985K2756O6603J10181N0423J32013J60767J48556J48085L12077K78674
5059H733120J07074q1908j93727l16336j49068q6758o7120n5487j0202L8124M8313
5048G966025K14587K02484K87163J74237J38230j7292k19830l33250r7160m938
5038H310256o5957O3903P0562R180R9589J9324M428r024J7091R040O832l2703
$$ plain form
5026 8502521 8492131 8586869 8616267 8587428 8652360 8712263 8705403 8757248 8882030 9033307 9173866
5015 9173866 9339659 9485272 9661686 9892634 10034888 10168080 10436714 10607883 10786011 10937198
5005 10937198 11051179 11222393 11441580 11597057 11699462 11799781 11945385 12164501 12417800
4996 12417800 12586175 12778427 12942586 13172614 13504494 13799501 14128183 14482312 14848871
4987 14848871 15251980 15636576 16041745 16446098 17039979 17550072 18014529 18376178 18655149
4978 18655149 18861819 18930493 18903519 18764261 18697297 18585710 18404748 18296180 18337058 18428638
4968 18428638 18607253 18904114 19297391 19726134 20149264 20595308 21043957 21536747 22067313
4959 22067313 22637362 23301495 23868566 24348590 24795041 25231653 25781175 26372112 26952079
$$ packed form
5026H502521j0390R4738K9398k8839O4932N9903o860N1845J24782J51277J40559
5015I173866J65793J45613J76414K30948J42254J33192K68634J71169J78128J51187
5005A0937198J13981J71214K19187J55477J02405J00319J45604K19116K53299
4996A2417800J68375J92252J64159K30028L31880K95007L28682L54129L66559
4987A4848871M03109L84596M05169M04353N93881N10093M64457L61649K78971
4978A8655149K06670O8674k6974j39258o6964j11587j80962j08568M0878R1580
4968A8428638J78615K96861L93277M28743M23130M46044M48649M92790N30566
4959B2067313N70049O64133N67071M80024M46451M36612N49522N90937N79967
$$ plain form
4950 26952079 27614485 28440951 29453491 30668236 31945054 33283537 34607018 35886077
4942 35886077 36932138 37943206 38798636 39409089 39987713 40480207 41044685 41602526 42300243
4933 42300243 43124344 44012503 44781960 45380997 45851459 46310086 46862827 47553265 48275709
4924 48275709 48952948 49374850 49524952 49689059 49939110 50240578 50811625 51461193 52223776
4915 52223776 53227195 54458676 55973950 57576149 59269046 61203840 63400261 65838355
4907 65838355 68556878 71463506 74594997 78194374 82291156 86738267 91384895 96183684
4899 96183684 100677787 103939971 105023197 103311721 99445708 95104604 91369356 88504631
4891 88504631 86218044 84053588 81678311 79148097 76527325 73680865 70428910 66855218
$$ packed form
4950B6952079O62406Q26466J012540J214745J276818J338483J323481J279059
4942C5886077J046061J011068Q55430O10453N78624M92494N64478N57841O97717
4933D2300243Q24101Q88159P69457N99037M70462M58627N52741O90438P22444
4924D8275709O77239M21902J50102J64107K50051L01468N71047O49568P62583
4915E2223776J003419J231481J515274J602199J692897J934794K196421K438094
4907F5838355K718523K906628L131491L599377M096782M447111M646628M798789
4899I6183684M494103L262184J083226j711476l866013m341104l735248k864725
4891H8504631k286587k164456k375277k530214k620772k846460l251955l573692
$$ plain form
4883 66855218 63269915 59615251 56212985 53119324 50230560 47571985 45044226 42639280
4875 42639280 40404756 38530065 36949458 35645779 34640067 33837092 32941184 32140385 31562692
4866 31562692 31178558 30852656 30560268 30329542 30009685 29737807 29435966 29129962 28970270
4857 28970270 28910410 28738510 28562511 28296603 27625110 26447592 24942106 23336867 21932474
4848 21932474 20729274 19750282 18850822 18147120 17551511 17041368 16611246 16173203 15857578
4839 15857578 15472347 15236232 15174980 15148826 15066500 14965697 15087708 15334021 15565520 15943878
4829 15943878 16434026 17164322 18024651 19090129 20561567 22405134 24749547 27641030 30831082
4820 30831082 32617017 31449938 28027705 24421435 21645523 19743783 18406342 17283192
$$ packed form
4883F6855218l585303l654664l402266l093661k888764k658575k527759k404946
4875D2639280k234524j874691j580607j303679j005712q02975q95908q00799n77693
4866C1562692l84134l25902k92388k30726l19857k71878l01841l06004j59692
4857B8970270n9860j71900j75999k65908o71493j177518j505486j605239j404393
4848B1932474j203200r78992q99460p03702n95609n10143m30122m38043l15625
4839A5857578l85231k36115o1252k6154q2326j00803J22011K46313K31499L78358
4829A5943878M90148P30296Q60329J065478J471438J843567K344413K891483L190052
4820C0831082J785935j167079l422233l606270k775912j901740j337441j123150
$$ plain form
4812 17283192 16339501 15709621 15193111 14794537 14555063 14283328 14158908 14032009 13988146 14115563
4802 14115563 14449774 14812227 15387678 16228732 17272322 18715461 20368276 22623598 25588652
4793 25588652 28966614 31824875 32137810 29316011 25253724 21897995 19530292 17757798
4785 17757798 16397169 15342738 14461575 13713639 13176566 12800488 12575683 12260364 12067459
4776 12067459 12131722 12281593 12506582 12897760 13470219 14237882 15278196 16668941 18408610
4767 18408610 20643888 22972626 24058017 22779083 19975193 17417355 15520052 14217407
4759 14217407 13234660 12506435 11816008 11222706 10920762 10617468 10310507 10110030 10012782 9924856
4749 9924856 9976143 10012747 10147839 10426647 10927838 11557925 12338505 13448035 14762270 16477844
$$ packed form
4812A7283192r43691o29880n16510l98574k39474k71735j24420j26899m3863J27417
4802A4115563L34211L62453N75451Q41054J043590J443139J652815K255322K965054
4793B5588652L377962K858261L12935k821799m062287l355729k367703j772494
4785A7757798j360629j054431q81163p47936n37073l76078k24805l15319j92905
4776A2067459O4263J49871K24989L91178N72459P67663J040314J390745J739669
4767A8408610K235278K328738J085391j278934k803890k557838j897303j302645
4759A4217407r82747p28225o90427n93302l01944l03294l06961k00477r7248q7926
4749I924856N1287L6604J35092K78808N01191O30087P80580J109530J314235J715574
$$ plain form
4739 16477844 18590476 21291551 23308055 23001677 20396514 17216544 14676338 12895732
4731 12895732 11623440 10642961 9753093 9108605 8433211 7934435 7532255 7116585 6743443
4722 6743443 6497340 6249245 5897400 5651576 5522331 5416681 5401536 5319803 5165463 5147208
4712 5147208 5106408 5039281 5019894 5002088 4820305 4773795 4711610 4648458 4538871 4548688 4477031
4701 4477031 4454423 4519023 4501947 4497351 4547699 4483167 4466635 4411930 4389637 4386521 4405256 4445253
4689 4445253 4427552 4359286 4389604 4459051 4448525 4431579 4348872 4293051 4199921 4058342 4063832
4678 4063832 4047326 3953584 3843249 3788175 3819466 3852723 3842243 3828798 3879366 3867579 3889388
4667 3889388 4007117 4094690 4213336 4372168 4531581 4639011 4703015 4731597 4765694 4870387
$$ packed form
4739A6477844K112632K701075K016504l06378k605163l179970k540206j780606
4731A2895732j272292r80479q89868o44488o75394m98776m02180m15670l73142
4722F743443k46103k48095l51845k45824j29245j05650j5145q1733j54340j8255
4712E147208m0800o7127j9387j7806j81783m6510o2185o3152j09587R817p1657
4701D477031k2608O4600j7076m596N0348o4532j6532n4705k2293l116J8735L9997
4689D445253j7701o8266L0318O9447j0526j6946q2707n5821r3130j41579N490
4678D063832j6506r3742j10335n5074L1291L3257j0480j3445N0568j1787K1809
4667C889388J17729Q7573J18646J58832J59413J07430O4004K8582L4097J04693
$$ plain form
4657 4870387 4758397 4692198 4665749 4543908 4418614 4339905 4279989 4213572 4122273 4009812 3933288
4646 3933288 3968922 3951714 3873867 3838877 3902438 3963242 3967111 4052009 4244288 4422893 4524144
4635 4524144 4683824 4815375 4840247 4786780 4694273 4642528 4571158 4505404 4427283 4311454 4316364
4624 4316364 4295718 4347961 4359279 4349274 4275894 4249962 4255920 4236420 4217665 4273576 4370261 4460693
4612 4460693 4488485 4577152 4750936 4824407 4978116 5035210 5029370 4970445 4978156 4971966 5048164 5041489
4600 5041489 5032411 4993523 5069033 5190278 5292980 5385429 5466479 5601615 5777084 5969341 6225248
4589 6225248 6551972 6855701 7263050 7374412 7137029 6828917 6690904 6655852 6737885 6740709
4579 6740709 6724881 6810902 6868201 6941975 7017408 7082574 7163132 7278055 7471224 7616767 7752042
$$ packed form
4657D870387j11990o6199k6449j21841j25294p8709n9916o6417r1299j12461p6524
4646C933288L5634j7208p7847l4990O3561O0804L869Q4898J92279J78605J01251
4635D524144J59680J31551K4872n3467r2507n1745p1370o5754p8121j15829M910
4624D316364k0646N2243J1318j0005p3380k5932N958j9500j8755N5911R6685R0432
4612D460693K7792Q8667J73784P3471J53709N7094n840n8925P711o190P6198o675
4600E041489r078l8888P5510J21245J02702R2449Q1050J35136J75469J92257K55907
4589F225248L26724L03729M07349J11362k37383l08112j38013l5052Q2033K824
4579F740709j5828Q6021N7299P3774P5433O5166Q0558J14923J93169J45543J35275
$$ plain form
4568 7752042 7907367 8025977 8166003 8292065 8461797 8743024 9109318 9425554 9512885 9311449
4558 9311449 9199726 9241792 9193358 9185827 9321215 9387343 9532389 9664580 9789046 9924857
4548 9924857 10060969 10133761 10230524 10295337 10333249 10437556 10555344 10640155 10730143 10806608 10922348
4537 10922348 11155127 11486061 11820707 12292993 12900389 13635245 14692781 16081088 17746935
4528 17746935 18687173 17684268 15680333 14157740 13367630 12762050 12281982 11999207 11707716
4519 11707716 11575883 11439603 11291550 11217270 11251389 11271682 11427924 11683463 12071934 12628941
4509 12628941 13571983 14620388 16041247 17869036 20278364 23069864 25071892 24587648
4501 24587648 21452612 18165383 15857017 14304481 13310593 12489574 11947033 11567212 11287445
$$ packed form
4568G752042J55325J18610J40026J26062J69732K81227L66294L16236Q7331k01436
4558I311449j11723M2066m8434p531J35388O6128J45046J32191J24466J35811
4548I924857J36112P2792R6763O4813L7912J04307J17788Q4811Q9988P6465J15740
4537A0922348K32779L30934L34646M72286O07396P34856J057536J388307J665847
4528A7746935R40238j002905k003935j522593p90110o05580m80068k82775k91491
4519A1707716j31833j36280j48053p4280L4119K0293J56242K55539L88471N57007
4509A2628941R43042J048405J420859J827789K409328K791500K002028m84244
4501B4587648l135036l287229k308366j552536r93888q21019n42541l79821k79767
$$ plain form
4492 11287445 11184560 11216850 11414316 11716848 12217727 13068799 14207328 15473166 16071171
4483 16071171 14987383 13130914 11540894 10446105 9780189 9318838 8917789 8558439 8345424
4474 8345424 8140148 8008280 7881058 7857244 7936412 7973016 7912691 7931116 7939803 7955627 7955296
4463 7955296 7985562 7987029 8006151 7991153 8003985 8043735 7983328 8067923 8079096 8110894 8137397 8254645
4451 8254645 8320272 8448129 8727773 9006211 9284705 9625629 9904347 9814020 9578888 9340335
4441 9340335 9143615 9120444 9199505 9381481 9617874 9925124 10241132 10432808 10599794 10688779
4431 10688779 10760899 10938547 11131849 11475328 11886957 12322916 12575518 12781240 13095558 13602237
4421 13602237 14208152 15057163 16014254 17105126 18550023 20211386 21853025 23470718 24677448
$$ packed form
4492A1287445j02885L2290J97466L02532N00879Q51072J138529J265838N98005
4483A6071171j083788j856469j590020j094789o65916m61351m01049l59350k13015
4474H345424k05276j31868j27222k3814P9168L6604o0325J8425Q687J5824l31
4463G955296L0266J467J9122j4998J2832L9750o0407Q4595J1173L1798K6503J17248
4451H254645O5627J27857K79644K78438K78494L40924K78718r0327k35132k38553
4441I340335j96720k3171P9061J81976K36393L07250L16008J91676J66986Q8985
4431A0688779P2120J77648J93302L43479M11629M35959K52602K05722L14318N06679
4421A3602237O05915Q49011R57091J090872J444897J661363J641639J617693J206730
$$ plain form
4412 24677448 25534437 26170026 26560875 26915271 27201549 27623869 28111342 28806482 29648593
4403 29648593 30624495 31479201 32246801 32914346 33439214 33948295 34441125 34751090 34917865
4394 34917865 34983981 34819118 34485266 33854883 32869023 31763324 30381942 28859001 27441362
4385 27441362 26109696 24942850 24018085 23266623 22603307 22004165 21599651 21387680 20891148
4376 20891148 20050202 18737801 17218812 15844785 14591579 13509636 12542461 11758077 11145155
4367 11145155 10656898 10153274 9705880 9259635 8897909 8576403 8250934 7833031 7411977
4358 7411977 7179925 7015130 6806875 6645231 6491481 6281148 6234403 6208056 6224497 6186161
4348 6186161 6213344 6251947 6181759 6197764 6245522 6129380 6033778 5864287 5746489 5682767 5619505
$$ packed form
4412B4677448Q56989O35589L90849L54396K86278M22320M87473O95140Q42111
4403B9648593R75902Q54706P67600O67545N24868N09081M92830L09965J66775
4394C4917865O6116j64863l33852o30383r85860j105699j381382j522941j417639
4385B7441362j331666j166846r24765p51462o63316n99142m04514k11971m96532
4376B0891148q40946j312401j518989j374027j253206j081943r67175p84384o12922
4367A1145155m88257n03624m47394m46245l61726l21506l25469m17903m21054
4358G411977k32052j64795k08255j61644j53750k10333m6745k6347J6441l8336
4348F186161K7183L8603p0188J6005M7758j16142r5602j69491j17798o3722o3262
$$ plain form
4337 5619505 5435275 5269295 5230054 5177647 5122593 5121705 5065633 4915068 4826569 4805335 4783970
4326 4783970 4770468 4612249 4448432 4389115 4243178 4123810 3948422 3718330 3534127 3419384
4316 3419384 3355364 3221647 3135384 3103843 3062244 3010348 2908623 2917053 2779922 2702962 2732318
4305 2732318 2707228 2686015 2622089 2571534 2505974 2468580 2490425 2479690 2420733 2445294 2429947
4294 2429947 2399436 2344674 2355070 2415203 2384302 2414923 2393324 2425655 2340558 2280952 2331013
4283 2331013 2363550 2264090 2277560 2287099 2315057 2313485 2364024 2351257 2196284 2189417 2268395 2281492
4271 2281492 2309157 2364256 2284231 2197894 2188770 2214194 2211028 2202691 2199130 2190216 2163598 2171489 2214716
4258 2214716 2215833 2331370 2396222 2292705 2225368 2162050 2228016 2323658 2295756 2262221 2260222
$$ packed form
4337E619505j84230j65980l9241n2407n5054q88n6072j50565q8499k1234k1365
4326D783970j3502j58219j63817n9317j45937j19368j75388k30092j84203j14743
4316C419384o4020j33717q6263l1541m1599n1896j01725Q430j37131p6960K9356
4305B732318k5090k1213o3926n0555o5560l7394K1845j0735n8957K4561j5347
4294B429947l0511n4762J0396O0133l0901L0621k1599L2331q5097n9606N0061
4283B331013L2537r9460J3470R539K7958j572N0539j2767j54973o867P8978J3097
4271B281492K7665N5099q0025q6337r124K5424l166q337l561q914k6618P891M3227
4258B214716J117J15537O4852j03517o7337o3318O5966R5642k7902l3535j999
$$ plain form
4247 2260222 2290674 2354074 2475725 2482664 2407418 2460078 2540577 2511980 2559163 2587710 2607320
4236 2607320 2720859 2744372 2756234 2803780 2901099 2927786 3003990 3016090 3134196 3172308 3161772
4225 3161772 3261707 3311394 3423529 3404429 3439718 3582103 3619079 3723591 3746284 3793208 3877221
4214 3877221 3932939 4038591 4209490 4374416 4559452 4592192 4663077 4926583 5114012 5355158
4204 5355158 5653020 6064015 6510708 6937079 7482549 8142579 8912962 9835972 10728582 10977650
4194 10977650 10655329 10182192 10121910 10243491 10447338 10881051 11573514 12439864 13582284
4185 13582284 15164843 16855341 18315969 18424129 17307512 16429755 16109979 16353917 17020964
4176 17020964 17854850 18431481 18297337 18251313 18781636 19926661 21013068 21430441 21642723
$$ packed form
4247B260222L0452O3400J21651O939p5246N2660Q0499k8597M7183K8547J9610
4236B607320J13539K3513J1862M7546R7319K6687P6204J2100J18106L8112j0536
4225C161772R9935M9687J12135j9100L5289J42385L6976J04512K2693M6924Q4013
4214C877221N5718J05652J70899J64926J85036L2740P0885K63506J87429K41146
4204E355158K97862M10995M46693M26371N45470O60030P70383R23010Q92610K49068
4194A0977650l22321m73137o0282J21581K03847M33713O92463Q66350J142420
4185A3582284J582559J690498J460628J08160j116617q77757l19776K43938O67047
4176A7020964Q33886N76631j34144m6024N30323J145025J086407M17373K12282
$$ plain form
4167 21642723 22023484 22047896 22175931 23011811 24038259 23688144 22025164 20582388 19897901
4158 19897901 19847170 20374158 21313143 22531878 23232136 22628638 21887981 21817399 22135809 22100670
4148 22100670 21654285 21235668 20269291 19103816 18494064 18442467 18578099 18373804 17881280
4139 17881280 17569001 17579756 17981401 18654731 19578200 19813587 18242752 16075472 14315655
4130 14315655 12991615 12036423 11525192 11173003 11028769 11129068 11351297 11717464 12219878
4121 12219878 12273997 11444243 10464711 9731859 9158669 8613586 8274424 8263679 8126386 7803585
4111 7803585 7593619 7488151 7312425 7141499 6883050 6642663 6549700 6477763 6442072 6459865
4101 6459865 6479698 6458785 6617145 6727861 6993250 7328829 7640076 7913051 7924493 7692194
$$ packed form
4167B1642723L80761K4412J28035Q35880J026448l50115j662980j442776o84487
4158A9897901n0731N26988R38985J218735P00258o03498p40657p0582L18410l5139
4148B2100670m46385m18617r66377j165475o09752n1597J35632k04295m92524
4139A7881280l12279J0755M01645O73330R23469K35387j570835k167280j759817
4130A4315655j324040r55192n11231l52189j44234J00299K22229L66167N02414
4121A2219878N4119q29754r79532p32852n73190n45083l39162j0745j37293l22801
4111G803585k09966j05468j75726j70926k58449k40387r2963p1937l5691J7793
4101F459865J9833k0913J58360J10716K65389L35579L11247K72975J1442k32299
$$ plain form
4091 7692194 7397823 7171667 7160439 7297780 7343966 7432318 7308106 7262783 7316718 7453703
4081 7453703 7486142 7426497 7225113 7010588 7014496 7059121 7299208 7659321 8077283 8628319
4071 8628319 9291457 10039203 10606057 10950743 11018625 10622623 9995364 9453932 8829035 8391691
4061 8391691 8255241 8306571 8522213 8927173 9474078 9850267 9507885 8797660 8434118 8364754
4051 8364754 8569077 8890185 8951158 8651170 8075768 7571171 7330523 7281180 7377795 7511480
4041 7511480 7519879 7300721 6990909 6558586 6226891 5749161 5361867 5129257 4945998 4887863
4031 4887863 4818556 4846404 4950128 4856987 4663255 4450248 4384067 4367775 4404334 4468379 4317936
4020 4317936 4127279 3994892 3795685 3734627 3590430 3471933 3388603 3274187 3232802 3316293
$$ packed form
4091G692194k94371k26156j1228J37341M6186Q8352j24212m5323N3935J36985
4081G453703L2439n9645k01384k14525L908M4625K40087L60113M17962N51036
4071H628319O63138P47746N66854L44686O7882l96002o27259n41432o24897m37344
4061H391691j36450N1330K15642M04960N46905L76189l42382p10225l63542o9364
4051H364754K04323L21108O0973k99988n75402n04597k40648m9343R6615J33685
4041G511480Q399k19158l09812m32323l31695m77730l87294k32610j83259n8135
4031D887863o9307K7848J03724r3141j93732k13007o6181j6292L6559O4045j50443
4020D317936j90657j32387j99207o1058j44197j18497q3330j14416m1385Q3491
$$ plain form
4010 3316293 3264289 3014920 2838099 2619023 2594295 2592100 2415988 2381510 2347876 2302438 2287922
3999 2287922 2304018 2308124 2290733 2359283 2387704 2413201 2589002 2577155 2511381 2406710 2322526
3988 2322526 2184542 2085540 2102094 2124391 2118428 2015079 1996244 2102652 2124908 2079375 2147434
3977 2147434 2053320 1987922 1967094 1978177 2024438 2016760 2008333 1988751 1891890 1834507 1819439 1803575
3965 1803575 1843965 1917188 1872425 1912200 1957455 1945887 1915685 1931108 1918934 1987046 1966786
3954 1966786 2034151 2053965 2048647 2141686 2220465 2312838 2415642 2456884 2581384 2793899 3062361
3943 3062361 3309487 3433116 3616907 3713445 3623303 3245458 2900619 2624843 2422384 2317044
3933 2317044 2150147 2064398 1985046 1895023 1940146 1986116 1910809 1808565 1792098 1774305 1786713
$$ packed form
4010C316293n2004k49369j76821k19076k4728k195j76112l4478l3634m5438j4516
3999B287922J6096M106j7391O8550K8421K5497J75801j1847o5774j04671q4184
3988B322526j37984r9002J6554K2297n963j03349j8835J06408K2256m5533O8059
3977B147434r4114o5398k0828J1083M6261p678q427j9582r6861n7383j5068j5864
3965A803575M0390P3223m4763L9775M5255j1568l0202J5423j2174O8112k0260
3954A966786O7365J9814n318R3039P8779R2373J02804M1242J24500K12515K68462
3943C062361K47126J23629J83791R6538r0142l77845l44839k75776k02459j05340
3933B317044j66897q5749p9352r0023M5123M5970p5307j02244j6467j7793J2408
$$ plain form
3922 1786713 1777164 1777137 1782946 1816091 1841356 1868082 1857075 1866585 1904153 1978820 2052629 2162499
3910 2162499 2242972 2303073 2353968 2315390 2322607 2399370 2611081 2845521 3037225 3282282 3723932
3899 3723932 4179529 4326112 3933739 3384837 3025475 2832110 2724624 2784026 2698479 2676922
3889 2676922 2720580 2798311 2902141 3025074 3209858 3543015 3950081 4064997 3710616 3240431
3879 3240431 2903313 2576499 2341586 2239755 2119318 2050807 2060758 2011609 1961461 1838615
3869 1838615 1918882 1956579 1796308 1762627 1781313 1796655 1695952 1700398 1671792 1703154 1630074
3858 1630074 1495162 1653629 1613027 1548541 1613670 1627905 1630868 1653995 1697021 1681163 1743998
3847 1743998 1839690 1924336 1994436 2058342 2200395 2327702 2497177 2542607 2514157 2365666 2309475
$$ packed form
3922A786713r549k7N809L3145K5265K6726j1007R510L7568P4667P3809J09870
3910B162499Q0473O0101N0895l8578P217P6763K11711K34440J91704K45057M41650
3899C723932M55597J46583l92373n48902l59362j93365j07486N9402q5547k1557
3889B676922M3658P7731J03830J22933J84784L33157M07066J14916l54381m70185
3879C240431l37118l26814k34913j01831j20437o8511R951m9149n0148j22846
3869A838615Q0267L7697j60271l3681J8686J5342j00703M446k8606L1362p3080
3858A630074j34912J58467m0602o4486O5129J4235K963K3127M3026j5858O2835
3847A743998R5692Q4646P0100O3906J42053J27307J69475M5430k8450j48491n6191
$$ plain form
3836 2309475 2238425 2237005 2243236 2374779 2368337 2425178 2572460 2743417 2832027 2977980 3280864
3825 3280864 3567761 3856696 3853041 3709895 3667229 3800223 3985038 3980043 3746239 3521588
3815 3521588 3495615 3456296 3473862 3684183 3820891 3881727 4091872 4433571 4642109 4670841
3805 4670841 4750798 4930687 5317142 5737099 5917102 5639630 5260959 5072371 5023535 5010071
3795 5010071 4942975 4919821 4881659 4701652 4619526 4607170 4608791 4702474 4832535 4876025 4797053
3784 4797053 4950571 5128715 5189129 5201808 5324206 5438846 5449239 5260862 4995414 4840354
3774 4840354 4789920 4856349 4905795 4920887 4927320 5002618 5122835 5176591 5297594 5346044 5488480
3763 5488480 5746819 5989451 6196263 6398441 6646872 6877813 7093036 7539792 8092420 8650692
$$ packed form
3836B309475p1050j420O231J31543o442N6841J47282J70957Q8610J45953L02884
3825C280864K86897K88935l655j43146m2666J32994J84815m995k33804k24651
3815C521588k5973l9319J7566K10321J36708O0836K10145L41699K08538K8732
3805D670841P9957J79889L86455M19957J80003k77472l78671j88588m8836j3464
3795E010071o7096k3154l8162j80007q2126j2356J621R3683J30061M3490p8972
3784D797053J53518J78144O0414J2679J22398J14640J0393j88377k65448j55060
3774D840354n0434O6429M9446J5092O433P5298J20217N3756J21003M8450J42436
3763E488480K58339K42632K06812K02178K48431K30941K15223M46756N52628N58272
$$ plain form
3753 8650692 9290290 10143069 11100080 12236878 13783224 15530442 17681548 20479541 23897160
3744 23897160 26550771 25589110 22074812 19073154 17124457 15916754 15128729 14647392 14431413
3735 14431413 14384759 14576849 15030851 15756814 16795562 18188130 19996033 22246532 25241120
3726 25241120 28982015 33585479 38275073 40865164 41582568 42013502 39994639 34529348
3718 34529348 28984425 24954057 22031714 19859791 18322659 17165486 16341073 15811895
3710 15811895 15484209 15488604 15681743 16231241 17148333 18507707 20321964 22794495 26010996
3701 26010996 29253294 29675588 25869964 21226306 17775122 15435543 13699188 12331779
3693 12331779 11222622 10238544 9399810 8771218 8241473 7790448 7351466 6937573 6618684
$$ packed form
3753H650692O39598Q52779R57011J136798J546346J747218K151106K797993L417619
3744B3897160K653611r61661l514298l001658j948697j207703p88025m81337k15979
3735A4431413m6654J92090M54002P25963J038748J392568J807903K250499K994588
3726B5241120L740895M603464M689594K590091P17404M30934k018863n465291
3718C4529348n544923m030368k922343k171923j537132j157173q24413n29178
3710A5811895l27686M395J93139N49498R17092J359374J814257K472531L216501
3701B6010996L242298M22294l805624m643658l451184k339579j736355j367409
3693A2331779j109157r84078q38734o28592n29745m51025m38982m13893l18889
$$ plain form
3684 6618684 6370268 6127445 5833660 5721031 5540359 5422350 5349517 5243526 5012512 4895607
3674 4895607 4885698 4840750 4796328 4669376 4590257 4496742 4442735 4445471 4480484 4396522 4366469 4411686
3662 4411686 4395463 4430073 4435440 4465214 4389673 4482917 4480399 4362303 4357609 4347346 4318078 4338850
3650 4338850 4336635 4304114 4313108 4309649 4306397 4331783 4323033 4352909 4445531 4508977 4599720 4753003
3638 4753003 4818935 4895044 4922072 4969015 5034795 5044228 5096089 5145777 5129011 5122684 5269781 5481134
3626 5481134 5537482 5545536 5645639 5624376 5742697 5905643 5989340 6097871 6291116 6429692
3616 6429692 6563350 6830828 7225626 7490891 7701903 7884678 8185517 8507958 8723202 8941128
3606 8941128 9056681 9082398 9109646 9181015 9154619 9163704 9229308 9240577 9238000 9263296 9393409
$$ packed form
3684F618684k48416k42823k93785j12629j80672j18009p2833j05991k31014j16905
3674D895607r909m4948m4422j26952p9119r3515n4007K736L5013q3962l0053M5217
3662D411686j6223L4610N367K9774p5541R3244k518j18096m694j0263k9268K0772
3650D338850k215l2521Q994l459l252K5386q750K9876R2622O3446R0743J53283
3638D753003O5932P6109K7028M6943O5780R433N1861M9688j6766o327J47097K11353
3626E481134N6348Q054J00103k1263J18321J62946Q3697J08531J93245J38576
3616F429692J33658K67478L94798K65265K11012J82775L00839L22441K15244K17926
3606H941128J15553K5717K7248P1369k6396R085O5604J1269k577K5296J30113
$$ plain form
3595 9393409 9625282 9903202 10115607 10325413 10611739 10881454 11215723 11631988 12025616 12439866
3585 12439866 12868434 13253090 13754325 14329412 14999695 15711100 16628995 17735680 19292606
3576 19292606 21290178 23807209 27080962 30793090 33846558 34461777 32057417 28871707
3568 28871707 26462910 24989733 24425175 24625664 25332840 26555236 28511818 31227095 34304763
3559 34304763 36115667 35331500 32291294 28932315 26721938 25771386 25657122 26310255 27675469
3550 27675469 29636558 31572105 32165143 30467151 27681370 25306272 23814481 23157718
3542 23157718 23037231 23457164 24358939 25663644 27562357 29925601 31722950 31349578 28838679
3533 28838679 25512738 22648007 20435171 18633239 17193339 16027685 15057693 14283889
$$ packed form
3595I393409K31873K77920K12405K09806K86326K69715L34269M16265L93628M14250
3585A2439866M28568L84656N01235N75087O70283P11405R17895J106685J556926
3576A9292606J997572K517031L273753L712128L053468O15219k404360l185710
3568B8871707k408797j473177n64558K00489P07176J222396J956582K715277L077668
3559C4304763J810904p84167l040206l358979k210377r50552j14264O53133J365214
3550B7675469J961089J935547N93038j697992k785781k375098j491791o56763
3542B3157718j20487M19933R01775J304705J898713K363244J797349l73372k510899
3533B8838679l325941k864731k212836j801932j439900j165654r69992p73804
$$ plain form
3525 14283889 13659053 13129119 12770427 12550099 12354574 12124742 12031873 11968879 11999421 12005549
3515 12005549 12010392 11885532 11689973 11467191 11160479 10784481 10468631 9986016 9561709 9081358
3505 9081358 8569919 8214080 7735210 7450460 7262773 6884092 6564918 6388066 6302425 6148520
3495 6148520 5921740 5875601 5710875 5663877 5538895 5490272 5409953 5348064 5359520 5401066 5438300
3484 5438300 5428746 5463614 5567722 5669315 5849294 6051427 6302877 6779723 7084736 7030753
3474 7030753 6628089 6236159 6012414 5934257 5921997 5998792 6227520 6500836 6908601 7122863
3464 7122863 6676920 6131702 5772012 5526130 5323039 5324616 5306404 5371725 5445565 5674706
3454 5674706 6032285 6313159 6331202 6162629 5973753 5809675 5734173 5627940 5685962 5880090
$$ packed form
3525A4283889o24836n29934l58692k20328j95525k29832r2869o2994L0542O128
3515A2005549M843j24860j95559k22782l06712l75998l15850m82615m24307m80351
3505I081358n11439l55839m78870k84750j87687l78681l19174j76852q5641j53905
3495F148520k26780m6139j64726m6998j24982m8623q0319o1889J1456M1546L7234
3484E438300r554L4868J04108J01593J79979K02133K51450M76846L05013n3983
3474G030753m02664l91930k23745p8157j2260P6795K28728K73316M07765K14262
3464G122863m45943n45218l59690k45882k03091J577j8212O5321P3840K29141
3454E674706L57579K80874J8043j68573j88876j64078p5502j06233N8022J94128
$$ plain form
3444 5880090 6170959 6472063 6603520 6444977 6087327 5874684 5875537 6038042 6163278 6076462
3434 6076462 6012855 5870676 5686426 5562791 5383249 5126832 4928727 4778900 4670207 4583080
3424 4583080 4586002 4553225 4645823 4608022 4562135 4550298 4413878 4376992 4411855 4449468 4516996
3413 4516996 4567191 4628837 4748873 4860777 4861172 4868252 4789670 4776157 4831397 4842641 4740248
3402 4740248 4699519 4652575 4670103 4642693 4575738 4500269 4382111 4246200 4139144 4087783 3980901
3391 3980901 3933141 3885881 3858113 3821738 3792293 3806311 3830923 3834202 3781913 3781728 3870288 3950596
3379 3950596 3991351 4054974 4178618 4288192 4383803 4435429 4550192 4658330 4642309 4787698
3369 4787698 4942900 5004640 5196219 5251915 5428563 5631846 5919011 6188090 6440791 6769387
$$ packed form
3444E880090K90869L01104J31457j58543l57650k12643Q53J62505J25236q6816
3434F076462o3607j42179j84250j23635j79542k56417j98105j49827j08693q7127
3424D583080K922l2777R2598l7801m5887j1837j36420l6886L4863L7613O7528
3413D516996N0195O1646J20036J11904L95P080p8582j3513N5240J1244j02393
3402D740248m0729m6944J7528k7410o6955p5469j18158j35911j07056n1361j06882
3391C980901m7760m7260k7768l6375k9445J4018K4612L279n2289j85Q8560Q0308
3379C950596M0755O3623J23644J09574R5611N1626J14763J08138j6021J45389
3369D787698J55202O1740J91579N5696J76648K03283K87165K69079K52701L28596
$$ plain form
3359 6769387 7172037 7556286 7869590 8026583 8227501 8291129 8281388 8170342 8081571 8163275
3349 8163275 8262155 8315991 8258213 8265257 8334006 8367029 8411767 8498537 8485119 8512957 8685000
3338 8685000 8805799 8875371 9031073 9140693 9189459 9168076 9091673 8954397 8756273 8536424
3328 8536424 8451096 8343821 8032514 7793357 7494159 7174578 6807874 6605595 6439403 6264527
3318 6264527 6139170 6145820 6108673 5984004 5945100 5873884 5809522 5690856 5582987 5561071 5458179
3307 5458179 5404766 5440033 5388491 5434085 5472193 5470318 5449183 5433395 5483674 5507251 5489389 5648683
3295 5648683 5705809 5676389 5813467 5879649 6054329 6241450 6448942 6510282 6644802 6876903
3285 6876903 7157100 7512731 7634397 7771343 7827839 7831267 7817139 7938507 7907850 7795732
$$ packed form
3359F769387M02650L84249L13304J56993K00918O3628r741j11046q8771Q1704
3349H163275R8880N3836n7778P044O8749L3023M4738Q6770j3418K7838J72043
3338H685000J20799O9572J55702J09620M8766k1383p6403j37276j98124k19849
3328H536424q5328j07275l11307k39157k99198l19581l66704k02279j66192j74876
3318F264527j25357O650l7147j24669l8904p1216o4362j18666j07869k1916j02892
3307E458179n3413L5267n1542M5594L8108j875k1135j5788N0279K3577j7862J59294
3295E648683N7126k9420J37078O6182J74680J87121K07492O1340J34520K32101
3285F876903K80197L55631J21666J36946N6496L428j4128J21368l0657j12118
$$ plain form
3275 7795732 7864593 7852463 7760116 7763702 7797950 7989941 8051637 8125168 8256608 8428065 8583124
3264 8583124 8847848 9082217 9238911 9432121 9559143 9710524 9827708 9860961 9742540 9466365
3254 9466365 9217200 9107235 8942273 8774381 8615103 8446056 8311041 8192338 8075497 7930462
3244 7930462 7844695 7813810 7803780 7832890 7848781 7877753 7816530 7900366 8051326 8233847 8353689
3233 8353689 8466596 8729740 9064857 9374566 9762705 10205418 10662904 11159896 11415611 11298237
3223 11298237 11133340 11133574 11201462 11299475 11414436 11599134 11758491 11917551 12094252 12329943
3213 12329943 12516738 12690243 12958353 13324437 13598451 13726803 13843313 14011800 14025821 14161539
3203 14161539 14324700 14522662 14681054 14891165 15097944 15222058 15323499 15573956 15844562
$$ packed form
3275G795732O8861j2130r2347L586L4248J91991O1696P3531J31440J71457J55059
3264H583124K64724K34369J56694J93210J27022J51381J17184L3253j18421k76175
3254I466365k49165j09965j64962j67892j59278j69047j35015j18703j16841j45035
3244G930462q5767l0885j0030K9110J5891K8972o1223Q3836J50960J82521J19842
3233H353689J12907K63144L35117L09709L88139M42713M57486M96992K55715j17374
3223A1298237j64897K34O7888R8013J14961J84698J59357J59060J76701K35691
3213A2329943J86795J73505K68110L66084K74014J28352J16510J68487J4021J35718
3203A4161539J63161J97962J58392K10111K06779J24114J01441K50457K70606
$$ plain form
3194 15844562 16100496 16405463 16662897 16856441 17136312 17400925 17681916 18012434 18353736
3185 18353736 18583218 18752981 19107629 19552090 19822001 20122676 20437252 20733626 21059959
3176 21059959 21493985 21950195 22389577 22919468 23557374 24174231 24741619 25410944 26098493
3167 26098493 26810863 27519210 28365214 29354410 30388792 31504666 32778908 34183807 35639364
3158 35639364 37110181 38549471 40094159 41779432 43779698 45784934 47810148 50069547
3150 50069547 52534203 55316080 58523077 62057246 65937406 70031072 74552775 79851271
3142 79851271 86289532 93937683 102980427 113640562 126467107 142342768 161861501 185781811
3134 185781811 215661528 252488987 295850824 334937370 351542302 347115925 327184445
$$ packed form
3194A5844562K55934L04967K57434J93544K79871K64613K80991L30518L41302
3185A8353736K29482J69763L54648M44461K69911L00675L14576K96374L26333
3176B1059959M34026M56210M39382N29891O37906O16857N67388O69325O87549
3167B6098493P12370P08347Q46004R89196J034382J115874J274242J404899J455557
3158C5639364J470817J439290J544688J685273K000266K005236K025214K259399
3150E0069547K464656K781877L206997L534169L880160M093666M521703N298496
3142G9851271O438261P648151R042744J0660135J2826545J5875661J9518733K3920310
3134A85781811K9879717L6827459M3361837L9086546J6604932m426377j9931480
$$ plain form
3127 327184445 310245014 301166831 286737777 262839203 230731949 200548316 177691805
3120 177691805 161328036 149989577 142366750 137422908 133399188 127295624 118012040 106423502
3112 106423502 95120933 85633119 77922839 71613988 66380919 61959513 58088494 54711822
3104 54711822 52020214 49489408 47361778 45644782 44171975 42812700 41392634 39957169
3096 39957169 38713732 37710161 36763900 35678265 34746067 33801101 32894121 31981679 31127057
3087 31127057 30179216 29387214 28782200 28217534 27574606 26969031 26389608 25819280 25316703
3078 25316703 24842736 24266663 23768152 23231150 22698172 22196430 21658541 21097390 20630785
3069 20630785 20173815 19840988 19579396 19364514 19201819 19101801 18845428 18610389 18429440
$$ packed form
3127C27184445j6939431r078183j4429054k3898574l2107254l0183633k2856511
3120A77691805j6363769j1338459p622827m943842m023720o103564r283584j1588538
3112A06423502j1302569r487814p710280o308851n233069m421406l871019l376672
3104E4711822k691608k530806k127630j716996j472807j359275j420066j435465
3096C9957169j243437j003571r46261j085635r32198r44966r06980r12442q54622
3087C1127057r47841p92002o05014n64666o42928o05575n79423n70328n02577
3078B5316703m73967n76073m98511n37002n32978n01742n37889n61151m66605
3069B0630785m56970l32827k61592k14882j62695j00018k56373k35039j80949
$$ plain form
3060 18429440 18238249 18154046 18150512 18151301 18257341 18404507 18577842 18934921 19457454 20001491
3050 20001491 20434068 20291221 19759379 19250889 18881238 18777321 18852379 18991775 19172184 19437054
3040 19437054 19725267 20243231 20803205 21212204 21728732 22281516 22981706 23987596 25209036
3031 25209036 26872816 28955780 31493053 34585196 38591710 43664228 49948872 56227979
3023 56227979 62938189 71600981 80143234 83119843 76197934 64125259 53257065 44990299
3015 44990299 38775084 34096743 30505691 27477946 24831926 22602768 20779628 19303021
3007 19303021 17971369 16770831 15871568 14959701 14190662 13528704 12896713 12355599 11853352
2998 11853352 11295334 10815486 10433016 10074006 9668281 9308465 9085926 8742505 8384438
$$ packed form
3060A8429440j91191q4203l534P89J06040J47166J73335L57079N22533N44037
3050B0001491M32577j42847n31842n08490l69651j03917P5058J39396J80409K64870
3040A9437054K88213N17964N59974M08999N16528N52784P00190J005890J221440
3031B5209036J663780K082964K537273L092143M006514N072518O284644O279107
3023E6227979O710210Q662792Q542253K976609o921909j2072675j0868194q266766
3015D4990299o215215m678341l591052l027745k646020k229158j823140j476607
3007A9303021j331652j200538q99263r11867p69039o61958o31991n41114n02247
2998A1853352n58018m79848l82470l59010m05725l59816k22539l43421l58067
$$ plain form
2989 8384438 8135879 7823064 7606965 7415575 7135360 6826645 6601300 6384993 6237233 6169802
2979 6169802 5988230 5773989 5580484 5242896 5066960 4972663 4904600 4789585 4641508 4593417
2969 4593417 4512919 4464333 4395184 4248984 4129984 4049639 3961304 3847448 3800871 3783064 3763259
2958 3763259 3665133 3627561 3615454 3599281 3563019 3520757 3572225 3569604 3530203 3508855 3420264 3460238
2946 3460238 3510150 3402788 3311902 3381859 3354360 3378799 3408844 3354755 3413610 3436150 3408776
2935 3408776 3403234 3288453 3136281 3055597 2969196 2848347 2786040 2803614 2719738 2711106 2785836
2924 2785836 2803883 2756758 2665079 2579801 2479570 2463397 2431447 2390133 2301022 2278862 2233281
2913 2233281 2213299 2247658 2176124 2142836 2063148 1963292 2060719 2043527 1959831 1926007 1905771
$$ packed form
2989H384438k48559l12815k16099j91390k80215l08715k25345k16307j47760o7431
2979F169802j81572k14241j93505l37588j75936r4297o8063j15015j48077m8091
2969D593417q0498m8586o9149j46200j19000q0345q8335j13856m6577j7807j9805
2958C763259r8126l7572j2107j6173l6262m2262N1468k621l9401k1348q8591L9974
2946C460238M9912j07362r0886O9957k7499K4439L0045n4089N8855K2540k7374
2935C408776n542j14781j52172q0684q6401j20849o2307J7574q3876q632P4730
2924B785836J8047m7125r1679q5278j00231j6173l1950m1314q9111k2160m5581
2913B233281j9982L4359p1534l3288p9688r9856R7427j7192q3696l3824k0236
$$ plain form
2902 1905771 1932220 2022772 2071918 2028581 1974483 1933520 1911858 1922940 1902295 1941930 1928020
2891 1928020 1906297 1931300 1896310 1822560 1792550 1751098 1708268 1768162 1626517 1581484 1578786
2880 1578786 1512129 1439836 1413598 1387547 1329656 1229086 1160391 1115759 1027303 1074875 1066644
2869 1066644 1019080 986618 982302 948112 985333 980721 891034 941538 878235 935305 936845 962205
2857 962205 1026307 1048702 1070969 1136943 1162933 1147750 1103754 1152799 1189117 1273720 1270071 1281342
2845 1281342 1309192 1333976 1340833 1379793 1341763 1327571 1440433 1416733 1392158 1501937 1525968
2834 1525968 1552832 1604564 1682625 1769527 1775204 1864183 1945007 2027771 2106078 2310418 2460456
2823 2460456 2655802 2882592 3008950 2934604 2857428 2862526 2739766 2688575 2585465 2497463 2344628
$$ packed form
2902A905771K6449R0552M9146m3337n4098m0963k1662J1082k0645L9635j3910
2891A928020k1723K5003l4990p3750l0010m1452m2830N9894j41645m5033k698
2880A578786o6657p2293k6238k6051n7891j00570o8695m4632q8456M7572q231
2869A066644m7564l2462m316l4190L7221m612q9687N0504o3303N7070J540K5360
2857I62205O4102K2395K2267O5974K5990j5183m3996M9045L6318Q4603l649J1271
2845A281342K7850K4784O857L8960l8030j4192J12862k3700k4575J09779K4031
2834A525968K6864N1732P8061Q6902N677Q8979Q0824Q2764P8307K04340J50038
2823B460456J95346K26790J26358p4346p7176N098j22760n1191j03110q8002j52835
$$ plain form
2812 2344628 2218007 2246213 2212847 2189590 2225337 2315039 2282476 2269272 2237744 2133438 2098159
2801 2098159 2209670 2392696 2474228 2650615 2964545 3282545 3608779 4091418 4688178 5430190
2791 5430190 6215989 6283740 5502853 4594102 3882365 3379295 3030677 2785601 2473069 2323231
2781 2323231 2179508 2054064 2034838 2033632 1878435 1694747 1554458 1430013 1282636 1171585
2771 1171585 1060100 1013954 939079 890263 858563 809323 840462 806892 813918 748793 767738
2760 767738 828602 824915 837274 894007 923520 927171 834997 760769 689675 739745 650075 635045
2748 635045 615560 609107 668777 639510 606775 694683 680271 691140 765992 823520 795921 818062
2736 818062 916766 960590 1037953 1046646 941917 905266 823136 788612 714638 654702 687372 668855
$$ packed form
2812B344628j26621K8206l3366k3257L5747Q9702l2563j3204l1528j04306l5279
2801B098159J11511J83026Q1532J76387L13930L18000L26234M82639N96760P42012
2791E430190P85799O7751p80887r08751p11737n03070l48618k45076l12532j49838
2781B323231j43723j25444j9226j206j55197j83688j40289j24445j47377j11051
2771A171585j11485m6146p4875m8816l1700m9240L1139l3570P026o5125J8945
2760G67738O0864l687J2359N6733K9513L651r2174p4228p1094N0070q9670j5030
2748F35045j9485o453N9670k9267l2735Q7908j4412J0869P4852N7528k7599K2141
2736H18062R8704M3824P7363Q693j04729l6651q2130l4524p3974n9936L2670j8517
$$ plain form
2724 668855 672178 661294 659019 648499 648189 660679 644818 614779 650179 810139 844398 947621
2712 947621 973252 997607 813952 580594 608454 560985 440857 427752 388789 309748 381317
2701 381317 404057 387408 320528 256999 336204 339991 319713 370255 315662 246652 239310 251609
2689 251609 348122 366389 246702 193212 119534 165876 265624 244082 184156 179939 221421 277570
2677 277570 217942 159868 135420 161710 175014 191234 83514 95108 111100 50322 53348 87477
2665 87477 87296 127545 80167 -12424 53949 -23576 -57985 70009 34501 28157 15717 111118
2653 111118 54429 14962 -19198 14386 8456 9936 74939 57110 45471 94011 93786 200851
2641 200851 147723 124940 105848 69766 128470 167951 151525 89793 148579 124161 125122 96763
$$ packed form
2724F68855L323j0884k275j0520l10J2490j5861l0039L5400J59960L4259J03223
2712I47621K5631K4355j83655k33358K7860m7469j20128j3105l8963p9041P1569
2701C81317K2740j6649o6880o3529P9205L787k0278N0542n4593o9010p342J2299
2689B51609R6513J8267j19687n3490p3678M6342R9748k1542n9926m217M1482N6149
2677B77570n9628n8074k4448K6290J3304J6220j07720J1594J5992o0778L026L4129
2665H7477j81M0249m7378r2591O6373p7525l4409J27994l5508o344j2440R5401
2653A11118n6689l9467l4160L3584n930J480O5003j7829j1639M8540k25J07065
2641B00851n3128k2783j9092l6082N8704L9481j6426o1732N8786k4418R61k8359
$$ plain form
2629 96763 134740 103742 190167 116582 91475 70333 35238 49733 97133 47550 3714 -33797
2617 -33797 -114947 -45129 -7670 -19389 -13439 -28521 49535 3236 -21574 -7389 -29964 -18209
2605 -18209 -3113 -59971 -68124 -42002 39698 -3631 -1492 -1601 -46082 -46119 -1903 36723 36621 60622
2591 60622 88426 95640 37055 51277 60701 59823 39900 145194 61014 35011 32600 103018 85488
2578 85488 -22359 -10194 18175 27922 17580 -3721 -165 40874 94228 16666 -30664 23106
2566 23106 96056 98478 30556 22868 13921 31922 19256 -10732 -19815 -26170 -36464 -49066 -5057
2553 -5057 45981 -13272 -26318 -37100 -88332 -92370 -108653 -9200 69251 76607 58377 116642
2541 116642 151249 204554 104490 18705 58147 13140 37661 118343 172290 129330 51635
$$ packed form
2629I6763L7977l0998Q6425p3585k5107k1142l5095J4495M7400m9583m3836l7511
2617c3797q1150O9818L7459j1719N950j5082P8056m6299k4810J4185k2575J1755
2605a8209J5096n6858q153K6122Q1700m3329K139j09m4481l7M4216L8626j02K4001
2591F0622K7804P214n8585J4222R424q78j9923J05294q4180k6003k411P0418j7530
2578H5488j07847J2165K8369R747j0342k1301L556M1039N3354p7562m7330N3770
2566B3106P2950K422o7922p688q947J8001j2666k9988r083o355j0294j2602M4009
2553e057N1038n9253j3046j0782n1232m038j6283R9453P8451P356j8230N8265
2541A16642L4607N3305j00064q5785L9442m5007K4521Q0682N3947m2960p7695
$$ plain form
2530 51635 104586 74589 47953 -1802 -9375 89856 -43900 74266 122915 80844 68110 36084
2518 36084 48896 16141 22451 64389 90163 88917 32312 -54069 4552 137729 176235 98524
2506 98524 5232 -10551 -32141 20422 25252 23077 -22539 -14174 25263 47425 34435 39775 22418
2493 22418 5233 8788 57093 135060 166249 110473 87055 167410 124052 98482 65426 40261
2481 40261 -30279 -25848 25150 -31516 -5437 34438 -25022 -33217 1617 -8501 29219 16930
2469 16930 -14431 -33001 -12831 4619 27023 15446 2796 61917 53919 66847 26962 49297
2457 49297 84071 63472 6034 26116 19765 24234 15603 16017 42400 25045 42939 45990 11828
2444 11828 51606 107300 144327 190817 140441 146757 94339 115363 72296 102555 47099 19625
$$ packed form
2530E1635N2951k9997k6636m9755p573R9231j33756J18166M8649m2071j2734l2026
2518C6084J2812l2755O310M1938K5774j246n6605q6381N8621J33177L8506p7711
2506I8524r3292j5783k1590N2563M830k175m5616Q365L9437K2162j2990N340j7357
2493B2418j7185L555M8305P7967L1189n5776k3418Q0355m3358k5570l3056k5165
2481D0261p0540M431N0998n6666K6079L9875n9460q195L4834j0118L7720j2289
2469A6930l1361j8570K0170J7450K2404j1577j2650N9121p998J2928l9885K2335
2457D9297L4774k0599n7438K0082o351M469q631M14K6383j7355J7894L051l4162
2444A1828L9778N5694L7027M6490n0376O316n2418K1024m3067L0259n5456k7474
$$ plain form
2432 19625 80064 101089 130317 13514 -27559 120795 87320 26682 52566 117236 129942
2421 129942 128542 69542 52421 96811 127382 136634 154839 127075 23961 -17991 -29577 -24267
2409 -24267 -62584 -17874 -22716 -19273 -53434 2131 48910 64418 -17952 -2644 -1548 27625
2397 27625 62117 73855 42472 -18686 53160 32553 -70218 -22410 -3974 -27031 4675 26902
2385 26902 1758 56969 52460 49821 77929 108083 137359 156864 170396 161788 171884 101491
2373 101491 119193 89720 90069 78386 17404 -21359 9316 42435 -9676 -28226 -33166 72224
2361 72224 82108 112947 92694 165260 226518 175931 162455 154436 190049 159443 173560 112122
2349 112122 77602 111703 39458 44746 93220 71940 70457 79643 80818 31404 96220 130350
$$ packed form
2432A9625O0439K1025K9228j16803m1073J48354l3475o0638K5884O4670J2706
2421A29942j400n9000j7121M4390L0571R252J8205k7764j03114m1952j1586N310
2409b4267l8317M4710m842L443l4161N5565M6779J5508q2370J5308J096K9173
2397B7625L4492J1738l1383o1158P1846k0607j02771M7808J8436k3057L1706K2227
2385B6902k5144N5211m509k639K8108L0154K9276J9505J3532q608J0096p0393
2373A01491J7702k9473L49j1683o0982l8763L0675L3119n2111j8550m940J05390
2361G2224R884L0839k0253P2566O1258n0587j3476q019L5613l0606J4117o1438
2349A12122l4520L4101p2245N288M8474k1280j483R186J175m9414O4816L4130
$$ plain form
2337 130350 185135 197417 144884 121435 152038 199269 211251 218344 235689 259999 281717 232243
2325 232243 233516 287828 256270 266259 229031 137274 124445 167799 123500 95728 100893 187499
2313 187499 127351 195335 246738 135173 159466 121177 126049 138816 61239 -10708 63989 57202
2301 57202 9332 70485 92337 89031 210879 283778 246088 224456 230735 237391 354880 371521
2289 371521 438894 483535 432293 393562 357808 379321 435547 314521 251563 289503 301734
2278 301734 309399 278302 232309 240240 313497 339114 397737 352692 406660 408901 421880 431237
2266 431237 458700 422365 411198 408346 464420 464884 443163 541987 502787 541578 531967 451014
2254 451014 473107 496511 560969 628874 644915 577092 509388 578680 564701 595547 664382 661947
$$ packed form
2337A30350N4785J2282n2533k3449L0603M7231J1982P093J7345K4310K1718m9474
2325B32243J273N4312l1558R989l7228r1757j2829M3354m4299k7772N165Q6606
2313A87499o0148O7984N1403j11565K4293l8289M872J2767p7577p1947P4697o787
2301E7202m7870O1153K1852l306J21848P2899l7690k1632O279O656J17489J6641
2289C71521O7373M4641n1242l8731l5754K1513N6226j21026o2958L7940J2231
2278C01734P665l1097m5993P931P3257K5617N8623m5045N3968K241J2979R357
2266D31237K7463l6335j1167k852N6074M64k1721R8824l9200L8791r611q0953
2254D51014K2093K3404O4458O7905J6041o7823o7704O9292j3979L0846O8835k435
$$ plain form
2242 661947 612199 600135 635377 671256 624947 644058 713346 709714 656688 706906 743081 737479
2230 737479 804908 909934 915032 963698 1120466 1165157 1220947 1222962 1189053 1238102 1234348 1148010
2218 1148010 991810 901464 888423 895083 892518 897728 908176 856815 825007 820464 835999 901221
2206 901221 980284 1077297 1123113 1108906 1151060 1125989 1182815 1159982 1190057 1306849 1338078
2195 1338078 1397948 1422207 1443061 1650670 1814349 1922773 2000063 1976313 1976466 1972702 2001140
2184 2001140 1984156 1945662 2003703 2049013 2103156 2196038 2263231 2418352 2484696 2678845 2761527
2173 2761527 2934020 3011866 2947430 3019408 2955580 2838775 2626741 2344447 2202940 2079615
2163 2079615 2000572 1894520 1779790 1751855 1660803 1663975 1613163 1507794 1458353 1381145 1457515
$$ packed form
2242F61947m9748j2064L5242L5879m6309J9111O9288l632n3026N0218L6175n602
2230G37479O7429J05026N098M8666J56768M4691N5790K015l3909M9049l754q6338
2218A148010j56200r0346j3041O660k565N210J0448n1361l1808m543J5535O5222
2206I01221P9063R7013M5816j4207M2154k5071N6826k2833L0075J16792L1229
2195A338078N9870K4259K0854K07609J63679J08424P7290k3750J53l764K8438
2184B001140j6984l8494N8041M5310N4143R2882O7193J55121O6344J94149Q2682
2173B761527J72493P7846o4436P1978o3828j16805k12034k82294j41507j23325
2163B079615p9043j06052j14730k7935r1052L172n0812j05369m9441p7208P6370
$$ plain form
2152 1457515 1390983 1262946 1214274 1126517 1096293 1071457 970835 921026 978535 939212 859908
2141 859908 779657 808601 807457 814117 838634 778064 742646 765068 711103 727945 825348 874320
2129 874320 845954 820629 797037 765501 673993 682427 698767 653288 632862 682241 619674 662429
2117 662429 585337 538666 544118 584763 610936 594028 568158 545342 554348 643154 654709 626636
2105 626636 678773 670944 624755 608338 706019 698763 717873 692348 680809 779335 782914 816345
2093 816345 948600 1014214 1150443 1193491 1068659 936070 818981 719249 707872 699589 643133
2082 643133 622454 568560 503173 524746 563478 554477 524671 549893 555872 490611 466588 549812
2070 549812 590185 572094 574110 593815 591917 610250 674307 772387 901626 1020759 1058349 866181
$$ packed form
2152A457515o6532j28037m8672q7757l0224k4836j00622m9809N7509l9323p9304
2141H59908q0251K8944j144O660K4517o0570l5418K2422n3965J6842R7403M8972
2129H74320k8366k5325k3592l1536r1508Q434J6340m5479k0426M9379o2567M2755
2117F62429p7092m6671N452M0645K6173j6908k5870k2816R006Q8806J1555k8073
2105F26636N2137p829m6189j6417R7681p256J9110k5525j1539R8526L579L3431
2093H16345J32255O5614J36229M3048j24832j32589j17089r9732j1377q283n6456
2082F43133k0679n3894o5387K1573L8732r001k9806K5222N979o5261k4023Q3224
2070E49812M0373j8091K016J9705j898J8333O4057R8080J29239J19133L7590j92168
$$ plain form
2058 866181 652541 562218 478175 401093 355262 299612 291948 344278 282847 318113 300906 266999
2046 266999 204233 201374 222680 162409 172228 139224 185671 234131 176871 157354 99822 51306
2034 51306 79275 101024 76188 90870 77941 112301 147237 195895 207675 183108 153062 105690
2022 105690 117642 186658 174506 99577 123146 122328 95124 43281 -3207 63634 69793 52351
2010 52351 21841 67353 88692 89056 121645 121064 138323 131528 98740 80664 47907 65230 49238
1997 49238 40565 66554 106789 168321 106438 49650 34342 78368 18895 36893 118893 140110
1985 140110 180451 99356 49120 105899 83461 82561 129422 67106 71475 102677 152484 101133
1973 101133 135510 176288 109578 89404 134656 197406 236052 218990 122168 158447 64496 98167
$$ packed form
2058H66181k13640r0323q4043p7082m5831n5650p664N2330o1431L5266j7207l3907
2046B66999o2766k859K1306o0271R819l3004M6447M8460n7260j9517n7532m8516
2034E1306K7969K1749k4836J4682j2929L4360L4936M8658J1780k4567l0046m7372
2022A05690J1952O9016j2152p4929K3569q18k7204n1843m6488O6841O159j7442
2010E2351l0510M5512K1339L64L2589n81J7259o795l2788j8076l2757J7323j5992
1997D9238q673K5989M0235O1532o1883n6788j5308M4026n9473J7998Q2000K1217
1985A40110M0341q1095n0236N6779k2438r00M6861o2316M369L1202M9807n1351
1973A01133L4377M0778o6710k0174M5252O2750L8646j7062r6822L6279r3951L3671
$$ plain form
1961 98167 65621 52315 67316 62637 89630 144453 147373 118651 86953 32981 82442 711
1949 711 28975 102470 48273 61356 78041 40391 98111 83979 105205 166284 138592 61434
1937 61434 555 -7559 59185 -21853 58982 52446 26292 115726 134672 73820 30112 73184
1925 73184 123353 110738 25593 77579 57351 140867 173604 109160 52490 178510 169403 190347
1913 190347 206378 173876 152621 177269 144773 112558 77761 87962 79718 75519 129524 163936
1901 163936 185900 153059 170524 164556 168528 207301 132878 194556 158778 74921 125647 119663
1889 119663 138937 83689 114487 165383 185801 174356 176301 278292 315432 310602 248495 242370
1877 242370 210278 258708 303671 260507 225786 120042 155536 222871 195567 240943 229208
$$ packed form
1961I8167l2546j3306J5001m679K6993N4823K920k8722l1698n3972M9461q1731
1949G11K8264P3495n4197J3083J6685l7650N7720j4132K1226O1079k7692p7158
1937F1434o0879q114O6744q1038Q0835o536k6154Q9434J8946o0852m3708M3072
1925G3184N0169j2615q5145N1986k0228Q3516L2737o4444n6670J26020r107K0944
1913A90347J6031l2502k1255K4648l2496l2215l4797J0201q244m199N4005L4412
1901A63936K1964l2841J7465n968L972L8773p4423O1678l5778q3857N0726n984
1889A19663J9274n5248L0798N0896K0418j1445J945J01991L7140m830o2107o125
1877B42370l2092M8430M4963m3164l4721j05744L5494O7335k7304M5376j1735
$$ plain form
1866 229208 162844 128480 98929 118614 208387 206543 139452 166838 161480 245741 244559 212752
1854 212752 189030 200908 173174 139650 206939 114589 77702 167851 160368 214819 212024 201810
1842 201810 178644 234185 247875 228399 235608 296279 292280 332175 479413 395321 382264 445315
1830 445315 410144 420294 378847 350455 345747 301308 301189 318480 311602 331448 342216 317842
1818 317842 352210 427305 414899 335195 363513 424006 384295 373642 416775 471990 492865 439203
1806 439203 409808 478055 404661 428952 438933 392799 373705 373733 417076 341376 329284 410851
1794 410851 439409 513318 489009 470985 494374 426891 345878 388292 408553 441547 492121 471551
1782 471551 470416 493262 399449 435501 477204 545911 519578 428434 482200 501640 573852 487734
$$ packed form
1866B29208o6364l4364k9551J9685Q9773j844o7091K7386n358Q4261j182l1807
1854B12752k3722J1878k7734l3524O7289r2350l6887R0149p483N4451k795j0214
1842B01810k3166N5541J3690j9476P209O0671l999L9895J47238q4092j3057O3051
1830D45315l5171J0150m1447k8392m708m4439j19J7291o878J9846J0768k4374
1818C17842L4368P5095j2406p9704K8318O0493l9711j0653M3133N5215K0875n3662
1806D39203k9395O8247p3394K4291R981m6134j9094K8M3343p5700j2092Q1567
1794D10851K8558P3909k4309j8024K3389o7483q1013M2414K0261L2994N0574k0570
1782D71551j135K2846r3813L6052M1703O8707k6333r1144N3766J9440P2212q6118
$$ plain form
1770 487734 428879 402589 460147 339551 317281 344914 349897 374134 333230 315334 337461 312605
1758 312605 312743 400299 344318 295890 297704 373954 368985 261760 219390 269380 332351 233844
1746 233844 243109 248949 225656 226028 241849 249506 286516 296537 246298 220061 190775 126399 77245
1733 77245 177654 200150 216402 222184 203830 248972 225689 218346 255967 261388 294143 267020
1721 267020 214214 233694 227359 189109 121121 44011 55811 45986 60725 55478 52110 59535 -1311
1708 -1311 4052 39126 20796 -40697 3533 75889 40015 13972 53221 19090 27341 63500
1696 63500 71257 -81437 -70198 -7513 -74696 -101773 -239 9486 2380 58397 -17105 -5018
1684 -5018 -4318 -2285 43711 33192 74995 70542 42694 -19113 22967 71813 62894 23777 88898
$$ packed form
1770D87734n8855k6290N7558j20596k2270K7633M983K4237m0904j7896K2127k4856
1758C12605J38Q7556n5981m8428J814P6250m969j07225m2370M9990O2971r8507
1746B33844R265N840k3293L72J5821P657L7010J0021n0239k6237k9286o4376m9154
1733G7245J00409K2496J6252N782j8354M5142k3283p343L7621N421L2755k7123
1721B67020n2806J9480o335l8250o7988p7110J1800r825J4739n247l368P425o0846
1708a311N363L5074j8330o1493M4230P2356l5874k6043L9249l4131Q251L6159
1696F3500P757j52694J1239O2685o7183k7077J01534R725p106N6017p5502J2087
1684e018P00K033M5996j0519M1803m453k7848o1807M2080M8846q919l9117O5121
$$ plain form
1671 88898 86885 54285 68568 22889 105291 62799 65697 47291 -27614 -23316 3159 -69252
1659 -69252 16285 48149 -44211 -76213 -28354 39276 -29467 -119288 -275 -32930 -107486 -20673
1647 -20673 -33894 -14158 -38565 -4696 -21056 -120444 -136251 -164910 -140456 -143220 -128449 -59765
1635 -59765 -64926 -128565 -100476 -52998 -80226 -21283 -85814 -100021 -120619 -140090 -47592 -42085
1623 -42085 -50874 9025 -24137 -44523 48398 80437 7034 -59454 -14024 -16439 -7041 13689
1611 13689 40673 4313 26589 72100 31308 -11984 -9386 43327 172 -55245 -10004 -13134
1599 -13134 -47995 -55085 -112521 -226158 -249348 -78938 -87154 -110298 -70348 -123644 -74437 -11645
1587 -11645 -6176 -33505 -62806 -26742 3240 33245 20958 -44860 -76929 -92687 -35420 -1714
$$ packed form
1671H8898k013l2600J4283m5679Q2402m2492K898j8406p4905M298K6475p2411
1659f9252Q5537L1864r2360l2002M7859O7630o8743q9821J19013l2655p4556Q6813
1647b0673j3221J9736k4407L3869j6360r9388j5807k8659K4454k764J4771O8684
1635e9765n161o3639K8089M7478k7228N8943o4531j4207k0598j9471R2498N507
1623d2085q789N9899l3162k0386R2921L2039p3403o6488M5430k415R398K0730
1611A3689K6984l6360K2276M5511m0792m3292K598N2713m3155n5417M5241l130
1599a3134l4861p090n7436j13637k3190J70410q216k3144L9950n3296M9207O2792
1587a1645N469k7329k9301L6064K9982L0005j2287o5818l2069j5758N7267L3706
$$ plain form
1575 -1714 -36279 -58478 14724 -31996 -19493 -3411 -5595 -15825 -1223 91047 154336 120528
1563 120528 78767 126071 143853 117472 104528 58032 -13641 46596 61444 -7925 -54978 -34261
1551 -34261 -10705 -37858 7943 -17078 -16854 -51340 12857 99631 72465 -32255 -29064 -29875 -99083
1538 -99083 -125188 -74894 -95814 -101962 -8842 -4671 -61111 -10022 -32011 -25631 -25187 -87633 23771
1525 23771 2340 90408 151612 184764 179496 167667 138834 81176 87703 41733 4941 62193
1513 62193 49908 18980 2846 -22510 -14487 27734 -75874 -56758 -29055 -47214 -19774 9562
1501 9562 -36731 -61395 -52941 -92017 -151662 -152126 -114969 -140398 -196634 -204609 -195576 -143113 -132154
1488 -132154 -153835 -130802 -164045 -130497 -44933 -77704 -125632 -930 -4166 -33035 -36851 -23987
$$ packed form
1575a714l4565k2199P3202m6720J2503J6082k184j0230J4602R2270O3289l3808
1563A20528m1761M7304J7782k6381j2944m6496p1673O0237J4848o9369m7053K0717
1551c4261K3556k7153M5801k5021K24l4486O4197Q6774k7166j04720L191q11o9208
1538i9083k6105N0294k0920o148R3120M171n6440N1089k1989O380M44o2446J11404
1525B3771k1431Q8068O1204L3152n268j1829k8833n7658O527m5970l6792N7252
1513F2193j2285l0928j6134k5356Q023M2221j03608J9116K7703j8159K7440K9336
1501I562m6293k4664Q454l9076n9645m64L7157k5429n6236p975R033N2463J0959
1488a32154k1681K3033l3243L3548Q5564l2771m7928J24702l236k8869l816J2864
$$ plain form
1476 -23987 -1203 10644 29402 16447 32876 6046 -50504 1610 -26463 -69473 -11635 34041
1464 34041 57625 68410 38424 -40628 -52828 -34111 -25350 30149 81264 26661 76643 33221
1452 33221 -67442 -99456 -92093 -61746 -23784 66165 -17589 -52001 -84392 -57798 -46171 -117062
1440 -117062 -79226 -120636 -135122 -160362 -160302 -171886 -168163 -110242 -68584 -42748 -21278 4461
1428 4461 -39361 -66272 -8495 -66369 -16142 45284 -20509 -58211 -27064 -16493 -27815 34592
1416 34592 50946 66377 10878 -4108 117120 33595 -42794 61907 80264 93026 69657
1405 69657 44702 -3689 -12278 12306 110 -45571 -43569 11071 3556 -15109 74600 43636
1393 43636 -55273 -23156 -17885 22168 -27153 -30629 -35857 -65099 -95800 -90721 -23151 -61512 17787
$$ packed form
1476b3987K2784J1847J8758j2955J6429k6830n6550N2114k8073m3010N7838M5676
1464C4041K3584J0785k9986p9052j2200J8717Q761N5499N1115n4603M9982m3422
1452C3221j00663l2014P363L0347L7962Q9949q3754l4412l2391K6594J1627p0891
1440a17062L7836m1410j4486k5240O0j1584L723N7921M1658K5836K1470K5739
1428D461m3822k6911N7777n7874N0227O1426o5793l7702L1147J0571j1322O2407
1416C4592J6354J5431n5499j4986J21228q3525p6389J04701J8357J2762k3369
1405F9657k4955m8391q589K4584j2196m5681K002N4640p515j8665Q9709l0964
1393D3636r8909L2117N271M0053m9321l476n228k9242l0701N079O7570l8361P9299
$$ plain form
1380 17787 23688 -1365 26825 56387 83086 26692 -38510 -41820 -39348 24148 -28778 -91035
1368 -91035 -74985 -33436 -12323 73255 66658 155609 159271 62162 110491 24966 42017 40361
1356 40361 86131 45301 17205 48306 119631 110494 8774 22492 47031 16595 -64216 -88230
1344 -88230 -182561 -126025 -65206 -58138 -186672 -231463 -203213 -188077 -70231 -14621 -123987
1333 -123987 -145354 -130134 -171411 -103539 -169439 -114837 -131444 -72909 -17935 -38413 -91034 -126784
1321 -126784 -124749 -90221 -98283 -133913 -72548 -70870 -49277 -2229 -7786 -49727 -79642 -67331
1309 -67331 -52290 -12605 41352 -55550 -113662 -149457 -100586 -122070 -105408 -158067 -144427 -164607
1297 -164607 -146077 -76134 -87499 -21767 6106 6991 -28432 -103741 -116154 -64759 -57937 -127967
$$ packed form
1380A7787N901k5053K8190K9562K6699n6394o5202l310K472O3496n2926o2257
1368i1035J6050M1549K1113Q5578o597Q8951L662r7109M8329q5525J7051j656
1356D0361M5770m0830k8096L1101P1325r137j01720J3718K4539l0436q0811k4014
1344h8230r4331N6536O0819P068j28534m4791K8250J5136J17846N5610j09366
1333a23987k1367J5220m1277O7872o5900N4602j6607N8535N4974k0478n2621l5750
1321a26784K035L4528q062l5630O1365J678K1593M7048n557m1941k9915J2311
1309f7331J5041L9685N3957r6902n8112l5795M8871k1484J6662n2659J3640k0180
1297a64607J8530O9943j1365O5732K7873Q85l5423p5309j2413N1395O822p0030
$$ plain form
1285 -127967 -135641 -172409 -165006 -120867 -116255 -54981 -114040 -126198 -155486 -180948 -186806 -127411
1273 -127411 -107348 -94055 -49312 -69039 12404 8812 -50236 -36607 -13417 96093 -35367
1262 -35367 -58941 -4886 69090 11023 -27403 -40593 -54436 -62035 -12502 -58273 -73092 -48392
1250 -48392 -51757 19539 -26813 10411 35407 32832 20631 30659 110253 123830 57314 41495
1238 41495 19700 -9236 -39192 17363 -39358 -99029 -77730 -12508 -28529 3804 -32405 -47720
1226 -47720 -24615 52841 46332 16427 -7718 -43432 -49556 -75297 -31174 15690 13013 -8440
1214 -8440 6920 -5022 49862 30269 33044 5972 36629 47294 -12036 36803 40719 7506
1202 7506 13771 -18923 40479 141863 111725 33057 18470 60706 126192 75124 2489 -39434
$$ packed form
1285a27967p674l6768P403M4139M612O1274n9059j2158k9288k5462n858N9395
1273a27411K0063J3293M4743j9727Q1443l592n9048J3629K3190J09510j31460
1262c5367k3574N4055P3976n8067l8426j3190j3843p599M9533m5771j4819K4700
1250d8392l365P1296m6352L7224K4996k575j2201J0028P9594J3577o6516j5819
1238D1495k1795k8936k9956N6555n6721n9671K1299O5222j6021L2333l6209j5315
1226d7720K3105P7456o509k9905k4145l5714o124k5741M4123M6864k677k1453
1214h440J5360j1942N4884j9593K775k7072L0657J0665n9330M8839L916l3213
1202G506O265l2694N9402J01384l0138p8668j4587M2236O5486n1068p2635m1923
$$ plain form
1190 -39434 -6943 48341 15371 -74550 -172039 -97823 -22721 -44558 -46149 -89406 -124760 -124959
1178 -124959 -46318 11750 -18889 -35343 -25075 -47993 -41240 -46933 -24546 -25034 -14711 -9799 83550
1165 83550 80590 79647 100581 155554 173825 65956 93957 125745 115325 131067 41640 99078
1153 99078 76007 62347 132088 142692 143627 66612 144315 154626 136566 70237 28455 39371
1141 39371 84840 45043 19723 51189 42455 24051 300 722 32077 -9335 -34613 -79168
1129 -79168 -44460 -18032 -23195 2573 4048 55024 53574 45187 50566 93330 67071 30166 95821
1116 95821 103546 38513 -13436 84167 116380 153409 156106 190691 175568 230717 256600 231743
1104 231743 228136 177443 160165 213539 206780 176001 124750 156105 230754 148675 16852 22130
$$ packed form
1190c9434L2491N5284l2970q9921r7489P4216P5102k1837j591m3257l5354j99
1178a24959P8641N8068l0639j6454J0268k2918O753n693K2387m88J0323M912R3349
1165H3550k960r43K0934N4973J8271j07869K8001L1788j0420J5742q9427N7438
1153I9078k3071j3660O9741J0604R35p7015P7703J0311j8060o6329m1782J0916
1141C9371M5469l9797k5320L1466q734j8404k3751M22L1355m1412k5278m4555
1129g9168L4708K6428n163K5768J475N0976j450q387N379M2764k6259l6905O5655
1116I5821P725o5033n1949R7603L2213L7029K697L4585j5123N5149K5883k4857
1104B31743l607n0693j7278N3374o759l0779n1251L1355P4649q2079j31823N278
$$ plain form
1092 22130 81368 110693 100399 81839 20793 179678 195510 188209 252465 227940 188023 203407
1080 203407 297401 282022 252143 201991 206374 209772 220658 254924 255071 232533 233963 168447 238953
1067 238953 249455 261952 292548 236320 258938 250109 335162 416837 415032 423912 464498 505294
1055 505294 466259 460783 442290 426344 521335 554040 528480 525596 500155 586716 649242 671679
1043 671679 628026 659242 663946 693822 694684 649442 627224 620663 663811 643589 585276 593750 598828
1030 598828 607004 627590 614213 611563 589764 531569 536972 477704 537990 579623 626252 633268
1018 633268 676352 754316 751146 773873 742859 777265 823928 860168 805469 763250 824815 877894
1006 877894 908860 905444 973919 949740 988708 1055378 1097785 1162326 1149812 1273105 1385678
$$ packed form
1092B2130N9238K9325j0294j8560o1046J58885J5832p301O4256k4525l9917J5384
1080B03407R3994j5379k9879n0152M383L398J0886L4266J47k2538J430o5516P0506
1067B38953J0502J2497L0596n6228K2618q829Q5053Q1675j805Q880M0586M0796
1055E05294l9035n476j8493j5946R4991L2705k5560k884k5441Q6561O2526K2437
1043F71679m3653L1216M704K9876Q62m5242k2218o561M3148k0222n8313Q474N078
1030E98828Q176K0586j3377k650k1799n8195N403n9268O0286M1633M6629P016
1018F33268M3084P7964l170K2727l1014L4406M6663L6240n4699m2219O1565N3079
1006H77894L0966l416O8475k4179L8968O6670M2407O4541j2514J23293J12573
$$ plain form
995 1385678 1396004 1482086 1497813 1449626 1479800 1546779 1628385 1694113 1823583 1987061 2049078
984 2049078 2104638 2116269 2348893 2526642 2658367 2805327 3024326 3155879 3470049 3816864
974 3816864 4185643 4483255 4670303 4822613 5194854 5584216 6052063 6625210 7574382 8571490
964 8571490 9874768 11616458 13786943 16063913 19522796 24122293 31073050 34806690
956 34806690 28249346 20854077 16432676 13658534 11454488 9862064 8555852 7437002
948 7437002 6576903 5961597 5535328 5078627 4704944 4451858 4336799 4094962 3646346 3320327
938 3320327 3110438 2895875 2664085 2416820 2308028 2195926 2118654 1922651 1788160 1713937
928 1713937 1648421 1593220 1521699 1446726 1367834 1258047 1173222 1152889 1092215 1003977 922834
$$ packed form
995A385678J0326Q6082J5727m8187L0174O6979Q1606O5728J29470J63478O2017
984B049078N5560J1631K32624J77749J31725J46960K18999J31553L14170L46815
974C816864L68779K97612J87048J52310L72241L89362M67847N73147R49172R97108
964H571490J303278J741690K170485K276970L458883M599497O950757L733640
956C4806690o557344p395269m421401k774142k204046j592424j306212j118850
948G437002q60099o15306m26269m56701l73683k53086j15059k41837m48616l26019
938C320327k09889k14563k31790k47265j08792j12102p7272j96003j34491p4223
928A713937o5516n5201p1521p4973p8892j09787q4825k0333o0674q8238q1143
$$ plain form
917 922834 917766 941296 833500 839169 774940 731330 710284 701809 674801 679588 612570 650267
905 650267 660584 635190 693539 668006 632187 579928 590703 562483 527680 542063 570258 581613
893 581613 574102 594706 428558 415271 477556 416560 392172 398162 432214 497323 489810 413543
881 413543 340459 339618 353077 330993 328780 270838 280067 251526 187560 201290 257575 266474 219083
868 219083 279182 233190 210621 262406 268732 297874 279951 307654 333938 233753 179831 202059
856 202059 192174 142227 177327 236274 163884 198822 268049 194130 168799 161352 192295 138911
844 138911 131258 165767 92302 34178 70315 159088 182076 151514 144899 159405 93437 96700
832 96700 51450 -8970 -17501 -16905 30577 34830 39636 77648 8539 -6541 29857 21248 -44106
$$ packed form
917I22834n068K3530j07796N669o4229m3610k1046q475k7008M787o7018L7697
905F50267J0317k5394N8349k5533l5819n2259J0775k8220l4803J4383K8195J1355
893E81613p511K0604j66148j3287O2285o0996k4388N990L4052O5109p513p6267
881D13543p3084q41J3459k2084k213n7942R229k8541o3966J3730N6285Q899m7391
868B19083O0099m5992k2569N1785O326K9142j7923K7703K6284j00185n3922K2228
856B02059r885m9947L5100N8947p2390L4938O9227p3919k5331p447L0943n3384
844A38911p653L4509p3465n8124L6137Q8773K2988l0562o615J4506o5968L263
832I6700m5250o0420q531N96M7482M253M806L8012o9109j5080L6398q609o5354
$$ plain form
819 -44106 -128496 1566 30204 -6023 77696 104115 -22348 -61453 32375 91349 -14804
808 -14804 -57462 -94806 -51733 -51551 -54328 -1769 -150149 -151212 -61117 -99707 -105068 -13027 1728
795 1728 -42846 -42097 5413 29044 47649 73879 53891 -9945 -101093 -14016 28661 17493 28673
782 28673 7618 44576 -52698 -2665 7151 -125777 -35668 -49148 -82906 -41830 60091 35784
770 35784 -24780 7687 -52338 -70729 -59614 -74976 -70282 -46459 -134950 -175415 -128233 -125932
758 -125932 -32366 -5029 -16978 -48292 -105045 -54917 -125606 -48406 -1001 -65545 -73217 -20920
746 -20920 16846 -22140 -14892 10495 2243 14661 39993 78451 -20808 -35253 -43674 -94995 -29416
733 -29416 4904 17398 -7061 -34642 52728 60064 63509 45388 61754 45120 27456 71275
$$ packed form
819d4106q4390J30062K8638l6227Q3719K6419j26463l9105R3828N8974j06153
808a4804m2658l7344M3073J82k777N2559j48380j063R0095l8590n361R2041J4755
795A728m4574P49M7510K3631J8605K6230j9988o3836r1148Q7077M2677j1168J1180
782B8673k1055L6958r7274N0033R816j32928R0109j3480l3758M1076J01921k4307
770C5784o0564L2467o0025j8391J1115j5362M694K3823q8491m0465M7182K301
758a25932R3566K7337j1949l1314n6753N0128p0689P7200M7405o4544p672N2297
746b0920L7766l8986P248K5387q252J2418K5332L8458r9259j4445q421n1321O5579
733b9416L4320J2494k4459k7581Q7370P336L445j8121J6366j6634j7664M3819
$$ plain form
721 71275 120002 67956 -13320 22784 49589 31388 44448 -50619 -113514 -35500 -74317 -85814
709 -85814 -148754 -64083 -49865 -115627 -86367 -21857 -55868 -57992 -28511 -78909 4356 56223
697 56223 49270 38473 -48344 -34115 -23204 -68840 -87499 -31814 -26074 -41358 16748 76309
685 76309 73055 52006 95093 129477 94781 37607 8524 7024 68304 91046 74333 92997
673 92997 142937 176149 202058 218973 167015 71768 50851 92332 55375 -9962 50109 69943
661 69943 40987 -5382 16546 -41615 -40877 -69466 -47726 -43377 -127791 -63793 -83699 -156307 -94113
648 -94113 -101571 -177978 -161978 -106638 -137797 -50170 15981 -63410 -23041 -2917 -10115 -52497
636 -52497 -7082 4678 14517 25434 10184 71106 66808 -19812 -41854 -89001 -114993 -123600 -99817
$$ packed form
721G1275M8727n2046q1276L6104K6805j8201J3060r5067o2895P8014l8817j1497
709h5814o2940Q4671J4218o5762K9260O4510l4011k124K9481n0398Q3265N1867
697E6223o953j0797q6817J4229J0911m5636j8659N5685N740j5284N8106N9561
685G6309l254k1049M3087L4384l4696n7174k9083j500O1280K2742j6713J8664
673I2997M9940L3212K5909J6915n1958r5247k0917M1481l6957o5337O0071J9834
661F9943k8956m6369K1928n8161P38k8589K1740M349q4414O3998j9906p2608O2194
648i4113p458p6407J6000N5340l1159Q7627O6151p9391M0369K0124p198m2382
636e2497M5415J1760R839J0917j5250O0922m298q6620k2042m7147k5992q607K3783
$$ plain form
623 -99817 -25262 -17901 -6579 92048 78180 27608 -9000 -32252 1906 1416 51794 61131 -37997
610 -37997 -31833 -10028 -18135 -35687 -81182 -55228 -81366 -95350 -71848 -112675 -99695 -28638
598 -28638 -31034 2238 -14733 -61539 -67815 -61642 -82647 -117075 -89565 -82921 -31404 -108861 -113195
585 -113195 -74930 -93132 -77916 -96839 -56130 -66406 -26402 -21132 -66772 -110618 -67842 5991
573 5991 23519 74895 61880 50922 -50448 -19326 -67548 -114578 -135173 -102665 -102935 -222683
561 -222683 -171768 -93312 -67212 -128448 -114322 -80707 -87778 -52915 -31930 -99726 -123630 -119623
549 -119623 -82802 -77839 -102338 -115586 -161750 -179143 -148440 -83719 -116503 -149247 -150225 -168100
537 -168100 -90249 -54140 -66284 -90471 -90690 -64012 9415 -16448 -13836 65212 67661 108100 47477
$$ packed form
623i9817P4555P361J1322R8627j3868n0572l6608k3252L4158m90N0378R337r9128
610c7997O164K1805q107j7552m5495K5954k6138j3984K3502m0827J2980P1057
598b8638k396L3272j6971m6806o276O173k1005l4428K7510O644N1517p7457m334
585a13195L8265j8202J5216j8923M0709j0276M0004N270m5640m3846M2776P3833
573E991J7528N1376j3015j0958j01370L1122m8222m7030k0595L2508k70j19748
561b22683N0915P8456K6100o1236J4126L3615p071L4863K0985o7796k3904M007
549a19623L6821M963k4499j3248m6164j7393L0703O4721l2784l2744r78j7875
537a68100P7851L6109j2144k4187k19K6678P3427k5863K612P9048K449M0439o0623
$$ plain form
524 47477 28902 -64698 -8867 67917 6810 8548 -16807 -3718 -65906 -72970 21725 4312
512 4312 -30342 59367 74380 66233 95016 105622 15782 -43007 -49810 -53653 -51438 -109382 -50728
499 -50728 -103757 -127610 -49369 -38939 -24546 57312 29629 -62466 -88813 8500 29064 14044
487 14044 49065 -31432 -50183 23312 63394 -2425 -61269 -103889 -4831 -13301 22853 32585
475 32585 -51492 -66950 -44484 -52101 -129789 -124497 1144 -33924 -46449 -31039 38862 19281
463 19281 -21175 -5268 -31753 -44701 -32579 -52757 -67940 -7512 -52749 -142068 -92425 -46621
451 -46621 -88005 -107231 -105427 -36676 -58285 -189628 -90176 2332 -39114 -37374 42815 120824
439 120824 63310 -7890 -28435 -12430 33670 22263 -4677 41425 -28364 -76235 -112240 -73599
$$ packed form
524D7477j8575r3600N5831P6784o1107J738k5355J3089o2188p064R4695j7413
512D312l4654Q9709J5013q147K8783J0606q9840n8789o803l843K215n7944N8654
499e0728n3029k3853P8241J0430J4393Q1858k7683r2095k6347R7313K0564j5020
487A4044L5021q0497j8751P3495M0082o5819n8844m2620R9058q470L6154R732
475C2585q4077j5458K2466p617p7688N292J25641l5068j2525J5410O9901j9581
463A9281m0456J5907k6485j2948J2122k0178j5183O0428m5237q9319M9643M5804
451d6621m1384j9226J804O8751k1609j31343R9452R2508m1446J740Q0189P8009
439A20824n7514p1200k0545J6005M6100j1407k6940M6102o9789m7871l6005L8641
$$ plain form
427 -73599 24983 -14985 -46878 3243 29474 31224 63131 102721 92260 64792 41936 47285
415 47285 -15911 62648 114360 145080 79423 -24661 -9207 6312 -22825 63772 83145 -7805
403 -7805 -14516 26898 16097 37173 20083 30765 71675 67843 84882 -843 39346 5938 -34950
390 -34950 -2759 69325 96665 -7950 13391 16008 3650 55612 60513 68114 17836 18023 26241
377 26241 -27804 34663 -1141 -83775 -88236 -59898 -57259 16188 -24159 -87027 -74671 -26502
365 -26502 -19283 -13575 -31346 -34612 64511 93120 31854 4654 28701 43600 34039 -31086 42176
352 42176 50247 53040 9516 -39030 -67881 -40444 -29806 -27246 -48820 -80065 -74740 -19850 23608
339 23608 42017 33758 47610 53542 -52934 -81993 -50667 -77483 -136614 -96232 -45035 16893
$$ packed form
427g3599R8582l9968l1893N0121K6231J750L1907L9590j0461k7468k2856N349
415D7285o3196P8559N1712L0720o5657j04084J5454J5519k9137Q6597J9373r0950
403g805o711M1414j0801K1076j7090J0682M0910l832J7039q5725M0189l3408m0888
390c4950L2191P2084K7340j04615K1341K617j2358N1962M901P601n0278J87Q218
377B6241n4045O2467l5804q2634m461K8338K639P3447m0347o2868J2356M8169
365b6502P219N708j7771l266R9123K8609o1266k7200K4047J4899r561o5125P3262
352D2176Q071K793m3524m8546k8851K7437J0638K560k1574l1245N325N4890M3458
339B3608J8409q259J3852N932j06476k9059L1326k6816n9131M0382N1197O1928
$$ plain form
327 16893 -45789 -20351 -23578 -12771 16051 -23007 29397 -36598 -39013 -71361 -51770 -39059
315 -39059 -25957 -20116 -44111 -17694 -9795 14187 149816 118104 41261 53220 18084 45592
303 45592 78886 50806 39110 -3695 37811 5097 76608 52172 28855 108675 44461 -9981
291 -9981 13908 41527 26614 64160 50590 46549 -9350 19863 60735 51375 73847 48796 -30025
278 -30025 16628 -16719 -16027 -1776 -209 31150 93524 118273 76741 49302 52401 66805 55658
265 55658 -49128 -9465 38800 48918 81499 94999 206410 193403 108278 24504 102355 115858
253 115858 33480 43231 95663 128302 44759 15668 -994 25966 125637 137937 83663 35863
241 35863 39667 -19934 -72679 -3254 55755 76768 -11247 45264 29057 -3053 17193 37049
$$ packed form
327A6893o2682K5438l227J0807K8822l9058N2404o5995k415l2348J9591J2711
315c9059J3102N841k3995K6417P899K3982J35629l1712p6843J1959l5136K7508
303D5592L3294k8080j1696m2805M1506l2714P1511k4436k3317P9820o4214n4442
291i981K3889K7619j4913L7546j3570m041n5899K9213M0872r360K2472k5051p8821
278c0025M6653l3347O92J4251J567L1359O2374K4749m1532k7439L099J4404j1147
265E5658j04786L9663M8265J0118L2581J3500J11411j3007q5125q3774P7851J3503
253A15858q2378R751N2432L2639q3543k9091j6662K6960R9671J2300n4274m7800
241C5863L804n9601n2745O9425N9009K1013q8015N6511j6207l2110K0246J9856
$$ plain form
229 37049 -15289 -55525 -5696 -48769 -125769 -125227 -108506 -127955 -145907 -77009 -54793 -65700
217 -65700 -16007 13242 13977 -44706 -46078 -31589 -104509 -54838 -34973 -92628 -96933 -14805 40314
204 40314 -709 -54286 -37172 -90616 -99291 -37841 -102066 -50440 -36778 17859 2575 20766
192 20766 18233 25582 42435 5036 18000 51568 -52278 -58722 -11627 -37116 -75232 -52586
180 -52586 -13562 -5994 25685 43534 -3553 -34489 -58317 -33786 -71113 -63198 -64063 -48190 -60776
167 -60776 -8263 32211 6650 -50725 -72106 -54439 -45919 -39902 7915 3883 15632 76235 1916
154 1916 14855 5595 -19433 -6505 41298 169095 108101 37547 69177 70370 97242 89828 32636
141 32636 22579 29405 74150 52617 11394 81281 90859 70868 50377 7843 -20573 19278
$$ packed form
229C7049n2338m0236M9829m3073p7000N42J6721j9449j7952O8898K2216j0907
217f5700M9693K9249P35n8683j372J4489p2920M9671J9865n7655m305Q2128N5119
204D0314m1023n3577J7114n3444q675O1450o4225N1626J3662N4637j5284J8191
192B0766k533P349J6853l7399J2964L3568j03846o444M7095k5489l8116K2646
180e2586L9024P568L1679J7849m7087l0936k3828K4531l7327P915q65J5873j2586
167f0776N2513M0474k5561n7375k1381J7667Q520O017M7817m032J1749O0603p4319
154A916J2939r260k5028J2928M7803J27797o0994p0554L1630J193K6872p414n7192
141C2636j0057O826M4745k1533m1223O9887R578j9991k0491m2534k8416L9851
$$ plain form
129 19278 54127 77214 153 -8929 47188 79404 18257 -13780 39819 36811 -31236 -10248
117 -10248 27060 38961 -3798 97824 130761 98035 109830 83513 59374 23743 12366 28917
105 28917 -13279 777 21794 -2632 -13264 39970 6382 -54112 -84091 -56537 -47929 -47551 -60604
92 -60604 -56370 -39794 -21447 -2383 -49881 -99753 -49942 -26290 -33267 -75657 13975 6797 -14378
79 -14378 11229 38382 -21381 -56699 -24850 -20817 -38551 -31013 38388 22812 -11215 -26597 -38603
66 -38603 -78126 23618 59566 52527 -15183 -39646 11374 38837 27175 73379 -45466 -51346
54 -51346 -7182 -32180 -37267 -29723 -19756 28900 69538 77177 78434 64469 20235 49437 37233
41 37233 13180 -14029 22697 16403 23949 20360 -2928 -53553 -2029 42380 -39462 9303 38479
$$ packed form
129A9278L4849K3087p7061r082N6117L2216o1147l2037N3599l008o8047K0988
117a0248L7308J1901m2759J01622L2937l2726J1795k6317k4139l5631j1377J6551
105B8917m2196J4056K1017k4426j0632N3234l3588o0494k9979K7554Q608L78j3053
92f0604M234J6576J8347J9064m7498m9872M9811K3652o977m2390Q9632p178k1175
79a4378K5607K7153n9763l5318L1849M033j7734P538O9401j5576l4027j5382j2006
66c8603l9523J01744L5948p039o7710k4463N1020K7463j1662M6204j18845n880
54e1346M4164k4998n087P544R967M8656M0638P639J257j3965m4234K9202j2204
41C7233k4053k7209L6726o294P546l589k3288n0625N1524M4409q1842M8765K9176
$$ plain form
28 38479 15928 -12150 33143 18743 -5770 -16313 16224 95221 57815 -50406 -25967 10576
16 10576 27251 38501 9326 -20479 -4282 8145 -9472 -11495 12367 30303 -5185 -49199
4 -49199 -28116 -13350 -43825 -58793
0 -58793
$$ packed form
28C8479k2551k8078M5293j4400k4513j0543L2537P8997l7406j08221K4439L6543
16A0576J6675J1250k9175k9805J6197J2427j7617k023K3862J7936l5488m4014
4d9199K1083J4766l0475j4968
0e8793
$$ Imaginary data points
##PAGE= N=2
##DATA TABLE= (X++(I..I)), XYDATA
$$ plain form
16383 -1120241 -1128222 -1129736 -1128377 -1110542 -1042850 -1036864 -1054565 -1048999 -1045738 -1011742 -994241 -977850
16371 -977850 -914293 -875298 -906389 -876153 -784281 -812131 -803568 -765704 -798253 -811887 -765346 -735550
16359 -735550 -728837 -671572 -637287 -616530 -623199 -603408 -567423 -563636 -530405 -566734 -542404 -500873
16347 -500873 -480303 -414366 -376181 -370604 -352184 -276681 -255582 -259635 -237438 -251151 -246575 -238383
16335 -238383 -176012 -194188 -196700 -114984 -81040 -87773 -72839 -90445 -98920 -45337 -29436 18522
16323 18522 8295 -17024 79198 110859 138589 207438 190539 136308 170467 205679 206722 181737
16311 181737 132914 275753 288669 270406 311971 336946 334399 331793 398577 373535 441970 530967
16299 530967 532725 517943 547793 546410 632967 553062 583520 632150 627050 603300 595431 630501
$$ packed form
16383a120241p981j514J359J7835O7692N986j7701N566L261L3996J7501J6391
16371i77850O3557L8995l1091L0236R1872k7850Q563L7864l2549j3634M6541K9796
16359g35550O713N7265L4285K0757o669J9791L5985L787L3231l6329K4330M1531
16347e00873K0570O5937L8185N577J8420P5503K1099m053K2197j3713M576Q192
16335b38383O2371j8176k512Q1716L3944o733J4934j7606q475N3583J5901M7958
16323A8522j0227k5319R6222L1661K7730O8849j6899n4231L4159L5212J043k4985
16311A81737m8823J42839J2916j8263M1565K4975k547k606O6784k5042O8435Q8997
16299E30967J758j4782K9850j383Q6557p9905L0458M8630n100k3750p869L5070
$$ plain form
16287 630501 646781 725833 659464 663202 708934 794136 814495 772629 776288 849961 805746 794869
16275 794869 901091 895713 857834 835704 836126 877542 798091 833104 873696 841044 921693 961723
16263 961723 922907 873696 942584 1046301 1044025 1061531 1032340 1060049 1106567 1074962 1107910
16252 1107910 1088432 1091104 1121354 1142803 1142606 1143561 1136523 1103098 1186767 1198346 1195942 1209580 1258284
16239 1258284 1296878 1255290 1319869 1352492 1305538 1303168 1312356 1338700 1353484 1400532 1381654 1357608
16227 1357608 1297285 1305657 1413223 1455515 1451111 1457694 1394269 1295399 1354749 1434316 1467789 1526336
16215 1526336 1627204 1597554 1578999 1539136 1508704 1564072 1494141 1489377 1559133 1464929 1483295
16204 1483295 1590618 1633954 1602846 1638297 1632696 1555924 1557246 1588749 1619565 1587637 1626133
$$ packed form
16287F30501J6280P9052o6369L738M5732Q5202K0359m1866L659P3673m4215j0877
16275G94869J06222n378l7879k2130M22M1416p9451L5013M0592l2652Q0649M0030
16263I61723l8816m9211O8888J03717k276J7506k9191K7709M6518l1605L2948
16252A107910j9478K672L0250K1449j97R55p038l3425Q3669J1579k404J3638M8704
16239A258284L8594m1588O4579L2623m6954k370R188K6344J4784M7048j8878k4046
16227A357608o0323Q372J07566M2292m404O583o3425r8870N9350P9567L3473N8547
16215A526336J00868k9650j8555l9863l0432N5368o9931m764O9756r4204J8366
16204A483295J07323M3336l1108L5451n601p6772J322L1503L0816l1928L8496
$$ plain form
16193 1626133 1602084 1594662 1616852 1648557 1694736 1664713 1592382 1585591 1646463 1622443 1658665 1658419
16181 1658419 1609949 1672114 1741199 1733684 1708375 1695486 1607144 1613021 1637741 1654122 1715544 1735623
$$ packed form
16193A626133k4049p422K2190L1705M6179l0023p2331o791O0872k4020L6222k46
16181A658419m8470O2165O9085p515k5309j2889q8342N877K4720J6381O1422K0079
$$ [...]
##END NTUPLES=NMR SPECTRUM
##END=
