##TITLE=1H_CA-8800-2
 CDCl3, 8 sc, 
 22.12.2020
##JCAMPDX= 6.0         $$ Bruker NMR JCAMP-DX V2.0
##DATA TYPE= NMR SPECTRUM
##DATA CLASS= NTUPLES
##ORIGIN= UXNMR, Bruker Analytische Messtechnik GmbH
##OWNER= root
$$ XWIN-NMR		Version 3.5
$$ Tue Dec 22 10:28:07 2020 Russian Standard Time (UT+4h)  she@DPX200
##.OBSERVE FREQUENCY= 200.1315066352
##.OBSERVE NUCLEUS= ^1H
##.ACQUISITION MODE= SIMULTANEOUS
##.ACQUISITION SCHEME= undefined
##.AVERAGES= 8
##.DIGITISER RES= 18
##SPECTROMETER/DATA SYSTEM= spect
##.PULSE SEQUENCE= zg30
##.SOLVENT NAME= CDCl3
##.SHIFT REFERENCE= (INTERNAL, CDCl3, 0, 15.9833)
##AUDIT TRAIL= $$ (NUMBER, WHEN, WHO, WHERE, WHAT)
$$ ##TITLE= Audit trail, XWIN-NMR		Version 3.5
$$ ##JCAMPDX= 5.01
$$ ##ORIGIN= Bruker BioSpin GmbH
$$ ##OWNER= she
$$ F:/spectra/data/she/nmr/H-F/1/pdata/1/auditp.txt
$$ ##AUDIT TRAIL=  $$ (NUMBER, WHEN, WHO, WHERE, WHAT)
(   1,<2020-12-22 10:27:00.64 +0400>,<she>,<DPX200>,
      <created by zg, POWCHK disabled, PULCHK disabled
       configuration hash MD5:
       00 E9 B6 7A A2 85 ED C7 34 08 36 98 17 FE 4E 26
       data hash MD5: 16K
       6F 24 5A C3 FD A8 C4 52 09 E9 9F F3 D2 C3 A4 C3>)
(   2,<2020-12-22 10:27:02.96 +0400>,<she>,<DPX200>,
      <Start of raw data processing
       efp BC_mod = 2 LB = 0.24 FT_mod = 6 PKNL = 1 PHC0 = -10760.09 PHC1 = 7.40095 SI = 16K 
       data hash MD5: 16K
       EC C7 B5 A2 B1 FF F1 7D 56 C5 A0 8A EA D6 33 17>)
(   3,<2020-12-22 10:27:18.75 +0400>,<she>,<DPX200>,
      <pk PHC0 = -2.697191 PHC1 = 3.4 
       data hash MD5: 16K
       32 C5 0C 05 90 4A 15 08 81 D3 41 6F 4D FD 80 C7>)
(   4,<2020-12-22 10:27:22.04 +0400>,<she>,<DPX200>,
      <abs ABSG = 5 
       data hash MD5: 16K
       97 63 6A 39 E0 5C CB 2A AD 32 51 13 72 6D 2D E4>)
$$ ##END=
$$ 
$$ hash MD5
$$ 9D 71 BB 13 8B 05 66 D3 F7 A0 62 DF 3E 57 23 F3
##$RELAX= 
##$RELAX= 
##$RELAX= 
##$RELAX= 
##$RELAX= 
##$RELAX= 
$$ Bruker specific parameters
$$ --------------------------
##$DU= <F:/spectra>
##$EXPNO= 1
##$NAME= <H-F>
##$PROCNO= 1
##$TYPE= <nmr>
##$USER= <she>
##$AMP= (0..31)
100 100 100 100 100 100 100 100 100 100 100 100 100 100 100 100 100 100 
100 100 100 100 100 100 100 100 100 100 100 100 100 100 
##$AQSEQ= 0
##$AQ_mod= 1
##$AUNM= <au_zg>
##$AUTOPOS= <>
##$BF1= 200.13
##$BF2= 200.13
##$BF3= 200.13
##$BF4= 200.13
##$BF5= 200.13
##$BF6= 200.13
##$BF7= 200.13
##$BF8= 200.13
##$BYTORDA= 1
##$CFDGTYP= 0
##$CFRGTYP= 5
##$CHEMSTR= <none>
##$CNST= (0..31)
1 1 145 1 1 1 1 1 1 1 1 1 1 1 1 1 1 1 1 1 1 1 1 1 1 1 1 1 1 1 1 1 
##$CPDPRG= <>
##$CPDPRG1= <>
##$CPDPRG2= <>
##$CPDPRG3= <>
##$CPDPRG4= <mlev>
##$CPDPRG5= <mlev>
##$CPDPRG6= <mlev>
##$CPDPRG7= <mlev>
##$CPDPRG8= <mlev>
##$CPDPRGB= <>
##$CPDPRGT= <>
##$D= (0..31)
0 1.2 0 0 0 0 0 0 0 0.06 0 0.03 0 0 0 0 0.0002 0 0 0 0 0 0 0 0 0 0 0 0 
0 0 0 
##$DATE= 1608618420
##$DBL= (0..7)
120 120 120 120 120 120 120 120 
##$DBP= (0..7)
150 150 150 150 150 150 150 150 
##$DBP07= 0
##$DBPNAM0= <>
##$DBPNAM1= <>
##$DBPNAM2= <>
##$DBPNAM3= <>
##$DBPNAM4= <>
$$ [...]
##$SUBNAM3= <"">
##$SUBNAM4= <"">
##$SUBNAM5= <"">
##$SUBNAM6= <"">
##$SUBNAM7= <"">
##$SUBNAM8= <"">
##$SUBNAM9= <"">
##$SW= 16.9725356469052
##$SWIBOX= (0..15)
0 0 2 0 0 0 0 0 0 0 0 0 0 0 0 0 
##$SW_h= 3396.73913043478
##$TD= 16384
##$TD0= 1
##$TE= 0
##$TE2= 300
##$TE3= 300
##$TEG= 300
##$TL= (0..7)
0 120 120 120 120 120 120 120 
##$TP= (0..7)
150 150 150 150 150 150 150 150 
##$TP07= 0
##$TPNAME0= <>
##$TPNAME1= <>
##$TPNAME2= <>
##$TPNAME3= <>
##$TPNAME4= <>
##$TPNAME5= <>
##$TPNAME6= <>
##$TPNAME7= <>
##$TPOAL= (0..7)
0.5 0.5 0.5 0.5 0.5 0.5 0.5 0.5 
##$TPOFFS= (0..7)
0 0 0 0 0 0 0 0 
##$TUNHIN= 0
##$TUNHOUT= 0
##$TUNXOUT= 0
##$USERA1= <user>
##$USERA2= <user>
##$USERA3= <user>
##$USERA4= <user>
##$USERA5= <user>
##$V9= 5
##$VALIST= <valist>
##$VCLIST= <CCCCCCCCCCCCCCC>
##$VD= 0
##$VDLIST= <DDDDDDDDDDDDDDD>
##$VPLIST= <PPPPPPPPPPPPPPP>
##$VTLIST= <TTTTTTTTTTTTTTT>
##$WBST= 1024
##$WBSW= 4
##$XGAIN= (0..3)
0 0 0 0 
##$XL= 0
##$YL= 0
##$YMAX_a= 702841
##$YMIN_a= -276542
##$ZGOPTNS= <>
##$ZL1= 120
##$ZL2= 120
##$ZL3= 120
##$ZL4= 120
##$ABSF1= 15.99579
##$ABSF2= -0.9768744
##$ABSG= 5
##$ABSL= 3
##$ALPHA= 0
##$AQORDER= 0
##$ASSFAC= 0
##$ASSFACI= 0
##$ASSFACX= 0
##$ASSWID= 0
##$AUNMP= <proc_1d>
##$AZFE= 0.1
##$AZFW= 0.1
##$BCFW= 0
##$BC_mod= 2
##$BYTORDP= 0
##$COROFFS= 0
##$CY= -3
##$DATMOD= 1
##$DC= 0
##$DFILT= <>
##$DTYPP= 0
##$F1P= 0
##$F2P= 0
##$FCOR= 1
##$FTSIZE= 16384
##$FT_mod= 6
##$GAMMA= 0
##$GB= 0
##$INTBC= 1
##$INTSCL= 2.992141e-10
##$ISEN= 128
##$LB= 0.24
##$LEV0= 0
##$LPBIN= 0
##$MAXI= 10000
##$MC2= 0
##$MEAN= 0
##$ME_mod= 0
##$MI= 1.114404
##$NCOEF= 0
##$NC_proc= -5
##$NLEV= 6
##$NOISF1= 3.799351
##$NOISF2= 2.8
##$NSP= 0
##$NTH_PI= 0
##$NZP= 0
##$OFFSET= 15.98335
##$PC= 1
##$PHC0= -10762.79
##$PHC1= 10.80095
##$PH_mod= 1
##$PKNL= yes
##$PPARMOD= 0
##$PSCAL= 0
##$PSIGN= 0
##$REVERSE= no
##$SF= 200.130006257384
##$SI= 16384
##$SIGF1= 3
##$SIGF2= 2
##$SINO= 5.538805
##$SIOLD= 16384
##$SREGLST= <1H.CDCl3>
##$SSB= 0
##$STSI= 16384
##$STSR= 0
##$SW_p= 3396.73913043478
##$SYMM= 0
##$S_DEV= 0
##$TDeff= 16384
##$TDoff= 0
##$TI= <>
##$TILT= no
##$TM1= 0
##$TM2= 0
##$TOPLEV= 0
##$USERP1= <user>
##$USERP2= <user>
##$USERP3= <user>
##$USERP4= <user>
##$USERP5= <user>
##$WDW= 1
##$XDIM= 16384
##$YMAX_p= 460243111
##$YMIN_p= -285463
$$ End of Bruker specific parameters
$$ ---------------------------------
##NTUPLES= NMR SPECTRUM
##VAR_NAME=  FREQUENCY,     SPECTRUM/REAL,   SPECTRUM/IMAG
##SYMBOL=    X,             R,               I
##VAR_TYPE=  INDEPENDENT,   DEPENDENT,       DEPENDENT
##VAR_FORM=  AFFN,          ASDF,            ASDF
##VAR_DIM=   16384,         16384,           16384
##UNITS=     HZ,            ARBITRARY UNITS, ARBITRARY UNITS
##FACTOR=    0.207333158178281, 1,           1
##FIRST=     3198.74789550994, 0,            0
##LAST=      -197.991234924836, 0,           0
##MIN=       -197.991234924836, -285463,     0
##MAX=       3198.74789550994, 460243111,    0
$$ Real data points
##PAGE= N=1
##DATA TABLE= (X++(R..R)), XYDATA
$$ [...]
6094E61791J7339J9742J2807n113n8740j3400L2136m6557p1919M0300J18283O171
$$ 561791 579130 598872 611679 606566 547826 534426 566562 520005 448086 488386 606669 612840
6082F12840l5666J1465J3823j06125o2349M3l4451l2785J0669j3894n8167j1692
$$ 612840 577174 588639 602462 496337 433988 434031 399580 366795 377464 363570 305403 293711
6070B93711L3018j452Q9196j706j29658M9536P2229k5265r356M693P343j9221
$$ 293711 326729 325277 414473 412767 283109 332645 404874 379609 370253 374946 382289 363068
6058C63068l7973M4711q877q6608l891O6764l9225N1568J5844l3558l3348r613
$$ 363068 325095 369806 360929 274321 270430 337194 297969 349537 365381 331823 298475 288862
6046B88862j7822L3412k8318k1056L7728j15559K2284K3862M473K0210j4794L4668
$$ 288862 271040 304452 276134 255078 292806 177247 199531 223393 227866 248076 233282 267950
6034B67950m4423o5216J378o8816O3878R3045n9332m0198J5509K1596m8435L8820
$$ 267950 223527 158311 159689 90873 154751 247796 188464 148266 163775 185371 136936 175756
6022A75756J7567k1906j3723j438j6491Q215J2048K1485l683k367k1014K0974
$$ 175756 193323 171417 157694 156256 139765 147980 160028 181513 177830 175463 154449 175423
6010A75423K9045l84M9059P1881l0513q0176l8886k9895J8576L8483J0826M3664
$$ 175423 204468 204084 253143 325024 294511 214335 175449 145554 164130 202613 213439 257103
5998B57103j8506l2595l8016p648J1462M4409O0046J2430L882Q246n3198j4604
$$ 257103 238597 206002 167986 160338 171800 216209 276255 288685 292567 300813 247615 233011
5986B33011k7735L2929N6888K762k1112r3109m6348p3633k5182J10040O6375l6890
$$ 233011 205276 238205 295093 297855 276743 183634 137286 63653 38471 148511 214886 177996
5974A77996l2765q6241J00571P8518K2071J2711o7442m0699k8230k6476N0256
$$ 177996 145231 58990 159561 238079 260150 272861 205419 164720 136490 110014 160270
5963A60270k7612J8689p370K5775N7659J4861m1625l9814N7613J6157o3016K6633
$$ 160270 132658 151347 143977 169752 227411 242272 200647 160833 218446 234603 171587 198220
5951A98220r0093j6029L4679K3273Q1149n2277j0423n6801K475R9281n7294o2796
$$ 198220 108127 92098 126777 150050 231199 178922 168499 111698 114173 213454 156160 93364
5939I3364K2471j7627P3192k343M5572K6207k3424j8081P2096l6438k8858L1373
$$ 93364 115835 98208 171400 169057 214629 240836 217412 199331 271427 234989 206131 237504
5927B37504n3310q1553j5641q799N2475Q0125m2868n3940K6046K2351J7146o540
$$ 237504 184194 102641 87000 78201 130676 210801 167933 113993 140039 162390 179536 172996
5915A72996K522J2013l4462M276P451j7302Q6445m646k7141l1027k9265M5294
$$ 172996 175518 187531 153069 157345 164796 147494 233939 229293 202152 171125 141860 187154
5903A87154o5533M5949M4929o4846r214J08669n1864l1836J15359l3291r1893
$$ 187154 121621 167570 212499 147653 138439 247108 195244 163408 278767 245476 153583
5892A53583M3589k6069k5224k986M0848O045R053j1913m3894R8573M5055l4272
$$ 153583 197172 171103 145879 142893 183741 189786 198839 186926 143032 241605 286660 252388
5880B52388Q177j9117j9279Q8273J5022Q043k039n7548m8761M3597M3463l7971
$$ 252388 260565 241448 222169 310442 325464 333507 331468 273920 225159 268756 312219 274248
5868B74248m2410J5627q391p850k1912K7570P5554O9654j9229m4348O2234P0879
$$ 274248 231838 247465 239074 231224 209312 236882 312436 382090 362861 318513 380747 451626
5856D51626R3224O2101N84R1184k9236p205Q7265M4266o8888j00874j08435k8157
$$ 451626 544850 606951 607535 698719 669483 662278 749543 793809 724921 624047 515612 487455
5844D87455m7723j17939O1497m305J1262k6679p3795l8100L5781r749n6232J5887
$$ 487455 439732 321793 383290 378985 390247 363568 289773 251673 287454 277705 221473 237360
5832B37360K2360l6864Q0179r7478l2861P5526L7254n2090l4213J0639K0009J6422
$$ 237360 259720 222856 303035 205557 172696 248222 285476 233386 199173 209812 229821 246243
5820B46243k4378R10m8439j7956J36120p3411r4514N9579J3546m602K5788M1989
$$ 246243 221865 222775 174336 156380 292500 219089 124575 184154 197700 193098 218886 260875
5808B60875K9086j294q904m0077j3203K6766l988O6006M1253o7459l3323J2288
$$ 260875 289961 288667 279763 239686 226483 253249 249261 315267 356520 289061 255738 268026
5796B68026n2185j7786K8158N5661l0124K9578N4793m1044k976l8930L6110N6509
$$ 268026 215841 198055 226213 281874 251750 281328 336121 295077 292101 253171 289281 345790
5784C45790p6708p7659P918R0780O8666J7799p3881m8453q7024P5264P9334k1414
$$ 345790 269082 191423 199341 290121 358787 376586 302705 254252 167228 242492 321826 300412
5772C00412r4043J03278K3932j9230l8621k6944L9504o48J5312K028l8466K0383
$$ 300412 206369 309647 333579 314349 275728 248784 288288 287640 302952 304980 266514 286897
5760B86897J3016n5600l0188N9642J14334q6385O5462M6810r6995l7613J924R4845
$$ 286897 299913 244313 214125 273767 388101 301716 367178 413988 316993 279380 281304 376149
5748C76149Q2480o950m8922m1906j5583O8277L5025L5829K2240k6581l3894m9585
$$ 376149 458629 451679 402757 360851 345268 413545 448570 484399 506639 480058 446164 396579
5736C96579O9487P0123J5469q633j0781j6885q4268l3793M8357q964J25634Q8972
$$ 396579 466066 536189 551658 543025 532244 515359 431091 397298 445655 436691 562325 651297
5724F51297L644N6473m0999J8639M4187j2096J30707O8027L4738l9416k1788o826
$$ 651297 654941 711414 670415 689054 733241 721145 851852 919879 954617 915201 893413 886587
5712H86587j1799l1071J0821M3243q1041j9142J1307J1253M387J00581N5918K0714
$$ 886587 874788 843717 854538 897781 816740 797598 808905 820158 824545 925126 981044 1001758
5700A001758l7114K5003J63870P2431O2676L5391n4010j1400M9922K5235P2129
$$ 1001758 964644 989647 1153517 1225948 1288624 1324015 1270005 1258605 1308527 1333762 1405891
5689A405891m0899m4757p5428p6650J1404q1931o6701J07688N7295r833R9808
$$ 1405891 1364992 1320235 1244807 1168157 1179561 1097630 1030929 1138617 1195912 1186079 1285887
5678A285887O9916M7232j4281l8095m782R3280L4359P1369J27103l8978q9036
$$ 1285887 1355803 1403035 1388754 1350659 1345877 1439157 1473516 1544885 1671988 1633010 1543974
5667A543974k6466K2612n4090m8189Q5810m7898n6044Q519L3035J09287m6271
$$ 1543974 1517508 1540120 1486030 1437841 1523651 1475753 1419709 1428228 1461263 1570550 1524279
5656A524279j4970m0134l6454R8662J5360R1097Q473n0630o4020j58524j22684
$$ 1524279 1509309 1469175 1432721 1531383 1546743 1637840 1646313 1595683 1531663 1373139 1250455
5645A250455o9400Q7202m1812l1415n6340p4156N370J5508q4004m8712J12932
$$ 1250455 1181055 1268257 1226445 1195030 1138690 1064534 1069904 1085412 1001408 952696 1065628
5634A065628J08311J51891J13495P4482J7681j47140j66000m6312n2369L3361
$$ 1065628 1173939 1325830 1439325 1513807 1531488 1384348 1218348 1172036 1119667 1153028
5624A153028M4666o1860r7140j77885q5145n8905L0239j3436j12060k4007o751
$$ 1153028 1197694 1135834 1038694 860809 775664 716759 746998 733562 621502 597495 590744
5613E90744L7870n1586J390l3061M7544O7347L410J10254N1501O803M2512j38001
$$ 590744 628614 577028 578418 545357 592901 660248 663658 773912 825413 832216 874728 736727
5601G36727o7178k8073m2945K5670m5194k5415K9716l1746r2682k2681L0919P0835
$$ 736727 669549 641476 598531 624201 579007 553592 583308 551562 458880 436199 467118 537953
5589E37953K5506k8390m7770k5515n2242R622P1623N1048k438n6832l9024M588
$$ 537953 563459 535069 487299 461784 409542 419164 490787 541835 539397 482565 443541 448129
5577D48129j3330N6889p1147p4788P1849J3132n8485R1100K8047l0082K7543l511
$$ 448129 434799 491688 420541 345753 417602 430734 372249 463349 491396 461314 488857 485346
5565D85346P5131M6835o1196j49217J00823P1298j27110L756Q0413P275J2324
$$ 485346 560477 607312 546116 396899 497722 569020 441910 445666 526079 533354 545678
5554E45678L5264j0746j14522Q5992k4739l5435N9589M9380R5758O7328R1103
$$ 545678 580942 570196 455674 541666 516927 481492 541081 590461 686219 753547 844650
5543H44650r6437r3979l3054L737K6174j9744J0697n1519L1731O6513l1763o9966
$$ 844650 748213 654234 621180 624917 651091 631347 642044 590525 622256 688769 657006 587040
5531E87040K635O4330o524N5069p2600K6945Q8416Q925k1585M1408m2405J5372
$$ 587040 589675 654005 647481 702550 629950 656895 745311 754236 732651 774059 731654 747026
5519G47026L8307p1248l368O5172K7495j7796R0607k1729l7372K5599K6116l1509
$$ 747026 785333 714085 710717 775889 803384 785588 876195 854466 817094 842693 868809 837300
5507H37300J2728j2344M612q3379j05593J5880M1869l8385q283N9513l6941L621
$$ 837300 850028 837684 842296 758917 653324 669204 711073 672688 664405 723918 686977 690598
5495F90598l3292K7787j3073M8918r1378n0598L2097j8068K7173j7284k234R813
$$ 690598 657306 685093 672020 720938 629560 578962 611059 592991 620164 602880 600646 610459
5483F10459P7165l5000n6145K1762L4391O2070K9751n6668R4746J1232M460K331
$$ 610459 687624 652624 596479 618241 652632 714702 744453 687785 782531 793763 798223 800554
5471H00554p3156M8073M1493j3316K038m5172p4717K1766j8012K2082K9959L0140
$$ 800554 727398 775471 816964 803648 805686 760514 685797 707563 689551 711633 741592 771732
5459G71732k0324k7553J3912J8833j5303L2136l7783q2382k275m3984k2407n0055
$$ 771732 751408 723855 737767 756600 741297 773433 735650 653268 650993 607009 584602 534547
5447E34547l0291J5707m0283M5703O0680l386o2977k790L0590L4505K6202K099
$$ 534547 504256 519963 479680 525383 586063 582677 519700 516910 547500 582005 608207 610306
5435F10306O5085J3016l7690J0122j1702J77K1327o8148K6998M8555J7069l1763
$$ 610306 675391 688407 650717 660839 649137 649314 670641 602493 629491 678046 695115 663352
5423F63352n0966N5425J2014j8782P4736n708m8267N7956j1308n4747k2882k8944
$$ 663352 612386 667811 679825 661043 735779 730071 681804 739760 728452 673705 650823 621879
5411F21879L7224q278k1297M7803L9685k7501l907o41J7934L0975L1512k1912
$$ 621879 659103 650825 629528 677331 717016 689515 685608 684967 702901 733876 765388 743476
5399G43476j05435Q860Q7452O4932K1405J3216l4971q932O8185n1542M4446N470
$$ 743476 638041 646901 734353 799285 820690 833906 798935 790003 858188 806646 851092 856562
5387H56562j1943j4207L2053k8855M0354J5569k0036l7681P6717N2742o4098K7147
$$ 856562 844619 830412 862465 833610 873964 889533 869497 831816 908533 961275 897177 924324
5375I24324Q7264k1784M9090K7420j5048J1477K5496P3014J13691N1841L8742
$$ 924324 1011588 989804 1038894 1066314 1051266 1062743 1088239 1161253 1274944 1326785 1365527
5364A365527P0719Q4262J13061R4572J69921l6406j14594j04304r6180m2368N2176
$$ 1365527 1436246 1520508 1633569 1728141 1898062 1861656 1747062 1642758 1546578 1504210 1556386
5353A556386r3552N4135J03668Q5094L2601p809j546m8873k067O6901K6377P9149
$$ 1556386 1462834 1516969 1620637 1705731 1738332 1730523 1728977 1680104 1678037 1744938 1771315 1850464
5341A850464R4116Q4175J95061K35413J84404R922k12370k62661k41651j21572
$$ 1850464 1944580 2028755 2223816 2459229 2643633 2653555 2441185 2178524 1936873 1815301
5331A815301m7820j6910j11262m0530M1722K4038m0154K3889J4689M8633R5184
$$ 1815301 1767481 1750571 1639309 1598779 1640501 1664539 1624385 1648274 1662963 1711596 1806780
5320A806780L0954k7672R4648J07470J26249R6466J4574L2858L9850L5851O8314
$$ 1806780 1837734 1810062 1904710 2012180 2138429 2234895 2249469 2282327 2322177 2358028 2426342
5309B426342J02077J1674O7781R4042J45930J04600K5120L5152J68608J53862
$$ 2426342 2528419 2540093 2607874 2701916 2847846 2952446 2977566 3012718 3181326 3335188
5299C335188K81407L69786L05526K26757J00108k1607l82085m65788m21017l17278
$$ 3335188 3616595 3986381 4291907 4518664 4618772 4597165 4215080 3749292 3328275 3010997
5289C010997k24674j50221o7363o5611l6667K5341K7034n968m9118m999J5541
$$ 3010997 2786323 2636102 2568739 2503128 2466461 2491802 2518836 2512868 2463750 2458751 2474292
5278B474292L4077J29023J51948J13404R1628L520j17610m2868o3987R5745Q6432
$$ 2474292 2508369 2637392 2789340 2902744 2994372 2997892 2880282 2837414 2773427 2869172 2955604
5267B955604K0223l6386N0146M228O322R8946Q3127J34763R3833J44391K86244
$$ 2955604 2975827 2939441 2989587 2993815 3000137 3099083 3182210 3316973 3410806 3555197 3841441
5256C841441L20121K58760m0437k53362l68136k77452j65647o6210N0106j6096
$$ 3841441 4161562 4420322 4379885 4126523 3758387 3480935 3315288 3249078 3299184 3283088
5246C283088J4441P707J2998K2542K6423L4527L7295M0387K1866M3486Q442K6111
$$ 3283088 3297529 3305236 3318234 3340776 3367199 3401726 3439021 3479408 3501274 3544760 3553202 3579313
5234C579313L2816R2712K0820p4368n4847j8105K0366l0847M5030J04930J4199
$$ 3579313 3612129 3704841 3725661 3651293 3596446 3578341 3598707 3567860 3612890 3717820 3732019
5223C732019P9506Q5379M3641L124l5423L6670P5453R2381R4953J36867P4371
$$ 3732019 3811525 3896904 3940545 3943669 3908246 3944916 4020369 4112750 4207703 4344570 4418941
5212D418941O0650L8748M4596J45147J63942J92272Q6901R6654K13608J95156
$$ 4418941 4479591 4518339 4562935 4708082 4872024 5064296 5151197 5247851 5461459 5656615
5202E656615K35440K21745K22625K11217K06508K65611K92595K74603K44518L89766
$$ 5656615 5892055 6113800 6336425 6547642 6754150 7019761 7312356 7586959 7831477 8221243
5192H221243L47010L45645N05871M15162M12729O12722P20439Q34512R96035J155047
$$ 8221243 8568253 8913898 9419769 9834931 10247660 10860382 11580821 12415333 13411368 14566415
5182A4566415J362730J543131J838976K246109K874036L539076M339208M474983
$$ 14566415 15929145 17472276 19311252 21557361 24431397 27970473 32309681 36784664
5174C6784664K792747n56966l107151l544895k946910j957900j113416j74951
$$ 36784664 39577411 39020445 35913294 32368399 29421489 27463589 26350173 26175222
5166B6175222N67675J390065K347880L317205L662169J765817j723729m552299
$$ 26175222 26742897 28132962 30480842 33798047 37460216 39226033 37502304 32950005
5158C2950005n042398m028058k956295k202707j757645j229717r28017p33690
$$ 32950005 27907607 23879549 20923254 18720547 16962902 15733185 14805168 14071478
5150A4071478n11759k81969j68881l6882J34415K27095J65011o6192k68346k88981
$$ 14071478 13559719 13277750 13108869 13071987 13206402 13433497 13598508 13532316 13263970 12974989
5140A2974989o3627O4335K47779J80728K77450M28912N46303O31603Q51015J016521
$$ 12974989 12911362 12975697 13223476 13404204 13681654 14110566 14656869 15288472 16139487 17156008
5130A7156008J123453J355569J427219J440153J735439K275418K876384L609984
$$ 17156008 18279461 19635030 21062249 22502402 24237841 26513259 29389643 32999627
5122C2999627M643756N800621N325783K163734k128802m979852m938282l320000
$$ 32999627 37643383 43444004 48769787 50933521 48804719 43824867 38886585 35566585
5114C5566585j870454q39247k4893J077271K088130L419124M624947M235496J169447
$$ 35566585 33696131 32856884 32831991 33909262 35997392 39416516 44041463 48276959 49446406
5105D9446406l488223o500507o429599m939803l794918l008815k470386k016300
$$ 49446406 45958183 39457676 33028077 28088274 24293356 21284541 18814155 16797855
5097A6797855j690739j351644j082814q82713p06888o88916n59679m81018m88166
$$ 16797855 15107116 13755472 12672658 11789945 11083057 10394141 9834462 9353444 8865278
5088H865278m13087l67687k33922j94830j79307k55720j70674k11567k10553j31044
$$ 8865278 8452191 8084504 7850582 7655752 7476445 7220725 7050051 6838484 6627931 6496887
5078F496887n2840q1937j09833r3588j44333l3382k7701k8382j21253m0150o7611
$$ 6496887 6444047 6362110 6252277 6158689 6014356 5980974 5953273 5924891 5803638 5763488 5695877
5067E695877L4745q136P979J18839M1328m861o4859o6147j30116k1673n0506J4044
$$ 5695877 5730622 5722486 5730465 5849304 5890632 5885771 5820912 5754765 5624649 5602976 5552470 5566514
5055E566514O1149O6660n398q3771J5416J26991O2042M0526K9986n9163k4688
$$ 5566514 5627663 5694323 5688925 5605154 5620570 5747561 5809603 5850129 5880115 5820952 5796264
5044E796264k100J1397j87619l083J02331J6809k1705j01361m8057m0070o8861
$$ 5796264 5794164 5805561 5617942 5614859 5717190 5733999 5712294 5610933 5562876 5522806 5453945
5033E453945n521j4564j0490p6160j34179q7788j36452o7335j8053O7969p0530
$$ 5453945 5448424 5433860 5423370 5347210 5213031 5125243 4988791 4921456 4903403 4971372 4900842
5022D900842j01389o4696n5302N7966l3085K3923j4470m9225K0542l539k320J9037
$$ 4900842 4799453 4734757 4679455 4737421 4704336 4728259 4713789 4664564 4685106 4681567 4679247 4698284
5010D698284m9767L0795K799j6245M6992r685K7311J0114J04518K0167Q2665J13904
$$ 4698284 4648517 4679312 4682111 4665866 4712858 4703173 4730484 4740598 4845116 4865283 4947948 5061852
4998E061852K8465O0222K9270P3863O0763J3039P6179N2436Q1905n9964q2618
$$ 5061852 5090317 5150539 5179809 5253672 5314435 5327474 5403653 5456089 5537994 5478030 5395412
4987E395412N1475L9178J39644n4915l242M4542N2533N3339R711K6545J26937
$$ 5395412 5446887 5486065 5625709 5570794 5567552 5612094 5664627 5717966 5727677 5754222 5881159
4976E881159j0780L1844J26459L8963P8375J06813N9089Q3893O6528O5353P4715
$$ 5881159 5870379 5902223 6028682 6067645 6146020 6252833 6311922 6395815 6462343 6527696 6602411
4965F602411J34804J94315R9194J04605J49333J44662J5291N6881P8432J70411
$$ 6602411 6737215 6931530 7030724 7135329 7284662 7429324 7444615 7501496 7579928 7750339
4955G750339J69826K15844J80162J98732K97334L25848L78013L33195L62345K73957
$$ 7750339 7920165 8136009 8316171 8514903 8812237 9138085 9516098 9849293 10211638 10485595
4945A0485595J89099J90780J24126N2244J35430J71197J51218J50864J76624J20544
$$ 10485595 10674694 10865474 10989600 11041844 11177274 11348471 11499689 11650553 11827177 11947721
4935A1947721J48267L5311Q9781J28924R8075K29282K28908J69938J98760K38782
$$ 11947721 12095988 12131299 12221080 12350004 12448079 12677361 12906269 13076207 13274967 13513749
4925A3513749K00011K51688J93966L09029L44515M35374M98984M77323O20736
$$ 13513749 13713760 13965448 14159414 14468443 14812958 15248332 15747316 16224639 16845375
4916A6845375O26708N46039O17234P61255R70705J222668J438925J452131J571970
$$ 16845375 17472083 18018122 18635356 19396611 20367316 21589984 23028909 24481040 26053010
4907B6053010J874530K031146J993067J948669J783627J501000J319149J000087
$$ 26053010 27927540 29958686 31951753 33900422 35684049 37185049 38504198 39504285
4899C9504285O74959J62706k45692n16198p64352r29273j194382j289443j440681
$$ 39504285 40179244 40341950 40096258 39580060 38815708 37886435 36692053 35402610 33961929
4890C3961929j555741j503695j485408j316394j127494r32074o72319n61729n08654
$$ 33961929 32406188 30902493 29417085 28100691 26973197 26041123 25368804 24807075 24298421
4881B4298421m33764n85522o14097o83252o54109n61766n53175m83117m25677
$$ 24298421 23864657 23279135 22665038 21981786 21327677 20765911 20212736 19729619 19303942
4872A9303942l69109l72029l19269l25041j74681j71899j05316j78206j2468N8103
$$ 19303942 18934833 18562804 18243535 17918494 17743813 17571914 17466598 17288392 17275924 17334027
4862A7334027M8797J45821J15186K33840L31548K57894J98262J5448l52465m54112
$$ 17334027 17382824 17528645 17643831 17877671 18209219 18467113 18665375 18680823 18328358 17874246
4852A7874246l96679l02570j84883j02751j6195J6100J55060J81304L17123L45053
$$ 17874246 17477567 17174997 16990114 16887363 16871168 16887268 17042328 17223632 17540755 17885808
4842A7885808L19762M49061N06552M96925P00854P63447Q18321J051789J247283
$$ 17885808 18205570 18654631 19161183 19658108 20358962 21122409 21940730 22992519 24239802
4833B4239802J474282J603882K138758K749068L472273M512181N467571M909041
$$ 24239802 25714084 27317966 29456724 32205792 35678065 40190246 45657817 50566858
4825E0566858J273271l604874o064506n615878m219294l088712k285935j735620
$$ 50566858 51840129 48235255 42170749 36554871 32335577 29246865 26960930 25225310
4817B5225310j378425j041975p51951o58665n67479l25890r4067J00979K08403
$$ 25225310 23846885 22804910 22052959 21394294 20826815 20500925 20406858 20507837 20716240
4808B0716240L45405O58001R28581J214772J513306J786899K364883L174124M132194
$$ 20716240 21061645 21719646 22648227 23862999 25376305 27163204 29528087 32702211 36834405
4799C6834405N431736N556557L052892k012861o024305o550494n342873l928905
$$ 36834405 42266141 47822698 50875590 48862729 42838424 36287930 30945057 27016152
4791B7016152k844860k152947j635069j251775j055353p70589n50364l14326j39599
$$ 27016152 24171292 22018345 20383276 19131501 18076148 17305559 16755195 16440869 16301270
4782A6301270M2537K43417M27519N33546Q72256J056472J399613J979458K624404
$$ 16301270 16343807 16587224 17014743 17548289 18420545 19477017 20876630 22856088 25480492
4773B5480492L310738L923248L150503N3341l183338m565892l950880k864042
$$ 25480492 28791230 32714478 35864981 35918322 32734984 28169092 24218212 21354170
4765B1354170k171163j735465j255353r71379o70036n72319m04343l14423l20506
$$ 21354170 19183007 17447542 16192189 15220810 14550774 13978455 13574112 13259689 12939183
4756A2939183j13197N5628J69018N00197N69557P57170R94942J225412J415777
$$ 12939183 12825986 12881614 13050632 13550829 14120386 14877556 15872498 17097910 18513687
4747A8513687J953135K553805L274828M083991M051185J634708k481713n043479
$$ 18513687 20466822 23020627 26295455 30379446 34430631 36065339 33583626 28540147
4739B8540147m996271l918006k759756k024181j632271j329277j031556r20571
$$ 28540147 23543876 19625870 16866114 14841933 13209662 11880385 10848829 9928258
4731I928258q07991o14952o09839m33772l65491m52160l47726l36814k52864j81753
$$ 9928258 9120267 8505315 7895476 7461704 7096213 6644053 6296327 5959513 5706649 5524896
4721E524896k05035j73544j44478r8079q9048j04818r3124l291l2775j02401j44314
$$ 5524896 5319861 5146317 5001839 4903760 4814712 4709894 4616770 4613479 4580704 4478303 4333989
4710D333989l4738j22481p3687k0452q1493p7609K2471j17394o1875M6349j3134
$$ 4333989 4299251 4176770 4103083 4082631 4001138 3923529 3946000 3828606 3766731 3813080 3799946
4699C799946m5964J1276M3737n9632j06896J2726l8928q666j12683l2174l1286
$$ 3799946 3753982 3765258 3808995 3749363 3642467 3655193 3616265 3607599 3494916 3462742 3431456
4688C431456n3200m0995r9613j15211K2531M9151L8451k8626J6477j06670o0591
$$ 3431456 3378256 3337261 3237648 3122437 3144968 3194119 3232570 3203944 3220421 3113751 3053160
4677C053160l7292M5423J1088m3731M8730N1906K9418O5418R1925L1000q596J08044
$$ 3053160 3015868 3061291 3072379 3028648 3077378 3129284 3158702 3224120 3316045 3347045 3338449 3446493
4665C446493R5285J19853N5451r0142M2134M4433l115j28408j11039r8625p4670
$$ 3446493 3541778 3661631 3717082 3626940 3669074 3713507 3710392 3581984 3470945 3372320 3297650
4654C297650M9554j6797m5321l9273j8409Q9212j5304k2721j901j4051K3599J8449
$$ 3297650 3347204 3330407 3285086 3245813 3227404 3316616 3301312 3278591 3276690 3262639 3286238 3304687
4642C304687N7577O3268J3212K970R3920J8348o5807m7079n6711J6765m1987k7638
$$ 3304687 3362264 3425532 3438744 3441714 3535634 3553982 3488175 3441096 3384385 3401150 3359163 3331525
4630C331525m4305L1812r8386p3418r2049n1021j5990P1974q1019j19893l6449
$$ 3331525 3287220 3319032 3220646 3147228 3055179 3004158 2988168 3060142 2979123 2859230 2822781
4619B822781p5465J2896L6813M370l7616r6855Q1178L6925m5775O4270k890O749
$$ 2822781 2747316 2760212 2797025 2801395 2763779 2666924 2748102 2785027 2739252 2803522 2800632 2807381
4607B807381J415p220j17951j11504m9631o7734k699o6793k0445k813j9227m980
$$ 2807381 2808796 2801576 2683625 2572121 2522490 2454756 2452057 2385264 2364819 2362006 2342779 2337799
4595B337799l0640K0619P4907q203j1440L7255O0377O5679J39478L4776o3032
$$ 2337799 2307159 2327778 2402685 2394482 2383042 2420297 2480674 2546353 2685831 2720607 2657575
4584B657575j5890q1599j22891o1566K5900o0298j4393R0297n5720o9856K0134
$$ 2657575 2641685 2560086 2437195 2375629 2401529 2341231 2326838 2417135 2361415 2291559 2311693
4573B311693J178l4902o5679l5484N509J0398J3985L0612K4124J00942M2281J09998
$$ 2311693 2312871 2277969 2212290 2176806 2182315 2192713 2206698 2237310 2261434 2362376 2404657 2514655
4561B514655Q2506m3228n5857m4294k7656N3785N3135o8726P611o4387j5878P9340
$$ 2514655 2597161 2553933 2498076 2453782 2426126 2479911 2533046 2464320 2471931 2407544 2391666 2471006
4549B471006Q4898n6163m7011l5486k3956J07146J19420M9085J160J25840J28274
$$ 2471006 2555904 2499741 2452730 2417244 2393288 2500434 2619854 2668939 2670099 2795939 2924213
4538B924213N9590R1998K25092J23869J46846K74983L03554L81182M95225M84023
$$ 2924213 2983803 3075801 3300893 3424762 3571608 3846591 4150145 4531327 5026552 5510575
4528E510575K80153k91379n29586m55691k57412j73678j87581r2542n1524k6417
$$ 5510575 5790728 5499349 4969763 4514072 4256660 4082982 3895401 3802859 3751335 3724918
4518C724918O1102L4544R0240J87477J12483K38277K37291L04713M82656N70503
$$ 3724918 3786020 3820564 3910804 4098281 4210764 4449041 4686332 4991045 5473701 6044204
4508F044204N58051N94191L20594j00195n8843Q2099k2312n21848p11067n69741
$$ 6044204 6602255 7196446 7517040 7416845 7358002 7440101 7417789 6895941 6184874 5615133
4498E615133l54841j88840j54361m5349l7644O5496J27095J37767K09320L34059
$$ 5615133 5260292 5071452 4917091 4871742 4834098 4899594 5026689 5164456 5373776 5707835
4488E707835M69384K38205j98172m99391m32044l65470k58564k12958j44014L4570
$$ 5707835 6177219 6415424 6217252 5717861 5285817 4920347 4661783 4448825 4304811 4339381
4478D339381K1797J0949L6278L2340O8677N8154O661J1524k3672r8483k8758P8519
$$ 4339381 4361178 4372127 4408405 4440745 4509422 4567576 4574237 4585761 4562089 4463606 4434848 4513367
4466D513367r327k0100L4336M5418K8512M6705J10451Q5559j475L2606O3429Q7156
$$ 4513367 4504040 4483940 4518276 4563694 4592206 4638911 4749362 4834921 4833446 4866052 4929481 5016637
4454E016637Q802M6028O4229N5342J55411K01985M1859m994r6491M2547J85911
$$ 5016637 5025439 5071467 5135696 5191038 5346449 5548434 5590293 5585299 5488808 5531355 5717266
4443E717266R2014P2254K07774K17905K79744K33288K69629K68134J64423K89163
$$ 5717266 5809280 5881534 6089308 6307213 6586957 6820245 7089874 7358008 7522431 7811594
4433G811594J27845Q5784K06450J46630J69509K93751L07021L50218M67605O22752
$$ 7811594 7939439 8025223 8231673 8378303 8547812 8841563 9148584 9498802 9966407 10589159
4423A0589159P37753P87254R53094J054319P21851M47291L34903L45994K80954
$$ 10589159 11326912 12114166 13067260 14121579 14843430 15290721 15625624 15971618 16252572
4414A6252572J83315J8666p079N8495J67530K89966M58952N04581L44160K15950
$$ 16252572 16435887 16454553 16447474 16505969 16673499 16963465 17422417 17926998 18271158 18487108
4404A8487108J43366K12712M57090M59967K98861Q277q0972J2929J42896J28862
$$ 18487108 18630474 18843186 19300276 19760243 20059104 20067381 19986409 19999338 20142234 20271096
4394B0271096j54983m62478p34959q31889r99266j039510q03321o15862m89903
$$ 20271096 20116113 19653635 18918676 18086787 17087521 16048011 15244690 14628828 14138925
4385A4138925m86190m10012l93053l84597l65939m47889m41144l96385j91831
$$ 14138925 13652735 13242723 12849670 12465073 12099134 11651245 11210101 10813716 10621885
4376A0621885q4414k79118n60506o94567o43072m03268k25733m3191M2617P0413
$$ 10621885 10537471 10258353 9697847 9003280 8360208 7956940 7731207 7688016 7730633 7801046
4366G801046k9110k60101k95551m64719n51307m70201l12492j84139j44789j16607
$$ 7801046 7771936 7511835 7216284 6751565 6200258 5730057 5417565 5233426 5088637 4972030
4356D972030r1118r3767n8178r4394K4722n3769j08173j18150j58504o9668p2675
$$ 4972030 4880912 4787145 4728967 4634573 4659295 4605526 4497353 4379203 4220699 4151031 4078356
4345D078356j58566j08848l2030j52097o4110l0239J2841K7720l7800p5980N8066
$$ 4078356 3919790 3810942 3778912 3626815 3562705 3532466 3545307 3573027 3535227 3459247 3517313
4334C517313J4554o2465j14738j9157K8528o1957q548q442p8209n5087q7009j01788
$$ 3517313 3531867 3469402 3354664 3335507 3364035 3302078 3293530 3285088 3206879 3151792 3064783 2962995
4322B962995r1934j7011p0654o4137l2838N6689M6582o7016L3768J5416m02O6675
$$ 2962995 2871061 2854050 2783396 2719259 2686421 2743110 2789692 2722676 2756444 2771860 2771458 2838133
4310B838133n4990p7872N1802m692L8320o6639m9588j4737r6157j6751l9812J8018
$$ 2838133 2783143 2705271 2757073 2752381 2790701 2724062 2674474 2659737 2563580 2546829 2507017 2525035
4298B525035j3274M8724J224L9237p1448k9817M3321M7566Q186j3829P6497k0071
$$ 2525035 2511761 2560485 2561709 2600946 2529498 2499681 2543002 2590568 2598754 2584925 2661422 2641351
4286B641351r598m448J537P3420L5277M1501J6007q0916m0254P8112j752O3897
$$ 2641351 2631753 2627305 2628842 2702262 2737539 2779040 2795047 2714131 2673877 2751989 2750237 2814134
4274B814134j0103m0212K0710j525N5306L8408M165M3302J04172N1715J40494
$$ 2814134 2804031 2763819 2784529 2783004 2838310 2876718 2880883 2924185 3028357 3080072 3220566
4263C220566J9128q4341J6540N357o126N0455N7429R561N042M2373P6836J27103
$$ 3220566 3239694 3155353 3171893 3177250 3171124 3221579 3279008 3288569 3293611 3335984 3412820 3539923
4251C539923M3886l8664M2540J12123J6282L7564Q3042M4811L2054J31851P6982
$$ 3539923 3583809 3545145 3587685 3699808 3716090 3753654 3836696 3881507 3913561 4045412 4122394
4240D122394L4269M6762N8714J3479J21565K3637L248N0124J61570J52118J29591
$$ 4122394 4156663 4203425 4262139 4275618 4397183 4420820 4424068 4474192 4635762 4787880 4917471
4229D917471J73928J8410r145R2651J36365J57798R4232J20985J15422Q9345J26259
$$ 4917471 5091399 5109809 5100664 5193315 5329680 5487478 5581710 5702695 5818117 5907462 6033721
4218F033721K09774J96038J85584J97167K00906K71134L10040K74658L60647L32022
$$ 6033721 6243495 6439533 6625117 6822284 7023190 7294324 7604364 7879022 8239669 8571691
4208H571691M20638N65751O01434O83249O88744P22672R51293J187553J396232
$$ 8571691 8992329 9558080 10159514 10842763 11531507 12254179 13205472 14393025 15789257
4199A5789257J613214J120818l5531o21325m41052l3558K38020M79387Q70522
$$ 15789257 17402471 18523289 18487758 17866433 17425381 17391823 17629843 18109230 18979752
4190A8979752J323872J677932K212106K737686K871144J524010p49033j586747
$$ 18979752 20303624 21981556 24193662 26931348 29802492 31326502 30577469 28990722
4182B8990722j089652j59066O65338J282785J208245L46840m1763N02084J140491
$$ 28990722 27901070 27742004 28407342 29690127 30898372 31245212 31203449 31705533 32846024
4173C2846024J656994J442733O19392M43128K36648P7312O79271J545462Q40747
$$ 32846024 34503018 35945751 36565143 37008271 37244919 37322231 38001502 39546964 40387711
4164D0387711j518784k624453k018119q09115K98843J227261K028450J718458
$$ 40387711 38868927 36244474 34226355 33417240 33716083 34943344 36971794 38690252
4156C8690252n2108j086330o12480J87036N9503n43468q63592j475367j992323
$$ 38690252 38638144 37551814 36939334 37126370 37185873 36642405 35778813 34303446 32311123
4147C2311123j610733o86952J48014P2612m75263p33828j49107O59849J259450
$$ 32311123 30700390 30013438 30161452 30234064 29758801 29024973 28875866 29535715 30795165
4138C0795165J561507J051756j124695l040884l285208k619035j797745j220961
$$ 30795165 32356672 33408428 32283733 29242849 25957641 23338606 21540861 20319900
4130B0319900r27687m15044n7721K66765P13259R56652N98575n14052j364027
$$ 20319900 19392213 18977169 18919448 19186213 19899472 20856124 21454699 20940647 19576620
4121A9576620j434549r16670m89045m53812n56007l63449m3471r58k99936o19853
$$ 19576620 18142071 17225401 16736356 16282544 15726537 15363088 15319617 15318659 15018723 14398870
4111A4398870o31386m19744l55313k43478k51693j09538n0648J24211K69626K47074
$$ 14398870 13767484 13347740 12992427 12748949 12497256 12387718 12337070 12461281 12730907 12977981
4101A2977981K75533K16164K40594J75657R7756K23042L99986Q09983J118090
$$ 12977981 13253514 13469678 13710272 13885929 13983685 14206727 14606713 15416696 16534786
4092A6534786J295213Q59507N9555k34216J31402L17237k62537o79277o55464
$$ 16534786 17829999 18689506 18749061 18514845 18646247 18963484 18700947 18021670 17366206
4083A7366206k85718J54550J68646k37078k90577K3521K64448N19179Q32628R08725
$$ 17366206 17080488 17235038 17403684 17166606 16876029 16899550 17163998 17683177 18515805 19424530
4073A9424530Q91866O91039Q5257l6096L84626R76421J034605N53056Q6760n1309
$$ 19424530 20316396 21007435 21092692 21056596 21441222 22417643 23452248 24005304 24092064 24040755
4063B4040755N14483J388442K007040J167501k0417m83414o07821m81229l82265
$$ 24040755 24555238 25943680 27950720 29118221 29097804 28614390 28006569 27525340 27143075
4054B7143075l07708n52988q09746j140566j433761j634452j819314j520110j184602
$$ 27143075 26835367 26282379 25472633 24332067 22898306 21263854 19444540 17924430 16739828
4045A6739828j154544q11841m37178j18093K32020L10929K02350j27323o63528
$$ 16739828 15585284 14773443 14336265 14218172 14450192 14761121 14963471 14836148 14172620
4036A4172620q65554m71279q1126j56731m62881m01762j00355j0611l19144m79839
$$ 14172620 13307066 12835787 12754661 12597930 12135049 11733287 11632932 11622321 11303177 10823338
4026A0823338l70244j57422j7236n5175l20077p40989p50297m77416l80036l07198
$$ 10823338 10453094 10295672 10278436 10223261 9903184 9162195 8411898 7934482 7554446 7247248
4016G247248j58928K9651R9673J93920K93573j5333n09222o35436m02362m94447
$$ 7247248 7088320 7117971 7217644 7411564 7705137 7689804 7180582 6545146 6142784 5648337
4006E648337l68516j57063j70725j11176q7559r1826K904l9597n0933m4844L993
$$ 5648337 5279821 5122758 4952033 4840857 4753298 4661472 4664376 4624779 4573846 4529002 4532995
3995D532995j17207p0302j42442j48567q8136j5253l3703j17317k2933L4166m2039
$$ 4532995 4415788 4345486 4203044 4054477 3966341 3951088 3917385 3800068 3777135 3811301 3769262
3984C769262q2976Q9936L9735O163p382L6549n1443j2366P0074k4663M0686K2708
$$ 3769262 3686286 3776222 3815957 3822120 3814738 3851287 3799844 3787478 3857552 3832889 3873575 3896283
3972C896283n1055m4109K0411M3200J4899O3019R414N7525Q767M4149N2016K3316
$$ 3896283 3845228 3801119 3821530 3864730 3879629 3942648 3952062 4009587 4018354 4062503 4114519 4137835
3960D137835K6642k1623Q6320J23598Q5628J28583J04124P5320J74246K22842
$$ 4137835 4164477 4142854 4229174 4352772 4438400 4566983 4671107 4746427 4920673 5143515
3950E143515L55987L19709L71794L68507O23181R07003Q80380P26667M71871O51676
$$ 5143515 5499502 5819211 6191005 6559512 7182693 8089696 8970076 9696743 10168614 10820290
3940A0820290Q19257M10036m40432j104562j363704j194537q65295o30563m45374
$$ 10820290 11639547 12049583 11609151 10504589 9140885 7946348 7081053 6450490 6005116
3931F005116l19213k60619k20380j34470j70684n5303j2701j18141m0149Q3453
$$ 6005116 5685903 5425284 5204904 5070434 4899750 4844447 4831746 4713605 4673456 4756909
3921D756909N8455k7603O9337Q4620J76494J40598J46652K52238L04691L77634
$$ 4756909 4815364 4787761 4857098 4941718 5118212 5258810 5405462 5657700 5962391 6340025
3911F340025M42107L23437M7350n5489J50739K62936M75079N19076O37542P66321
$$ 6340025 6782132 7105569 7152919 7097430 7248169 7511105 7986184 8505260 9142802 9909123
3901I909123R59464R11642R67458J299218J284373j29576j659814j723090j140616
$$ 9909123 10868587 11780229 12747687 14046905 15331278 15201702 13541888 11818798 10678182
3892A0678182o82267l69595o2426m9554l8911J01217J73834K88899O49470J028915
$$ 10678182 9995915 9626320 9563894 9514340 9475429 9576646 9750480 10039379 10688849 11717764
3882A1717764J400479R98658l70438j538096j484510r86032p72512o89317p09049
$$ 11717764 13118243 14116901 13746463 12208367 10723857 9737825 8965313 8275996 7566947
3873G566947n04994m32081l08499j39993k0291l6129k09910l01098k19818k04585
$$ 7566947 7061953 6629872 6321373 6181380 6161089 6124960 5915050 5613952 5394134 5189549
3863E189549j71644j85913p3569M7465o688k7356o5209j7423l8992K4974P4176
$$ 5189549 5017905 4831992 4758423 4805888 4799200 4771844 4706635 4689212 4650220 4675194 4749370
3852D749370J43202J16960N5178J8960J06499J35942J56083K42730K63458K06835
$$ 4749370 4892572 5009532 5064710 5083670 5190169 5326111 5482194 5724924 5988382 6195217
3842F195217L61984N09614N10726M55826J33193j55511j47046j03459K2824P0894
$$ 6195217 6557201 7066815 7577541 8033367 8166560 8011049 7864003 7760544 7783368 7854262
3832G854262J01275J46552L48147N06898O23941P61818R63111J140273N23679
$$ 7854262 7955537 8102089 8450236 8957134 9581075 10342893 11306004 12446277 12969956
3823A2969956l50387l67486J1396L54058K52247j85608n21264o02385n24786j17621
$$ 12969956 12619569 12252083 12263479 12617537 12869784 12684176 12162912 11560527 11035741 10918120
3813A0918120J17761L42379M47629Q48809J016006P88054N26030L99824M34083
$$ 10918120 11035881 11378260 11825889 12674698 13690704 14478758 15004788 15404612 15838695
3804A5838695P76969J280173J329445J71674j296069j481396q92617k97174k57611
$$ 15838695 16615664 17895837 19225282 19396956 18100887 16619491 15726874 15429700 15172089
3795A5172089m52928m27164k16784k96286m73703l12283l666L41122J68643j63699
$$ 15172089 14719161 14291997 14075213 13778927 13305224 12992941 12989275 13330397 13499040 13335341
3785A3335341j30132K27619L06653M8292p2962K37807L63008n08554j119336r45554
$$ 13335341 13205209 13432828 13739481 13787773 13714811 13952618 14315626 13807072 12687736 11742182
3775A1742182o37686m52776k74885k17290r4764r4282m3798L4398J44274J08070
$$ 11742182 11104496 10651720 10376835 10159545 10064781 9970499 9926701 9961099 10105373 10213443
3765A0213443K33564L21444K99916K31908L82038L33716L67353M49350O60997
$$ 10213443 10447007 10768451 11068367 11300275 11682313 12016029 12383382 12832732 13493729
3756A3493729P51591R80063J315888J482893J673516J801946K219851K746428
$$ 13493729 14245320 15225383 16541271 18024164 19697680 21499626 23719477 26465905
3748B6465905L622652M611598N521464M836880M45867m350150n553895m121250
$$ 26465905 30088557 34700155 40221619 45058499 45504366 41154216 35600321 31479071
3740C1479071k756575j979300j384421p35047m5160M20932P88397J277362J765524
$$ 31479071 28722496 26743196 25358775 24623728 24578568 24999500 25787897 27065259 28830783
3731B8830783K284781K960196L746178M760899N880668P233447P770637N371961
$$ 28830783 31115564 34075760 37821938 42582837 48463505 55696952 63467589 68839550
3723F8839550K156455J124826j878069p399105r842325q328061o063415m438716
$$ 68839550 70996005 72120831 70242762 62843657 53001332 44673271 38609856 34171140
3715C4171140l286514k412778j657014j015078m63232m135L65921P10348J376643
$$ 34171140 30884626 28471848 26814834 25799756 25336524 25332389 25698310 26408658 27785301
3706B7785301J959003K758149L998474N197316N615759K357297m103313p537798
$$ 27785301 29744304 32502453 36500927 41698243 47314002 49671299 45567986 38030188
3698C8030188o752410m959180l526054k750633k231523j730217j441093j209377
$$ 38030188 31277778 26318598 22792544 20041911 17810388 16080171 14639078 13429701
3690A3429701r22438p61284p30818n66615m83114m99180m82503l37775k90587
$$ 13429701 12507263 11745979 11015161 10448546 9965432 9466252 8983749 8645974 8355387
3681H355387l01233k56663j33233k23582j91424j53147j62900j29296k14440q5921
$$ 8355387 8054154 7797491 7664258 7440676 7249252 7096105 6933205 6803909 6589469 6503548
3671F503548l6664o7688j16215k9550j32898j4773q0882l8477j17022j7399p1186
$$ 6503548 6466884 6399196 6282981 6253431 6120533 6105760 6024878 5986401 5869379 5851980 5780794
3660E780794j7029J03136m8237m620k0630n9638j87039l0102k0262j8501K5984
$$ 5780794 5763765 5866901 5818664 5814044 5793414 5733776 5546737 5516635 5496373 5477872 5503856
3649E503856M1182L4924l4630j2391k094P2672M2865n1507J12821M3498J15814
$$ 5503856 5545038 5579962 5545332 5532941 5530847 5603519 5646384 5594877 5707698 5751196 5867010
3638E867010O1114j8842O8896L5302L8348Q174L1116J666R6310L7676n279N0010
$$ 5867010 5928124 5909282 5978178 6013480 6051828 6060002 6091118 6092784 6189094 6226770 6221491 6271501
3626F271501J11889N2462Q4181M8502K0522K9055L5074P0370J06450N4881J08386
$$ 6271501 6383390 6435852 6520033 6568535 6589057 6618112 6653186 6723556 6830006 6884887 6993273
3615F993273J41614J73045J02923Q6332K9642R7381K12547J50002J67641R6482
$$ 6993273 7134887 7307932 7410855 7497187 7526829 7624210 7836757 7986759 8154400 8250882
3605H250882J92771K35561K45762K19612J98432K92254J69095K06690K85602L15683
$$ 8250882 8443653 8679214 8924976 9144588 9343020 9635274 9804369 10011059 10296661 10612344
3595A0612344K92257L67467N23582M30688L82138N78759N69323N54683O25545
$$ 10612344 10904601 11272068 11795650 12226338 12608476 13187235 13756558 14311241 14936786
3586A4936786Q64722J037220J148806J416351J645936K043239K276450K781031
$$ 14936786 15801508 16838728 17987534 19403885 21049821 23093060 25369510 28150541
3578B8150541L354340M181503N346196O152010N539045K251011k480132m839939
$$ 28150541 31504881 35686384 41032580 47184590 52723635 54974646 52494514 47654575
3570D7654575m506485k909231j495040m02517O77506J811595L077833M389450
$$ 47654575 43148090 40238859 38743819 38341302 39018808 40830403 43908236 48297686
3562D8297686N015257L749424j48115m190631n319120m319818k586945r83160
$$ 48297686 53312943 57062367 56914252 52723621 47404501 43084683 40497738 39514578
3554C9514578L83173J775579K985599L456108J792782j700701m185022m373407
$$ 39514578 39897751 41673330 44658929 48115037 49907819 48207118 44022096 39648689
3546C9648689l197730k002180j019840m08255K59973J084957K001173K943734
$$ 39648689 36450959 34448779 33428939 33020684 33280657 34365614 36366787 39310521
3538C9310521K674566K49434l244940n120677m742945l714821k668215k013015
$$ 39310521 41985087 42234521 38989581 33868904 29125959 25411138 22742923 20729908
3530B0729908j860689j516996j353331j057215q06210p85610m71637m26261m66412
$$ 20729908 18869219 17352223 15998892 14941677 14135467 13349857 12878220 12451959 11985547
3521A1985547l26803k57321m76179n30994l95772l38375l56058l11905j48550
$$ 11985547 11658744 11401423 10925244 10394250 9998478 9660103 9304045 8992140 8843590
3512H843590j11378r1745P213P2549n6467j78518k99457k60481k55502j66742
$$ 8843590 8732212 8640467 8647680 8720229 8663762 8485244 8185787 7925306 7669804 7503062
3502G503062j72332j26517j09422j05762n8744m041L5503Q705L6275P7356N3783
$$ 7503062 7330730 7204213 7094791 6989029 6930285 6926244 6961747 6970452 7006727 7084083 7137866
3491G137866j1459O3445P1934R5974K09205L22982L73485M33866L94075N75211
$$ 7137866 7126407 7189852 7261786 7357760 7566965 7889947 8263432 8697298 9091373 9666584
3481I666584O30059Q09907J117275J404538J822572J511785O45566n17619j356230
$$ 9666584 10296643 11106550 12223825 13628363 15450935 16962720 17608286 17090667 15734437
3472A5734437j163828o11129j73480J72389O04041J218648J600081R80584r54392
$$ 15734437 14570609 13959480 13786000 13958389 14562430 15781078 17381159 18361743 17407351
3463A7407351k055061j712523j090248n69506l57477j02740J72557M64841R20272
$$ 17407351 15352290 13639767 12549519 11980013 11622536 11519796 11692353 12157194 13077466
3454A3077466J117520J018784N25385k26082n02850n24825n10521l73844J29167
$$ 13077466 14194986 15213770 15739155 15513073 15010223 14485398 13974877 13601033 13730200
3445A3730200N60275Q90238R48123M79122o03475j779122k067097j553566j125499
$$ 13730200 14290475 15180713 16128836 16607958 16004483 14225361 12158264 10604698 9479199
3436I479199q84135p69244n83834n35524m11398l28283k90111j52498j43437j71696
$$ 9479199 8595064 7825820 7241986 6706462 6295064 5966781 5676670 5524172 5380735 5209039
3426E209039j34796j40225j04817k4743n6009j36904k6664J8969N4017R495m7671
$$ 5209039 5074243 4934018 4829201 4804458 4748449 4611545 4584881 4603850 4657867 4667362 4619691
3415D619691p3143M359J35727J36136P322l8955p234j17266j72774j30790k3596
$$ 4619691 4546548 4550907 4686634 4822770 4830092 4791137 4783903 4666637 4493863 4363073 4339477
3404D339477J9818R3941j2790l1952q6780k9793n1876j41970j09623r0723k512
$$ 4339477 4359295 4453236 4440446 4408494 4321714 4291921 4240045 4098075 3988452 3897729 3895217
3393C895217K12M908l746o2823m142j3569k4055J230K6002m4631k5682L3762N4533
$$ 3895217 3895429 3900337 3896591 3833768 3829626 3816057 3792002 3793232 3819234 3774603 3748921 3782683 3837216
3380C837216M9107J2438j7967m595P0444Q8592j3173j5132N626l1979J6029J23529
$$ 3837216 3886323 3898761 3880794 3876199 3946643 4035235 4022062 4006930 4012556 3980577 3996606 4120135
3368D120135O1925n3370L1657k1973j37826l1665l8657L1537m1455K7721K3607
$$ 4120135 4182060 4128690 4160347 4138374 4000548 3968883 3930226 3961763 3920308 3948029 3971636
3357C971636j8834O0504j6415N8082N6664R28M1376j5933J1969j7502j7059q1392
$$ 3971636 3952802 4013306 3996891 4054973 4111637 4112565 4153941 4138008 4149977 4132475 4115416 4034024
3345D034024K826k3211m2313N2060q5004l8227l0781q1277j37234k1436l8226
$$ 4034024 4036850 4013639 3971326 4023386 3938382 3900155 3869374 3788097 3650863 3629427 3591201
3334C591201j28532q4446o4362m0774K6313R886P5406J1731K1023K9691N4280
$$ 3591201 3462669 3378223 3313861 3273087 3299400 3309286 3384692 3396423 3417446 3447137 3501417
3323C501417k5524Q6956L5846n0714R8708R2189M7471Q3681J7703n4305l2836
$$ 3501417 3475893 3562849 3598695 3547981 3646689 3738878 3786349 3870030 3887733 3833428 3800592
3312C800592m6338J7709j6669k7808K787R555M1717k761K0117L621L1894M6853
$$ 3800592 3754254 3771963 3755294 3727486 3730273 3739828 3781545 3778784 3798901 3802522 3834416 3881269
3300C881269J01416M4247j1099N4485J47761J38412M5836M5455M9402K7307J7101
$$ 3881269 3982685 4026932 4015833 4070318 4218079 4356491 4402327 4447782 4497184 4524491 4541592
3289D541592j7767J2802J11905L8763p7375m0687Q3527P7491P7775P6570N2533
$$ 4541592 4523825 4536627 4648532 4687295 4609920 4569233 4652760 4730251 4808026 4884596 4937129
3278D937129J00800J58091L8493J07390J2671O1985P5645R1563R8035J0385N0583
$$ 4937129 5037929 5196020 5234513 5341903 5354574 5416559 5492204 5583767 5681802 5692187 5742770
3267E742770J19724P3560J10645O3865O1278J13046J03778R0487o79l4259q244
$$ 5742770 5862494 5936054 6046699 6110564 6171842 6284888 6388666 6479153 6478474 6444215 6435971
3256F435971k3313p5358p5924J02766Q4290R5648J17882J02244R5160J48675J66619
$$ 6435971 6412658 6337300 6261376 6364142 6448432 6544080 6661962 6764206 6859366 7008041 7174660
3245G174660J26902J06368J50952J50340K12884K01476K14023K20242K55731K10676
$$ 7174660 7301562 7407930 7558882 7709222 7922106 8123582 8337605 8557847 8813578 9024254
3235I024254L32381L70958N17188N80538P12969P71202Q68194M71532l01236n92144
$$ 9024254 9356635 9727593 10244781 10825319 11538288 12309490 13177684 13649216 13347980 12755836
3225A2755836n37458l00884j69318j1110r0399J5684P7253J85536J41375K22670
$$ 12755836 12218378 11917494 11748176 11737066 11646667 11662351 11739604 11925140 12066515 12289185
3215A2289185K71845L02453L35048K12001O094P3709K23546K43332K20578K17622
$$ 12289185 12561030 12863483 13198531 13410532 13416626 13490335 13713881 13957213 14177791 14395413
3205A4395413N3098J70453M1375M9289J76160J77475J16573J60098K1643J57280
$$ 14395413 14448511 14618964 14660339 14709628 14885788 15063263 15179836 15339934 15361577 15518857
3195A5518857J90542J67030K00922K13271K47236K66305L01201K81165L51627
$$ 15518857 15709399 15876429 16077351 16290622 16537858 16804163 17105364 17386529 17738156
3186A7738156L38743K88126L86474L27774L65111N21168P15933P74863Q97541
$$ 17738156 18076899 18365025 18751499 19079273 19444384 19965552 20681485 21456348 22353889
3177B2353889R38041R87543R26190Q78570Q95921J102952J246426J341199J275181
$$ 22353889 23291930 24279473 25205663 26084233 26980154 28083106 29329532 30670731 31945912
3168C1945912J402795J578883J913172K131762K354664K252883K210497K045645
$$ 31945912 33348707 34927590 36840762 38972524 41327188 43580071 45790568 47836213
3160D7836213K205643K391025K644309K985702L330676L499709L623354L875043
$$ 47836213 50041856 52432881 55077190 58062892 61393568 64893277 68516631 72391674
3152G2391674M185238M547489N307849O578544Q158261J0139968J2436285J4804892
$$ 72391674 76576912 81124401 86432250 93010794 101169055 111309023 123745308 138550200
3144A38550200J7424167K0315775K4503298L0650410L9220323M9907593O0445238
$$ 138550200 155974367 176290142 200793440 231443850 270664173 320571766 381017004
3137C81017004N5149416K4076691j4232603m5828530n3928274m6762668m0487781
$$ 381017004 436166420 460243111 446010508 400181978 346253704 299491036 259003255
3130B59003255l7033911l2099013k5295113j9272812j4765141j1506504q704663
$$ 259003255 221969344 189870331 164575218 145302406 130537265 119030761 110326098
3123A10326098o553849n718977o461336p593846q374576p800078o596423n343996
$$ 110326098 103772249 98053272 91591936 83998090 75623514 67823436 61227013 55883017
3115E5883017m330841l586794k978296k532504k296333j936205j697368j359393
$$ 55883017 51552176 47965382 44987086 42454582 40158249 38222044 36524676 35165283
3107C5165283j303955j402427j449298j369185j225503r08410p87370o50585p09023
$$ 35165283 33861328 32458901 31009603 29640418 28414915 27506505 26719135 26068550 25359527
3098B5359527q50760j047198q59613p72133o06828m26579n15183o27475o02951
$$ 25359527 24508767 23461569 22601956 21829823 21222995 20796416 20281233 19653758 19050807
3089A9050807o00361m84621n81865m67906m53565l85105l40669k93455l03471
$$ 19050807 18450446 17965825 17383960 16916054 16462489 16077384 15736715 15443260 15139789
3080A5139789k68930l84988l33228m32196m21349l76326m02001k97236k92156
$$ 15139789 14870859 14485871 14152643 13720447 13299098 12922772 12520771 12223535 11931379
3071A1931379k40535l02673k77304j35754j34420j19077p9661k8661q2731J3811
$$ 11931379 11690844 11388171 11110867 10975113 10840693 10721616 10641955 10613294 10530563 10544374
3061A0544374R6245m8782q4345j18032p892l1352m6571n1500l5393n198m4448
$$ 10544374 10640619 10591837 10507492 10389460 10381568 10350216 10303645 10252145 10216752 10211554 10167106
3050A0167106l4730N2519N8122M698K1810J65393K49242K39318K94667L36577
$$ 10167106 10132376 10184895 10243017 10247715 10269525 10434918 10684160 10923478 11218145 11554722
3040A1554722M76810M74010O24197R17283J189368J367856J163387J65962j217124
$$ 11554722 12031532 12505542 13129739 14047022 15236390 16604246 17767633 17933595 16716471
3031A6716471k020471j684281j188675p93056o02787o23427o13293m57188k91139
$$ 16716471 14696000 13011719 11823044 11029988 10427201 9803774 9190481 8733293 8442154
3022H442154k36195j85735l14721l22723k36011j84090j43806j84151j92146p8144
$$ 8442154 8205959 8020224 7705503 7382780 7146769 6962679 6818873 6634722 6442576 6364432
3012F364432N7194J3900n0246k5813O1794L7925Q1419Q9601J30528K23232N9078
$$ 6364432 6421626 6435526 6385280 6359467 6421261 6459186 6540605 6630206 6760734 6983966 7043044
3001G043044J03273R7640M0896P2152R1292J31349N4338J47545J80990K55561
$$ 7043044 7146317 7243957 7284853 7357005 7448297 7579646 7633984 7781529 7962519 8218080
2991H218080J83770K7304J35852K33533R2480J21645J65027N23r766o8107j37306
$$ 8218080 8401850 8429154 8565006 8798539 8891019 9012664 9177691 9178214 9168448 9100341 8963035
2980H963035j31712k13988l77105m17954m05934l03949k64978k64843k28314l02793
$$ 8963035 8831323 8617335 8240230 7822276 7416342 7112393 6847415 6582572 6354258 6051465
2970F051465k01445k50677l34754j97917k23056j69077j94339q7945j66277k07219
$$ 6051465 5850020 5599343 5264589 5066672 4843616 4674539 4480200 4392255 4225978 4018759
2960D018759j56733r2013m9913o4356j82943n7147j13654q0735q7722m8418j9937
$$ 4018759 3862026 3770013 3720100 3655744 3472801 3415654 3302000 3221265 3133543 3085125 3065188
2949C065188o3337j08331j49793J1652L2871K8857O4237O450j9112k8957q2623
$$ 3065188 3001851 2893520 2743727 2755379 2788250 2817107 2881344 2887794 2868682 2839725 2757102
2938B757102n7353j24933j19545p5523j15480o7311p4169o8293r5400J3442N519
$$ 2757102 2699749 2574816 2455271 2379748 2264268 2196957 2122788 2054495 1959095 1972537 1978056
2927A978056L5668L5172l6988p0611N122k6545o2066l6134m948r030j26182l5734
$$ 1978056 2013724 2048896 2011908 1941297 1946419 1919874 1857808 1821674 1816726 1807696 1681514 1645780
2915A645780k9438m1110m2373j6412r179p6539l6920j5975j26879n7518N0051
$$ 1645780 1616342 1575232 1532859 1516447 1507268 1430729 1393809 1377834 1250955 1193437 1243488
2904A243488R116Q2639N4963l8873m300Q5389j059r9447k4361q6177k06L2864
$$ 1243488 1252604 1335243 1390206 1351333 1347033 1432422 1431363 1331916 1307555 1221378 1221172 1254036
2892A254036l1768j15059k1766p383j2674n8514o4739m2284o1286J8966k3763
$$ 1254036 1222268 1107209 1085443 1078060 1065386 1006872 942133 899849 838563 857529 833766
2881H33766n2448l0783J15155m7516J5703L6603p9604K2273j5689N2934m5717
$$ 833766 781318 750535 865690 818174 833877 870480 790876 813149 797460 850394 804677
2870H04677K0782R857Q3452j3801j0400j5458J2400J6446m5294p999K7107o426
$$ 804677 825459 835316 918768 904967 894567 879109 891509 907955 862661 854662 881769 875343
2858H75343L6678R7835K7145L5107k5224P6063L7567K5029L9944J9749L1537J3852
$$ 875343 912021 1009856 1037001 1072108 1046884 1122947 1160514 1185543 1225487 1245236 1276773 1290625
2846A290625P3276k7111m174J08716M2173r062n6278k8683O7279N0418j496J08290
$$ 1290625 1363901 1336790 1332616 1441332 1483505 1474443 1418165 1389482 1456761 1507179 1505683 1613973
2834A613973Q4390L7309J77375K31821K94713K71441K96286K29581r4237k91710
$$ 1613973 1698363 1735672 1913047 2144868 2439581 2711022 3007308 3236889 3142652 2850942
2824B850942l10409j26379p3843k04354j86501q4586j18539m7873j6881q1120
$$ 2850942 2540533 2414154 2340311 2135957 1949456 1864870 1746331 1698458 1681577 1600457
2814A600457p4066j61058q3603q3048j7646n9560p4863m3816m9416N108k2952
$$ 1600457 1526391 1365333 1281730 1198682 1181036 1121476 1046613 1002797 953381 958489 935537
2803I35537o5876m8961J0235j7430N4648N8759Q7542O7926q3832j08380r8915
$$ 935537 869661 820700 830935 813505 868153 926912 1014454 1082380 998548 890168 791253
2792G91253o2871j8632m9113n0220P650L5248p0467j01644l2011M4212m2016l1114
$$ 791253 728382 709750 660637 610417 618067 653315 582848 481204 449193 493405 451389 420275
2780D20275j6432K0291q1982M412M6250q0885k3807M1591M6507j3295k7097l7685
$$ 420275 403843 424134 342152 346564 392814 311929 288122 329713 376220 362925 335828 298143
2768B98143n0777J4459l943J2509M3706J6665k3805L1875n3206l6907k6630p747
$$ 298143 247366 261825 257882 270391 314097 330762 306957 338832 285626 248719 222089 214342
2756B14342O629M3759O2245o5233n2779l6907o7056J0404P6709j1902L3781N6718
$$ 214342 220971 264730 326975 261742 208963 172056 105000 115404 192113 180211 213992 270710
2744B70710l6929k5369L5375k8626m476k1283K0835M400J3105O420m499K7210
$$ 270710 233781 208412 243787 215161 210685 189402 210237 214637 227742 234162 229663 256873
2732B56873Q4694o4152j2979j5844r176m377m5356J5862K0483m5578L5479J7820
$$ 256873 341567 277415 264436 248592 239416 235039 189683 205545 226028 180450 215929 233749
2720B33749q7703o3197O5348J921K3019J7192j2040r9271L9118k3690n2910k5687
$$ 233749 146046 82849 148197 150118 173137 190329 178289 79018 118136 94446 41536 15849
2708A5849j8259R7415l3965q9227J5066L7242l1267p86r996P2027m7528k9299
$$ 15849 -2410 95005 61040 -28187 -13121 24121 -7146 -7932 -17928 54099 6571 -22728
2696b2728n8295N0824P6431n1199M0036M8773j5976j9229q406P3673j1479l4972
$$ -22728 -81023 -30199 46232 -4967 35069 83842 67866 48637 40231 113904 102425 67453
2684F7453N6447n5153o2384k638K9109K5445N84P0373o5559m0139K3308J0920
$$ 67453 123900 68747 6363 3725 32834 58279 58863 129236 63677 23538 46846 57766
2672E7766o7789K415l314L9988J2790n294l5364O026L0556n5811j0213R473L494
$$ 57766 -10023 -7608 -10922 29066 41856 36562 1198 7224 37780 -18031 -28244 -18771 -15277
2659a5277l7678K9338J28655p5755j974j0398P315N3217M3087L5264J0266O900
$$ -15277 -52955 -23617 105038 29283 27309 16911 24226 77443 120530 155794 166060 172960
2647A72960l0518o3238P104P445j9440m3234M3509L0813m1631j10187L4612L7644
$$ 172960 142442 79204 86308 93753 74313 31079 74588 105401 63770 -46417 -11805 25839
2635B5839j5950N4841j0300j4609n2053J9131M2105J1471J0441l8994K0467q559
$$ 25839 9889 64730 54430 39821 -12232 6899 49004 60475 70916 31922 52389 43830
2623D3830k0480K9715p430j4993P8334J4827j10126m3228k3044P3649L1790p229
$$ 43830 23350 53065 45635 30642 108976 123803 13677 -29551 -52595 21054 52844 45615
2611D5615l8373l0077l1413Q375J3787R6673K3567j5099l2465Q674n7604K1337
$$ 45615 7242 -22835 -54248 -45873 -32086 64587 88154 73055 40590 49264 -8340 12997
2599A2997n8229P453p154J660J4376j4585o4560Q531O8773R373M8265k9146m5305
$$ 12997 -45232 -37779 -44933 -43273 -28897 -43482 -108042 -99511 -30738 -21365 26900 -2246 -47551
2586d7551m3618O537L6279J9279J5659Q742m987p0842L9287j7322j1834O3047
$$ -47551 -91169 -84632 -48353 -29074 -13415 -4673 -9660 -80502 -41215 -58537 -70371 -7324
2574g324M9487j332m9670r3305J5598O4843j0150M4796K1679P032J718J2560N936
$$ -7324 42163 40831 -8839 -102144 -86546 -21703 -31853 12943 34622 41654 43372 55932 61868
2561F1868j572p84k8988L1889k8768j555l4198P664J13537O204k9694l1381r271
$$ 61868 60296 59512 30524 62413 33645 32090 -2108 5556 119093 125297 95603 64222 54951
2548E4951L5508o4672o6N2430k1953o634p6126k8774j4580L8059K1145J396J5855
$$ 54951 90459 25787 25721 78151 56198 49564 -26562 -55336 -69916 -31857 -10712 -9316 6539
2535F539k2206o642K686n433N3248K2907j5480N5570L7921r1937j03169M0921
$$ 6539 -15667 -22309 -19623 -25056 28192 51099 35619 91189 129110 37173 -65996 -25075
2523b5075O156o374M1010k5405M0432r676M793J1031l0849j5460N3092l6001O282
$$ -25075 -18919 -25293 15717 -9688 30744 21068 25861 36892 6043 -9417 43675 7674 13956
2510A3956J6647l1433P1098Q0j5780K8560k5542M9174q1471q8052j5564Q7875
$$ 13956 30603 -830 70268 70348 54568 83128 57586 106760 25289 -62763 -78327 9548
2498I548O0861n0429k9133K0681q866o4751j6067J09786j2192q0832M6128P246
$$ 9548 70409 19980 -9153 11528 2662 -62089 -78156 31630 19438 -61394 -15266 -8020
2486h020j7299j5113Q6235L0799R30M521l2108l9812o1063j1856J1669R0962k6045
$$ -8020 -25319 -40432 45803 76602 77532 82053 49945 10133 -50930 -62786 -51117 39845 13800
2473A3800q8928l4480K9892N6844M0857q131O2139q288m5320j498q958M4942l2793
$$ 13800 -75128 -109608 -79716 -22872 17985 9854 71993 63705 18385 16887 7929 52871 20078
2460B0078M1768m0779L5036K6862m9788l2310Q0959Q3483j497K6900o4789k736
$$ 20078 61846 21067 56103 82965 33177 867 81826 165309 163812 190712 125923 123187
2448A23187K9659K6934m5700K5134L3473k0868N7652J6944o9962l3805K1042K365
$$ 123187 152846 179780 134080 159214 192687 171819 229471 246415 176453 142648 163690 166055
2436A66055n1873n2035K3406K6070j2459M8772k8539l9613N1310L0419l4967m2360
$$ 166055 114182 62147 85553 111623 99164 147936 119397 79784 131094 161513 126546 84186
2424H4186K044m367j641L2378o7481o7591j3616M3281P4215j3929J8279O13o1838
$$ 84186 86230 81863 80222 112600 45119 -22472 -36088 7193 81408 67479 85758 86371 24533
2411B4533p0719k8391N4085O7532N2679q674l5286m4890n826P5326m2327J1033
$$ 24533 -46186 -74577 -20492 47040 99719 91045 55759 10869 5043 80369 38042 49075
2399D9075N2075r229j5688l9559k0064k966k8176N4630L1104j35038K012K8154
$$ 49075 101150 91921 76233 36674 16610 13644 -14532 40098 71202 -63836 -61824 -33670
2387c3670l8061J7159J6973M8949Q274L2047K0597p5491K3982K4526l4045N1178
$$ -33670 -71731 -54572 -37599 11350 19624 51671 72268 -3223 20759 45285 11240 62418
2375F2418j0600L5356m9086L1839m4740L3302M9564M5712j02598k2417L3407K8713
$$ 62418 51818 87174 38088 69927 25187 58489 108053 153765 51167 28750 62157 90870
2363I0870Q7307K0879L1059j9664O4659K0773n4976l9806l7352K9486n2717l1399
$$ 90870 178177 199056 230115 210451 275110 295883 240907 201101 163749 193235 140518 109119
2351A09119L945m8547K2328K4986k7663l2804K323l7203K3588k1112J0523R1640
$$ 109119 113064 64517 86845 111831 84168 51364 53687 16484 40072 18960 29483 121123
2339A21123Q5891l5737k0322n4825P891K2247R6369J12027j0672K3560M2271K8337
$$ 121123 207014 171277 150955 96130 104021 126268 222637 334664 323992 347552 389823 418160
2327D18160P813N8826R1126O9042n9302p7287m5350n9046j00681n2273k9981m0358
$$ 418160 425973 484799 575925 644967 585665 508378 463028 403982 303301 251028 221047 180689
2315A80689k8978l3146N4140k8168p6856L360N2161O8147k8100l2840K8624q9046
$$ 180689 151711 118565 172705 144537 67681 71041 123202 191349 163249 130409 159033 69987
2303F9987o369K9046L3548j0791K269j718L1539O6563l4328O4222L6961N3561
$$ 69987 63618 92664 126212 115421 117690 115972 147511 214074 179746 243968 280929 334490
2291C34490Q0214K0759j1585o7245J8315o4554K6488L4169j16090J0108M3304
$$ 334490 414704 435463 423878 356633 374948 310394 336882 371051 254961 265069 308373
2280C08373K2506n7289m4353L5487j6311n6705M0924o0301L3024N6928O4474n0359
$$ 308373 330879 273590 229237 264724 248413 191708 232632 172331 205355 262283 326757 276398
2268B76398j02437M3961J8344N3909M8662K6384O6379o009J683J03433N4441J00351
$$ 276398 173961 217922 236266 290175 338837 365221 431600 425591 427274 530707 585148 685499
2256F85499r307n2916m9515j11729l6455k3612j5412J0501M2104L9926j51273
$$ 685499 676192 623276 573761 462032 425577 401965 386553 397054 439158 479084 327811
2245C27811L5492M6248P233L839M024j12309j3990O9298P0240m1700j1982J05178
$$ 327811 363303 409551 416784 420623 424647 312338 298348 367646 437886 396186 384204 489382
2233D89382n265M4866k049J2243J19319Q0649P7799Q1871J15342Q3576O7687k7273
$$ 489382 484117 528983 526934 539177 658496 739145 816944 898815 1014157 1097733 1165420 1138147
2221A138147n4761M739j46656r3675r0598p5133k4345l3396m9055K6845J3513
$$ 1138147 1083386 1088125 941469 847794 757196 682063 657718 624322 575267 602112 615625
2210F15625j6480K7634k492n801p1839n307M3471M2187N9587M7440J9123p2103
$$ 615625 599145 626779 624287 618486 546647 541340 584811 626998 686585 734025 753148 681045
2198F81045k6692J26650M9144Q2376N5739l7270P4857J33450J01759L8290J28918
$$ 681045 654353 781003 830147 912523 968262 930992 1005849 1139299 1241058 1279348 1408266
2187A408266L132p0793j15800j12372k0874j7913K4217N632m2237K105l9011Q6302
$$ 1408266 1411398 1340605 1224805 1112433 1091559 1073646 1097863 1103495 1061258 1063363 1024352 1110654
2175A110654O3833Q1611J3659N4482K6797L8913J1614j9897J0260r8463j17777
$$ 1110654 1174487 1256098 1269757 1324239 1351036 1389949 1401563 1381666 1391926 1293463 1175686
2164A175686O159r8489J2463L4013j24626N52J7837L340p3822r4897j28241j19676
$$ 1175686 1181845 1083356 1095819 1129832 1005206 1005758 1023595 1026935 953113 858216 729975 610299
2152F10299j1433O6461j7298p0108K7988m2754J717N8634m2053l9824m3351j4383
$$ 610299 598866 665327 648029 577921 605909 563155 564872 623506 581453 541629 498278 483895
2140D83895m3991K1513K7477j7873m6730O4955j06225k9980J4128m2211l7248
$$ 483895 439904 461417 488894 471021 424291 489246 383021 353041 367169 324958 287710
2129B87710k565o746N7201L5044p9000j5442k0066M9239M5597j4488o4591m7083
$$ 287710 285145 278399 335600 370644 291644 276202 256136 305375 350972 336484 271893 224810
2117B24810l1422M3686L0222m9321k2631j0925K1204K2190N7341M747k0964k4589
$$ 224810 193388 237074 267296 217975 195344 184419 205623 227813 285154 289901 268937 244348
2105B44348k7210J33711n1386J1155j1662l7550j1434M4378K9230K441j09441
$$ 244348 217138 350849 299463 310618 298956 261406 249972 294350 323580 326021 216580
2094B16580j38886J9639O7973J7555l4338n8474L3947L973L9326J6629l2101n4516
$$ 216580 77694 97333 165306 182861 148523 90049 123996 127969 167295 183924 151823 97307
2082I7307K9586o8244J5991P7466k6990l5846K0258P0251O7092N2756j34542p0735
$$ 97307 126893 58649 74640 152106 125116 89270 109528 179779 246871 299627 165085 94350
2070I4350k7701j8427L547J10673K5085L3439m910J2570l0415j9038k968q2130
$$ 94350 66649 48222 51769 162442 187527 220966 216056 228626 198211 179173 176205 94075
2058I4075n2029M0817m7501K4721m9413n5699j3260P2074j7355j3117N954m4601
$$ 94075 42046 82863 35362 60083 10670 -45029 -58289 13785 -3570 -16687 -10733 -55334
2046e5334O178N4600M1912n485l939J4111p243K4504K883K9428m6791n8319n7825
$$ -55334 -49156 5444 47356 41871 37932 52043 44800 69304 72187 101615 54824 -3495 -61320
2033f1320K9624K3597J1750M9261Q955N4438k3500n9675p199O1020k1021K3455
$$ -61320 -31696 -8099 3651 52912 61867 116305 92805 33130 25931 86951 65930 89385
2021H9385n1155q2037K4851k2247J979J0863K9995J6944j4388n0020k7159j3343
$$ 89385 38230 -43807 -18956 -41203 -39224 -28361 1634 18578 4190 -45830 -72989 -86332
2009h6332N1122M6257o5156l1682J0287J13071l1782n573l9741L4851Q2752r484
$$ -86332 -35210 11047 -54109 -85791 -75504 37567 5785 212 -39529 -4678 78074 68590
1997F8590k7914J0340l3607N2698n3708p2948l7735N5037L6493p6935J2094j939
$$ 68590 40676 51016 17409 70107 16399 -56549 -94284 -39247 -2754 -79689 -67595 -69534
1985f9534J417J0355M7828Q699K8186l0910M8736k1433r3946k2454j544M2535
$$ -69534 -68117 -57762 -9934 -1235 26951 -3959 44777 23344 -70602 -93056 -94600 -52065
1973e2065j413n4198N478M1272j4845j5526L7818J0492q946l3940m2234Q3014
$$ -52065 -53478 -107676 -102198 -60926 -75771 -91297 -53479 -42987 -51933 -85873 -128107 -45093
1961d5093N231o7812J8691L1646m3374Q4127j5238K7540L01l9940R095k7721K3390
$$ -45093 -39862 -107674 -88983 -57337 -100711 -16584 -31822 -4282 -3981 -43921 -34826 -62547 -39157
1948c9157M6807n3897k9381J7055j2371J739m6619O6441M9731o6824J7177P63
$$ -39157 7650 -46247 -75628 -58573 -70944 -69205 -115824 -49383 348 -66476 -49299 -48536
1936d8536r5800O6609O205K97L050J1196k7012j5644J4707n8154P2097L4517N6732
$$ -48536 -144336 -77727 -71522 -71225 -68175 -56979 -83991 -99635 -84928 -143082 -70985 -36468 20264
1923B0264J8887q5461m0469j6824l4921J09193N6575J0864L0035K0747m0957k1081
$$ 20264 39151 -46310 -86779 -103603 -138524 -29331 27244 38108 68143 88890 47933 26852
1911B6852P1573o6294o7269l8550K1846J1640j0354k1219j788j7514M9925J512
$$ 26852 98425 32131 -35138 -73688 -51842 -40202 -50556 -71775 -73563 -91077 -41152 -39640
1899c9640O7072k1944p1425l5239k5028M1866R7302l291r1130N7470N7237m8918
$$ -39640 27432 5488 -65937 -101176 -126204 -84338 12964 9673 -81457 -23987 33250 -15668
1887a5668k3628R678p8785l0396P2237K1093N4419K8015j7611l5069k6383L9250
$$ -15668 -39296 -29618 -108403 -138799 -66562 -45469 8950 36965 19354 -15715 -42098 -2848
1875b848m5930Q89J0081j6207M5878R020m2675j3989q50J08722k4232l9154k4303
$$ -2848 -48778 -47889 -37808 -54015 -8137 883 -41792 -55781 -56631 52091 27859 -11295 -35598
1862c5598k0550K7364l970P655l021m2735K8682J4561P571n0137p2594L5284R3883
$$ -35598 -56148 -28784 -32754 -25099 -28120 -70855 -42173 -27612 -20041 -70178 -142772 -107488 -13605
1849a3605K5900M469k6765P185m7776j5834O8062L0823P0581Q293p4830L4324
$$ -13605 12295 16764 -10001 -2816 -50592 -66426 1636 32459 103040 111333 36503 70827
1837G0827R1039P555k1924k6519K1171R708n8644j39510K2884M3290m0600k0027
$$ 70827 161866 169421 147497 120978 142149 151857 93213 -46297 -23413 19877 -20723 -40750
1825d0750L8393p609K0091j0409Q3767p367m530k5021n1579m3403j9143R7917
$$ -40750 -2357 -9966 10125 -284 83483 76116 71586 46565 -5014 -48417 -67560 30357
1813C0357N2993J3764N6230L0310j08606r1619J40732Q4556L4564o5822m9031
$$ 30357 83350 97114 153344 183654 75048 -16571 124161 208717 243281 177459 128428
1802A28428m8403r6545P396M4583O3941r0599R860j8441L4164j2190k8990L4540
$$ 128428 80025 -16520 -9124 35459 99400 8801 18661 220 34384 22194 -6796 27744
1790B7744n919J04538N1147o9659q4287O075L8846O8955M1544n7222j0214o1047
$$ 27744 21825 126363 177510 107851 23564 29639 68485 137440 178984 121762 111548 50501
1778E0501Q253k1943j9932P629N5892j4957L9449m1600O5743r09J9126N6455p3533
$$ 50501 58754 36811 16879 24508 80400 65443 104892 63292 129035 128126 147252 203707 130174
1765A30174k5453m8808J192m3059J3580q156K5924n75k1097M2681K3682r6838
$$ 130174 104721 55913 57105 14046 27626 19470 45394 44819 23722 66403 90085 -6753
1753f753R4264k4143p9744l0402L5979j7093M430J9709J5634j1451k9127Q2996
$$ -6753 87511 63368 -16376 -46778 -10799 -27892 -23462 -3753 11881 430 -28697 54299
1741E4299n4550r1046K4800l4664N1561m750r38N1652n8383Q809q113J01076K0392
$$ 54299 -251 -91297 -66497 -101161 -49600 -54350 -55288 -3636 -62019 -53210 -61323 39753 60145
1728F0145m0449p4552j151N3957m4808l1758O9612L5062J9273m2392R567j8901
$$ 60145 19696 -54856 -56007 -2050 -46858 -78616 -9004 26058 45331 2939 12506 -6395
1716f395k0557J7860j411k7957k8093K1269o2582J8690P831N9986N3698j05943
$$ -6395 -26952 -9092 -10503 -38460 -66553 -45284 -107866 -89176 -81345 -21359 32339 -73604
1704g3604O3406j7115q3036l2519N3966R6790j038N491O422k732k4219M95R546
$$ -73604 -10198 -27313 -110349 -142868 -88902 7888 6850 12341 18763 16031 -8188 -7693 1853
1691A853l9873J7307L7423n7232m8407j7480K6738M0985j6635o5006O560p912
$$ 1853 -38020 -20713 16710 -40522 -88929 -106409 -79671 -38686 -55321 -120327 -113767 -121679
1679a21679K0708O322m8396M7802L3966l9654N0045o8015n4156J1892Q8171Q1628
$$ -121679 -100971 -94649 -143045 -95243 -61277 -100931 -50886 -118901 -173057 -161165 -72994 8634
1667H634m3920m0118l6533O1129r2716j7956O9415J0155O0756p322n4613J6698
$$ 8634 -35286 -75404 -111937 -50808 -143524 -161480 -92065 -81910 -21154 -28476 -83089 -66391
1655f6391K2965r745j8604k8131N383J5143j2525k9355J0539k8392O4886j8780
$$ -66391 -43426 -53171 -71775 -99906 -94523 -79380 -91905 -121260 -110721 -139113 -74227 -93007
1643i3007L4850m6832L38l1615k5779L0947J474R565Q974l272K5884l8234L2415
$$ -93007 -58157 -104989 -104651 -136266 -162045 -131098 -129624 -120059 -111085 -114357 -88473 -126707 -94292
1630i4292J11896j06168m5145j2144L2243r5946N0683O5358O9703l4056n035q0741
$$ -94292 17604 -88564 -133709 -145853 -113610 -209556 -158873 -93515 -23812 -57868 -62903 -143644
1618a43644R5327J3673K6595k8319m3196L2641n4920j6616L73K2806M8436R8978
$$ -143644 -48317 -34644 -8049 -36368 -79564 -46923 -101843 -118459 -118086 -95280 -46844 52134
1606E2134n532r2765o290p093k9626M1479J0594M916L234M4108m3258q006k6611
$$ 52134 46602 -46163 -52453 -59546 -89172 -47693 -37099 -32183 -28949 15159 -28099 -36105 -62716
1593f2716K8496n1149L8758O580p08l8158j6956K4124n566j9033K3480n9922m5919
$$ -62716 -34220 -85369 -46611 -40031 -40739 -78897 -95853 -71729 -77295 -96328 -72848 -132770 -178689
1580a78689R8934N2742o8517n7460L2055K5237k9675Q0567l4021J4498j3347J7746
$$ -178689 -79755 -27013 -95530 -152990 -120935 -95698 -125373 -44806 -78827 -64329 -77676 -59930
1568e9930M0531n5572l5370M2586J9103K8609m707q5204K1262n4140L47l1345
$$ -59930 -19399 -74971 -110341 -67755 -48652 -20043 -24750 -109954 -88692 -142832 -142485 -173830
1556a73830K5555Q6055J2175j1345l8748p9584P4145K0243m8639P1611l0385m1236
$$ -173830 -148275 -62220 -50045 -61390 -100138 -179722 -105577 -85334 -133973 -62362 -92747 -133983
1544a33983N7802j7555J2054M673M5965j977n2658n5324J8482n2650L7870J21577
$$ -133983 -76181 -93736 -81682 -77009 -31044 -33021 -85679 -141003 -122521 -175171 -137301 -15724
1532a5724L1527m1905j7678l0996M2624k9640l0872L3725K2224m3463q94O7346
$$ -15724 15803 -26102 -43780 -74776 -32152 -61792 -92664 -58939 -36715 -80178 -81072 -13726
1520a3726J6399l3180L8900L012j25779l4707K2320J8383N1599N962n3741O5338
$$ -13726 2673 -30507 8393 11405 -114374 -149081 -126761 -108378 -56779 -50817 -104558 -39220
1508c9220l9209l513n551j4686K6296k3545k0489k8562j2989j8023N5128J27842
$$ -39220 -78429 -81942 -87493 -102179 -75883 -99428 -119917 -148479 -161468 -179491 -124363 3479
1496C479r340k1841m0691k5681m8236n1914J6963M9263N3155J8143m1822J7973
$$ 3479 -5861 -27702 -68393 -94074 -142310 -194224 -177261 -127998 -74843 -56700 -98522 -80549
1484h0549o4801l9071L1801J00586p438l9213r251j7295k7671m1444O3363Q5710
$$ -80549 -145350 -184421 -152620 -52034 -59472 -98685 -107936 -125231 -152902 -194346 -130983 -45273
1472d5273L9506l8263j3705j3993o5879O3637P0063K1257m2291j54510M8359M2278
$$ -45273 -5767 -44030 -57735 -71728 -137607 -73970 -3907 17350 -24941 -179451 -131092 -88814
1460h8814k3777j6016J0945P0745l911l0108j2488m8352m964q577J647N3866l3970
$$ -88814 -112591 -128607 -117662 -46917 -50828 -80936 -93424 -141776 -146740 -155317 -153670 -99804 -133774
1447a33774K9798j1777k4559K4259L0887n51q66m5845K328N1709P897N0553M4832
$$ -133774 -103976 -115753 -140312 -116053 -85166 -85717 -86583 -132428 -130100 -78391 -70494 -19941 24891
1434B4891p2441m1820J00248n271j14940M758P1564M2506J0078q4362j9800M8387
$$ 24891 -47550 -89370 10878 5607 -109333 -104575 -33011 9495 19573 -64789 -84589 -36202
1422c6202p2227j2773L0617o2476l1191M6650J6364K6604N0000n7404J0075O2661
$$ -36202 -108429 -121202 -90585 -153061 -184252 -137602 -121238 -94634 -44634 -102038 -91963 -29302
1410b9302J6285o9451l4139M1110j8511Q3103Q549j13010r644n0860O2465M9666
$$ -29302 -13017 -82468 -116607 -75497 -94008 -10905 -2356 -115366 -125010 -175870 -113405 -63739
1398f3739M6661R597m7580K5250O9228o4739j4245m5828L7525m2913M8781N1212
$$ -63739 -17078 -7481 -55061 -29811 39417 -25322 -39567 -85395 -47870 -90783 -42002 9210
1386I210n632m877n1621J5698n4360j9593j7707l6390P141p171M0443m1260M6726
$$ 9210 3578 -1299 -52920 -37222 -91582 -111175 -128882 -165272 -158131 -165302 -124859 -166119 -119393
1373a19393N2331J8554l4817m7705N555K8706L1039k7079J8022K4939J7257J3918
$$ -119393 -67062 -48508 -83325 -131030 -125475 -96769 -65730 -92809 -74787 -49848 -32591 -18673
1361a8673N7051n531q5448L7598L545N765N9827j1681l5473k342k6546M5977l482
$$ -18673 38378 32847 -52601 -15003 -11458 -5693 54134 42453 6980 4638 -21908 24069 20587
1348B0587m8168O1247l2098n7523l4048O4369L3471m0805K2032k7014l4349L8374
$$ 20587 -27581 33666 1568 -55955 -90003 -25634 7837 -32968 -10936 -37950 -72299 -33925
1336c3925k1354J1880q4143M6297m1449p921L1665L8951j5194M5204J8104n9261
$$ -33925 -55279 -43399 -127542 -81245 -122694 -130615 -98950 -59999 -75193 -29989 -11885 -71146
1324g1146P4694P9459p67j7843j01967k0020M7368J12100l0006q4098R37n6627
$$ -71146 3548 83007 82240 64397 -37570 -57590 -10222 101878 71872 -12226 -11289 -67916
1312f7916j3272J4529M1971K8759J5297k186j29396J2877M5715Q686l4163j00768
$$ -67916 -81188 -66659 -24688 4071 19368 17182 -112214 -99337 -53622 -44936 -79099 -179867
1300a79867K1008K6454k7807j625M0275K1056K8053k6058o6128K6186K1985k2562
$$ -179867 -158859 -132405 -160212 -161837 -121562 -100506 -72453 -98511 -164639 -138453 -116468 -139030
1288a39030M3692N9929M0780J7752j7682j4374k0817o9713O2003J3608j8405K6772
$$ -139030 -95338 -35409 5371 23123 5441 -8933 -29750 -99463 -37460 -23852 -42257 -15485
1276a5485J7122m0986R8361K9453k947J5263r9163J0446K704Q5089r4170m2975
$$ -15485 1637 -39349 59012 88465 85518 100781 1618 12064 14768 99857 5687 -37288
1264c7288K7857o675n3932k6904n3968Q1312J13470m7970k4537M852k0567L0285
$$ -37288 -9431 -16106 -70038 -96942 -150910 -69598 43872 -4098 -28635 -23783 -44350 -14065
1252a4065M3901k9344j9485J5678K8283j4982Q0187j2187n4744O1517J5615l3949
$$ -14065 29836 492 -18993 -3315 24968 9986 90173 77986 23242 84759 100374 66425
1240F6425K705P7767N0717j5458k7506r2145j5258L4959q410J2037l4410p2023
$$ 66425 69130 146897 197614 182156 154650 62505 47247 82206 73796 85833 51423 -20600
1228b0600l645n5100L2912L0253O783l8319P0539l9757p8407j2876M7398N6081
$$ -20600 -24245 -79345 -46433 -16180 -9397 -47716 22823 -16934 -95341 -108217 -60819 -4738
1216d738K1252m3234l4032L6208q345K0413N7243P471n6723k0499k8915m0047
$$ -4738 16514 -26720 -60752 -24544 -32889 -12476 44767 52238 -4485 -24984 -53899 -93946
1204i3946N1540Q912Q1801K2897k5810j3495L5703L3897J4204n347m9769j5431
$$ -93946 -42406 -33494 48307 71204 45394 31899 67602 101499 115703 110356 60587 45156
1192D5156L6986o6937j337R048l782l6759L8128k6486l9826j8364R910M8861K5986
$$ 45156 82142 15205 13868 22916 19134 -17625 20503 -5983 -45809 -64173 -54263 -5402 20584
1179B0584J9598N1427p6203j10716Q9027R074J0098P5725O3331o2048j6065J9853
$$ 20584 40182 91609 15406 -95310 -6283 2791 12889 88614 151945 89897 73832 93685
1167I3685K4903k3951M159O7422o4072m9096l5449n2243J6802P8841m6773j6406
$$ 93685 118588 94637 98796 166218 102146 53050 17601 -34642 -17840 61001 14228 -2178
1155b178N4129r416N887m0908N6404k1798R8700j6294p2454j6437L9198j2689
$$ -2178 51951 42535 48422 7514 63918 42120 140820 124526 52072 35635 74833 62144
1143F2144l2587j049M7485j9966l0493j1808L8851J0337l3394J6416L7007m6250
$$ 62144 29557 28508 75993 56027 25534 13726 52577 62914 29520 45936 82943 36693
1131C6693m5960J09544M0782k7242K5192J8405K4185l1916j6325j7059K0001m6752
$$ 36693 -9267 100277 141059 113817 139009 157414 181599 149683 133358 116299 136300 89548
1119H9548M6261L6825q1403M0177K7136K3313m2355j4783J8288k7836M4126J6924
$$ 89548 135809 172634 91231 131408 158544 181857 139502 124719 143007 115171 159297 176221
1107A76221m8468l6674k1759M5156k3609j1441O1964l2738k5989j8167O732Q6345
$$ 176221 127753 91079 69320 114476 90867 79426 141390 108652 82663 64496 71228 157573
1095A57573L4153o5744k3372q089M9900J4559n5526J6817L3301j180L4860K1756
$$ 157573 191726 125982 102610 94521 144421 158980 103454 120271 153572 152392 187252 209008
1083B09008n9309P0637O6805l8102n2575m0548M8057K9974j5910r044j5535M2700
$$ 209008 149699 220336 287141 249039 196464 155916 203973 233947 218037 208993 193458 236158
1071B36158m464K0700l9670J2977K3188L4674j220k6195N577l0059P4479L5826
$$ 236158 231694 252394 212724 225701 248889 283563 282343 256148 261725 231666 306145 341971
1059C41971k5264n003l5565R839N0398J4035j4087J6009R043j9769N7170K9456
$$ 341971 316707 311704 276139 285978 336376 350411 336324 352333 361376 341607 398777 428233
1047D28233n0825Q0467M2213K3112O5603l7901J432j938P992K411l0719L7985
$$ 428233 377408 457875 500088 523200 588803 550902 552334 550396 558388 560799 530080 568065
1035E68065J7483J2957M0036J1579q601K7676K8211J349K4591j3976K3374O215
$$ 568065 585548 598505 638541 650120 641519 669195 697406 698755 723346 709370 732744 738959
1023G38959J6460o247J13326K6456n6687N966L6291K6852k6517p9167M3137J4618
$$ 738959 755419 749172 862498 888954 832267 838233 874524 901376 874859 795692 838829 853447
1011H53447m6935Q6850N5056l6465l1686P2371N9847O0145K5459m1530L415N0087
$$ 853447 806512 893362 948418 911953 880267 952638 1012485 1072630 1098089 1056559 1059974 1110061
999A110061Q7118J04048Q7355M5138M9383J6062K2716J00540M8992M4454J28384
$$ 1110061 1197179 1301227 1388582 1433720 1483103 1499165 1521881 1622421 1671413 1715867 1844251
988A844251O3099J40374Q1944P0724K74225K48915K27047J65354J26890J30841
$$ 1844251 1907350 2047724 2129668 2200392 2474617 2723532 2950579 3115933 3242823 3373664
978C373664J94693J55819L25591L04731K70881L04074M39235K58338P7249K80164
$$ 3373664 3568357 3724176 4049767 4354498 4625379 4929453 5368688 5627026 5704275 5984439
968E984439L63318N35793Q02071R75077J234775J481371J629988J876893K513520
$$ 5984439 6347757 6883550 7685621 8660698 9895473 11376844 13006832 14883725 17397245
959A7397245L464598M637205O276283O447945j091247p808867p033851m563463
$$ 17397245 20861843 25499048 31775331 38223276 37132029 29323162 22289311 17725848
951A7725848l106490k437822j874761j522291j167837q69253p14088n55876l85426
$$ 17725848 14619358 12181536 10306775 8784484 7616647 6747394 6033306 5477430 5092004
942E092004k86505k10415k78244l60018m47915m21423k88110j47844k43764j37123
$$ 5092004 4805499 4595084 4316840 3956822 3508907 3087484 2799374 2651530 2407766 2270643
932B270643j19990m4348q5037j48194o5550j8795k4779n8092k08585l8053M509
$$ 2270643 2150653 2106305 2021268 1873074 1807524 1788729 1763950 1705858 1497273 1459220 1463729
921A463729m9114n3223j26799j08021K165m2071l3330p2401K6904R675r391o5661
$$ 1463729 1414615 1361392 1234593 1126572 1128737 1086666 1053336 980935 1007839 1017514 1008123 942462
909I42462l0736n3485o5061l671p649J3888r683k0616n8621L7161o3847m6438
$$ 942462 911726 858241 793180 789509 781860 795748 786065 765449 706828 743989 680142 633704
897F33704k3291n4860P6760j2641M015p1562r8971L6829k7210p6788R8186l2873
$$ 633704 610413 555553 632313 619672 623687 552125 453154 489983 462773 385985 484171 451298
885D51298k8825J8359K7736o4938j5291L6194k4888K027J3962J1250n0111j495
$$ 451298 422473 440832 468568 403630 388339 424533 399645 401672 415634 426884 376773 375278
873C75278K5224K5839j7247p6454K2680L3841l4398k9276J0984j2791k7606M4097
$$ 375278 400502 426341 409094 332640 355320 389161 354763 325487 336471 323680 296074 340171
861C40171o4218j2579P4173j2865j46766m1187J05936r722m9417q996J406K9437
$$ 340171 275953 263374 337547 324682 177916 136729 242665 232943 183526 174530 175936 205373
849B05373Q750k3228n7511M0044j9588o7669l5928O365P6027j1140n5351N7317
$$ 205373 214123 190895 133384 173428 153840 86171 50243 56608 132635 121495 66144 123461
837A23461K8122l1941L3483m1017J844O8688j11227l3599l6174M1927O510J0030
$$ 123461 151583 119642 153125 112108 113952 182640 71413 37814 1640 43567 50077 60107
825F0107Q1830j5896j7559m4650j3337J6747o677o7165L3089Q2708N7334p5952
$$ 60107 141937 126041 108482 63832 50495 67242 60565 -6600 26489 109197 166531 90579
813I0579j20185j6657O3392P1104K1479q517L2035M2839n5126o6794q105O3604
$$ 90579 -29606 -46263 17129 88233 109712 101195 133230 176069 120943 54149 46044 109648
801A09648j3788J2470r990r4880j6059K0328Q6196J6458j4556l934O0267l2635
$$ 109648 95860 108330 98340 3460 -12599 7729 93925 110383 95827 91893 152160 119525
789A19525q8042k9839m5765O2711O0419k7809Q108J6690p8139R907l4579M6552
$$ 119525 31483 1644 -44121 18590 79009 51200 59308 75998 -2141 7766 -26813 19739
777A9739L6715M0855N0528k0372m8379l4259l8255K4308K9655p6600N3561L624
$$ 19739 56454 97309 147837 127465 79086 44827 6572 30880 60535 -16065 37496 41120
765D1120l7908K3302q2652n606l572O7968J5019m4497M775j901L124K9601j1196
$$ 41120 3212 26514 -56138 -61744 -65316 2652 17671 -26826 -22051 -23952 -20828 8773 -2423
752b423l0595r651O179L8889L7448o0273j1051M7032L4865l9339q913K0559L070
$$ -2423 -33018 -42669 -36490 2399 39847 -20426 -31477 15555 50420 11081 2168 22727 25797
739B5797q326k4733k4855o167K1487K965P347K7188p6212n943L1827k7568O4024
$$ 25797 17471 -7262 -32117 -38284 -16797 -13832 -6485 20703 -55509 -61452 -29625 -57193 6831
726F831K3059n0653q898Q2783J7727q7338O7219l1491m3857N5699k2537j6220
$$ 6831 29890 -20763 -29661 53122 70849 -16489 50730 19239 -24618 31081 8544 -7676
714g676n563o323K8152k7940n1179k598K3139P3501k9743l8385R180O4951j6222
$$ -7676 -13239 -19562 8590 -19350 -70529 -73127 -49988 23513 -6230 -44615 -35435 29516 13294
701A3294K3392K3506o7510K4647L5316k2848o2174L6529O4578p1606N5438M0522
$$ 13294 36686 60192 -7318 17329 52645 29797 -32377 4152 68730 -2876 52562 93084
689I3084o0815k1251K0366q9327M0093j7491O1216l309n2514l0139M7954O875
$$ 93084 32269 11018 31384 -57943 -17850 -35341 25875 22566 -29948 -60087 -12133 -5258
677e258L8672P1353M232m3506J00856L5187m2441L9985l8853j8830k4373o8509
$$ -5258 33414 104767 108999 65493 166349 201536 159095 199080 160227 141397 117024 48515
665D8515j8251k9047K5735R8315k7148q038K5777k6636j18196k4133N4258k3050
$$ 48515 30264 1217 26952 125267 98119 90081 115858 89222 -28974 -53107 1151 -21899
653b1899J0993J4125J3255o0939l741M1056m0834k8794N5321K5614L8173m760
$$ -21899 -10906 3219 16474 -44465 -48206 -7150 -47984 -76778 -21457 4157 42330 37570
641C7570q6432m3165K149P8355N5037l397m0858j6221N1986j8007M0218n563j18326
$$ 37570 -48862 -92027 -89878 -11523 43514 40117 -741 -16962 35024 17017 57235 51672 -66654
628f6654J0974M6408o8942p5894Q869O7102L1878K3189L4835l4237m9347K1791
$$ -66654 -55680 -9272 -78214 -154108 -145239 -78137 -46259 -23070 11765 -22472 -71819 -50028
616e0028K3037J1324K0175p6713L3621L4507k7692n6779P5374J8852k2444q541
$$ -50028 -26991 -15667 4508 -72205 -38584 -4077 -31769 -88548 -13174 5678 -16766 -25307
604b5307m1925m3158k8994O3535J42527k4287J9897j6184j52329j7941J23801
$$ -25307 -67232 -110390 -139384 -75849 66678 42391 62288 46104 -106225 -124166 -365
593c65p1451M7716J27750o5659j8302j6150m9684J1666P734K8498j6623o1310
$$ -365 -71816 -24100 103650 37991 19689 3539 -46145 -34479 -26745 1753 -14870 -76180
581g6180j3379J9641m3553P9426M380j8254k686l6362K7736N7258J3153m4390
$$ -76180 -89559 -69918 -113471 -34045 -29665 -47919 -50605 -86967 -59231 -1973 11180 -33210
569c3210j8576P359P2670l9935k0106K849j794j5435O2812L3198r0187m4547J0351
$$ -33210 -51786 -44427 28243 -11692 -31798 -28949 -30743 -46178 16634 49832 -40355 -84902 -74551
556g4551J9713N8146K5892n2730l0922m711J4560J7179O589J9270J6152n2040
$$ -74551 -54838 3308 29200 -23530 -54452 -59163 -44603 -27424 -20835 -1565 14587 -37453
544c7453L270j3212j7964n4763K4357N1486l9624J883K1709j2887j3358M8267
$$ -37453 -34183 -47395 -65359 -120122 -95765 -44279 -83903 -82020 -60311 -73198 -86556 -38289
532c8289K0188m0586j590l1706K919P6096J9255o1589J7583l0956q8154N6779
$$ -38289 -18101 -58687 -60277 -91983 -89064 -12968 6287 -55302 -37719 -68675 -156829 -100050
520a00050J8054n2180J9907J11937l6917l488N7133m0517l9158q968N7580k0942
$$ -100050 -81996 -134176 -114269 -2332 -39249 -42737 14396 -26121 -65279 -74247 -16667 -37609
508c7609L6630J7012l8419j9595k3393L3066K9423N9167l1385l1739K6930n2107
$$ -37609 -979 16033 -22386 -41981 -65374 -32308 -2885 56282 24897 -6842 20088 -32019
496c2019l3567k1567K6761M7702l3083L966P840N322n3207R099J1590j4395l3384
$$ -32019 -65586 -87153 -60392 -12690 -45773 -41807 -33967 -28645 -81852 -72753 -61163 -75558 -108942
483a08942N7834M6081q3757K0542Q9504l2025j0516l2459p0557M8028M5995J505
$$ -108942 -51108 -5027 -88784 -68242 21262 -10763 -21279 -53738 -124295 -76267 -30272 -28767
471b8767O5869l2340l5722p7269j8260R4499K6786n634P2289l0325K6403k4919
$$ -28767 37102 4762 -30960 -108229 -126489 -31990 -5204 -10838 61451 31126 57529 32610
459C2610j0502j1848n2653Q759L8639J7675k7858L12K2835r6690j3381Q6653L8922
$$ 32610 22108 10260 -42393 -33634 5005 22680 -5178 -4866 17969 -78721 -92102 -5449 33473
446C3473k9853m2853m8364K5985K4548O6417l0271l7534O8914k0920K75o5832
$$ 33473 3620 -39233 -87597 -61612 -37064 29353 -918 -38452 30462 9542 9817 -56015
434e6015N036J07648j6550J3322m96P150m6662l4018O429r858K028p5517m1398
$$ -56015 -50979 56669 40119 53441 52945 60095 13433 -20585 -14156 -24014 -21986 -97503 -138901
421a38901N417Q6752K0579K9975J6083l2071L0992K6450m6360m5263M9776M3151
$$ -138901 -133484 -46732 -26153 3822 19905 -12166 18826 45276 -1084 -46347 3429 46580
409D6580o5438M6232n1756l432k4745J8938k1751J8487R8554l3491o4246j6017
$$ 46580 -18858 27374 -24382 -27814 -52559 -33621 -55372 -36885 61669 28178 -36068 -52085
397e2085j7677P6925L4980P5451r2835n6548o3927L0863R362M311M1826K1399
$$ -52085 -69762 7163 42143 117594 24759 -31789 -95716 -64853 -55491 -51180 -9354 12045
385A2045K9508n8763J4357k1421M0823J8573k7885l0276J3686J926K1747l0729
$$ 12045 41553 -17210 -2853 -24274 16549 35122 7237 -23039 -9353 -7427 14320 -16409
373a6409j0435o8374l1969R3061K9691J5930p6168l9678M5264Q8662n2883r6997
$$ -16409 -26844 -95218 -127187 -34126 -4435 11495 -64673 -104351 -59087 29575 -23308 -120305
361a20305m416R4161L303J8897M5519P344n5000j3574J8919k4559Q9938K0651
$$ -120305 -124721 -30560 -27257 -8360 37159 44503 -10497 -24071 -5152 -29711 60227 80878
349H0878k1627k1127j8309n9522k2865J5018K6759p0149K318K8285L8167L9538
$$ 80878 59251 38124 19815 -39707 -62572 -47554 -20795 -90944 -88626 -60341 -22174 17364
337A7364k6641L6857m8475R7286R726l8103j3634j44679M2667L226o0194N0743
$$ 17364 -9277 27580 -20895 76391 86117 48014 34380 -110299 -67632 -64406 -124600 -73857
325g3857K6308l4992J6936L3861O3080q5401k3250N7442L2075o3282k6030n183
$$ -73857 -47549 -82541 -65605 -31744 31336 -54065 -77315 -19873 12202 -51080 -77110 -82293
313h2293L0594M6965k0992l7975R9j7084M4027P2088J7185J6618l4713M407m6116
$$ -82293 -51699 -4734 -25726 -63701 -63602 -80686 -36659 35429 52614 69232 34519 38926 -7190
300g190o2022p842N3696j0086m3029L1589J21472k7366j24186n6164P6831r024
$$ -7190 -69212 -77054 -23358 -33444 -76473 -44884 76588 49222 -74964 -131128 -54297 -63321
288f3321n9285O2867k8444n8905L2822R4618k706P1665l6315l207p0588o6252
$$ -63321 -122606 -59739 -88183 -147088 -114266 -19648 -22354 49311 12996 9789 -60799 -127051
276a27051J2791N0145N6830K0592o3248o1840M3740j582J7010K4914K4425l47
$$ -127051 -114260 -64115 -7285 13307 -49941 -111781 -68041 -69623 -52613 -27699 -3274 -3621
264c621k4N3775o4977m5787N6891M5815L3397q2039n9131O5967O1957j578r6942
$$ -3621 -3645 50130 -14847 -60634 -3743 42072 75469 -6570 -65701 266 62223 60645 -36297
251c6297R540L0788j8025l3165l9174K2094L892l8407K659q689M8463Q067j07010
$$ -36297 -26757 4031 -13994 -47159 -86333 -64239 -60347 -98754 -96095 -104784 -56321 -48254 -155264
238a55264M1909M5806K4508q439m7373N3245R971K004O5568l9702O1750p4316
$$ -155264 -113355 -67549 -43041 -51480 -98853 -45608 -35637 -33633 31935 -7767 53983 -20333
226b0333m3529k4890K6378O000k3804K5664M2113k327l4513M347l1297M6659J6954
$$ -20333 -63862 -88752 -62374 -56374 -80178 -54514 -12401 -14728 -49241 -44894 -76191 -29532 -12578
213a2578j533J4862k0533j13689M711j9571O1978P8072p6031M8388k4153L8391
$$ -12578 -14111 751 -19782 -133471 -128760 -148331 -86353 -8281 -84312 -35924 -60077 -21686
201b1686k9943N8832n122m32n9482j7187M15j5975K4667l7928M0298N8128L3123
$$ -21686 -51629 7203 2081 1649 -57833 -75020 -74605 -90580 -65913 -103841 -63543 -5415 27708
188B7708p1556j5502P1231j9195m7516j5493J1839J0412n6262M3428L0916K4273
$$ 27708 -43848 -59350 11881 -7314 -54830 -70323 -58484 -48072 -104334 -60906 -29990 -5717
176e717R471O911l2412r3923n766M1245J1531j0767L1837j6582n2842L546J9317
$$ -5717 3754 10665 -21747 -115670 -121436 -80191 -68660 -79427 -47590 -64172 -117014 -113468 -94151
163i4151L3796M5934N976m2061l9861J594L6979q708L1874J9142K7537m714o2242
$$ -94151 -60355 -14421 -8445 -50506 -90367 -88773 -51794 -60502 -28628 -9486 18051 13337 -48905
150d8905k206M5508l0488k0913o687j6260M9740k6963k2693N7335n5070m1574
$$ -48905 -51111 -5603 -36091 -57004 -63691 -79951 -30211 -57174 -79867 -22532 -77602 -119176
138a19176M8880K2265K1837j0474j7318k8960n1359o880k654L0486m059K7602
$$ -119176 -70296 -48031 -26194 -36668 -53986 -82946 -134305 -141185 -143839 -113353 -117412 -89810
126h9810j8734P5696K28J79m6233j8031j1657j5003N9448M9719l6717m5340M8287
$$ -89810 -108544 -32848 -32620 -32441 -78674 -96705 -108362 -123365 -63917 -14198 -50915 -96255 -47968
113d7968N6040q4251m9057N5714J02536K9540m0587j7571k9962l2928J5025L978
$$ -47968 8072 -76179 -125236 -69522 33014 62554 21967 4396 -25566 -58494 -43469 -39491
101c9491j4800j7821k7338L4022j8719o424L8904L0149n3444K6139k8359m8428
$$ -39491 -54291 -72112 -99450 -65428 -84147 -90571 -51667 -21518 -74962 -48823 -77182 -125610
89a25610k9762o540k1945J004Q2900n763l4062K6416M1686L6381N3469j5262m5646
$$ -125610 -155372 -161912 -183857 -182853 -99953 -105716 -139778 -113362 -71676 -35295 18174 2912 -42734
76d2734j2690K982N5781m4318l2127M2193J8824j7079k4560J0232k2619l2178
$$ -42734 -55424 -52442 3339 -40979 -73106 -30913 -12089 -29168 -53728 -43496 -66115 -98293
64i8293O4425K5710n370n3752m7127N825M7758n9404P5527J5028o2566j000R824
$$ -98293 -33868 -8158 -13528 -67280 -114407 -108582 -60824 -120228 -44701 -29673 -92239 -93239 -83415
51h3415J3198r6j0000k8678n9268m462M9674M8147n057J8778K9618n6888Q800
$$ -83415 -70217 -70313 -80313 -108991 -168259 -172721 -123047 -74900 -79957 -61179 -31561 -88449 -79649
38g9649j0380m5824k88L0295M9673j268j3665k5479J0576K5479R1662k8125o4952
$$ -79649 -90029 -135853 -136141 -105846 -56173 -57441 -71106 -96585 -86009 -60530 31132 3007 -61945
25f1945j1360m8638K4939r9j7100L1453k3923Q610P5703m2666N777J3245o7099
$$ -61945 -73305 -121943 -97004 -97103 -114203 -82750 -106673 -98063 -22360 -65026 -59249 -46004 -113103
12a13103J444M9334j3456j2749k2402k153M2M9914J5935j9328K546k8514
$$ -113103 -111659 -62325 -75781 -88530 -110932 -113085 -113043 -63129 -47194 -66522 -63976 -92490
0i2490
$$ -92490
$$ Imaginary data points
##PAGE= N=2
##DATA TABLE= (X++(I..I)), XYDATA
16383a097998K6811j1303L8704J3080K0941L3151m9634N4873J5490K2091l4370
$$ -1097998 -1071187 -1082490 -1043786 -1030706 -1009765 -976614 -1026248 -971375 -955885 -933794 -968164
16372i68164M3324j8441l891J8881O1534N4615L1305Q0978j2229k0502N4751L6301
$$ -968164 -924840 -943281 -947172 -928291 -866757 -812142 -780837 -699859 -712088 -732590 -677839 -641538
16360f41538M5667k3040P608O3647K6972j5571n5472j7706J12041Q5026J8387
$$ -641538 -595871 -618911 -611303 -547656 -520684 -536255 -591727 -609433 -497392 -412366 -393979
16349c93979K0944k938J6086J9317j8422O6553N8810L656m1744j6145L6859K0021
$$ -393979 -373035 -375973 -359887 -340570 -358992 -292439 -233629 -229973 -271717 -287862 -251003 -230982
16337b30982L0436N33j0628k1919o360K1604M0689N663N4541K1829j1918L49O8701
$$ -230982 -200546 -200013 -210641 -232560 -238920 -217316 -176627 -170964 -116423 -94594 -106512 -106163 -37462
16324c7462r418M263K4386J9694N8096J3797J3779K1303O118N2965K1328N4432
$$ -37462 -46880 -42617 -18231 1463 59559 73356 87135 108438 114556 167521 188849 243281
16312B43281q586L1329J0419J0074K2872k569K1603L1970p454K5535l652l0618
$$ 243281 234695 266024 276443 286517 309389 306820 328423 360393 352939 378474 374822 344204
16300C44204J310M9479l522L0157r998p584m7300M5405L1128P0755M3357K8775
$$ 344204 345514 394993 391471 421628 411630 404046 356746 402151 433279 504034 547391 576166
16288E76166K5823L127m3453J5512N3050K9631l2897m3787Q8958j6731l4160N7169
$$ 576166 601989 605116 561663 577175 630225 659856 626959 583172 672130 655399 621239 678408
16276F78408J46709j2725J4957K0527m0849l2819L7667K7742J987J317O0289O40
$$ 678408 825117 812392 827349 847876 807027 774208 811875 839617 841604 842921 903210 903850
16264I03850o747M5072m147M8761N0555o0413l5659M5978j6556l424N233M0286
$$ 903850 897103 942175 938028 986789 1037344 976931 941272 987250 970694 967270 972503 1012789
16252A012789L6215P6398K9115l0164J2047l104M6034Q085l7091j7804k4011P5988
$$ 1012789 1049004 1125402 1154517 1124353 1136400 1133296 1179330 1187415 1150324 1132520 1108509 1184497
16240A184497M1568k3958k7820o6616Q3145J5848m4050n6082L7570J7036O120
$$ 1184497 1226065 1202107 1174287 1107671 1190816 1206664 1162614 1106532 1144102 1161138 1167258
16229A167258J08576o35l3253j3687k4152O9215L0330J7140l151n6225J6183O7734
$$ 1167258 1275834 1275199 1241946 1228259 1204107 1273322 1303652 1320792 1317641 1261416 1277599 1345333
16217A345333L3149n551K6434m0452Q842J9235k8483M4140N3051k4105K5509j3005
$$ 1345333 1378482 1372931 1399365 1358913 1367755 1386990 1358507 1402647 1455698 1431593 1457102 1444097
16205A444097l0121l4088J5797P9652J0465r875P4753j2814r8047J02972P8k6480
$$ 1444097 1413976 1379888 1395685 1475337 1485802 1475927 1550680 1537866 1439819 1542791 1542869 1516389
16193A516389N0251L1658k6454k144N015K7131M996j6010J7672k9824N599M8375
$$ 1516389 1566640 1598298 1571844 1569700 1574715 1601846 1606842 1590832 1608504 1578680 1584279 1632654
16181A632654l2218L265n4658K1388Q8943N7586q6134l263J5983K111r191P0117
$$ 1632654 1600436 1603701 1549043 1570431 1659374 1716960 1630826 1627563 1643546 1645657 1636466 1706583
16169A706583Q512O607m5452m0261M8814k0361P0056K9210L6505p729q4032m6185
$$ 1706583 1715095 1721702 1676250 1635989 1684803 1664442 1734498 1763708 1800213 1792484 1708452 1662267
$$ [...]
##END NTUPLES=NMR SPECTRUM
##END=
