##TITLE=1H_CA-8800-1
 CDCl3, 8 sc, 
 21.12.2020
##JCAMPDX= 6.0         $$ Bruker NMR JCAMP-DX V2.0
##DATA TYPE= NMR SPECTRUM
##DATA CLASS= NTUPLES
##ORIGIN= UXNMR, Bruker Analytische Messtechnik GmbH
##OWNER= root
$$ XWIN-NMR		Version 3.5
$$ Mon Dec 21 12:03:25 2020 Russian Standard Time (UT+4h)  she@DPX200
##.OBSERVE FREQUENCY= 200.1315066352
##.OBSERVE NUCLEUS= ^1H
##.ACQUISITION MODE= SIMULTANEOUS
##.ACQUISITION SCHEME= undefined
##.AVERAGES= 8
##.DIGITISER RES= 18
##SPECTROMETER/DATA SYSTEM= spect
##.PULSE SEQUENCE= zg30
##.SOLVENT NAME= CDCl3
##.SHIFT REFERENCE= (INTERNAL, CDCl3, 0, 15.9916)
##AUDIT TRAIL= $$ (NUMBER, WHEN, WHO, WHERE, WHAT)
$$ ##TITLE= Audit trail, XWIN-NMR		Version 3.5
$$ ##JCAMPDX= 5.01
$$ ##ORIGIN= Bruker BioSpin GmbH
$$ ##OWNER= she
$$ F:/spectra/data/she/nmr/H-F/1/pdata/1/auditp.txt
$$ ##AUDIT TRAIL=  $$ (NUMBER, WHEN, WHO, WHERE, WHAT)
(   1,<2020-12-21 12:02:06.04 +0400>,<she>,<DPX200>,
      <created by zg, POWCHK disabled, PULCHK disabled
       configuration hash MD5:
       00 E9 B6 7A A2 85 ED C7 34 08 36 98 17 FE 4E 26
       data hash MD5: 16K
       D5 B7 2D 25 42 BD EA 81 09 4B 0A 08 75 A1 27 17>)
(   2,<2020-12-21 12:02:08.48 +0400>,<she>,<DPX200>,
      <Start of raw data processing
       efp BC_mod = 2 LB = 0.24 FT_mod = 6 PKNL = 1 PHC0 = -10919.64 PHC1 = 14.00095 SI = 16K 
       data hash MD5: 16K
       AD 88 41 EA 44 F0 12 C2 2D 52 DB 98 31 90 18 42>)
(   3,<2020-12-21 12:02:28.37 +0400>,<she>,<DPX200>,
      <pk PHC0 = 161.1128 PHC1 = -4.2 
       data hash MD5: 16K
       45 4B D4 EC B2 7E 08 D4 BB 83 76 E6 5B 75 B0 9C>)
(   4,<2020-12-21 12:02:31.65 +0400>,<she>,<DPX200>,
      <abs ABSG = 5 
       data hash MD5: 16K
       E1 7F 16 7D 3F F3 D8 E3 B0 4B 74 A6 35 BB 1B FC>)
(   5,<2020-12-21 12:03:02.70 +0400>,<she>,<DPX200>,
      <abs ABSG = 5 
       data hash MD5: 16K
       4B 7A 9C 92 34 8F D0 2D F8 DA 89 CD 08 26 83 61>)
$$ ##END=
$$ 
$$ hash MD5
$$ C1 8F 0F 65 ED 30 00 28 54 53 5B 64 A3 FF 16 5C
##$RELAX= 
##$RELAX= 
##$RELAX= 
##$RELAX= 
##$RELAX= 
##$RELAX= 
$$ Bruker specific parameters
$$ --------------------------
##$DU= <F:/spectra>
##$EXPNO= 1
##$NAME= <H-F>
##$PROCNO= 1
##$TYPE= <nmr>
##$USER= <she>
##$AMP= (0..31)
100 100 100 100 100 100 100 100 100 100 100 100 100 100 100 100 100 100 
100 100 100 100 100 100 100 100 100 100 100 100 100 100 
##$AQSEQ= 0
##$AQ_mod= 1
##$AUNM= <au_zg>
##$AUTOPOS= <>
##$BF1= 200.13
##$BF2= 200.13
##$BF3= 200.13
##$BF4= 200.13
##$BF5= 200.13
##$BF6= 200.13
##$BF7= 200.13
##$BF8= 200.13
##$BYTORDA= 1
##$CFDGTYP= 0
##$CFRGTYP= 5
##$CHEMSTR= <none>
##$CNST= (0..31)
1 1 145 1 1 1 1 1 1 1 1 1 1 1 1 1 1 1 1 1 1 1 1 1 1 1 1 1 1 1 1 1 
##$CPDPRG= <>
##$CPDPRG1= <>
##$CPDPRG2= <>
##$CPDPRG3= <>
##$CPDPRG4= <mlev>
##$CPDPRG5= <mlev>
##$CPDPRG6= <mlev>
##$CPDPRG7= <mlev>
##$CPDPRG8= <mlev>
##$CPDPRGB= <>
##$CPDPRGT= <>
##$D= (0..31)
0 1.2 0 0 0 0 0 0 0 0.06 0 0.03 0 0 0 0 0.0002 0 0 0 0 0 0 0 0 0 0 0 0 
0 0 0 
##$DATE= 1608537725
##$DBL= (0..7)
$$ [...]
##$SUBNAM3= <"">
##$SUBNAM4= <"">
##$SUBNAM5= <"">
##$SUBNAM6= <"">
##$SUBNAM7= <"">
##$SUBNAM8= <"">
##$SUBNAM9= <"">
##$SW= 16.9725356469052
##$SWIBOX= (0..15)
0 0 2 0 0 0 0 0 0 0 0 0 0 0 0 0 
##$SW_h= 3396.73913043478
##$TD= 16384
##$TD0= 1
##$TE= 0
##$TE2= 300
##$TE3= 300
##$TEG= 300
##$TL= (0..7)
0 120 120 120 120 120 120 120 
##$TP= (0..7)
150 150 150 150 150 150 150 150 
##$TP07= 0
##$TPNAME0= <>
##$TPNAME1= <>
##$TPNAME2= <>
##$TPNAME3= <>
##$TPNAME4= <>
##$TPNAME5= <>
##$TPNAME6= <>
##$TPNAME7= <>
##$TPOAL= (0..7)
0.5 0.5 0.5 0.5 0.5 0.5 0.5 0.5 
##$TPOFFS= (0..7)
0 0 0 0 0 0 0 0 
##$TUNHIN= 0
##$TUNHOUT= 0
##$TUNXOUT= 0
##$USERA1= <user>
##$USERA2= <user>
##$USERA3= <user>
##$USERA4= <user>
##$USERA5= <user>
##$V9= 5
##$VALIST= <valist>
##$VCLIST= <CCCCCCCCCCCCCCC>
##$VD= 0
##$VDLIST= <DDDDDDDDDDDDDDD>
##$VPLIST= <PPPPPPPPPPPPPPP>
##$VTLIST= <TTTTTTTTTTTTTTT>
##$WBST= 1024
##$WBSW= 4
##$XGAIN= (0..3)
0 0 0 0 
##$XL= 0
##$YL= 0
##$YMAX_a= 829535
##$YMIN_a= -301595
##$ZGOPTNS= <>
##$ZL1= 120
##$ZL2= 120
##$ZL3= 120
##$ZL4= 120
##$ABSF1= 15.99164
##$ABSF2= -0.9810238
##$ABSG= 5
##$ABSL= 3
##$ALPHA= 0
##$AQORDER= 0
##$ASSFAC= 0
##$ASSFACI= 0
##$ASSFACX= 0
##$ASSWID= 0
##$AUNMP= <proc_1d>
##$AZFE= 0.1
##$AZFW= 0.1
##$BCFW= 0
##$BC_mod= 2
##$BYTORDP= 0
##$COROFFS= 0
##$CY= -3
##$DATMOD= 1
##$DC= 0
##$DFILT= <>
##$DTYPP= 0
##$F1P= 0
##$F2P= 0
##$FCOR= 1
##$FTSIZE= 16384
##$FT_mod= 6
##$GAMMA= 0
##$GB= 0
##$INTBC= 1
##$INTSCL= 2.992141e-10
##$ISEN= 128
##$LB= 0.24
##$LEV0= 0
##$LPBIN= 0
##$MAXI= 10000
##$MC2= 0
##$MEAN= 0
##$ME_mod= 0
##$MI= 1.114404
##$NCOEF= 0
##$NC_proc= -6
##$NLEV= 6
##$NOISF1= 3.799351
##$NOISF2= 2.8
##$NSP= 0
##$NTH_PI= 0
##$NZP= 0
##$OFFSET= 15.99164
##$PC= 1
##$PHC0= -10758.53
##$PHC1= 9.80095
##$PH_mod= 1
##$PKNL= yes
##$PPARMOD= 0
##$PSCAL= 0
##$PSIGN= 0
##$REVERSE= no
##$SF= 200.13000459866
##$SI= 16384
##$SIGF1= 3
##$SIGF2= 2
##$SINO= 5.538805
##$SIOLD= 16384
##$SREGLST= <1H.CDCl3>
##$SSB= 0
##$STSI= 16384
##$STSR= 0
##$SW_p= 3396.73913043478
##$SYMM= 0
##$S_DEV= 0
##$TDeff= 16384
##$TDoff= 0
##$TI= <>
##$TILT= no
##$TM1= 0
##$TM2= 0
##$TOPLEV= 0
##$USERP1= <user>
##$USERP2= <user>
##$USERP3= <user>
##$USERP4= <user>
##$USERP5= <user>
##$WDW= 1
##$XDIM= 16384
##$YMAX_p= 455427661
##$YMIN_p= -627994
$$ End of Bruker specific parameters
$$ ---------------------------------
##NTUPLES= NMR SPECTRUM
##VAR_NAME=  FREQUENCY,     SPECTRUM/REAL,   SPECTRUM/IMAG
##SYMBOL=    X,             R,               I
##VAR_TYPE=  INDEPENDENT,   DEPENDENT,       DEPENDENT
##VAR_FORM=  AFFN,          ASDF,            ASDF
##VAR_DIM=   16384,         16384,           16384
##UNITS=     HZ,            ARBITRARY UNITS, ARBITRARY UNITS
##FACTOR=    0.207333158178281, 1,           1
##FIRST=     3200.40700494041, 0,            0
##LAST=      -196.332125494365, 0,           0
##MIN=       -196.332125494365, -627994,     0
##MAX=       3200.40700494041, 455427661,    0
$$ Real data points
##PAGE= N=1
##DATA TABLE= (X++(R..R)), XYDATA
$$ [...]
$$ plain form
5828 1573393 1744387 1804578 1681888 1565926 1462480 1595469 1641840 1487106 1458743 1498044
5818 1498044 1496891 1544222 1578771 1543367 1440016 1511978 1568191 1453580 1144827 957387 1053035
5807 1053035 1081733 1138004 1151316 1178611 1083801 1145697 1145890 1173355 1274917 1176104 1135246 1235234
5795 1235234 1200573 1380861 1372382 1215014 1106716 1208973 1185544 1197038 1202313 1131513 870613
5784 870613 1145606 1302439 1165325 1073731 977057 1139500 1073101 1045227 956905 1143034 1216165
5773 1216165 1238149 1233233 1188471 1373895 1293647 1326555 1318373 1159454 1116007 1094075 1435181
5762 1435181 1509704 1444407 1451770 1584302 1497894 1421343 1382053 1421796 1598518 1581195 1696639
5751 1696639 1785513 1780785 1684844 1724882 1651583 1831684 1992849 1888112 1882614 1974363 1889786
$$ packed form
5828A573393J70994O0191j22690j15962j03446J32989M6371j54734k8363L9301
5818A498044j153M7331L4549l5404j03351P1962N6213j14611l08753j87440R5648
5807A053035K8698N6271J3312K7295r4810O1896J93K7465J01562r8813m0858R9988
5795A235234l4661J80288q479j57368j08298J02257k3429J1494N275p0800k60900
5784H70613K74993J56833j37114r1594r6674J62443o6399k7874q8322J86129P3131
5773A216165K1984m916m4762J85424q0248L2908q182j58919m3447k1932L41106
5762A435181P4523o5297P363J32532q6408p6551l9290L9743J76722j7323J15444
5751A696639Q8874m728r5941M0038p3299J80101J61165j04737n498R1749q4577
$$ plain form
5740 1889786 1678529 1884005 1924244 2039340 2074955 2046869 2126195 2320623 2226077 1891818
5730 1891818 1998828 2112691 2218055 2164973 2372116 2617827 2728844 2535386 2666141 2729938
5720 2729938 2422360 2363688 2653255 2941957 2956411 2992438 2931094 2906744 3113679 2991546
5710 2991546 2886430 3022776 3185594 2844515 2642538 2876873 2905093 2881005 2862889 3090136
5700 3090136 3191026 3259202 3403698 3530145 3339613 3646983 3732383 3685682 3821641 3744831
5690 3744831 3536841 3700903 3900917 3741017 3464752 3345249 3312162 3486465 3474998 3382727
5680 3382727 3357636 3377058 3553233 3768919 3593009 3439833 3636573 3678602 3724433 4054198
5670 4054198 4044495 3786230 3828334 3883209 3776143 3504090 3499704 3338240 3362989 3370946 3365235
$$ packed form
5740A889786k11257K05476M0239J15096L5615k8086P9326J94428r4546l34259
5730A891818J07010J13863J05364n3082K07143K45711J11017j93458J30755O3797
5720B729938l07578n8672K89567K88702J4454L6027o1344k4350K06935j22133
5710B991546j05116J36346J62818l41079k01977K34335K8220k4088j8116K27247
5700C090136J00890O8176J44496J26447j90532L07370Q5400m6701J35959p6810
5690C744831k07990J64062K00014j59900k76265j19503l3087J74303j1467r2271
5680C382727k5091J9422J76175K15686j75910j53176J96740M2029M5831L29765
5670D054198r703k58265M2104N4875j07066k72053m386j61464K4749P957n711
$$ plain form
5659 3365235 3297447 3190267 3253670 3438404 3506480 3467944 3372795 3448894 3717281 3782953 3328594
5648 3328594 2891796 2957240 2921958 2786042 2655819 2721026 2488591 2455069 2487907 2643648
5638 2643648 2610418 2279394 2397726 2665794 2782810 2714556 2643416 2629232 2667162 2667794 2511843
5627 2511843 2309138 2584157 2673796 2462174 2362270 2201185 1956881 1938155 2057955 1864090
5617 1864090 1836302 1768977 1603013 1592798 1450777 1380346 1474943 1734401 2019847 1927016 1588737
5606 1588737 1756676 1879381 1734797 1618498 1461395 1541543 1518842 1642274 1625052 1434497
5596 1434497 1337681 1307606 1391147 1331136 1311465 1346841 1417311 1619320 1530537 1210541 994313
5585 994313 997173 1155021 1237318 1245179 1332760 1218431 1162588 1295021 1388771 1108478 903084
$$ packed form
5659C365235o7788j07180O3403J84734O8076l8536r5149P6099K68387O5672m54359
5648C328594m36798O5444l5282j35916j30223O5207k32435l3522L2838J55741
5638B643648l3230l31024J18332K68068J17016o8254p1140j4184L7930O32j55951
5627B511843k02705K75019Q9639k11622r9904j61085k44304j8726J19800j93865
5617A864090k7788o7325j65964j0215j42021p0431R4597K59458K85446r2831l38279
5606A588737J67939J22705j44584j16299j57103Q0148k2701J23432j7222j90555
5596A434497r6816l0075Q3541o0011j9671L5376P0470K02009q8783l19996k16228
5585I94313K860J57848Q2297P861Q7581j14329n5843J32433R3750k80293k05394
$$ plain form
5574 903084 1008340 1192899 1409880 1177001 1050880 1084264 1253572 1312138 1162979 1067815
5564 1067815 1196395 1210019 1270817 1096996 1067596 1045116 1079397 1373314 1287345 1121628 1136054
5553 1136054 1165612 1109568 1135560 1167917 1155619 1391295 1520634 1476593 1304181 1301781 1244545
5542 1244545 1267899 1218840 1249192 1331670 1356510 1586090 1587001 1342290 1473548 1660442 1703891
5531 1703891 1717961 1609715 1449011 1550996 1496802 1324649 1444470 1429807 1557166 1785047
5521 1785047 1700569 1688028 1766770 1804036 1897352 1836827 1443696 1225438 1499517 1738240 1741889
5510 1741889 1833235 1888280 2060046 2145113 1936947 1736528 1608983 1716426 1595950 1618687
5500 1618687 1830340 2044157 1906639 1831568 2001445 2027529 1927272 1804376 1703738 1725213
$$ packed form
5574I03084J05256J84559K16981k32879j26121L3384J69308N8566j49159r5164
5564A067815J28580J3624O0798j73821k9400k2480L4281K93917q5969j65717J4426
5553A136054K9558n6044K5992L2357j2298K35676J29339m4041j72412k400n7236
5542A244545K3354m9059L0352Q2478K4840K29580R11k44711J31258J86894M3449
5531A703891J4070j08246j60704J01985n4194j72153J19821j4663J27359K27881
5521A785047q4478j2541P8742L7266R3316o0525l93131k18258K74079K38723L649
5510A741889R1346N5045J71766Q5067k08166k00419j27545J07443j20476K2737
5500A618687K11653K13817j37518p5071J69877K6084j00257j22896j00638K1475
$$ plain form
5490 1725213 1715497 1700268 1631343 1769490 1862284 1799048 1829301 1971618 1983135 1872301 1895787
5479 1895787 2153407 2323550 2228185 1889593 2017843 2100196 2228673 2035125 1917009 2115707
5469 2115707 2243481 2320314 2301042 2329737 2475698 2452051 2472052 2564195 2377988 2192182 2427502
5458 2427502 2471532 2412866 2352701 2390328 2543822 2647079 2723486 2685342 2699958 2772461 2880924
5447 2880924 2703603 2553707 2529128 2575391 2712902 2678702 2637819 2881877 2897026 2876226 2732571
5436 2732571 2470447 2637466 2903114 3113377 3219394 3135888 3022783 2971067 2914393 2898172
5426 2898172 2977820 3047652 3305152 3345296 3129055 2926437 3102873 3218692 3342791 3662149
5416 3662149 3553345 3290882 3417903 3144089 3166193 3189101 3168091 3122251 3351292 3371358
$$ packed form
5490A725213r716j5229o8925J38147R2794o3236L0253J42317J1517j10834K3486
5479A895787K57620J70143r5365l38592J28250Q2353J28477j93548j18116J98698
5469B115707J27774P6833j9272K8695J45961k3647K0001R2143j86207j85806K35320
5458B427502M4030n8666o0165L7627J53494J03257P6407l8144J4616P2503J08463
5447B880924j77321j49896k4579M6263J37511l4200m0883K44058J5149k0800j43655
5436B732571k62124J67019K65648K10263J06017q3506j13105n1716n6674j6221
5426B898172P9648O9832K57500M0144k16241k02618J76436J15819J24099L19358
5416C662149j08804k62463J27021k73814K2104K2908k1010m5840K29041K0066
$$ plain form
5406 3371358 3407656 3462543 3393715 3314171 3232782 3084279 3126849 3433743 3458554 3432003 3370198
5395 3370198 3240741 3069188 3249508 3403346 3437994 3450478 3362704 3359056 3427284 3572645 3394712
5384 3394712 3022137 3220941 3556224 3600463 3447056 3402100 3539622 3731033 3727255 3581510
5374 3581510 3341575 3404674 3415869 3594266 3871772 3678739 3447770 3591832 3780947 3864821
5364 3864821 3702476 3721184 3858082 4208288 4246025 4236808 4138243 4102885 4239145 4212521 4323944
5353 4323944 4034195 4127736 4323997 4318530 4316274 4199213 3961684 3989238 4189028 4422938 4474765
5342 4474765 4661894 4758756 4783879 4591943 4688360 4763772 4695917 4774198 4766582 4728123 5024045
5331 5024045 5221487 5143645 5328974 5759429 6100223 6385781 6389971 5997395 5932184 5875955
$$ packed form
5406C371358L6298N4887o8828p9544q1389j48503M2570L06894K4811k6551o1805
5395C370198j29457j71553J80320J53838L4648J2484q7774l648O8228J45361j77933
5384C394712l72575J98804L35283M4239j53407m4956J37522J91411l778j45745
5374C581510k39935O3099J1195J78397K77506j93033k30969J44062J89115Q3874
5364C864821j62345J8708J36898L50206L7737r217r8565l5358J36260k6624J11423
5353D323944k89749R3541J96261n467k256j17061k37529K7554J99790K33910N1827
5342D474765J87129R6862K5123j91936R6417P5412o7855P8281p616l8459K95922
5331E024045J97442p7842J85329M30455L40794K85558M190l92576o5211n6229
$$ plain form
5321 5875955 5691103 5362879 5322968 5233527 5402251 5535045 5460373 5364860 5227337 5324474
5311 5324474 5447080 5716525 5966839 6114982 6371904 6718292 6745359 6715856 6858570 6673799
5301 6673799 6696077 6932366 6922105 6993892 7153265 6947682 6815622 7015817 7235254 7426172
5291 7426172 7672735 7851278 8152150 8541495 9004801 9274764 9490599 9829855 10196913 9857824
5281 9857824 9613009 9306548 8954298 8665819 8443154 8366717 8445757 8405252 8076412 8194342
5271 8194342 8403504 8622194 8684188 8989344 9304454 9823271 10213075 10118711 10250342 10184200
5261 10184200 9949559 9793743 9774701 9765716 9465446 9390526 9418132 9273358 9053972 9051016 9118682
5250 9118682 9463632 9869202 9949743 10372351 10744614 11068222 11288562 11451889 11501444 11427260
$$ packed form
5321E875955j84852l28224l9911q9441J68724J32794p4672r5513j37523R7137
5311E324474J22606K69445K50314J48143K56922L46388K7067k9503J42714j84771
5301F673799K2278K36289j0261P1787J59373k05583j32060K00195K19437J90918
5291G426172K46563J78543L00872L89345M63306K69963K15835L39256L67058l39089
5281I857824k44815l06461l52250k88479k22665p6437P9040m0505l28840J17930
5271H194342K09162K18690O1994L05156L15110N18817L89804r4364J31631o6142
5261A0184200k34641j55816j9042q985l00270p4920K7606j44774k19386k956O7666
5250I118682L44950M05570Q0541M22608L72263L23608K20340J63327M9555p4184
$$ plain form
5240 11427260 11076322 10668596 10666985 10621415 10425619 10220146 10163489 10472906 10731233 10821619
5230 10821619 11134151 11180583 11154523 11500402 11497628 11367937 11776049 12069003 12274311 12552448
5220 12552448 12541546 12191776 12096971 12085406 11983095 11771617 11893002 11927595 12302590 12592075
5210 12592075 12791292 12672180 12603802 12732672 12474394 12345581 12568120 12805301 13120663 13468816
5200 13468816 13808120 13982100 13975121 13984406 14094830 14371369 14373776 14483211 14765322 14982293
5190 14982293 15171716 15563168 15812678 16010309 16496530 17064196 17729310 18560412 19355242
5181 19355242 20104126 20963559 22267078 23583842 25102158 27138269 29772256 33242409
5173 33242409 36721298 38874430 38621692 36770320 34497873 32468122 31051167 30106734
$$ packed form
5240A1427260l50938m07726j611m5570j95796k05473n6657L09417K58327R0386
5230A0821619L12532M6432k6060L45879k774j29691M08112K92954K05308K78137
5220A2552448j0902l49770r4805j1565j02311k11478J21385L4593L74995K89485
5210A2592075J99217j19112o8378J28870k58278j28813K22539K37181L15362L48153
5200A3468816L39304J73980o979R285J10424K76539K407J09435K82111K16971
5190A4982293J89423L91452K49510J97631M86221N67666O65114Q31102P94830
5181A9355242P48884Q59433J303519J316764J518316K036111K633987L470153
5173C3242409L478889K153132k52738j851372k272447k029751j416955r44433
$$ plain form
5165 30106734 29972004 30506919 31823747 33642774 36464280 38966644 39881496 38861983 36469889
5156 36469889 33532631 30836511 28668531 26279873 24290250 22664074 21384689 20366427
5148 20366427 19836491 19336045 18958469 18745320 18682403 18793379 18984231 19204944 19072728 18808772
5138 18808772 18567984 18267243 18142772 18369091 19002617 19368000 19651946 20249599 20997024
5129 20997024 22101161 23363646 24514685 25643176 27097644 28336673 30037570 32079803
5121 32079803 34775297 38625102 43291398 47491831 49700412 49069800 46720285 44252764
5113 44252764 42301284 40591412 39272948 38753909 39077970 40540284 42848862 45662233
5105 45662233 48086544 48606100 46311865 42131088 37524235 33322181 29899859 27268887
$$ packed form
5165C0106734j34730N34915J316828J819027K821506K502364R14852j019513k392094
5156C6469889k937258k696120k167980k388658j989623j626176j279385j018262
5148B0366427n29936n00446l77576k13149o2917J10976J90852K20713j32216k63956
5138A8808772k40788l00741j24471K26319O33526L65383K83946N97653P47425
5129B0997024J104137J262485J151039J128491J454468J239029J700897K042233
5121C2079803K695494L849805M666296M200433K208581o30612k349515k467521
5113D4252764j951480j709872j318464n19039L24061J462314K308578K813371
5105D5662233K424311N19556k294235m180777m606853m202054l422322k630972
$$ plain form
5097 27268887 25002522 22823913 21097242 20298647 19624455 18866647 18101629 17359934 16820828
5088 16820828 16437525 15895990 15423896 15185700 15384916 15269972 14777247 14378409 13866073
5079 13866073 13379526 13300758 13144361 12971396 13203577 13331852 13623481 13696122 13292562 12859183
5069 12859183 12757259 12657036 12409616 12161992 12035287 12057882 12232312 12050091 11519635 11365108
5059 11365108 11448803 11559674 11858319 12240932 12578103 12755927 12984599 13200977 12887462 12321242
5049 12321242 12215337 12156385 12171762 12223567 12004822 11965740 12418950 12794803 12702976 12668046
5039 12668046 12857952 12974871 12977059 12896307 12685241 12403654 12421244 12602774 12594918 12575120 12623236
5028 12623236 12673626 12696520 12672103 12594895 12441964 12622372 12896281 12867393 12674216 12508804
$$ packed form
5097B7268887k266365k178609j726671p98595o74192p57808p65018p41695n39106
5088A6820828l83303n41535m72094k38196J99216j14944m92725l98838n12336
5079A3866073m86547p8768j56397j72965K32181J28275K91629P2641m03560m33379
5069A2859183j01924j00223k47420k47624j26705K2595J74430j82221n30456j54527
5059A1365108Q3695J10871K98645L82613L37171J77824K28672K16378l13515n66220
5049A2321242j05905n8952J5377N1805k18745l9082M53210L75853r1827l4930
5039A2668046J89906J16919K188q0752k11066k81587J7590J81530p856j9798M8116
5028A2623236N0390K2894k4417p7208j52931J80408K73909k8888j93177j65412
$$ plain form
5018 12508804 12725719 12804101 12783002 12640522 12822272 12954928 13146309 13206365 12964194 12972002
5008 12972002 13288864 13623114 13864494 14171027 14227373 14494261 14791883 14840207 14809895 14871934
4998 14871934 15214186 15481791 15736977 15988104 16295433 16567582 16866565 17204692 17347882
4989 17347882 17640373 18116469 18595189 18998966 19310305 19838201 20484534 21027811 21419376
4980 21419376 21821498 22540691 23404809 24280456 24741281 24812042 25198017 25601087 25688987 25527177
4970 25527177 25506667 25630793 25720190 26014806 26336378 26731468 27034743 27385062 28115387 28934835
4960 28934835 29271388 29764981 30689508 31584705 32254575 33086457 33739632 34517803 35314797
4951 35314797 36092771 37038957 38092899 39417858 40757034 42133395 43787936 45674788
$$ packed form
5018A2508804K16915P8382k1099j42480J81750J32656J91381O0056k42171P808
5008A2972002L16862L34250K41380L06533N6346K66888K97622M8324l0312O2039
4998A4871934L42252K67605K55186K51127L07329K72149K98983L38127J43190
4989A7347882K92491M76096M78720M03777L11339N27896O46333N43277L91565
4980B1419376M02122P19193Q64118Q75647M60825P0761L85975M03070Q7900j61810
4970B5527177k0510J24126Q9397K94616L21572L95090L03275L50319P30325Q19448
4960B8934835L36553M93593R24527Q95197O69870Q31882O53175P78171P96994
4951C5314797P77974R46186J053942J324959J339176J376361J654541J886852
$$ plain form
4943 45674788 47602591 50136311 52679234 55367965 57977087 60727435 63135952 65110238
4935 65110238 66790745 68158699 69487491 70630235 71459960 71880213 72258466 72593861 72926303
4926 72926303 73048460 73037553 72978932 72862460 72665850 72083240 71247041 70289845 69257859 68235647
4916 68235647 67250928 66518839 65931857 65612121 65852313 66708802 67756615 69237170 70988077
4907 70988077 73245762 75557030 77872034 79926343 81818002 83563127 85118787 86459542
4899 86459542 87258419 87230685 86108487 83884372 81002794 77992253 74291161 70729139 67524060
4890 67524060 64566377 61796943 59449007 57674228 56073933 54745600 53507418 52253921
4882 52253921 51238940 50618503 49833546 49047768 48362555 47658744 46832797 45893781 45228136
$$ packed form
4943D5674788J927803K533720K542923K688731K609122K750348K408517J974286
4935F5110238J680507J367954J328792J142744Q29725M20253L78253L35395L32442
4926G2926303J22157j0907n8621j16472j96610n82610q36199r57196j031986j022212
4916F8235647r84719p32089n86982l19736K40192Q56489J047813J480555J750907
4907G0988077K257685K311268K315004K054309J891659J745125J555660J340755
4899H6459542P98877k7734j122198k224115k881578l010541l701092l562022l205079
4890F7524060k957683k769434k347936j774779j600295j328333j238182j253497
4882E2253921j014981o20437p84957p85778o85213p03811q25947r39016o65645
$$ plain form
4873 45228136 44492075 43505764 42316318 41280864 40455792 39597020 38653652 37832490 37066833
4864 37066833 36649255 36491146 36005647 35643742 35314484 34614850 33600297 32866008 32145631
4855 32145631 31422973 30800761 30072129 29406021 28737484 28378122 27978813 27463016 27333139
4846 27333139 27138747 26698570 26491536 26254655 25880260 25566644 25611114 25391530 25319368 25350657
4836 25350657 25603643 25720213 25690056 25811650 25929574 25752660 25954622 26429007 26669165 27134330
4826 27134330 27923545 28728712 29538640 30553743 31836100 33520337 35434567 38483409 41976296
4817 41976296 45865413 49400322 50204069 47779883 44044011 40048852 36507110 33897559
4809 33897559 32114739 30430132 28917591 27947786 27239256 26732853 26203814 25869123 25795554
$$ packed form
4873D5228136p36061r86311j189446j035454q25072q58772r43368q21162p65657
4864C7066833m17578j58109m85499l61905l29258o99634j014553p34289p20377
4855C2145631p22658o22212p28632o66108o68537l59362l99309n15797j29877
4846B7333139j94392m40177k07034k36881l74395l13616M4470k19584p2162L1289
4836B5350657K52986J16570l0157J21594J17924j76914K01962M74385K40158M65165
4826B7134330P89215Q05167Q09928J015103J282357J684237J914230L048842L492887
4817D1976296L889117L534909Q03747k424186l735872l995159l541742k609551
4809C3897559j782820j684607j512541r69805p08530n06403n29039l34691p3569
$$ plain form
4800 25795554 25806243 25924080 26391562 26868388 27662569 28652297 29549172 31078474 33274564
4791 33274564 35831070 38933063 43009460 47276426 49546522 48577531 45061001 40738944
4783 40738944 36657581 33331786 30662962 28622700 27078477 25961028 25140134 24548666
4775 24548666 24141080 23649839 23417417 23496851 23654656 23883779 24361071 25035402 25880142 26841318
4765 26841318 28200863 30342186 33158446 35974598 37802125 37861681 36123595 33213609
4757 33213609 30282644 27736403 25867558 24363387 23238910 22420474 21800368 21353475 20788416
4748 20788416 20460828 20294510 20165417 20262975 20283721 20526553 20973158 21429746 22057917 22909245
4738 22909245 23976471 25193314 27110035 29843242 33158465 36149687 37317321 36058281
$$ packed form
4800B5795554J0689J17837M67482M76826P94181R89728Q96875J529302K196090
4791C3274564K556506L101993M076397M266966K270096r68991l516530m322057
4783D0738944m081363l325795k668824k040262j544223j117449q20894n91468
4775B4548666m07586m91241k32422P9434J57805K29123M77292O74331Q44740R61176
4765B6841318J359545K141323K816260K816152J827527N9556j738086k909986
4757C3213609k930965k546241j868845j504171j124477q18436o20106m46893n65059
4748B0788416l27588j66318j29093R7558K0746K42832M46605M56588O28171Q51328
4738B2909245J067226J216843J916721K733207L315223K991222J167634j259040
$$ plain form
4730 36058281 33293715 30030117 26848838 24117439 22035723 20413874 19234526 18529751
4722 18529751 17754635 17200050 16563399 16223094 15835616 15368509 14736828 14288030 14458483
4713 14458483 14563091 14314995 13951494 13900484 13848304 13900735 13841735 13770450 13636787 13774562
4703 13774562 14106219 14136309 13692401 13586535 13692242 13697630 13699167 13723774 13408562 13550349
4693 13550349 13675158 13636903 13285027 13235683 13399255 13264294 13360986 13451540 13437915 13475996
4683 13475996 13514492 13588595 13575524 13539563 13593077 13687473 13732753 13766920 13860312 13885125 14351842
4672 14351842 14584632 14578621 14902242 15357682 15505417 15561870 15578808 15703238 15670610 15641967
4662 15641967 15671658 15565525 15751728 15916205 16068838 16174649 16704355 17196115 17277617 17368142
$$ packed form
4730C6058281k764566l263598l181279k731399k081716j621849j179348p04775
4722A8529751p75116n54585o36651l40305l87478m67107o31681m48798J70453
4713A4458483J04608k48096l63501n1010n2180N2431n9000p1285j33663J37775
4703A3774562L31657L0090m43908j05866J05707N388J537K4607l15212J41787
4693A3550349J24809l8255l51876m9344J63572j34961R6692R0554j3625L8081
4683A3475996L8496P4103j3071l5961N3514R4396M5280L4167R3392K4813M66717
4672A4351842K32790o011L23621M55440J47735N6453J6938J24430l2628k8643
4662A5641967K9691j06133J86203J64477J52633J05811N29706M91760Q1502R0525
$$ plain form
4652 17368142 17868529 18446378 18697320 19203717 19972879 21104162 22206114 23307831 23897599
4643 23897599 24145987 23759931 23160212 22291820 21593265 21135807 20664888 20454436 20833921
4634 20833921 21189172 21338454 22177288 23185070 24127596 24864556 25291070 25121967 24523300
4625 24523300 23679748 22395604 21219235 20145109 19417165 18640957 17911736 17758288 17492008
4616 17492008 17058129 16729428 16757937 16623091 16206086 16070450 16039982 15886086 15797806 15859094
4606 15859094 15631855 15595813 15625258 15361917 15182366 15267146 15564545 15459266 15481699 15857807
4596 15857807 16093098 16179638 16284953 16608999 16750302 16978287 17209830 17381771 18044675 18618078
4586 18618078 19104149 19483048 19789704 20184195 20473977 20848226 21307807 21657331 22223421
$$ packed form
4652A7368142N00387N77849K50942N06397P69162J131283J101952J101717N89768
4643B3897599K48388l86056n99719q68392o98555m57458m70919k10452L79485
4634B0833921L55251J49282Q38834J007782R42526P36960M26514j69103n98667
4625B4523300q43552j284144j176369j074126p27944p76208p29221j53448k66280
4616A7492008m33879l28701K8509j34846m17005j35636l0468j53896q8280O1288
4606A5859094k27239l6042K9445k63341j79551Q4780K97399j05279K2433L76108
4596A5857807K35291Q6540J05315L24046J41303K27985K31543J71941O62904N73403
4586A8618078M86071L78899L06656L94491K89782L74249M59581L49524N66090
$$ plain form
4577 22223421 23022119 24100884 25075770 26103206 27368479 29117448 31094583 33344207
4569 33344207 35588859 37376390 38486968 38708084 38099341 36894539 35610214 34597949
4561 34597949 33447182 32775428 32784801 32615910 32847788 33483054 34288563 35325467 36409778
4552 36409778 37252965 37381421 36781295 35425070 33664496 31853477 30090230 28448835 27398346
4543 27398346 26783844 25866387 25156877 24773141 24344518 23909917 23236695 22540555 22073153
4534 22073153 21677624 21297470 21068415 21021020 20711090 20575653 20760743 21048973 21383199 21811357
4524 21811357 22382902 22798776 22676580 22269157 21583313 21283945 21195663 20823653 20404237 20222093
4514 20222093 20254674 20258951 20092147 19826403 19687216 19684233 19637520 19679066 19758914 19806242 19851999
$$ packed form
4577B2223421P98698J078765R74886J027436J265273J748969J977135K249624
4569C3344207K244652J787531J110578K21116o08743j204802j284325j012265
4561C4597949j150767o71754R373j68891K31878O35266Q05509J036904J084311
4552C6409778Q43187J28456o00126j356225j760574j811019j763247j641395j050489
4543B7398346o14502r17457p09510l83736m28623m34601o73222o96140m67402
4534B2073153l95529l80154k29055m7395l09930j35437J85090K88230L34226M28158
4524B1811357N71545M15874j22196m07423o85844k99368q8282l72010m19416j82144
4514B0222093L2581M277j66804k65744j39187k983m6713M1546P9848M7328M5757
$$ plain form
4503 19851999 20338607 20838076 20958084 21363803 22251490 23199351 23663060 23725173 23195314 22581798
4493 22581798 22151402 21507199 20718685 20068518 19837313 19828360 19920397 19943926 19926201 20108292
4483 20108292 20434875 21006884 21461299 21910167 22415220 23283911 24038075 24404892 24527033
4474 24527033 24539345 24387911 24221927 24085818 23849557 23613709 23391963 23332932 23249334 23214093
4464 23214093 22906940 22431123 22222193 22123509 21918793 21500205 21260220 21197103 21221478 21138525
4454 21138525 21206883 21356959 21376501 21360095 21487233 21564676 21636936 21906037 21956084 22395899
4444 22395899 22957999 23274465 23549914 23828167 24157815 24404509 24556472 24692312 24792379
4435 24792379 24607526 24421194 24208417 24234736 24255649 24523311 25092378 25449331 25697862 25871734
$$ packed form
4503A9851999M86608M99469J20008M05719Q87687R47861M63709O2113n29859o13516
4493B2581798m30396o44203p88514o50167k31205q953R2037K3529j7725J82091
4483B0108292L26583N72009M54415M48868N05053Q68691P54164L66817J22141
4474B4527033J2312j51434j65984j36109k36261k35848k21746n9031q3598l5241
4464B3214093l07153m75817k08930r8684k04716m18588k39985o3117K4375q2953
4454B1138525O8358J50076J9542j6406J27138P7443P2260K69101N0047M39815
4444B2395899N62100L16466K75449K78253L29648K46694J51963J35840J00067
4435B4792379j84853j86332k12777K6319K0913K67662N69067L56953K48531J73872
$$ plain form
4425 25871734 25848593 25753855 25898511 25782113 25908354 26280749 26904490 27416599 28084799 28835292
4415 28835292 29459460 30451283 31410001 32438889 33310057 34234369 35058730 35762511 36908567
4406 36908567 38197585 39808370 41353201 43204446 45102208 46526314 47813149 49204367
4398 49204367 50668197 51614422 51267972 49997189 48311135 46857351 45652276 44477943
4390 44477943 43857707 44117039 44584802 45071990 45822947 47097613 48725126 50197432 51752349
4381 51752349 53042647 53842438 54274238 54913835 55910260 56805939 56802710 55930173 54750708
4372 54750708 53167473 50426479 46614935 42853464 39454472 37127111 35302196 33783403
4364 33783403 32676643 31886934 31293917 31098800 31194169 31613433 32354553 33185489 34852396
$$ packed form
4425B5871734k3141r4738J44656j16398J26241L72395O23741N12109O68200P50493
4415B8835292O24168R91823R58718J028888Q71168R24312Q24361P03781J146056
4406C6908567J289018J610785J544831J851245J897762J424106J286835J391218
4398D9204367J463830R46225l46450j270783j686054j453784j205075j174333
4390D4477943o20236K59332M67763M87188P50957J274666J627513J472306J554917
4381E1752349J290298P99791M31800O39597R96425Q95679l229q72537j179465
4372E4750708j583235k740994l811544l761471l398992k327361j824915j518793
4364C3783403j106760p89709n93017j95117R5369M19264P41120Q30936J666907
$$ plain form
4355 34852396 36363375 37008579 36744129 35904471 35165824 34692454 34746664 35207755 35938981
4346 35938981 36621493 36664778 35871729 33791371 31493388 29303319 27447862 25846480 24527549
4337 24527549 23273108 22316324 21592910 20939806 20290246 19718700 19285134 18918203 18811001
4328 18811001 18838118 18571319 18307066 18174460 17924219 17716266 17684847 17446970 16965590 16740529
4318 16740529 16602056 16263662 15925096 15842745 15596054 15408360 15343583 15551306 15781571 15882056
4308 15882056 16209202 16577615 16796273 17318548 17956789 18705598 19606912 20833911 21950110
4299 21950110 22640551 22749370 22095953 21104469 19743136 18604112 17603572 16594175 15914199
4290 15914199 15495679 15136123 15035412 14909530 14858382 14637667 14367020 14382185 14231263 14139936
$$ packed form
4355C4852396J510979O45204k64450q39658p38647m73370N4210M61091P31226
4346C5938981O82512M3285p93049k080358k297983k190069j855457j601382j318931
4337B4527549j254441r56784p23414o53104o49560n71546m33566l66931j07202
4328A8811001K7117k66799k64253j32606k50241k07953l1419k37877m81380k25061
4318A6740529j38473l38394l38566q2351k46691j87694o4777K07723K30265J00485
4308A5882056L27146L68413K18658N22275O38241P48809R01314J226999J116199
4299B1950110O90441J08819o53417r91484j361333j139024j000540j009397o79976
4290A5914199m18520l59556j00711j25882n1148k20715k70647J5165j50922r1327
$$ plain form
4280 14139936 14019281 14212401 14791203 15466533 16054384 16215561 16711499 17662009 18503355
4271 18503355 19444134 20332565 20981349 20993005 20210166 19086318 17964669 16681953 15512237
4262 15512237 14787451 14269168 13778486 13226514 12769234 12621286 12565424 12224454 11744434 11511816
4252 11511816 11532171 11553171 11355430 11142545 11079167 10933251 10778096 10816283 10755968 10629049
4242 10629049 10690209 10522962 10522885 10669862 10694190 10552565 10809071 10897361 10926413 10867728 10772761
4231 10772761 10769005 10678868 10858502 10724969 10813746 10896845 10905209 11013496 10982824 10694194 10853021
4220 10853021 10995872 11223117 11401674 11669222 11697219 11496472 11588441 11578081 11412045 11447748
4210 11447748 11676857 11858489 12077386 12547385 12831033 12890897 12959349 12891144 13120037 13530355
$$ packed form
4280A4139936j20655J93120N78802O75330N87851J61177M95938R50510Q41346
4271A8503355R40779Q88431O48784J1656p82839j123848j121649j282716j169716
4262A5512237p24786n18283m90682n51972m57280j47948n5862l40970m80020k32618
4252A1511816K0355K1000j97741k12885o3378j45916j55155L8187o0315j26919
4242A0629049O1160j67247p7J46977K4328j41625K56506Q8290K9052n8685r4967
4231A0772761l756r0137J79634j33533Q8777Q3099Q364J08287l0672k88630J58827
4220A0853021J42851K27245J78557K67548K7997k00747R1969j0360j66036L5703
4210A1447748K29109J81632K18897M69999K83648N9864O8452o8205K28893M10318
$$ plain form
4200 13530355 13913626 14454202 15133710 15769024 16357750 17087719 17899281 18729965 19834334
4191 19834334 20935299 21385171 21348616 21111182 20966388 21122711 21508181 22112722 22731509
4182 22731509 24156334 26007612 28149653 30267701 31392756 31516519 30861930 29989182 29611439
4173 29611439 29909830 30839952 31827988 32052282 32411745 32934085 33603421 34841190 35788984
4164 35788984 36576562 37248857 37729641 38214058 39018869 39754588 40067219 39419723 37795425
4155 37795425 36215985 35260391 35128363 35760778 37006376 38246390 38415433 38096018 37858978
4146 37858978 37695537 37482569 37429838 37169731 36107066 35092369 33861600 32887531 32515893
4137 32515893 32342873 31982663 31318141 31117349 31293673 31819323 32979231 33732749 33140210
$$ packed form
4200A3530355L83271N40576O79508O35314N88726P29969Q11562Q30684J104369
4191A9834334J100965M49872l6555k37434j44794J56323L85470O04541O18787
4182B2731509J424825J851278K142041K118048J125055J23763o54589q72748l77743
4173B9611439K98391R30122R88036K24294L59463N22340O69336J237769R47794
4164C5788984P87578O72295M80784M84417Q04811P35719L12631o47496j624298
4155C7795425j579440r55594j32028O32415J245598J240014J69043l19415k37040
4146C7858978j63441k12968n2731k60107j062665j014697j230769r74069l71638
4137C2515893j73020l60210o64522k00792J76324N25650J159908P53518n92539
$$ plain form
4128 33140210 31494121 29574852 27517715 25650934 24371880 23640193 23166721 22842316 23020950
4119 23020950 23403543 23906311 24049758 23776820 23216101 22328272 21392629 20585336 20271361
4110 20271361 20265227 20341258 20696418 20979448 21456314 21796398 21669438 21915435 22223034 22359475
4100 22359475 22304563 22212333 21889706 21602780 21660017 21613002 21474326 21270041 21023839 20847710
4090 20847710 20876035 21042043 21136651 21218701 21714324 22731933 23943369 25396819 26771302
4081 26771302 28422897 30584229 32571630 34011060 34811225 35761385 36956918 37659450 37491507
4072 37491507 36900897 36148946 34993745 33857974 33065275 32650235 32441592 32683392 33475626
4063 33475626 34546646 35555382 36131482 36698993 37781491 39180493 40350868 41111540 41129655
$$ packed form
4128C3140210j646089j919269k057137j866781j279054p31687m73472l24405J78634
4119B3020950L82593N02768J43447k72938n60719q87829r35643q07293l13975
4110B0271361o134P6031L55160K83030M76866L40084j26960K45997L07599J36441
4100B2359475n4912r2230l22627k86926N7237m7015j38676k04285k46202j76129
4090B0847710K8325J66008R4608Q2050M95623J017609J211436J453450J374483
4081B6771302J651595K161332J987401J439430Q00165R50160J195533P02532j67943
4072C7491507n90610p51951j155201j135771p92699m15040k08643K41800P92234
4063C3475626J071020J008736N76100N67511J082498J399002J170375P60672J8115
$$ plain form
4054 41129655 41147228 41105360 41760678 43973270 47369682 51676442 54509435 54036693 52005058
4045 52005058 49664504 48174223 48054987 48499403 48582219 47440769 45026495 41959375 38837312
4036 38837312 36241822 34193928 32662093 31861297 31575085 31707306 31784783 31734174 30723816
4027 30723816 29516947 28369023 27700194 27226521 27002359 27177384 27444480 27156635 26385586
4018 26385586 25609237 24960080 24543377 24414358 24557981 24336109 23486454 22184238 21080108
4009 21080108 20250267 19450982 18672753 18339736 18191538 18077482 18108451 17987653 17372753 16626817
3999 16626817 15737799 14825965 14185433 13658742 13130579 12533557 12220098 12038151 11901208
3990 11901208 11622377 11487542 11495394 11309870 11067502 10979273 10677502 10537634 10687662 10432462
$$ packed form
4054D1129655J7573m1868O55318K212592L396412M306760K832993m72742k031635
4045E2005058k340554j490281j19236M44416Q2816j141450k414274l067120l122063
4036C8837312k595490k047894j531835q00796k86212J32221P7477n0609j010358
4027C0723816j206869j147924o68829m73673k24162J75025K67096k87845p71049
4018B6385586p76349o49157m16703j29019J43623k21872q49655j302216j104130
4009B1080108q29841p99285p78229l33017j48198j14056L0969j20798o14900p45936
3999A6626817q89018r11834o40532n26691n28163n97022l13459j81947j36943
3990A1901208k78831j34835P852j85524k42368q8229l01771j39868J50028k55200
$$ plain form
3980 10432462 10257241 10320253 10366434 10227472 10199896 10138404 10163850 10186003 10178316 9935453 9782258
3969 9782258 9940370 10113453 10053505 9956334 10135122 10238905 10076314 10196544 10442853 10442717
3959 10442717 10259514 10326361 10368006 10559687 10726173 10701201 10796656 11103960 11424169 11336507
3949 11336507 11432922 11945257 12455205 12786580 13420375 14392801 15247432 16159287 17543919
3940 17543919 18758265 19816102 21309367 22543579 23104816 22860568 21459447 19399455
3932 19399455 17550088 16246395 14984427 13859850 13417307 13091618 12650492 12341248 12177997
3923 12177997 12114360 12108380 12057472 11871672 11618722 11576304 11797659 11685031 11596420 11596019 11625367
3912 11625367 11853100 12104107 12462430 12695742 12988931 13650175 14438427 14685381 14842944
$$ packed form
3980A0432462j75221O3012M6181j38962k7576o1492K5446K2153p687k42863j53195
3969I782258J58112J73083n9948r7171J78788J03783j62591J20230K46309j36
3959A0442717j83203O6847M1645J91681J66486k4972R5455L07304L20209q7662
3949A1336507R6415N12335N09948L31375O33795R72426Q54631R11855J384632
3940A7543919J214346J057837J493265J234212N61237k44248j401121k059992
3932A9399455j849367j303693j261968j124577m42543l25689m41126l09244j63251
3923A2177997o3637n980n0908j85800k52950m2418K21355j12628q8611m01K9348
3912A1625367K27733K51007L58323K33312K93189O61244P88252K46954J57563
$$ plain form
3903 14842944 15089155 15510684 16223154 16819142 17790778 19107282 20989350 23235334 25639219
3894 25639219 26655410 25771753 23768922 21632130 20032273 19007992 18109789 17645676 17734310
3885 17734310 18022356 17954123 18060052 18907820 19973426 21410103 23080457 24012776 23383723
3876 23383723 21735085 19558990 17501918 15776091 14717681 13959506 13227322 12670555 12242815
3867 12242815 11824107 11355840 11220671 11132944 10630911 10256044 10100690 9825190 9707555 9766096
3857 9766096 9459712 9225456 9297539 9387901 9419851 9379601 9406321 9489725 9560290 9501545 9408976
3846 9408976 9534309 9686212 9895637 10092666 10511803 10955367 11451671 11954670 12614222 13666427
3836 13666427 13906828 13529589 13162103 12928324 12626349 12450482 12237919 12043757 12122736 12413769
$$ packed form
3903A4842944K46211M21529P12470N95988R71636J316504J882068K245984K403885
3894B5639219J016191q83657k002831k136792j599857j024281q98203m64113Q8634
3885A7734310K88046o8233J05929Q47768J065606J436677J670354R32319o29053
3876B3383723j648638k176095k057072j725827j058410p58175p32184n56767m27740
3867A2242815m18708m68267j35169q7727n02033l74867j55354k75500j17635N8541
3857I766096l06384k34256P2083R0362L1950m0250K6720Q3404P0565n8745r2569
3846I408976J25333J51903K09425J97029M19137M43564M96304N02999O59552J052205
3836A3666427K40401l77239l67486k33779l01975j75867k12563j94162P8979K91033
$$ plain form
3826 12413769 12580314 12731060 13073309 13593423 14174031 15114029 16378768 17705300 19171110
3817 19171110 20599803 21221420 21115495 20986069 21038025 21411912 21780021 21499227 20620811
3808 20620811 19942317 19415007 19204384 19266412 19588695 20378426 21470193 22778141 24086006
3799 24086006 24910436 25355069 26021862 27385932 29293707 30841152 30735789 29361114 28038606
3790 28038606 26957084 26073468 25386469 24914025 24441017 23733757 22998068 22247634 21946468
3781 21946468 22047204 22422117 22455476 22611022 22885378 23120005 23266473 23321305 23528462 23661898
3771 23661898 23622293 22766724 21386509 19997221 18962004 18432204 18029031 17811270 17456983
3762 17456983 17272029 17439079 17610880 17517171 17661564 17907897 18156119 18645000 19063682 19355287
$$ packed form
3826A2413769J66545J50746L42249N20114N80608R39998J264739J326532J465810
3817A9171110J428693O21617j05925j29426N1956L73887L68109k80794q78416
3808B0620811o78494n27310k10623O2028L22283P89731J091767J307948J307865
3799B4086006Q24430M44633O66793J364070J907775J547445j05363j374675j322508
3790B8038606j081522q83616o86999m72444m73008p07260p35689p50434l01166
3781B1946468J00736L74913L3359J55546K74356K34627J46468N4832K07157J33436
3771B3661898l9605q55569j380215j389288j035217n29800m03173k17761l54287
3762A7456983j84954J67050J71801r3709J44393K46333K48222M88881M18682K91605
$$ plain form
3752 19355287 19669796 20277609 21168614 22063802 22942424 24097065 25545869 27185384 29254773
3743 29254773 31686241 34443549 37649043 42197767 47676864 51902164 53227254 51857086
3735 51857086 49216909 46296080 43950646 42079561 40631507 39847903 39580033 39487081 40202884
3726 40202884 41528309 43426631 45931808 49342991 53565926 58525815 64784666 72402648
3718 72402648 79839345 85246003 88977823 91208951 89785772 84727393 77821769 70360310
3710 70360310 63728987 58576839 54662551 52016010 50523672 50033308 50259123 50874546 51692637
3701 51692637 52658338 53748867 55206584 57229106 60387719 64635341 68709645 69949673
3693 69949673 66960020 61868431 56365798 51686069 48087851 45315129 43103428 41219031
$$ packed form
3752A9355287L14509O07813Q91005Q95188Q78622J154641J448804J639515K069389
3743B9254773K431468K757308L205494M548724N479097M225300J325090j370168
3735E1857086k640177k920829k345434j871085j448054p83604k67870r2952P15803
3726D0202884J325425J898322K505177L411183M222935M959889O258851P617982
3718G2402648P436697N406658L731820K231128j423179n058379o905624p461459
3710G0360310o631323n152148l914288k646541j492338m90364K25815O15423Q18091
3701E1692637R65701J090529J457717K022522L158613M247622M074304J240028
3693F9949673k989653n091589n502633m679729l598218k772722k211701j884397
$$ plain form
3685 41219031 39727875 38561547 37487670 36047727 34365747 32351410 30741748 29685355
3677 29685355 28844126 27985069 27502251 27341298 27317440 27383956 27411113 27167547 26832689 26344042
3667 26344042 25848729 25141615 24124236 23083619 22332203 21820604 21249130 20749114 20366708
3658 20366708 20067467 20030119 20054748 19945115 19935239 19879534 19491352 19045328 18624949 17992860
3648 17992860 17498244 17035037 16690014 16441051 16468125 16478880 16420618 16224261 16000612 15875158
3638 15875158 15960995 15971410 15946363 15927801 16090621 16305764 16439929 16441918 16301439 16254817 16413085
3627 16413085 16458255 16656879 16771854 17056326 17386587 17680217 17746768 17742198 17717945 18078841
3617 18078841 18513599 18906782 19232137 19624059 20295937 20851083 21000129 21228958 21638153
$$ packed form
3685D1219031j491156j166328j073877j439943j681980k014337j609662j056393
3677B9685355q41229q59057m82818j60953k3858O6516K7157k43566l34858m88647
3667B6344042m95313p07114j017379j040617p51416n11599n71474n00016l82406
3658B0366708k99241l7348K4629j09633r876n5705l88182m46024m20379o32089
3648A7992860m94616m63207l45023k48963K7074J0755n8262j96357k23649j25454
3638A5875158Q5837J0415k5047j8562J62820K15143J34165J989j40479m6622J58268
3627A6413085M5170J98624J14975K84472L30261K93630O6551m570k4253L60896
3617A8078841M34758L93183L25355L91922O71878N55146J49046K28829M09195
$$ plain form
3608 21638153 21950550 22380797 22886913 23356736 23646098 24102982 24475669 24739719 24742847 24990909
3598 24990909 25183438 25485202 25891079 26085398 26155744 26558434 26650019 26732067 26936355 27046273
3588 27046273 27283198 27432486 27533079 27837211 28299457 28512415 28917854 29122938 29612420
3579 29612420 30255869 31003229 31885164 33042335 34610401 36027438 37825662 40193030 43034376
3570 43034376 46821665 51445773 56276109 59274669 58979562 56812635 53827580 50798521
3562 50798521 49043760 47937964 47870111 49060320 51374072 54368523 57993470 61743761
3554 61743761 63340593 62166501 59329599 56189884 53524087 52323345 52217362 53354684
3546 53354684 55484489 58411510 60956350 61645742 60458904 58491408 56916913 56386838
$$ packed form
3608B1638153L12397M30247N06116M69823K89362M56884L72687K64050L128K48062
3598B4990909J92529L01764M05877J94319P0346M02690R1585Q2048K04288J09918
3588B7046273K36925J49288J00593L04132M62246K12958M05439K05084M89482
3579B9612420O43449P47360Q81935J157171J568066J417037J798224K367368K841346
3570D3034376L787289M624108M830336K998560k95107k166927k985055l029059
3562E0798521j754761j105796o7853J190209K313752K994451L624947L750291
3554F1743761J596832j174092k836902l139715k665797j200742j05983J137322
3546E3354684K129805K927021K544840O89392j186838j967496j574495n30075
$$ plain form
3538 56386838 56919895 58120492 59567763 60905794 62347818 64038410 65746182 66423900
3530 66423900 65336822 62686242 59374853 56689055 54924830 53873364 53101245 52055374
3522 52055374 50922360 50093460 50020831 50294812 51205043 52882028 55068594 57094202 57934327
3513 57934327 57045011 54782949 52250596 49766470 47640375 45731807 44171398 43276713
3505 43276713 42957297 43165280 43665921 44465386 45507715 46129466 46728991 47682377 49028726
3496 49028726 50866961 52649778 53538598 53733995 52943887 50783133 47588866 44455748 41579169
3487 41579169 39273011 37751406 36494236 35782388 35539989 35366410 35398260 35704063 36251609
3478 36251609 37001824 37822022 39209100 41109209 43554515 46386148 48228245 49212916 49799896
$$ packed form
3538E6386838N33057J200597J447271J338031J442024J690592J707772O77718
3530F6423900j087078k650580l311389k685798j764225j051466p72119j045871
3522E2055374j133014q28900p2629K73981R10231J676985K186566K025608Q40125
3513E7934327q89316k262062k532353k484126k126095j908568j560409q94685
3505D3276713l19416K07983N00641P99465J042329O21751N99525R53386J346349
3496D9028726J838235J782817Q88820J95397p90108k160754l194267l133118k876579
3487D1579169k306158j521605j257170p11848k42399j73579L1850L05803N47546
3478C6251609P50215Q20198J387078J900109K445306K831633J842097R84671N86980
$$ plain form
3469 49799896 49474080 47832589 45262557 42694266 40509858 39238130 38600138 38627726 39853309
3460 39853309 41727287 43054367 42500822 40560644 38273191 35837918 33917518 32807536
3452 32807536 32227817 32100644 32180083 32580339 33443913 34659499 35755867 35899310 35375968
3443 35375968 34372445 33059572 32132214 31570001 31572889 32182030 33219897 34028287 33806605
3434 33806605 32384403 30395830 28372899 26817162 25665706 24597565 23675914 22833675
3426 22833675 22085517 21347047 20572412 19815225 19509792 19014894 18427961 17798496 17620812
3417 17620812 17560666 17153914 16962087 16770907 16727044 16806331 16557291 16232409 16114335 16079920
3407 16079920 16089263 16346714 16430524 16322060 16287822 16251438 16095854 16022788 15760236 15616975
$$ packed form
3469D9799896l25816j641491k570032k568291k184408j271728o37992K7588J225583
3460C9853309J873978J327080n53545j940178k287453k435273j920400j109982
3452C2807536n79719j27173P9439M00256Q63574J215586J096368J43443n23342
3443C5375968j003523j312873r27358n62213K888O09141J037867Q08390k21682
3434C3806605j422202j988573k022931j555737j151456j068141r21651q42239
3426B2833675p48158p38470p74635p57187l05433m94898n86933o29465j77684
3417A7620812o0146m06752j91827j91180m3863P9287k49040l24882j18074l4415
3407A6079920R343K57451Q3810j08464l4238l6384j55584p3066k62552j43261
$$ plain form
3397 15616975 15744100 15735160 15786226 15823103 15744888 15595075 15497297 15502223 15332014 15160590 14726865
3386 14726865 14580195 14868540 14896454 14744744 14679146 14766102 14942203 15028740 14967950 15069112
3376 15069112 15017035 15184621 15422433 15932590 16361555 16391093 16629375 17167268 17826499 18300742
3366 18300742 18879379 19382140 19982427 20267650 20481625 20681345 20545471 20568859 20451238 20420662
3356 20420662 20542778 20837146 21070404 21429681 21846121 21924439 22101918 22539811 22753507 22831079
3346 22831079 22934130 22943075 22942762 22866175 22600482 22306325 22307076 21904912 21274258 20939650 20598018
3335 20598018 20013483 19410342 18918865 18366277 17848179 17454876 17241589 17191232 16777029 16399440
3325 16399440 15987503 15750579 15661015 15336539 14972179 14853664 14834719 14560206 14347325 14357133
$$ packed form
3397A5616975J27125q940N1066L6877p8215j49813r7778M926j70209j71424m33725
3386A4726865j46670K88345K7914j51710o5598Q6956J76101Q6537o0790J01162
3376A5069112n2077J67586K37812N10157M28965K9538K38282N37893O59231M74243
3366A8300742N78637N02761O00287K85223K13975J99720j35874K3388j17621l0576
3356B0420662J22116K94368K33258L59277M16440P8318J77479M37893K13696P7572
3346B2831079J03051Q945l13p6587k65693k94157P51m02164o30654l34608l41632
3335B0598018n84535o03141m91477n52588n18098l93303k13287n0357m14203l77589
3325A6399440m11937k36924q9564l24476l64360j18515j8945k74513k12881R808
$$ plain form
3315 14357133 14241409 14228631 14260186 14238861 14319680 14435186 14554323 14498640 14621234 14837526
3305 14837526 14794656 14770579 14994572 15237272 15241441 14966874 15088737 15425195 15714996 16025334
3295 16025334 16512097 16722030 17106270 17698121 18052090 18143100 18452252 18701130 18833362 19108784
3285 19108784 19335137 19365976 19271852 19424238 19405478 19216707 19060910 19071229 19181398 19347958
3275 19347958 19593254 19687054 19780338 19900403 20117968 20188106 20192833 20651801 21006190 20934274
3265 20934274 20710557 20576539 20393199 20087770 20051056 19862621 19741055 19826471 19727730 19314976
3255 19314976 19346465 19403867 19349466 19181676 19356427 19526479 19382057 19242139 19227252 19135883
3245 19135883 19169015 19367467 19489038 19567560 19641735 19892478 20113413 20518688 20615374 20692762
$$ packed form
3315A4357133j15724j2778L1555k1325Q0819J15506J19137n5683J22594K16292
3305A4837526m2870k4077K23993K42700M169k74567J21863L36458K89801L10338
3295A6025334M86763K09933L84240N91851L53969R1010L09152K48878J32232K75422
3285A9108784K26353L0839r4124J52386j8760j88771j55797J0319J10169J66560
3275A9347958K45296R3800R3284J20065K17565P0138M727M58968L54389p1916
3265B0934274k23717j34018j83340l05429l6714j88435j21566Q5416r8741m12754
3255A9314976L1489N7402n4401j67790J74751J70052j44422j39918j4887r1369
3245A9135883L3132J98452J21571P8522P4175K50743K20935M05275R6686P7388
$$ plain form
3235 20692762 20874938 21356151 21832857 22285190 22638250 23058630 23641019 24124304 24621879
3226 24621879 25524414 26482882 27293673 27915029 28271256 28373855 28328692 28510895 28522279 28684989
3216 28684989 29067533 29541382 29988237 30633599 31342020 31818873 32410958 33176052 33860328
3207 33860328 34446950 35344964 36568611 38022092 39411662 40712371 42254148 43978703
3199 43978703 46028057 48406411 51022451 53632558 55834554 56643157 56384507 55995961 55698682
3190 55698682 55589063 55974026 56975719 58267550 59976072 62269869 65087791 67548971
3182 67548971 69241191 69879292 69592929 69349103 69804802 70948636 72541934 74824212 77621987
3173 77621987 80422049 82544333 83818780 84421910 85079457 86344985 87944141 90083438
$$ packed form
3235B0692762J82176M81213M76706M52333L53060M20380N82389M83285M97575
3226B4621879R02535R58468Q10791O21356L56227J02599m5163J82203J1384J62710
3216B8684989L82544M73849M46855O45362P08421M76853N92085P65094O84276
3207C3860328N86622Q98014J223647J453481J389570J300709J541777J724555
3199D3978703K049354K378354K616040K610107K201996Q08603k58650l88546k97279
3190E5698682j09619L84963J001693J291831J708522K293797K817922K461180
3182F7548971J692220O38101k86363k43826M55699J143834J593298K282278K797775
3173G7621987K800062K122284J274447O03130O57547J265528J599156K139297
$$ plain form
3165 90083438 92914723 96654045 100951996 106171330 112281600 118879489 125133645 131595527
3157 131595527 139185137 148815698 161337460 177282369 195840880 212116574 220935053
3150 220935053 224967848 227853775 229141406 223665563 211337946 197106679 184390635 174854275
3142 174854275 168250757 164409530 163111169 163841267 166495016 170749411 176925552 185491005
3134 185491005 196311983 209027989 223867098 241392822 262251445 287524618 319879119
3127 319879119 360959218 407156973 442627554 455427661 440732848 406618406 370743435
3120 370743435 340526008 319681354 304483512 289930000 272574430 252810667 233125730
3113 233125730 215490946 200759152 189644901 181732001 176826280 173889951 171610988 167944717
$$ packed form
3165I0083438K831285L739322M297951N219334O110270O597889O254156O461882
3157A31595527P589610R630561J2521762J5944909J8558511J6275694Q818479
3150B20935053M032795K885927J287631n475843j2327617j4231267j2716044r536360
3142A74854275o603518l841227j298361P30098K653749M254395O176141Q565453
3134A85491005J0820978J2716006J4839109J7525724K0858623K5273173L2354501
3127C19879119M1080099M6197755L5470581J2800107j4694813l4114442l5874971
3120C70743435l0217427k0844654j5197842j4553512j7355570j9763763j9684937
3113B33125730j7634784j4731794j1114251p912900m905721k936329k278963l666271
$$ plain form
3105 167944717 161849761 153171198 143252091 133342859 124682673 117531081 111943371 107255800
3097 107255800 103228800 100103985 97396777 95648964 94543812 93835584 93508206 93487665 93931471
3088 93931471 94357589 94744367 94996871 94970907 95113525 95219576 94508701 92639599 89225152
3079 89225152 85016307 80581839 76596030 72932720 69452905 66540899 64161263 62137739
3071 62137739 60448234 58743701 56958158 55423189 54161563 53186993 52155232 50870788
3063 50870788 49784578 49143680 48539110 48190833 47862813 47525405 47421778 47252736 47361404
3054 47361404 47734728 48256025 49158225 50132050 50833941 50660969 50172051 49484257 49069580
3045 49069580 48675572 48371590 48061717 48374164 48679524 48969887 49504005 50106581 50889636
$$ packed form
3105A67944717o094956q678563r919107r909232q660186p151592n587710m687571
3097A07255800m027000l124815k707208j747813j105152p08228l27378k0541M43806
3088I3931471M26118L86778K52504k5964J42618J06051p10875j869102l414447
3079H9225152m208845m434468l985809l663310l479815k912006k379636k023524
3071F2137739j689505j704533j785543j534969j261626r74570j031761j284444
3063E0870788j086210o40898o04570l48277l28020l37408j03627j69042J08668
3054D7361404L73324N21297R02200R73825P01891j72972m88918o87794m14677
3045D9069580l94008l03982l09873L12447L05360K90363N34118O02576P83055
$$ plain form
3036 50889636 51916235 53377483 55189371 57479278 60247910 63929209 68096444 73101318
3028 73101318 79323068 86755840 95777447 107066504 121659589 138328563 152702802 157281158
3020 157281158 150038661 135708495 118966298 103391042 90064878 79503298 71543235
3013 71543235 65159097 59877692 55575594 52066853 49095014 46442686 44038974 41994381
3005 41994381 39951132 38246270 36996673 35665068 34506624 33262051 32127399 31250161
2997 31250161 30579976 29892357 29382391 29124891 29083343 29145954 29111828 28862798 28781685 28793185
2987 28793185 28538212 28339866 27842492 27390720 26827735 26156702 25403352 24637856 23673326
2978 23673326 22740419 22211971 21860174 21544826 21345684 21213909 20964192 20659776 20518631
$$ packed form
3036E0889636J026599J461248J811888K289907K768632L681299M167235N004874
3028G3101318O221750P432772R021607J1289057J4593085J6668974J4374239M578356
3020A57281158p242497j4330166j6742197j5575256j3326164j0561580p960063
3013G1543235o384138n281405m302098l508741k971839k652328k403712k044593
3005D1994381k043249j704862j249597j331605j158444j244573j134652q77238
2997C1250161o70185o87619n09966k57500m1548O2611l4126k49030q1113J1500
2987B8793185k54973j98346m97374m51772n62985o71033p53350p65496r64530
2978B3673326r32907n28448l51797l15348j99142j31775k49717l04416j41145
$$ plain form
2969 20518631 20252956 19926563 19641825 19535073 19299971 18950698 18753595 18398677 18053437
2960 18053437 17890528 17706967 17402956 17133974 16859104 16560571 16373381 16220162 15908060
2951 15908060 15700731 15475022 15236391 15104362 15038674 15024689 14875286 14843911 14878212 15076531
2941 15076531 14899361 14925445 15095301 14813096 14664028 14780365 15000953 14894751 14980576 15208090
2931 15208090 15361013 15570084 15755688 15979012 16218462 16634169 17236206 17501753 17920681
2922 17920681 18343049 18121173 17442451 16799923 15966140 15047236 14465906 14068991 13650846
2913 13650846 13428642 13187270 12797100 12525020 12388337 11952423 11405250 11343562 11461971 11288950
2903 11288950 11099611 11206143 11260472 11127957 10997876 11209708 11234922 11136223 11317731 11289588
$$ packed form
2969B0518631k65675l26393k84738j06752k35102l49273j97103l54918l45240
2960A8053437j62909j83561l04011k68982k74870k98533j87190j53219l12102
2951A5908060k07329k25709k38631j32029o5688j3985j49403l1375L4301J98319
2941A5076531j77170K6084J69856k82205j49068J16337K20588j06202Q5825K27514
2931A5208090J52923K09071J85604K23324K39450M15707O02037K65547M18928
2922A7920681M22368k21876o78722o42528q33783r18904n81330l96915m18145
2913A3650846k22204k41372l90170k72080j36683m35914n47173o1688J18409j73021
2903A1288950j89339J06532N4329j32515j30081K11832K5214r8699J81508k8143
$$ plain form
2893 11289588 11367210 11484773 11581042 11595499 11664354 11840529 11989101 12029561 12093531 12070743 11705631
2882 11705631 11573879 11407950 11372310 11212935 10994915 10723847 10606067 10818863 10817559 10662953
2872 10662953 10569613 10805309 10966411 11118396 11330407 11403367 11658354 12021907 12393416 12572427
2862 12572427 12799350 13293541 13734280 13836740 13772789 13748202 13592463 13663295 13520721 13288156
2852 13288156 13664722 14057665 14280841 14756751 15200097 15791513 16826542 17970478 19123907
2843 19123907 20714783 22541143 24822705 27849745 32136430 37727148 44302135 46458701
2835 46458701 43257097 38229714 32589030 28244996 25012988 22600213 20575829 18990685
2827 18990685 17776883 16735178 15687267 14941288 14225670 13743959 13414703 13026908 12558584
$$ packed form
2893A1289588P7622J17563R6269J4457O8855J76175J48572M0460O3970k2788l65112
2882A1705631j31752j65929l5640j59375k18020k71068j17780K12796j304j54606
2872A0662953r3340K35696J61102J51985K12011P2960K54987L63553L71509J79011
2862A2572427K26923M94191M40739J02460o3951k4587j55739P0832j42574k32565
2852A3288156L76566L92943K23176M75910M43346N91416J035029J143936J153429
2843A9123907J590876J826360K281562L027040M286685N590718O574987K156566
2835D6458701l201604n027383n640684m344034l232008k412775k024384j585144
2827A8990685j213802j041705j047911p45979p15618m81711l29256l87795m68324
$$ plain form
2818 12558584 12492871 12385034 12152161 12089686 11905964 11499321 11125687 11169071 11103045 10681678
2808 10681678 10437857 10315170 10229293 9893172 9490463 9358702 9251622 9271999 9260424 9233103
2798 9233103 9369173 9718367 9836603 10010136 10381276 10782586 11449323 12145815 13027801 14017040
2788 14017040 14322559 13811316 12925102 11900573 10823749 9998245 9537853 9197582 8873012
2779 8873012 8671645 8358311 8286454 8169694 7937286 7485794 7333487 7272181 7185228 7157994
2769 7157994 6817302 6601735 6491778 6294488 6177201 6055734 5744087 5590011 5577842 5600882
2759 5600882 5612943 5513839 5345355 5289747 5195234 5122512 5035415 4827933 4689047 4728573 4537575
2748 4537575 4351550 4385906 4263874 4197852 4366387 4495223 4293401 4321802 4216937 4190548
$$ packed form
2818A2558584o5713j07837k32873o2475j83722m06643l73634M3384o6026m21367
2808A0681678k43821j22687q5877l36121m02709j31761j07080K0377j1575k7321
2798I233103J36070L49194J18236J73533L71140M01310O66737O96492Q81986R89239
2788A4017040L05519n11243q86214j024529j076824q25504m60392l40271l24570
2779H873012k01367l13334p1857j16760k32408m51492j52307o1306q6953k7234
2769G157994l40692k15567j09957j97290j17287j21467l11647j54076j2169K3040
2759E600882J2061r9104j68484n5608r4513p2722q7097k07482j38886L9526j90998
2748D537575j86025L4356j22032o6022J68535J28836k01822K8401j04865k6389
$$ plain form
2738 4190548 4362033 4380354 4411698 4403793 4598788 4488956 4352920 4297485 4354186 4457505 4172659
2727 4172659 4133024 4186334 4054980 3892102 3821233 3862996 3942760 4055952 4147445 4251205 4311877
2716 4311877 4386183 4459820 4704999 4687239 4611774 4425746 4439236 4422207 4375016 4250782 4078962
2705 4078962 4063851 3932406 3775761 3589759 3484442 3442729 3401704 3253648 3306067 3172186
2695 3172186 3097654 3252586 3187475 3101968 3044866 2901501 2912543 3157102 3142933 2950013 3042280
2684 3042280 3208833 3160447 2944482 2849938 2816233 2738028 2859607 2904612 2905622 3066371 3119618
2673 3119618 2968056 2804196 2717187 2579691 2548969 2588882 2669672 2776597 2587658 2673840
2663 2673840 2838381 2757098 2665502 2712583 2656481 2686245 2629049 2347486 2178155 2342174 2648919
$$ packed form
2738D190548J71485J8321L1344p905J94995j09832j36036n5435N6701J03319k84846
2727D172659l9635N3310j31354j62878p0869M1763P9764J13192R1493J03760O0672
2716D311877P4306P3637K45179j7760p5465j86028J3490j7029m7191j24234j71820
2705D078962j5111j31445j56645j86002j05317m1713m1025j48056N2419j33881
2695C172186p4532J54932o5111q5507n7102j43365J1042K44559j4169j92920R2267
2684C042280J66553m8386k15965r4544l3705p8205J21579M5005J010J60749N3247
2673C119618j51562j63860q7009j37496l0722L9913Q0790J06925j88939Q6182
2663B673840J64541q1283r1596M7081n6102K9764n7196k81563j69331J64019L06745
$$ plain form
2652 2648919 2600861 2504095 2501603 2145739 1921838 1994346 1926721 1914825 2268252 2264117 2026560
2641 2026560 1778722 1825252 1903583 1669152 1633968 1722004 1549719 1410412 1621124 1502867
2631 1502867 1506655 1587359 1442148 1457883 1666776 1484305 1276579 1536137 1527699 1387817 1226102
2620 1226102 1103043 1355988 1371522 1247117 1183747 1364164 1203214 1290709 1172375 1015618
2610 1015618 994747 1054619 1091132 959925 1122512 1254517 1128868 1175522 1330832 1468737
2600 1468737 1380718 1315880 1352128 1198448 1178238 1266830 1216803 1187034 1264691 1271327 1354999
2589 1354999 1351359 1222815 1160484 1257079 1469969 1364485 1568299 1611478 1564548 1673334 1603197
2578 1603197 1437549 1486644 1555478 1433615 1556292 1603585 1609320 1648818 1612394 1479944 1390363
$$ packed form
2652B648919m8058r6766k492l55864k23901P2508o7625j1896L53427m135k37557
2641B026560k47838M6530P8331k34431l5184Q8036j72285j39307K10712j18257
2631A502867L788Q0704j45211J5735K08893j82471k07726K59558q438j39882j61715
2620A226102j23059K52945J5534j24405o3370J80417j60950Q7495j18334j56757
2610A015618k0871N9872L6513j31207J62587J32005j25649M6654J55310J37905
2600A468737q8019o4838L6248j53680k0210Q8592n0027k9769P7657O636Q3672
2589A354999l640j28544o2331R6595K12890j05484K03814M3179m6930J08786p0137
2578A603197j65648M9095O8834j21863J22677M7293N735L9498l6424j32450q9581
$$ plain form
2567 1390363 1295143 1317127 1251465 1469187 1606956 1561319 1667679 1807318 1632593 1369428
2557 1369428 1504413 1450641 1533667 1551134 1523593 1617514 1503479 1349124 1260141 1226819 1303143
2546 1303143 1426721 1601302 1601012 1593011 1769145 1664253 1562626 1570933 1253074 1009783 1265508
2535 1265508 1474908 1359658 1424393 1600563 1379059 1481142 1441533 1181032 1027103 1242159
2525 1242159 1411493 1367568 1429759 1609618 1534128 1507736 1392042 1126144 813373 886064
2515 886064 1167813 1221621 1251541 1254114 1213430 1159852 1175744 1275001 1270995 1313881 1171023 1000448
2503 1000448 1017275 1111511 1155605 1026696 1123286 1123254 1003622 1024877 1093596 1082798 889920
2492 889920 905258 1191018 1135425 960431 886590 858775 1075057 1049825 869877 590001 687691
$$ packed form
2567A390363r5220K1984o5662K17722J37769m5637J06360J39639j74725k63165
2557A369428J34985n3772Q3026J7467k7541R3921j14035j54355q8983l3322P6324
2546A303143J23578J74581k90q001J76134j04892j01627Q307l17859k43291K55725
2535A265508K09400j15250O4735J76170k21504J02083l9609k60501j53929K15056
2525A242159J69334m3925O2191J79859p5490k6392j15694k65898l12771P2691
2515H86064K81749N3808K9920K573m0684n3578J5892R9257m006M2886j42858j70575
2503A000448J6827R4236M4094j28909R6590l2j19632K1255O8719j0798j92878
2492H89920J5338K85760n5593j74994p3841k7815K16282k5232j79948k79876R7690
$$ plain form
2481 687691 1006374 920880 762795 911537 1099071 1147963 941987 762724 767969 906423
2471 906423 805126 799220 764187 784462 915283 789682 1011964 1064716 907769 829165 967287
2460 967287 1033889 838280 748291 868221 1049463 1116273 976463 895281 828628 935763 807658
2449 807658 759783 906971 979357 944152 793255 757548 1058117 1032651 1131205 962031 879675
2438 879675 1041033 1127055 944764 820524 909752 971127 1037230 1127671 979231 942535 1015464
2427 1015464 1049279 1070200 1031731 1032105 921463 1060760 1211597 1168514 991826 935932 1155555
2416 1155555 1154422 959163 1013811 984356 1089490 1104187 1105439 1112081 1106753 1018044 909167 965113
2404 965113 912407 943541 1082035 1092018 1128800 1137550 843814 931005 1047039 970990 899599
$$ packed form
2481F87691L18683q5494j58085J48742J87534M8892k05976j79263N245J38454
2471I06423j01297n906l5033K0275J30821j25601K22282N2752j56947p8604J38122
2460I67287O6602j95609q9989J19930J81242O6810j39810q1182o6653J07135j28105
2449H07658m7875J47188P2386l5205j50897l5707L00569k5466R8554j69174q2356
2438H79675J61358Q6022j82291j24240Q9228O1375O6103R0441j48440l6696P2929
2427A015464L3815K0921l8469L74j10642J39297J50837m3083j76688n5894K19623
2416A155555j133j95259N4648k9455J05134J4697J252O642n328q8709j08877N5946
2404I65113n2706L1134J38494R983L6782Q750k93736Q7191J16034p6049p1391
$$ plain form
2393 899599 865862 1008470 1017658 973582 827137 868821 878721 766877 826202 872423 851412
2382 851412 817704 709488 868599 1022172 1041698 797986 684314 902516 1148800 956138
2372 956138 645983 634538 725814 765155 861610 852684 696823 666135 825001 805838 819626
2361 819626 764862 574899 789415 1001006 915212 723032 768578 1128348 1364378 1307079
2351 1307079 1131284 1150976 1228294 1181957 966554 935535 729847 655409 1013177 938596 975941
2340 975941 741017 581557 764763 1039838 957131 883403 740736 831139 897421 901026 840023
2329 840023 897080 847587 777614 972264 957765 968885 983184 901178 1057267 1143975 912312
2318 912312 884967 891438 886491 903691 1002377 922280 917858 850402 867324 784348 936903 907736
$$ packed form
2393H99599l3737J42608R188m4076j46445M1684R900j11844N9325M6221k1011
2382H51412l3708j08216J59111J53573J9526k43712j13672K18202K46284j92662
2372I56138l10155j1445R1276L9341R6455q926j55861l0688J58866j9163J3788
2361H19626n4764j89963K14516K11591q5794j92180M5546L59770K36030n7299
2351A307079j75795J9692P7318m6337k15403l1019k05688p4438L57768p4581L7345
2340I75941k34924j59460J83206K75075q2707p3728j42667R0403O6282L605o1003
2329H40023N7057m9493o9973J94650j4499J1120J4299q2006J56089Q6708k31663
2318I12312k7345O471m947J7200R8686q0097m422o7456J6922q2976J52555k9167
$$ plain form
2306 907736 608917 712242 833663 835954 797348 687327 657446 596485 792491 902195 563077
2295 563077 621353 731149 806867 931164 708366 672402 786442 929933 868832 689100
2285 689100 553967 792600 1126588 1138605 921934 612288 660124 750479 929427 923307 617172
2274 617172 547233 944240 964672 640555 594062 652959 674777 761055 940900 904677 744192
2263 744192 674397 784413 782124 819834 749900 607875 881396 1036000 885763 676450 733142
2252 733142 750330 665862 705801 813736 937414 935342 972875 909534 863064 853882 842763 804845
2240 804845 746749 773966 907151 934993 902195 796253 641197 589832 744154 867019 905654
2229 905654 756465 742529 846610 1040110 1226655 1071947 890743 1022439 1238852 1163445
$$ packed form
2306I07736k98819J03325J21421K291l8606j10021k9881o0961J96006J09704l39118
2295E63077N8276J09796P5718J24297k22798l5964J14040J43491o1101j79732
2285F89100j35133K38633L33988J2017k16671l09646M7836R0355J78948o120l06135
2274F17172o9939L97007K0432l24117m6493N8897K1818Q6278J79845l6223j60485
2263G44192o9795J10016k289L7710o9934j42025K73521J54604j50237k09313N6692
2252G33142J7188q4468L9939J07935J23678k072L7533o3341m6470r182j1119l7918
2240H04845n8096K7217J33185K7842l2798j05942j55056n1365J54322J22865L8635
2229I05654j49189j3936J04081J93500J86545j54708j81204J31696K16413p5407
$$ plain form
2219 1163445 1181023 1229681 1245747 1442857 1609033 1511867 1517197 1586752 1665109 1722477 1643055
2208 1643055 1344679 1280184 1365377 1210504 982667 1031207 1057548 1278890 1589836 1497372
2198 1497372 1166960 1145598 1205328 1186264 1319430 1346452 1552222 1677756 1904789 1780312
2188 1780312 1537201 1580074 1692046 1745299 1986545 2208403 2100550 2107081 2271477 2345936
2178 2345936 2275074 2001585 2024116 2236212 2252928 2304039 2261747 2107463 2121378 2253242 2357931
2167 2357931 2023762 2122371 2499938 2368889 2584615 2765728 2785304 2764316 2787932 2787055 2755800
2156 2755800 2674475 2624634 2302899 2062213 2107881 2099550 1961239 2124699 2111251 1964663 1804815
2145 1804815 1956918 1986642 1901786 1777508 1664770 1655217 1661460 1444125 1330966 1649701 1759003
$$ packed form
2219A163445J7578M8658J6066J97110J66176r7166N330O9555P8357N7368p9422
2208A643055k98376o4495Q5193j54873k27837M8540K6341K21342L10946r2464
2198A497372l30412k1362N9730j9064J33166K7022K05770J25534K27033j24477
2188A780312k43111M2873J11972N3253K41246K21858j07853O531J64396P4459
2178B345936p0862k73489K2531K12096J6716N1111m2292j54284J3915J31864J04689
2167B357931l34169R8609L77567j31049K15726J81113J9576k0988K3616q77l1255
2156B755800q1325m9841l21735k40686M5668q331j38311J63460j3448j46588j59848
2145A804815J52103K9724q4856j24278j12738r553O243k17335j13159L18735J09302
$$ plain form
2134 1759003 1731314 1667138 1639018 1674629 1668265 1454737 1536916 1610287 1768873 1977161 2143061
2123 2143061 2236474 2280251 2346479 2526857 2868493 3360833 3718699 3711788 3527373 3058019
2113 3058019 2477559 2052471 2068987 1998363 1831074 1754952 1783373 1955766 1930266 1906349 1719795
2102 1719795 1649821 1702960 1854591 1879151 1771599 1663565 1815984 2046281 1964491 1983404
2092 1983404 1923809 2138718 2593891 2834131 2894247 3308466 4134292 4736149 5312597 5815690
2082 5815690 5649178 4902261 4297719 4025606 3463968 2952935 2621576 2375377 2217228 2124452
2072 2124452 1957813 1759298 1827336 1913206 1715154 1620924 1711839 1634060 1373901 1151729
2062 1151729 1355044 1433337 1390673 1359885 1570612 1763783 1885479 1842168 1811116 1987556
$$ packed form
2134A759003k7689o4176k8120L5611o364k13528Q2179P3371J58586K08288J65900
2123B143061R3413M3777O6228J80378L41636M92340L57866o911j84415m69354
2113C058019n80460m25088J6516p0624j67289p6122K8421J72393k5500k3917j86554
2102A719795o9974N3139J51631K4560j07552j08034J52419K30297q1790J8913
2092A983404n9595K14909M55173K40240O0116M14219Q25826O01857N76448N03093
2082E815690j66512p46917o04542k72113n61638n11033l31359k46199j58149r2776
2072B124452j66639j98515O8038Q5870j98052r4230R0915p7779k60159k22172
2062A151729K03315P8293m2664l0788K10727J93171J21696m3311l1052J76440
$$ plain form
2052 1987556 2190076 2488786 2807071 3051869 3004011 2773110 2297839 1922463 1836616 1471336
2042 1471336 1345312 1353947 1101679 1039403 1223524 1113920 728109 689463 870773 826504
2032 826504 733758 559181 483268 561782 709342 805560 779892 611715 671695 743464 674249
2021 674249 512667 409163 398179 509863 770492 576028 435464 477036 588409 611529
2011 611529 640149 606563 592678 466476 440909 549175 422063 388219 522109 602812 516300
2000 516300 605717 645747 529602 409211 413324 330515 382859 480162 582993 473087 375274
1989 375274 503180 431536 308268 339598 370381 372545 489549 657550 665951 481075 379222
1978 379222 422119 447807 450644 401688 321302 382138 592594 688212 465713 166948 331604
$$ packed form
2052A987556K02520K98710L18285K44798m7858k30901m75271l75376q5847l65280
2042A471336j26024Q635k52268o2276J84121j09604l85811l8646J81310m4269
2032H26504r2746j74577p5913P8514J47560R6218k5668j68177N9980P1769o9215
2021F74249j61582j03504j0984J11684K60629j94464j40564M1572J11373K3120
2011F11529K8620l3586j3885j26202k5567J08266j27112l3844J33890Q0703q6512
2000E16300Q9417M0030j16145j20391M113q2809N2344R7303J02831j09906r7813
1989C75274J27906p1644j23268L1330L0783K164J17004J68001Q401j84876j01853
1978C79222M2897K5688K837m8956q0386O0836K10456R5618k22499k98765J64656
$$ plain form
1967 331604 432507 377484 356234 281586 398796 348607 504676 353045 209534 271648 305962
1956 305962 330036 559649 449430 175815 144967 340453 373075 312295 58001 90364 333992
1945 333992 337086 243603 166445 14120 226712 391864 293009 369766 219987 432024 440603
1934 440603 407084 437301 158357 236179 356658 275419 194253 281891 293742 346467 313566
1923 313566 360034 152641 187635 326143 135701 197774 233282 315963 139231 139182 5940
1912 5940 43846 330682 501901 281325 121450 103028 359856 349177 112861 99480 172465
1901 172465 259162 268424 59109 -7131 75586 -3915 59763 -964 6384 85793 56261 362327
1889 362327 492207 -3097 -78410 11251 230280 287551 164361 106966 247838 655944
$$ packed form
1967C31604J00903n5023k1250p4648J17210n0189J56069j51631j43511O2114L4314
1956C05962K4074K29613j10219k73615l0848J95486L2622o0780k54294L2363K43628
1945C33992L094r3483p7158j52325K12592J65152r8855P6757j49779K12037Q579
1934D40603l3519L0217k78944P7822J20479q1239q1166Q7638J1851N2725l2901
1923C13566M6468k07393L4994J38508j90442O2073L5508Q2681j76732m9j33242
1912E940L7906K86836J71219k20576j59875j8422K56828j0679k36316j3381P2985
1901A72465Q6697R262k09315o6240Q2717p9501O3678o0727P348P9409k9532L06066
1889C62327J29880m95304p5313Q9661K19029N7271j23190n7395J40872M08106
$$ plain form
1879 655944 551907 235360 56533 -78987 -112414 63872 257439 227974 236417 369938
1869 369938 555730 515992 193478 -73650 61268 222501 207737 51827 -48253 131500
1859 131500 371324 405642 143794 158036 212784 240114 136509 164776 294849 261436 428914
1848 428914 476930 246288 69992 148914 148467 86860 118641 149144 86059 193444 293134
1837 293134 110228 -102629 -18891 242459 271640 226255 276054 324567 215057 4410 -124017
1826 -124017 -148342 -106355 93852 99082 122342 267089 475246 294654 111596 59024 36185
1815 36185 -1606 60249 281719 234489 117810 80360 267836 227344 186836 176244 85186
1804 85186 173065 217691 95114 -161446 49414 70332 -795 313608 362715 159447 70511
$$ packed form
1879F55944j04037l16547j78827j35520l3427J76286J93567k9465Q443J33521
1869C69938J85792l9738l22514k67128J34918J61233j4764j55910j00080J79753
1859A31500K39824L4318k61848J4242N4748K7330j03605K8267J30073l3413J67478
1848D28914M8016k30642j76296P8922m47o1607L1781L0503o3085J07385R9690
1837B93134j82906k12857Q3738K61350K9181m5385M9799M8513j09510k10647j28427
1826a24017k4325M1987K00207N230K3260J44747K08157j80592j83058n2572k2839
1815C6185l7791O1855K21470m7230j16679l7450J87476m0492m0508j0592r1058
1804H5186Q7879M4626j22577k56560K10860K0918p1127L14403M9107k03268q8936
$$ plain form
1793 70511 42323 19002 248909 227565 129285 188463 196537 25059 -111695 -90062 -72386
1782 -72386 -5606 -4871 -56887 125407 333633 243679 277670 387919 193695 95102 63794
1771 63794 75973 -3892 -60732 -6097 -47963 196522 205997 142060 -1529 -77605 -152409 -201874
1759 -201874 -5296 158824 157599 105506 74516 25726 85798 115852 94262 18374 199912
1748 199912 424121 535200 226576 97300 -40613 -19614 58913 32403 126113 255413
1738 255413 326242 392068 142573 37518 57108 12880 182166 274313 147039 68919 224166
1727 224166 123787 110090 8306 69179 171370 413833 522756 474364 247849 196768
1717 196768 150981 174447 45265 -4110 285647 320940 525854 392379 274774 323159 375079
$$ packed form
1793G0511k8188k3321K29907k1344r8280N9178Q074j71478j36754K1633J7676
1782g2386O6780P35n2016J82294K08226q9954L3991J10249j94224r8593l1308
1771F3794J2179p9865n6840N4635m1866K44485R475o3937j43589p6076p4804m9465
1759b01874J96578J64120j225n2093l0990m8790O0072L0054k1590p5888J81538
1748A99912K24209J11079l08624j29276j37913K0999P8527k6510R3710J29300
1738B55413P0829O5826k49495j05055J9590m4228J69286R2147j27274p8120J55247
1727B24166j00379j3697j01784O0873J02191K42463J08923m8392k26515n1081
1717A96768m5787K3466j29182m9375K89757L5293K04914j33475j17605M8385N1920
$$ plain form
1706 375079 218723 111802 24188 113012 370341 379502 331770 121959 83183 144104 179479
1695 179479 262008 113773 -38378 65067 287202 318140 35018 -45732 151804 206466
1685 206466 310648 104525 -121992 -17658 190369 85299 -243387 -214948 166841 182872
1675 182872 64757 183616 77168 -22858 78305 -77723 -9735 -33151 20895 -8958
1665 -8958 -128463 14193 -148026 -244709 -70310 10570 -266964 -317649 -224899 -26723 -115371
1654 -115371 -65135 9323 -110297 -2555 -44735 -98035 -68762 -116454 -317739 -206862 -92233
1643 -92233 -56942 -1060 -268064 -140298 89666 -155687 -385954 -210094 -210121 -184542 -12085
1632 -12085 70072 -92090 -68598 14141 -962 -114612 -439494 -553472 -157335 113115 7620
$$ packed form
1706C75079j56356j06921q7614Q8824K57329R161m7732k09811l8776O0921L5375
1695A79479Q2529j48235j52151J03445K22135L0938k83122q0750J97536N4662
1685B06466J04182k06123k26517J04334K08027j05070l28686K8439L81789J6031
1675A82872j18115J18859j06448j00026J01163j56028O7988k3416N4046k9853
1665h958j19505J42656j62219r6683J74399Q0880k77534n0685R2750J98176q8648
1654a15371N0236P4458j19620J07742m2180n3300K9273m7692k01285J10877J14629
1643i2233L5291N5882k67004J27766K29964k45353k30267J75860k7K5579J72457
1632a2085Q2157j62162K3492Q2739j5103j13650l24882j13978L96137K70450j05495
$$ plain form
1621 7620 -178926 -279973 -181177 -111229 -122484 -291122 -431643 -265403 -15414 35719 -154761
1610 -154761 -315522 -371853 -346545 -148549 -120358 -322347 -370202 -286305 -219438 -280858 -282420
1599 -282420 -345791 -285186 -118722 -181094 -254762 -166064 -56984 -52728 -53285 -158961 -185708 -189375
1587 -189375 -116622 -142525 8055 61172 -1283 -67989 -91963 -238203 -118776 -12232 52873
1576 52873 12752 -257393 -229240 -98038 -30075 139317 276243 98824 60601 247978 332546
1565 332546 -51442 -382341 -276735 -38988 -18256 -57486 -65687 -105302 127690 142901 -25869
1554 -25869 -63990 8811 7297 -33224 83202 166778 76925 -146747 -89951 30693 60711
1543 60711 -128340 -106309 -36741 -142315 -107853 114799 -14011 -158035 -132352 -120769 -73786
$$ packed form
1621G620j86546j01047R8796O9948j1255j68638j40521J66240K49989N1133j90480
1610a54761j60761n6331K5308J97996K8191k01989m7855Q3897O6867o1420j562
1599b82420o3371O0605J66464o2372p3668Q8698J09080M256n57j05676k6747l667
1587a89375P2753k5903J50580N3117o2455o6706k3974j46240J19427J06544O5105
1576E2873m0121k70145K8153J31202O7963J69392J36926j77419l8223J87377Q4568
1565C32546l83988l30899J05606K37747K0732l9230q201l9615K32992J5211j68770
1554b5869l8121P2801j514m0521J16426Q3576q9853k23672N6796J20644L0018
1543F0711j89051K2031O9568j05574L4462K22652j28810j44024K5683J1583M6983
$$ plain form
1532 -73786 119376 155004 -9282 62936 114346 -107128 -156718 13494 9878 -36074 15928
1521 15928 47396 113935 79107 62248 74896 -85238 30864 -1822 -84044 -75024 -1281 163302
1509 163302 96168 -36400 -206295 -317320 -77992 62397 39 -165819 -80944 19811
1499 19811 261257 253828 135528 -4309 -62172 75229 393198 413383 166043 74408 145506
1488 145506 235716 156032 -28378 -186401 107449 220268 63047 -131829 -63163 -60282 94127
1477 94127 111467 36971 -98230 -104237 -103938 -118949 47743 -26013 30368 90953 202890 148248
1465 148248 -66710 -132845 -235368 -186737 -290015 -238126 70176 137682 218198 186219 221932
1454 221932 133966 39498 -89617 -192057 -98458 -13582 220042 252733 172365 164618 3064
$$ packed form
1532g3786J93162L5628j64286P2218N1410k21474m9590J70212l616m5952N2002
1521A5928L1468O6539l4828j6859J2648j60134J16102l2686q2222R020P3743J64583
1509A63302o7134j32568j69895j11025K39328J40389o2358j65858Q4875J00755
1499A9811K41446p429j18300j39837n7863J37401L17969K0185k47340r1635P1098
1488A45506R0210p9684j84410j58023K93850J12819j57221j94876O8666K881J54409
1477I4127J7340p4496j35201o007K99j5011J66692p3756N6381O0585J11937n4642
1465A48248k14958o6135j02523M8631j03278N1889L08302O7506Q0516l1979L5713
1454B21932q7966r4468j29115j02440R3599Q4876K33624L2691q0368p747j61554
$$ plain form
1443 3064 -211634 -86796 -127130 -51994 181289 272510 227207 218182 125538 -110019 -27504
1432 -27504 -56630 -109664 82528 78085 7537 143463 191893 20784 -157120 -79341 17791
1421 17791 142121 149417 93134 96491 65284 26880 81846 186259 133219 110901 120320 168930
1409 168930 100831 -155062 -46110 95232 -134277 -63779 125860 239876 274695 96324
1399 96324 180654 64640 -57000 -163659 -36863 99274 -25896 -95328 -47079 118468
1389 118468 188746 21345 -60400 184169 116155 -89960 -61673 -4732 167883 49979 7238
1378 7238 -15239 75169 189070 105574 204121 126567 -58404 -213207 -158923 56245 -33595
1367 -33595 -136138 -97747 225255 260996 55023 131372 157900 162403 165838 139049 15997
$$ packed form
1443C064k14698J24838m0334P5136K33283R1221m5303r025r2644k35557Q2515
1432b7504k9126n3034J92192m443p0548J35926M8430j71109j77904P7779R7132
1421A7791J24330P296n6283L357l1207l8404N4966J04413n3040k2318R419M8610
1409A68930o8099k55893J08952J41342k29509P0498J89639J14016L4819j78371
1399I6324Q4330j16014j21640j06659J26796J36137j25170o9432M8249J65547
1389A18468P0278j67401q1745K44569o8014k06115K8287N6941J72615j17904m2741
1378G238k2477R0408J13901q3496R8547p7554j84971j54803N4284K15168q9840
1367c3595j02543L8391L23002L5741k05973P6349K6528M503L435k6789j23052
$$ plain form
1356 15997 -52969 -19864 -113881 -25987 154249 67320 -25640 -51911 171885 35967 -2760
1345 -2760 33373 -56886 -135663 1482 11655 -6459 -156173 -92591 87041 -133290 -138508
1334 -138508 -80105 -116143 -124300 -4333 -45062 -52951 -14521 -198654 -362688 -116909 -39143
1323 -39143 -176852 -185447 -63065 101083 -73905 -42853 -9281 -128606 -134691 -86985 -37141
1312 -37141 80152 75540 -91612 -5492 181693 187615 -25168 -133765 -51442 72613 132284
1301 132284 -74633 32623 45490 -88956 -127077 -179307 -196300 -50553 42848 53560 64969
1290 64969 10462 -263619 -289038 -237027 -255340 -332768 -215355 -39524 -65778 -225817 -177272
1279 -177272 12314 -68841 -255168 -457584 -282616 -135386 81194 192990 -96569 -258980
$$ packed form
1356A5997o8966L3105r4017Q7894J80236q6929r2960k6271K23796j35918l8727
1345b760L6133r0259p8777J37145J0173j8114j49714O3582J79632k20331n218
1334a38508N8403l6038q157J19967m0729p889L8430j84133j64034K45779P7766
1323c9143j37709q595J22382J64148j74988L1052L3572j19325o085M7706M9844
1312c7141J17293m612j67152Q6120J87185N922k12783j08597Q2323J24055N9671
1301A32284k06917J07256J2867j34446l8121n2230j6993J45747R3401J0712J1409
1290F4969n4507k74081k5419N2011j8313p7428J17413J75831k6254j60039M8545
1279a77272J89586q1155j86327k02416J74968J47230K16580J11796k89559j62411
$$ plain form
1269 -258980 -68070 -97979 -172809 -344934 -385587 -167714 148385 183235 7041 -200123
1259 -200123 -333190 -235804 -145466 -346764 -429066 -358511 -104592 64224 76237 -117881 -273061
1248 -273061 -209433 -146380 -86955 -136761 -99466 -87760 -206818 -131225 -102392 -92646 -96671 -114283
1236 -114283 33287 -19748 -38488 17240 37018 160946 269737 156833 253953 213821 -140024
1225 -140024 -322975 -262976 -133775 -40945 -161006 -414111 -179027 56159 126085 119661 104813
1214 104813 -141673 -160391 -47045 -43550 -199550 -216090 -130196 -49091 238329 83048 -127884
1203 -127884 -28044 134776 166219 -31101 -382862 -349835 -196192 52696 110309 23590 -54772
1192 -54772 -13679 148640 265813 97183 -237057 -380736 -111981 194414 149344 112666
$$ packed form
1269b58980J90910k9909p4830j72125m0653K17873L16099L4850j76194k07164
1259b00123j33067R7386R0338k01298q2302P0555K53919J68816J2013j94118j55180
1248b73061O3628O3053N9425m9806L7295J1706j19058P5593K8833R746m025j7612
1236a14283J47570n3035j8740N5728J9778J23928J08791j12904R7120m0132l53845
1225a40024j82951N9999J29201R2830j20061k53105K35084K35186O9926o424j4848
1214A04813k46486j8718J13346L495j56000j6540Q5894Q1105K87420j55281k10932
1203a27884R9840J62820L1443j97320l51761L3027J53643K48888N7613q6719p8362
1192e4772M1093J62319J17173j68630l34240j43679K68755L06395m5070l6678
$$ plain form
1182 112666 164442 174510 288681 205546 -107783 -138472 -89495 48767 218112 144586 -69959
1171 -69959 64916 146110 82535 -108479 -264528 -184830 172203 202043 -54466 -37775 75979
1160 75979 51789 38258 -91183 24157 8720 10109 245210 123261 -175796 -171284 189536
1149 189536 301465 284635 2797 -123342 130127 368767 75362 -120616 -95501 10333
1139 10333 25405 -53548 -36721 -37415 89602 -105363 -43278 -110155 -211861 -77239 147844
1128 147844 84445 166548 109939 -75951 29200 64034 -103628 -196995 198718 73490 -91980
1117 -91980 -14182 29483 -33463 17127 20712 88823 224729 174761 -122142 -166794 -83545 89592
1105 89592 64863 194547 380562 231594 52478 110624 107263 -63670 -110615 81974 129435
$$ packed form
1182A12666N1776J0068J14171q3135l13329l0689M8977J38262J69345p3526k14545
1171f9959J34875Q1194o3575j91014j56049P9698L57033K9840k56509J6691J13754
1160G5979k4190j3531j29441J15340j5437J389K35101j21949k99057M512L60820
1149A89536J11929j6830k81838j26139K53469K38640k93405j95978K5115J05834
1139A0333J5072p8953J6827o94J27017j94965O2085o6877j01706J34622K25083
1128A47844o3399Q2103n6609j85890J05151L4834j67662r3367L95713j25228j65470
1117i1980P7798M3665o2946N0590L585O8111J35906m9968k96903m4652Q3249J73137
1105H9592k4729J29684J86015j48968j79116N8146l361j70933m6945J92589M7461
$$ plain form
1094 129435 102936 129823 192935 235014 257056 173902 266800 424304 311124 191041 287284
1083 287284 279194 420848 330136 27577 277059 533846 446659 488094 604792 290928 323450
1072 323450 317191 121924 204927 368904 377697 348094 487172 391424 161855 542466 641450
1061 641450 379056 471699 569028 605413 534447 626694 668792 544512 545521 618196 553425
1050 553425 575160 674435 783786 718807 803289 781738 854774 1057152 968925 1037217 904272
1039 904272 907486 918365 859263 791376 991359 1219130 1249761 1015422 966879 1046204 1143490
1028 1143490 1164195 998300 970004 1190524 1303118 1343868 1329951 1283632 1123152 1102649 1294692
1017 1294692 1381643 1574702 1682723 1538312 1560054 1742457 1736285 1639348 1529808 1636798
$$ packed form
1094A29435k6499K6887O3112M2079K2042q3154R2898J57504j13180j20083R6243
1083B87284q090J41654r0712l02559K49482K56787q7187M1435J16698l13864L2522
1072C23450o259j95267Q3003J63977Q793k9603J39078r5748k29569L80611R8984
1061F41450k62394R2643R7329L6385p0966R2247M2098j24280J009P2675o4771
1050E53425K1735R9275J09351o4979Q4482k1551P3036K02378q8227O8292j32945
1039I04272L214J0879n9102o7887J99983K27771L0631k34339m8543P9325R7286
1028A143490K0705j65895k8296K20520J12594M0750j3917m6319j60480k0503J92043
1017A294692Q6951J93059J08021j44411K1742J82403o172r6937j09540J06990
$$ plain form
1007 1636798 1723534 1773295 1836880 1868402 1943770 1994443 1959360 1903490 2161885 2313034 2405832
996 2405832 2551094 2488510 2288248 2137524 2301309 2661973 2970887 3203171 3055072 3099283
986 3099283 3277055 3304314 3184882 3333128 3321581 3542860 3884253 4071880 4194715 4340073
976 4340073 4591445 4846106 5092786 5508806 5661166 5904962 6323781 6756062 7422976 7802439
966 7802439 8172954 8665116 9537606 10206391 10780790 11256087 11689601 12277491 13075438 14326397
956 14326397 15699615 17747501 19752256 22362822 25598468 29324788 33869765 40441471
948 40441471 49794743 61262236 65713237 59751098 51109033 41453508 33919331 27827375
940 27827375 23344339 19906464 17447390 15493993 13970859 12951572 11786596 11031026
$$ packed form
1007A636798Q6736M9761O3585L1522P5368N0673l5083n5870K58395J51149R2798
996B405832J45262o2584k00262j50724J63785L60664L08914K32284j48099M4211
986C099283J77772K7259j19432J48246j1547K21279L41393J87627J22835J45358
976D340073K51372K54661K46680M16020J52360K43796M18819M32281O66914L79463
966G802439L70515M92162Q72490O68785N74399M75297M33514N87890P97947J250959
956A4326397J373218K047886K004755K610566L235646L726320M544977O571706
948D0441471R353272J1467493M451001n962139q642065r655525p534177o091956
940B7827375m483036l437875k459074j953397j523134j019287j164976p55570
$$ plain form
932 11031026 10587849 10164428 9364591 8587494 7887642 7167590 6639095 5973530 5371577 5120942
922 5120942 4908419 4754493 4398219 4248794 4133580 3999799 3697297 3475153 3513225 3414223
912 3414223 3264360 3205463 3112283 2803911 2812699 2730552 2454847 2484242 2371291 2204264 2222704
901 2222704 2242191 2171782 2078885 2107433 2053129 1821767 1852765 2099767 2073426 1853488 1828196
890 1828196 1655035 1518255 1810791 1817497 1649184 1598374 1493042 1423145 1189017 1100469 1150224
879 1150224 1177121 1247042 1298179 1405025 1287234 1200923 1221167 1018393 833707 1068268 1091577
868 1091577 1113337 1083625 1110991 1133244 1080774 1037316 807185 681038 692713 760325 699830
857 699830 880799 925140 927837 1000278 1060079 697427 387202 680200 784642 650338 490619
$$ packed form
932A1031026m43177m23421p99837p77097o99852p20052n28495o65565o01953k50635
922E120942k12523j53926l56274j49425j15214j33781l02502k22144L8072r9002
912C414223j49863n8897r3180l08372Q788q2147k75705K9395j12951j67027J8440
901B222704J9487p0409r2897K8548n4304k31362L0998K47002k6341k19938k5292
890A828196j73161j36780K92536O706j68313n0810j05332o9897k34128q8548M9755
879A150224K6897O9921N1137J06846j17791q6311K0244k02774j84686K34561K3309
868A091577K1760k9712K7366K2253n2470m3458k30131j26147J1675O7612o0495
857F99830J80969M4341K697P2441N9801l62652l10225K92998J04442j34304j59719
$$ plain form
846 490619 493793 619582 778168 753761 435505 393293 454622 580585 614288 638313 698572
835 698572 537918 377118 454237 464474 404264 296255 313759 461877 493129 312891 338780
824 338780 457876 463004 344580 191011 194385 354551 247602 203625 301966 542569 467885
813 467885 158109 5265 16036 238137 250117 256877 334875 385803 290961 282639 394964
802 394964 394464 131382 -23735 18958 50753 215758 -27286 -74434 93088 67294 18416
791 18416 1809 26416 -52064 -29641 95338 280831 105922 -53 6447 42325 168334
780 168334 179474 212580 145012 381310 634594 518745 228203 -86193 -114548 -13920 150749
769 150749 135092 209953 146286 205593 239382 134109 154746 14695 -154275 -122872 158948
$$ packed form
846D90619L174J25789J58586k4407l18256m2212O1329J25963L3703K4025O0259
835F98572j60654j60800P7119J0237o0210j08009J7504J48118L1252j80238K5889
824C38780J19096N128j18424j53569L374J60166j06949m3977R8341K40603p4684
813D67885l09776j52844J0771K22101J1980O760P7998N0928r4842q322J12325
802C94964n00k63082j55117M2693L1795J65005k43044m7148J67522k5794m8878
791A8416j6607K4607p8480K2423J24979J85493j74909j05975O500L5878J26009
780A68334J1140L3106o7568K36298K53284j15849k90542l14396k8355J00628J64669
769A50749j5657P4861o3667N9307L3789j05273K0637j40051j68970L1403K81820
$$ plain form
758 158948 203132 214073 226769 -40540 12166 4030 -303812 -250836 -126740 15476 97158
747 97158 118077 156823 -32946 -112694 -36221 -4836 -191764 -321374 52712 304685 250900
736 250900 20849 -190670 -148943 -18050 -115750 -227747 -234486 -228880 -237048 -34040 -66757
725 -66757 -189459 -101531 50022 -37237 -61479 -119798 -256363 17279 166085 104441 -111054
714 -111054 -173345 -19162 19531 -289606 -232052 -63552 -3783 72806 62882 -80650 -236185
703 -236185 -117090 -174127 -143893 -11924 84558 127129 157430 81383 -151515 -209647 -11174
692 -11174 84134 -43094 126266 36024 -124723 -95139 -140439 -314686 -104055 126131 96992
681 96992 -18202 -68365 111173 243930 102271 -147627 -218812 -92336 83137 119476 -106529
$$ packed form
758A58948M4184J0941J2696k67309N2706q136l07842N2976J24096J42216Q1682
747I7158K0919L8746j89769p9748P6473L1385j86928j29610L74086K51973n3785
736B50900k30051k11519M1727J30893r7700j11997o739N606q168K03008l2717
725f6757j22702Q7928J51553q7259k4242n8319j36565K73642J48806o1644k15495
714a11054o2291J54183L8693l09137N7554J68500N9769P6589r924j43532j55535
703b36185J19095n7037L0234J31969R6482M2571L0301p6047k32898n8132J98473
692a1174R5308j27228J69360r0242j60747K9584m5300j74247K10631K30186k9139
681I6992j15194n0163J79538J32757j41659k49898p1185J26476J75473L6339k26005
$$ plain form
670 -106529 -142950 239752 220052 233223 163533 -164424 -166448 -217875 53860 31046 158033
659 158033 435304 583975 428919 100338 -78677 -58667 28828 42531 79010 81931 250355
648 250355 464096 282150 102153 26355 -109736 -82740 97453 154156 121316 174500 143137
637 143137 106758 -95487 -5208 30817 53960 28662 14682 -107346 -103348 -46330 -85443 17745
625 17745 35859 18949 12224 35474 113166 106067 163082 48257 -45340 -110847 -46570 132763
613 132763 229701 101374 -65 -20823 63119 19387 -164277 -298755 -246457 -35902 91077
602 91077 122102 199670 142308 165932 118657 -100109 -211868 -343532 -317588 -111292 567
591 567 114754 225791 297097 248140 45617 -168718 -416470 -287425 -385080 -177171 26498
$$ packed form
670a06529l6421L82702j9700J3171o9690l27957k024n1427K71735k2814J26987
659A58033K77271J48671j55056l28581j79015K0010Q7495J3703L6479K921J68424
648B50355K13741j81946j79997p5798j36091K6996J80193N6703l2840N3184l1363
637A43137l6379k02245R0279L6025K3143k5298j3980j22028L998N7018l9113J03188
625A7745J8114j6910o725K3250P7692p099N7015j14825r3597o5507O4277J79333
613A32763R6938j28327j01439k0758Q3942m3732j83664j34478N2298K10555J26979
602I1077L1025P7568n7362K3624m7275k18766j11759j31664K5944K06296J11859
591E67J14187J11037P1306m8957k02523k14335k47752J29045r7655K07909K03669
$$ plain form
580 26498 -21046 -78397 -235363 -318312 -218038 24268 -194423 -227646 -18009 91279 14348
569 14348 8845 -18617 -34145 -124536 -225471 -102269 -152886 -232434 -262675 -263169 44572 167101
557 167101 2423 26407 142281 63759 83901 79373 -17178 111516 -47307 146364 332437
546 332437 175710 20378 -98795 -56246 69208 116041 -25912 -91528 58128 83583 -133998
535 -133998 -312717 -350407 -156373 117012 192789 214377 39099 -46323 -213151 -196350 -9756
524 -9756 -153298 -288620 -164335 204266 90903 -219840 -229148 -231858 -197073 -38205 184304
513 184304 44412 71642 8215 -75387 -20506 -151195 -140533 -149755 -36811 187976 278246
502 278246 113237 -128972 -294148 -288065 -276476 -137090 -51155 68760 87838 5357 93588
$$ packed form
580B6498m7544n7351j56966q2949J00274K42306k18691l3223K09637J09288p6931
569A4348n503k7462j5528r0391j00935J23202n0617p9548l0241m94L07741J22529
557A67101j64678K3984J15874p8522K0142m528r6551J28694j58823J93671J86073
546C32437j56727j55332j19173M2549J25454M6833j41953o5616J49656K5455k17581
535a33998j78719l7690J94034K73385P5777K1588j75278q5422j66828J6801J86594
524i756j43542j35322J24285L68601j13363l10743r308k710L4785J58868K22509
513A84304j39892K7230o3427q3602N4881j30689J0662r222J12944K24787R0270
502B78246j65009k42209j65176O083J1589J39386Q5935J19915J9078q2481Q8231
$$ plain form
491 93588 64836 -106232 -55086 -47395 30693 133834 -49088 -137160 -26542 92997 -5346
480 -5346 -206156 -272029 -285376 -176698 -37395 -118369 -50811 -108514 56914 129282 -33309
469 -33309 -116603 -222688 -245114 -401164 -266520 -74822 -96356 45049 25437 -168988 -236527
458 -236527 -323022 -33799 24386 -25478 -116265 -176445 -52082 -7437 -192168 -241815 -107086
447 -107086 -99530 -145297 -132586 -36894 -223056 -166251 -80596 -205443 -249840 -381116 -348050
436 -348050 -166129 -23567 -86758 -227235 -191070 -168902 -129310 -227994 -272955 -97731 -49819
425 -49819 -136112 -137217 -28499 -99706 -388078 -330149 -286687 -120246 -30923 -97067 -210626
414 -210626 -64075 137630 123884 -20393 -44520 54233 -34207 34255 5100 -152138 -234658
$$ packed form
491I3588k8752j71068N1146P691P8088J03141j82922q8072J10618J19539r8343
480e346k00810o5873j3347J08678J39303q0974O7558n7703J65428P2368j62591
469c3309q3294j06085k2426j56050J34644J91698k1534J41405j9612j94425o7539
458b36527q6495K89223N8185m9864r0787o0180J24363M4645j84731m9647J34729
447a07086P556m5767J2711R5692j86162N6805Q5655j24847m4397j31276L3066
436c48050J81921J42562o3191j40477L6165K2168L9592r8684m4961J75224M7912
425d9819q6293j105J08718p1207k88372N7929M3462J66441Q9323o6144j13559
414b10626J46551K01705j3746j44277k4127R8753q8440O8462k9155j57238q2520
$$ plain form
403 -234658 -226093 -267441 -148652 -43149 -115592 -214024 -137803 -10473 -153398 -189391 -86794
392 -86794 -134199 -225340 -122325 61700 -45727 -247869 -258477 -319774 46262 147091 -136795
381 -136795 -312138 -88718 12879 -154795 -476836 -576042 -237678 -189128 -80023 -79271 -84809
370 -84809 -116193 -287583 -317419 -305556 -174248 -190792 -168487 120089 185681 -186335 -468164
359 -468164 -381954 -221048 -208373 -357776 -189991 4098 125780 -48894 -173980 -167022 -245439
348 -245439 -272266 -233381 -51572 -28011 -126645 31152 -50854 -268513 -333706 -400675 -268700
337 -268700 -132153 -305856 -272775 -46624 -1815 -92498 -264438 -240663 -244060 -118732 -70581
326 -70581 -23817 63281 -163691 -277575 -47552 -31725 -243918 -241970 -295613 -198999 -222326
$$ packed form
403b34658Q565m1348J18789J05503p2443r8432P6221J27330j42925l5993J02597
392h6794m7405r1141J03015J84025j07427k02142j0608o1297L66036J00829k83886
381a36795j75343K23420J01597j67674l22041r9206L38364M8550J09105P52n538
370h4809l1384j71390k9836J1863J31308j6544K2305K88576O5592l72016k81829
359d68164Q6210J60906J2675j49403J67785J94089J21682j74674j25086O958p8417
348b45439k6827L8885J81809K3561r8634J57797q2006k17659o5193o6969J31975
337b68700J36547j73703L3081K26151M4809r0683j71940K3775l397J25328M8151
326g0581M6764Q7098k26972j13884K30023J5827k12193J948n3643R6614k3327
$$ plain form
315 -222326 -257292 -356646 -306299 -78012 -128537 -140826 -70332 -311435 -419157 -335209 -165383
304 -165383 -142798 -159757 -200832 -74464 -81999 -147495 -333810 -263443 -68318 -63826 -153490 -155588
292 -155588 -17195 -94464 -227610 -276849 -223761 -199801 -189118 -30482 -8474 -208233 -209396
281 -209396 -125258 -37078 -149137 -168770 -62840 69949 22577 -178142 -288405 -198073 -94513
270 -94513 30174 -99008 53399 45889 4095 -45261 -184583 -239072 -311548 -153032 59758
259 59758 67234 -34796 -125010 -151804 -153158 -199139 -282836 -249263 -165217 -34951 -30579 -21735
247 -21735 -63231 38026 -283657 -491892 -442015 -365813 -321716 -304230 -157916 -217669 -194287
236 -194287 -211397 -326293 -380122 -249961 -166785 -72387 -147507 -197953 -323944 -251160 -117491
$$ packed form
315b22326l4966r9354N0347K28287n0525j2289P0494k41103j07722Q3948J69826
304a65383K2585j6959m1075J26368p535o5496j86315P0367J95125M492q9664k098
292a55588J38393p7269j33146m9239N3088K3960J0683J58636K2008j99759j163
281b09396Q4138Q8180j12059j9633J05930J32789m7372k00719j10263R0332J03560
270i4513J24687j29182J52407p510m1794m9356j39322n4489p2476J58516K12790
259E9758P476j02030r0214k6794j354m5981q3697L3573Q4046J30266M372Q844
247b1735m1496J01257l21683k08235M9877P6202M4097J7486J46314n9753K3382
236a94287j7110j14896n3829J30161Q3176R4398p5120n0446j25991P2784J33669
$$ plain form
225 -117491 -458128 -589129 -353482 -108001 2779 -129416 -186361 -192281 -231071 -210702 -151859
214 -151859 -213195 -266295 -288444 -331831 -358118 -279314 -323613 -323621 -202071 -174634 -366394 -266091
202 -266091 -127338 -199070 -226868 -137127 -199080 -272693 -469211 -311651 -254047 -372524 -367088
191 -367088 -292651 -269491 -293397 -229191 -241249 -404364 -430542 -373307 -546778 -413029 -396355
180 -396355 -409231 -400348 -385005 -340474 -327130 -327713 -186416 -170545 -205107 -350761 -250803 -146078
168 -146078 -223252 -372227 -302410 -92269 79657 -177266 -389690 -281312 -92571 56166
158 56166 -38893 -198593 -292883 -236090 94096 -106159 -363179 -400012 -212937 -30542 -81093
147 -81093 -326994 -542913 -306335 68438 194214 -165585 -342374 -198386 -77886 -293644
$$ packed form
225a17491l40637j31001K35647K45481J10780j32195n6945n920l8790K0369N8843
214a51859o1336n3100k2149m3387k6287P8804m4299qJ21550K7437j91760J00303
202b66091J38753p1732k7798Q9741o1953p3613j96518J57560N7604j18477N436
191c67088P4437K3160k3906O4206j2058j63115k6178N7235j73471J33749J6674
180c96355j2876Q883J5343M4531J3344n83J41297J5871l4562j45654R9958J04725
168a46078p7174j48975O9817K10141J71926k56923k12424J08378J88741J48737
158E6166r5059j59700r4290N6793L30186k00255k57020l6833J87075J82395n0551
147h1093k45901k15919K36578L74773J25776l59799j76789J43988J20500k15758
$$ plain form
137 -293644 -334330 -334706 -198598 -17827 -169515 -286799 -346824 -344976 -246871 -163926 -109441 -220681
125 -220681 -227256 -180042 -52811 -178033 -332210 -327595 -198755 -265896 -296881 -171505 -167722
114 -167722 -97535 -168721 -341702 -406253 -289739 -226001 -293894 -222349 -107778 -164326 -226904
103 -226904 -276541 -322733 -220245 -438706 -346621 -107180 -30221 -110970 -125595 -89836 -124097
92 -124097 -50167 -234260 -309187 -201363 -10691 66972 66760 -36727 -148286 -329836 -374941
81 -374941 -435966 -456329 -360201 -329691 -185872 -110052 -193984 -270965 -488448 -440073 -191792
$$ packed form
137b93644m0686l76J36108J80771j51688j17284o0025J848R8105Q2945N4485j11240
125b20681o575M7214J27231j25222j54177M615J28840o7141l0985J25376L783
114a67722P0187p1186j72981o4551J16514O3738o7893P1545J14571n6548o2578
103b26904m9637m6192J02488k18461R2085K39441P6959q0749j4625L5759l4261
92a24097P3930j84093p4927J07824J90672P7663k12j03487j11559j81550m5105
81c74941o1025k0363R6128L0510J43819P5820q3932p6981k17483M8375K48281
$$ [...]
##END NTUPLES=NMR SPECTRUM
##END=
