##TITLE=1H_CA-8797-2
 CDCl3, 8 sc, 
 18.12.2020
##JCAMPDX= 6.0         $$ Bruker NMR JCAMP-DX V2.0
##DATA TYPE= NMR SPECTRUM
##DATA CLASS= NTUPLES
##ORIGIN= UXNMR, Bruker Analytische Messtechnik GmbH
##OWNER= root
$$ XWIN-NMR		Version 3.5
$$ Fri Dec 18 10:40:25 2020 Russian Standard Time (UT+4h)  she@DPX200
##.OBSERVE FREQUENCY= 200.1315066352
##.OBSERVE NUCLEUS= ^1H
##.ACQUISITION MODE= SIMULTANEOUS
##.ACQUISITION SCHEME= undefined
##.AVERAGES= 8
##.DIGITISER RES= 18
##SPECTROMETER/DATA SYSTEM= spect
##.PULSE SEQUENCE= zg30
##.SOLVENT NAME= CDCl3
##.SHIFT REFERENCE= (INTERNAL, CDCl3, 0, 16.0331)
##AUDIT TRAIL= $$ (NUMBER, WHEN, WHO, WHERE, WHAT)
$$ ##TITLE= Audit trail, XWIN-NMR		Version 3.5
$$ ##JCAMPDX= 5.01
$$ ##ORIGIN= Bruker BioSpin GmbH
$$ ##OWNER= she
$$ F:/spectra/data/she/nmr/H-F/1/pdata/1/auditp.txt
$$ ##AUDIT TRAIL=  $$ (NUMBER, WHEN, WHO, WHERE, WHAT)
(   1,<2020-12-18 10:39:07.84 +0400>,<she>,<DPX200>,
      <created by zg, POWCHK disabled, PULCHK disabled
       configuration hash MD5:
       00 E9 B6 7A A2 85 ED C7 34 08 36 98 17 FE 4E 26
       data hash MD5: 16K
       20 8A C4 D6 8A 60 41 87 A1 4D 90 82 CA 25 A5 38>)
(   2,<2020-12-18 10:39:10.37 +0400>,<she>,<DPX200>,
      <Start of raw data processing
       efp BC_mod = 2 LB = 0.24 FT_mod = 6 PKNL = 1 PHC0 = -10763.59 PHC1 = 12.60095 SI = 16K 
       data hash MD5: 16K
       C0 D2 31 D1 74 B7 E3 58 4A 4B 7F D1 D9 18 F5 86>)
(   3,<2020-12-18 10:39:25.40 +0400>,<she>,<DPX200>,
      <pk PHC0 = 1.289299 PHC1 = 0 
       data hash MD5: 16K
       7F B3 1C FB C9 0E 77 BF 75 04 69 0F 81 A6 1C DD>)
(   4,<2020-12-18 10:39:28.65 +0400>,<she>,<DPX200>,
      <abs ABSG = 5 
       data hash MD5: 16K
       AD 6E CD B5 42 3D 27 B0 11 F6 16 3F 4B 3E A4 B6>)
$$ ##END=
$$ 
$$ hash MD5
$$ BB A3 1D 79 1F 3F 86 1D FD AA 6D 82 94 03 AD 04
##$RELAX= 
##$RELAX= 
##$RELAX= 
##$RELAX= 
##$RELAX= 
##$RELAX= 
$$ Bruker specific parameters
$$ --------------------------
##$DU= <F:/spectra>
##$EXPNO= 1
##$NAME= <H-F>
##$PROCNO= 1
##$TYPE= <nmr>
##$USER= <she>
##$AMP= (0..31)
100 100 100 100 100 100 100 100 100 100 100 100 100 100 100 100 100 100 
100 100 100 100 100 100 100 100 100 100 100 100 100 100 
##$AQSEQ= 0
##$AQ_mod= 1
##$AUNM= <au_zg>
##$AUTOPOS= <>
##$BF1= 200.13
##$BF2= 200.13
##$BF3= 200.13
##$BF4= 200.13
##$BF5= 200.13
##$BF6= 200.13
##$BF7= 200.13
##$BF8= 200.13
##$BYTORDA= 1
##$CFDGTYP= 0
##$CFRGTYP= 5
##$CHEMSTR= <none>
##$CNST= (0..31)
1 1 145 1 1 1 1 1 1 1 1 1 1 1 1 1 1 1 1 1 1 1 1 1 1 1 1 1 1 1 1 1 
##$CPDPRG= <>
##$CPDPRG1= <>
##$CPDPRG2= <>
##$CPDPRG3= <>
##$CPDPRG4= <mlev>
##$CPDPRG5= <mlev>
##$CPDPRG6= <mlev>
##$CPDPRG7= <mlev>
##$CPDPRG8= <mlev>
##$CPDPRGB= <>
##$CPDPRGT= <>
##$D= (0..31)
0 1.2 0 0 0 0 0 0 0 0.06 0 0.03 0 0 0 0 0.0002 0 0 0 0 0 0 0 0 0 0 0 0 
0 0 0 
##$DATE= 1608273547
##$DBL= (0..7)
120 120 120 120 120 120 120 120 
##$DBP= (0..7)
150 150 150 150 150 150 150 150 
##$DBP07= 0
##$DBPNAM0= <>
##$DBPNAM1= <>
##$DBPNAM2= <>
##$DBPNAM3= <>
##$DBPNAM4= <>
$$ [...]
##$SUBNAM3= <"">
##$SUBNAM4= <"">
##$SUBNAM5= <"">
##$SUBNAM6= <"">
##$SUBNAM7= <"">
##$SUBNAM8= <"">
##$SUBNAM9= <"">
##$SW= 16.9725356469052
##$SWIBOX= (0..15)
0 0 2 0 0 0 0 0 0 0 0 0 0 0 0 0 
##$SW_h= 3396.73913043478
##$TD= 16384
##$TD0= 1
##$TE= 0
##$TE2= 300
##$TE3= 300
##$TEG= 300
##$TL= (0..7)
0 120 120 120 120 120 120 120 
##$TP= (0..7)
150 150 150 150 150 150 150 150 
##$TP07= 0
##$TPNAME0= <>
##$TPNAME1= <>
##$TPNAME2= <>
##$TPNAME3= <>
##$TPNAME4= <>
##$TPNAME5= <>
##$TPNAME6= <>
##$TPNAME7= <>
##$TPOAL= (0..7)
0.5 0.5 0.5 0.5 0.5 0.5 0.5 0.5 
##$TPOFFS= (0..7)
0 0 0 0 0 0 0 0 
##$TUNHIN= 0
##$TUNHOUT= 0
##$TUNXOUT= 0
##$USERA1= <user>
##$USERA2= <user>
##$USERA3= <user>
##$USERA4= <user>
##$USERA5= <user>
##$V9= 5
##$VALIST= <valist>
##$VCLIST= <CCCCCCCCCCCCCCC>
##$VD= 0
##$VDLIST= <DDDDDDDDDDDDDDD>
##$VPLIST= <PPPPPPPPPPPPPPP>
##$VTLIST= <TTTTTTTTTTTTTTT>
##$WBST= 1024
##$WBSW= 4
##$XGAIN= (0..3)
0 0 0 0 
##$XL= 0
##$YL= 0
##$YMAX_a= 622835
##$YMIN_a= -575862
##$ZGOPTNS= <>
##$ZL1= 120
##$ZL2= 120
##$ZL3= 120
##$ZL4= 120
##$ABSF1= 15.98127
##$ABSF2= -0.9913921
##$ABSG= 5
##$ABSL= 3
##$ALPHA= 0
##$AQORDER= 0
##$ASSFAC= 0
##$ASSFACI= 0
##$ASSFACX= 0
##$ASSWID= 0
##$AUNMP= <proc_1d>
##$AZFE= 0.1
##$AZFW= 0.1
##$BCFW= 0
##$BC_mod= 2
##$BYTORDP= 0
##$COROFFS= 0
##$CY= -3
##$DATMOD= 1
##$DC= 0
##$DFILT= <>
##$DTYPP= 0
##$F1P= 0
##$F2P= 0
##$FCOR= 1
##$FTSIZE= 16384
##$FT_mod= 6
##$GAMMA= 0
##$GB= 0
##$INTBC= 1
##$INTSCL= 2.992141e-10
##$ISEN= 128
##$LB= 0.24
##$LEV0= 0
##$LPBIN= 0
##$MAXI= 10000
##$MC2= 0
##$MEAN= 0
##$ME_mod= 0
##$MI= 1.114404
##$NCOEF= 0
##$NC_proc= -5
##$NLEV= 6
##$NOISF1= 3.799351
##$NOISF2= 2.8
##$NSP= 0
##$NTH_PI= 0
##$NZP= 0
##$OFFSET= 16.03308
##$PC= 1
##$PHC0= -10762.3
##$PHC1= 12.60095
##$PH_mod= 1
##$PKNL= yes
##$PPARMOD= 0
##$PSCAL= 0
##$PSIGN= 0
##$REVERSE= no
##$SF= 200.129996304512
##$SI= 16384
##$SIGF1= 3
##$SIGF2= 2
##$SINO= 5.538805
##$SIOLD= 16384
##$SREGLST= <1H.CDCl3>
##$SSB= 0
##$STSI= 16384
##$STSR= 0
##$SW_p= 3396.73913043478
##$SYMM= 0
##$S_DEV= 0
##$TDeff= 16384
##$TDoff= 0
##$TI= <>
##$TILT= no
##$TM1= 0
##$TM2= 0
##$TOPLEV= 0
##$USERP1= <user>
##$USERP2= <user>
##$USERP3= <user>
##$USERP4= <user>
##$USERP5= <user>
##$WDW= 1
##$XDIM= 16384
##$YMAX_p= 386788212
##$YMIN_p= -227842
$$ End of Bruker specific parameters
$$ ---------------------------------
##NTUPLES= NMR SPECTRUM
##VAR_NAME=  FREQUENCY,     SPECTRUM/REAL,   SPECTRUM/IMAG
##SYMBOL=    X,             R,               I
##VAR_TYPE=  INDEPENDENT,   DEPENDENT,       DEPENDENT
##VAR_FORM=  AFFN,          ASDF,            ASDF
##VAR_DIM=   16384,         16384,           16384
##UNITS=     HZ,            ARBITRARY UNITS, ARBITRARY UNITS
##FACTOR=    0.207333158178281, 1,           1
##FIRST=     3208.70007050688, 0,            0
##LAST=      -188.039059927904, 0,           0
##MIN=       -188.039059927904, -227842,     0
##MAX=       3208.70007050688, 386788212,    0
$$ Real data points
##PAGE= N=1
##DATA TABLE= (X++(R..R)), XYDATA
$$ [...]
5997H57305K1476K4268P4422o0713J7463O9556p7370q7775L2939K9260m257M7063
$$ 857305 878781 903049 977471 916758 934221 1003777 926407 838632 871571 900831 896574 943637
5985I43637O2895l9442q0756j7046K98j5582L961K207M8533O7707p46J9439m9334
$$ 943637 1006532 967090 886334 869288 869586 854004 857965 860172 908705 976412 975666 995105 945771
5972I45771j1207m6027L3681N9080J4245J0790m1526o1229J004O779n2154l5401
$$ 945771 934564 888537 922218 981298 995543 1006333 964807 903578 904582 911361 859207 823806
5960H23806P3748J8521J0937J2678K8786k9575m094J2571n0192m3547N9153J2321
$$ 823806 897554 916075 927012 939690 968476 938901 934807 947378 897186 853639 912792 925113
5948I25113K4477J9480K811n2218L5045J1453o691k588k3738K1998q1954k9452
$$ 925113 949590 969070 971881 919663 954708 966161 959470 956882 933144 955142 873188 843736
5936H43736L3185k0559K9436j2734N8881O1558m6527J1374j1609l1047k7196P5886
$$ 843736 876921 856362 885798 873064 931945 993503 946976 958350 946741 915694 888498 964384
5924I64384K1647j4096q1615p2298J5121J8902M8352P3833R177K4337j5011K2941
$$ 964384 986031 971935 890320 818022 833143 852045 900397 974230 983407 1007744 992733 1015674
5912A015674L9598J6825k4078o6654M0343l0434P0984J6694L8706k8013j35727
$$ 1015674 1055272 1072097 1048019 981365 1021708 991274 1062258 1078952 1117658 1089645 953918
5901I53918k7276m9364K8010k8918P2038P8124N9084p550N909M1341m3752P246
$$ 953918 926642 877278 905288 876370 948408 1026532 1085616 1078066 1083975 1125316 1081564 1088810
5889A088810M8268K7858j8357n2536p7778k4203o4603O8749j4050J32653o721
$$ 1088810 1137078 1164936 1146579 1094043 1016265 992062 927459 996208 982158 1114811 1108090
5878A108090m0756J40542j2641J3295m5779L1092P3940j1252k591J5097O0661
$$ 1108090 1067334 1207876 1195235 1208530 1162751 1193843 1267783 1256531 1253940 1269037 1329698
5867A329698o0234r795j2273L7983M7716k6589J4278j0201n0754N899L5630Q7728
$$ 1329698 1269464 1259669 1247396 1285379 1333095 1306506 1320784 1310583 1259829 1265728 1301358 1389086
5855A389086O2737K8955J20861o8249j2948K7360J3451R3020p208J9132J82837
$$ 1389086 1451823 1480778 1601639 1533390 1520442 1547802 1561253 1654273 1647065 1666197 1849034
5844A849034R5319N1548J37554L6271J30036J22803J36536K03555K4501j311j33327
$$ 1849034 1944353 1995901 2133455 2169726 2299762 2422565 2559101 2762656 2787157 2785846 2652519
5833B652519q6761o7873k6424l7689O5908N539N6464M6416K9004O629J58196J95976
$$ 2652519 2565758 2497885 2471461 2433772 2499680 2505219 2561683 2608099 2637103 2643732 2801928 2997904
5821B997904J64856K83909K76582M31289K67332L10013L60143L83840M48101K80541
$$ 2997904 3162760 3446669 3723251 4154540 4421872 4731885 5092028 5475868 5923969 6204510
5811F204510M7659j88199l59342n10543l81861l02752k10783j51853j84311Q565
$$ 6204510 6252169 6063970 5704628 5194085 4812224 4509472 4298689 4146836 3962525 3971090
5801C971090k4331Q9605p453R7770J50786J93666K14474L25547M50112M50244
$$ 3971090 3946759 4036364 4028911 4126681 4277467 4471133 4685607 5011154 5461266 5911510
5791E911510N55458N85073O61474N10401L59552Q1043l54359p19704q48153p52343
$$ 5911510 6466968 7052041 7713515 8223916 8583468 8664511 8310152 7590448 6742295 5989952
5781E989952n50788m35082m17334k39576j94819j70370j52835n4560R9451m5975
$$ 5989952 5439164 5004082 4586748 4347172 4152353 3981983 3829148 3774588 3874039 3828064
5771C828064J47210Q4987J64298J54598K51561L20489L42482L94605L05210K78386
$$ 3828064 3975274 4060261 4224559 4379157 4630718 4951207 5293689 5688294 5993504 6271890
5761F271890r925l90042m87157o13791o29821m44346l37773k52518k10925j69637
$$ 6271890 6261965 5871923 5384766 4770975 4141154 3696808 3359035 3106517 2895592 2725955
5751B725955j14803j23104j43430r3780j25003k8371j0278n3664Q6344N7828L0230
$$ 2725955 2611152 2488048 2344618 2250838 2125835 2097464 2087186 2033522 2119866 2177694 2207924
5740B207924O8239Q8923J50204L1981R52k16835j72192j65564k08825k11470n7817
$$ 2207924 2276163 2365086 2515290 2547271 2548223 2331388 2159196 1993632 1784807 1573337 1515520
5729A515520j21607o3539k3427m3785o1586o8706l0250l8780L6957n4961K1551
$$ 1515520 1393913 1330374 1306947 1263162 1201576 1132870 1102620 1063840 1100797 1045836 1067387
5718A067387r5648L0680N2969r051K7153l6441R666o0679l9764m9266n0422R504
$$ 1067387 971739 1002419 1055388 1046337 1073490 1037049 1046715 986036 946272 897006 846584 856088
5706H56088j6750P673K1970K449l5050R3304K7435n00p5107O027J9703J839r625
$$ 856088 839338 847011 868981 871430 836380 929684 957119 956619 881512 887539 907242 909081 899456
5693H99456k8455r403p4788J428k7893K1927M9387n5196M2232o439N8069q036
$$ 899456 871001 861598 786810 788238 760345 782272 831659 776463 818695 812256 870325 862289
5681H62289N555j9390N8494K4653l2231P1759n7497l2633o7110n1696n6761L988
$$ 862289 867844 848454 906948 931601 899370 971129 913632 880999 813889 762193 705432 709420
5669G09420j589L1595r537N7552j2883P2702m0253J2374r2577M5443J0887p5299
$$ 709420 707831 739426 729889 787441 774558 847260 807007 819381 726804 772247 783134 707835
5657G07835L3438r068p441k3033l9811M7192m6662j04393K9734l8173O1659K9356
$$ 707835 741273 732205 724764 701731 661920 709112 662450 558057 587791 549618 611277 640633
5645F40633k8040J7237j664l8196R625L2123j289L6543J9713l0169r265n1895
$$ 640633 612593 629830 628166 589970 599595 631718 630429 666972 686685 656516 647251 595356
5633E95356K8622n8004K0644r457k1039L8719o446O598k830P6326m3435m3710
$$ 595356 623978 565974 586618 577161 556122 594841 588395 594993 592163 668489 625054 581344
5621E81344p634L6276l8848o284K6553m5330L2716q7686j1536L0264l3977J1927
$$ 581344 573710 609986 571138 564854 591407 546077 578793 491107 479571 509835 475858 487785
5609D87785L9125K3607L5037m3446q83N499n1359j5965K0664L3657k9651O3892
$$ 487785 526910 550517 585554 542108 541225 546724 495365 479400 500064 533721 504070 567962
5597E67962j9750K6755m4330N1721J9352O372L2792n7620J984k2539o591n0276
$$ 567962 548212 574967 530637 582358 601710 608082 640874 583254 585238 562699 556108 505832
5585E05832K2585n7150K0438N1773J7389M02J4529K8338o7501P151K3030l9978
$$ 505832 528417 471267 491705 543478 560867 561269 575798 604136 536635 543786 566816 526838
5573E26838N1629l4091R074l2447n9889Q8440L2831l3796R0018l0580p2666k5111
$$ 526838 578467 544376 553450 521003 461114 549554 582385 548589 638607 608027 535361 510250
5561E10250k5417J18917n4106r919K4508j9358n8010p8627J50673l4920k3926
$$ 510250 484833 603750 549644 539725 564233 544875 486865 408238 558911 523991 500065
5550E00065m5384J85j928j1929Q2691q557J6717J5299m5168J97m5069J3515p7890
$$ 500065 454681 454866 452938 441009 523700 515143 531860 547159 501991 502188 457119 470634 392744
5537C92744J5632k5543j8930J08299O256J448M8230Q563l7603K2203j4438R465
$$ 392744 408376 382833 363903 472202 478458 479906 528136 536699 499096 521299 506861 516326
5525E16326m8505J8014j7068k9444M6293j9033k0557N4485j0690p642L6708r936
$$ 516326 467821 485835 468767 439323 485616 466583 446026 500511 489821 482179 518887 508951
5513E08951k753l7060o99O0081K1853M6601o3887k0817R1901n315k9227p246r994
$$ 508951 506198 469138 468439 528520 550373 596974 533087 512270 604171 598856 569629 562383 552389
5500E52389p6782o4286L6667N3259Q6092p7299j311K4293K3645j2965M3053P2904
$$ 552389 475607 411321 447988 501247 587339 510040 508729 533022 556667 543702 586755 659659
5488F59659l9065m6292m3431k1413o6620o1842K7525M5799p0144M8137J7634M6478
$$ 659659 620594 574302 530871 509458 442838 380996 408521 454320 384176 432313 449947 496425
5476D96425K4818N5141O3072r095L4686L1180l6349n8232q590p6105N26k8296
$$ 496425 521243 576384 639456 630361 665047 696227 659878 601646 593056 516951 517477 489181
5464D89181J592J0097k6474L9479K6942N118R411P6333M4693l1235N811K9466
$$ 489181 490773 500870 474396 513875 540817 545935 555346 631679 676372 645137 650948 680414
5452F80414j5950l7678m693M8063n8371k4963J5670k4313m579j6482P0567O5707
$$ 680414 664464 626786 622093 670156 611785 586822 602492 578179 573600 557118 627685 693392
5440F93392K7040j8838O1924K8970o5452L8672M085r7382L8474l43n8328L1113
$$ 693392 720432 701594 763518 792488 727036 765708 769793 672411 710885 710542 652214 683327
5428F83327O4169M4314L1709o0339J0767q3911K6005M0615J1343J5331m9150K7483
$$ 683327 747496 791810 823519 763180 773947 690036 716041 756656 767999 783330 734180 761663
5416G61663N8362M011K7287N1957j7691q2400m5837Q0403k0713K2269K2338m7179
$$ 761663 820025 824036 851323 903280 885589 803189 757352 837755 817042 839311 861649 814470
5404H14470m465N0960P6062j6983N6590K7436J8207j5367k3722M1041j6708O9944
$$ 814470 810005 860965 937027 920044 976634 1004070 1022277 1006910 983188 1024229 1007521 1077465
5392A077465K6037l4439j0460j7750L7573Q7772j6919L59j6641L0013P1756Q0605
$$ 1077465 1103502 1069063 1058603 1040853 1078426 1166198 1149279 1149638 1132997 1163010 1234766 1315371
5380A315371q19K2690Q007j331M9439l0770N8954j9252J5208J246J01575L0271
$$ 1315371 1314552 1337242 1345249 1343918 1393357 1362587 1421541 1402289 1417497 1418743 1520318 1550589
5368A550589m210J10918N3534O8373L3225L5248j2276M5512L8599O9402J49032
$$ 1550589 1546379 1657297 1710831 1779204 1812429 1847677 1835401 1880913 1919512 1988914 2137946
5357B137946Q0010k817l1086P8675J24352R7181J12450L3128K2591K6738J13609
$$ 2137946 2217956 2215139 2184053 2262728 2387080 2484261 2596711 2629839 2652430 2679168 2792777
5346B792777L2612N9613r683J04454J52743R2170J29354Q8470J56739P6723J33899
$$ 2792777 2825389 2885002 2875319 2979773 3132516 3224686 3354040 3442510 3599249 3675972 3809871
5335C809871J42199M2335J42079N8716J57343J7626K0503L8840K7767M5451R933
$$ 3809871 3952070 3994405 4136484 4195200 4352543 4370169 4390672 4429512 4457279 4502730 4512663
5324D512663J22778R1575J08508K2299P7847P4146k071K6419Q3093J32146J01801
$$ 4512663 4635441 4727016 4835524 4857823 4935670 5009816 5007745 5034164 5117257 5249403 5351204
5313E351204L6550N2180R8396K04664R2615L90L7984N1082K3771k3401J00523
$$ 5351204 5387754 5439934 5538330 5742994 5835609 5835999 5873983 5925065 5948836 5925435 6025958
5302F025958l3811J0781l0027m849Q6762O2773M5376K0888r25l5076K7175l1886
$$ 6025958 5992147 6002928 5972901 5968052 6054814 6117587 6162963 6183851 6182926 6147850 6175025 6143139
5290F143139j1920o1098j08932o0447k3140n0536r2781m2438p7068m3788n8984
$$ 6143139 6131219 6070121 5961189 5900742 5877602 5827066 5734285 5691847 5614779 5570991 5512007
5279E512007J8016k4034k882n7377j6601J0059j12370K2765l5747Q814m5931n2743
$$ 5512007 5530023 5505989 5503107 5445730 5429129 5439188 5326818 5349583 5313836 5322650 5276719 5223976
5267E223976O6304q2589q9270n5249N944j42222j33481r7733q6536l8974r6485
$$ 5223976 5290280 5207691 5118421 5063172 5069116 4926894 4793413 4695680 4609144 4570170 4473685
5256D473685o5075j21725q2892j82488j15702j66233q5762m9569j8434p4197n1963
$$ 4473685 4408610 4286885 4203993 4021505 3905803 3739570 3653808 3604239 3585805 3511608 3459645
5245C459645j66007j07665j00031J1832K0094k368n5597o6422K4261m0802m6874
$$ 3459645 3293638 3185973 3085942 3097774 3117868 3115500 3059903 2993481 3017742 2976940 2930066
5234B930066j3085j36269q3226k9620q9550p3415k414n1609r3238j00345n1403
$$ 2930066 2916981 2780712 2697486 2667866 2578316 2504901 2502487 2450878 2357640 2257295 2205892
5223B205892l8764o3855m1615n3623J3125l8492L322l2241M2050j54291p9633
$$ 2205892 2167128 2103273 2061658 2008035 2021160 1982668 1985990 1953749 1995799 1841508 1761875
5212A761875p5787m5742J1976m1428J8238p757j8123K400q383l0315L5688K3189
$$ 1761875 1686088 1640346 1652322 1610894 1629132 1621375 1603252 1605652 1597269 1566954 1602642 1625831
5200A625831k7130K7442n2371k8792q5562o5905l3518n6453L3862N728R205J6829
$$ 1625831 1598701 1626143 1573772 1544980 1459418 1393513 1359995 1303542 1337404 1343132 1352337 1369166
5188A369166J5635L2405M4481n66j0252l3725J2726J9203Q3502M3167L7899p6080
$$ 1369166 1384801 1417206 1461687 1461121 1450869 1417144 1429870 1449073 1532575 1575742 1613641 1537561
5176A537561o5403j33585q068P2656N0768J0326j8006p974j531M5070O5463m7327
$$ 1537561 1472158 1338573 1330505 1403161 1453929 1464255 1446249 1438275 1436744 1481814 1547277 1499950
5164A499950o6996J6706P8343J4876M1124o839l7999m5936L9023L5732L00M9030
$$ 1499950 1432954 1449660 1528003 1542879 1584003 1577164 1539165 1493229 1532252 1567984 1568284 1617314
5152A617314n2040N1445M5610q307L3626P2823n7089O7041j9173L2367P8246J8964
$$ 1617314 1565274 1616719 1662329 1654022 1687648 1760471 1703382 1770423 1751250 1783617 1861863 1880827
5140A880827k8240n0030Q909M4305m5800Q2693M6814n001k5008k6503J5974l6859
$$ 1880827 1852587 1802557 1811466 1855771 1809971 1892664 1939478 1934477 1909469 1882966 1898940 1862081
5128A862081k7276R7249K643j2500M5326K9375o3659m7820J9883N7238M2900J40515
$$ 1862081 1834805 1932054 1934697 1922197 1967523 1996898 1933239 1885419 1905302 1962540 2005440 2145955
5116B145955N0159K7801J7832M420P8813M7620Q331l1824J3890m8796J12889Q2150
$$ 2145955 2196114 2223915 2241747 2246167 2324980 2372600 2380931 2349107 2362997 2314201 2427090 2509240
5104B509240K5027J36498O8599N4645M4252P4729L3627j370L5808j6224J7608
$$ 2509240 2534267 2670765 2739364 2794009 2838261 2912990 2946617 2945247 2981055 2964831 2982439
5093B982439R473L4987K4030j520L598N5553O2979Q650R0831R1526J70329O0528
$$ 2982439 2991912 3026899 3050929 3049409 3053007 3108560 3171539 3180189 3271020 3362546 3532875 3593403
5081C593403J52765J25903K3294P9448N787K4706N8464J21649P3500J07098O8478
$$ 3593403 3746168 3872071 3895365 3974813 3980600 4005306 4063770 4185419 4258919 4366017 4434495
5070D434495L1112Q8359M7362M3706J06929Q6724Q8049Q4827J14948J55333J12037
$$ 4434495 4465607 4553966 4601328 4645034 4751963 4838687 4926736 5011563 5126511 5281844 5393881
5059E393881K1065P2432O4941O8100J40671J43663N4240N7519Q1276J03865J42966
$$ 5393881 5414946 5487378 5552319 5620419 5761090 5904753 5958993 6016512 6097788 6201653 6344619
5048F344619J60272J85999J93687J64511J42760J83696J11409J52600Q7473J07953
$$ 6344619 6504891 6690890 6884577 7049088 7191848 7375544 7486953 7639553 7727026 7834979
5038G834979J56985J88222K31303J22194J42946O3527J58793R8263K69847K09630
$$ 7834979 7991964 8180186 8411489 8533683 8676629 8740156 8898949 8997212 9267059 9476689
5028I476689J92123K42459K77528J95890J88135K80930L56446L42881L18662K65407
$$ 9476689 9668812 9911271 10188799 10384689 10572824 10853754 11210200 11553081 11871743 12137150
5018A2137150K17539K78674L32559L88120L89477L94896M73924N07985M74784
$$ 12137150 12354689 12633363 12965922 13354042 13743519 14138415 14612339 15120324 15595108
5009A5595108N33639L48363L43787K74232L61836M90748M96083N29691N81074
$$ 15595108 16128747 16477110 16820897 17095129 17456965 17947713 18443796 18973487 19554561
5000A9554561O85552P90841R71729J054826J126366J213066J435014J529076J759689
$$ 19554561 20240113 21030954 22002683 23057509 24183875 25396941 26831955 28361031 30120720
4991C0120720K053660K430214L060195L628838M283124M877993N530181O397282
$$ 30120720 32174380 34604594 37664789 41293627 45576751 50454744 55984925 62382207
4983F2382207P206844P645953O927175M601019J352825n53239j667392l734297
$$ 62382207 69589051 77235004 84162179 88763198 90116023 89562784 87895392 84161095
4975H4161095o435010p709522o557994m778509l078574k000404j184231n73946
$$ 84161095 77726085 70016563 63458569 58680060 55601486 53601082 52416851 51842905
4967E1842905P3120O92273J511049K491852L631433N067245O430919P593374Q601983
$$ 51842905 51916025 52608298 54119347 56611199 60242632 65309877 71740796 79334170 87936153
4958H7936153R741941J1215523J2736296J2778967Q181486l110893j5143903k0041840
$$ 87936153 97678094 108893617 121629913 134408880 142590366 139479473 124335570 104293730
4950A04293730j7658640j3262531r528834o785734n162241m107988l672175l226487
$$ 104293730 86635090 73372559 63843725 57057991 51895750 47787762 44115587 40889100
4942D0889100k910476k464713j981976j454979j108522p16881l69386l44051j76639
$$ 40889100 37978624 35513911 33531935 32076956 30968434 30251553 29882167 29538116 29361477
4933B9361477j36972r9977k03410l09257m57401n88818o54697o71298n84931n88555
$$ 29361477 29224505 29124528 28921118 28611861 28154460 27565642 26910945 26239647 25654716 25066161
4923B5066161m36341m14519l70157k34425j84530j65203j10679L276M4270K15035
$$ 25066161 24629820 24215301 23845144 23610719 23426189 23260986 23150307 23153583 23197853 23412888
4913B3412888K29217L21574M36924L85914L56807M27404N27929N64476P74084
$$ 23412888 23642105 23963679 24400603 24786517 25143324 25570728 26098657 26663133 27437217
4904B7437217R05243J072631J183915J272884J466797J446785J306090R61927
$$ 27437217 28342460 29415091 30599006 31871890 33338687 34785472 36091562 37053489
4896C7053489K55751n19675j107349j121502q30834n31427k87288j63782K00124
$$ 37053489 37309240 36789565 35682216 34560714 33729880 33198453 32911165 32747383 32947507
4887C2947507K05384L23846M57281N73063Q07724Q55199J149034J372910J669010
$$ 32947507 33152891 33476737 33934018 34507081 35314805 36170004 37319038 38691948 40360958
4878D0360958J837845K181765K395498K402023J948330J096820L35452k50984
$$ 40360958 42198803 44380568 46776066 49178089 51126419 52223239 52558691 52307707
4870E2307707q90460j884990k968484l550201l247792k559870j713701j281230
$$ 52307707 51417247 49532257 46563773 43013572 39765780 37205910 35492209 34210979
4862C4210979q73193m29062j52662K30922M12813Q31037J280233J574275J994541
$$ 34210979 33337786 32908724 32756062 32986984 33399797 34230834 35511067 37085342 39079883
4853C9079883K552250L044850L253907L344256L041691K711012J896890K89519
$$ 39079883 41632133 44676983 47930890 51275146 54316837 57027849 58924739 59214258
4845E9214258j393689k459728k876482l513783l902552l843584l322356k692027
$$ 59214258 57820569 55360841 52484359 48970576 45068024 41224440 37902084 35210057
4837C5210057k180958j720535j485751j021569q09337m43249k32958J62978N41843
$$ 35210057 33029099 31308564 29822813 28801244 27991907 27548658 27315700 27478678 28020521
4828B8020521P84662J186897J447963J780149J977395J784257Q28752l35156j181040
$$ 28020521 28805183 29992080 31440043 33220192 35197587 36981844 37810596 37475440 36294400
4819C6294400k008734k468162k583346k592329k750653k293248j796871j414938
$$ 36294400 34285666 31817504 29234158 26641829 23891176 21597928 19801057 18386119
4811A8386119j267864j062298p68152o22439n11261m03426k17036j95057M1346
$$ 18386119 17118255 16055957 15287805 14665366 14154105 13750679 13533643 13338586 13379932
4802A3379932L3688K99349L00665L77330M73054M26322L08468k39283n04314o65154
$$ 13379932 13413620 13712969 14013634 14390964 14864018 15290340 15598808 15359525 14855211 14190057
4792A4190057p83374j022345j039986p89240p06437m39042m74281l95346m22560
$$ 14190057 13406683 12384338 11344352 10555112 9848675 9409633 8935352 8540006 8117446
4783H117446l59008k89538j24913j07935j86871j49173q9240j53452o7718q7350
$$ 8117446 7758438 7468900 7343987 7236052 7049181 6900008 6810768 6657316 6589598 6502248
4773F502248j03262o9957m7457n2856j281N0203o2602j2169J3970Q617r8136j69324
$$ 6502248 6398986 6329029 6281572 6228716 6227435 6277638 6215036 6202867 6216837 6225454 6127318 5957994
4761E957994k85635k12687k43757k01834p0263k3059j06040m2680M2271k8554
$$ 5957994 5672359 5459672 5215915 5014081 4943818 4920759 4814719 4772039 4814310 4785756
4751D785756j5178R447P0969J9053j70306o3713n3679j0859q3241p2214k9851
$$ 4785756 4770578 4780025 4850994 4870047 4699741 4636028 4582349 4571490 4488249 4416035 4386184
4740D386184r327J1399k4826M8205J6898N9677N0394J4650n5793q8998k2123L3383
$$ 4386184 4376857 4388256 4363430 4411635 4428533 4488210 4538604 4553254 4497461 4408463 4386340 4419723
4728D419723J07760k1270J1829R7558N2199J10160P7706p370j1056j63309j58378
$$ 4419723 4527483 4506213 4518042 4615600 4667799 4777959 4855665 4848295 4837239 4673930 4515552
4717D515552o0035n8350n3337J7951l3707L4821L5204m2059J9375k8010k882p1083
$$ 4515552 4455517 4397167 4343830 4361781 4328074 4362895 4398099 4356040 4375415 4347405 4344523 4273440
4705D273440M4513N9941Q1279J02256J23915M2670J10920J16132K3098Q9547k1178
$$ 4273440 4317953 4377894 4459173 4561429 4685344 4728014 4838934 4955066 4978164 5067711 5046533
4694E046533m9052j8711p1120n9624j7113m7384j6464m7240k8396M4496K187O6588
$$ 5046533 4997481 4978770 4907650 4848026 4830913 4783529 4767065 4719825 4691429 4735925 4738112 4804700
4682D804700O4480N537K8990j0096R848O5875Q3367K3408P6805N6797J6190K4166
$$ 4804700 4869180 4874717 4903707 4893611 4903459 4969334 5052701 5076109 5152914 5209711 5225901 5250067
4670E250067J1887L6807j4843Q8703J55378J01414J18905M1325J05679K8798N7059
$$ 5250067 5261954 5298761 5283918 5372621 5527999 5629413 5748318 5789643 5895322 5924120 5981179
4659E981179M3536J56847J85332P9063J34823R8635J73114J59140J62233K36003
$$ 5981179 6024715 6181562 6366894 6445957 6580780 6679415 6852529 7011669 7173902 7409905
4649G409905K24757K25888K62629K65328L09533L87022K65240L34482M46282M02746
$$ 7409905 7634662 7860550 8123179 8388507 8698040 9085062 9350302 9684784 10131066 10533812
4639A0533812M79153N11581N84923M99057O19926O73340N85442N46879M34453
$$ 10533812 11012965 11524546 12109469 12608526 13228452 13901792 14487234 15034113 15468566
4630A5468566L54808K60965K22233J02061P7775Q2539O2484N2582p3279O5204
$$ 15468566 15823374 16084339 16306572 16408633 16486408 16568947 16631431 16684013 16610734 16675938
4620A6675938p743J73319J64458K01629K19697K24494K94566K82046M20768K84507
$$ 16675938 16668195 16841514 17005972 17207601 17427298 17651792 17946358 18228404 18649172 18933679
4610A8933679L96853M45731L54137L39662L14448L37186O8909J92171K29718L75592
$$ 18933679 19330532 19776263 20130400 20470062 20784510 21121696 21190605 21382776 21612494 21988086
4600B1988086M27393O07622R84875J063961J216813J385676J696970J783124J859646
$$ 21988086 22415479 23023101 24007976 25071937 26288750 27674426 29371396 31154520 33014166
4591C3014166J522919L97514j111162k178594k128583j706579j136910p44995
$$ 33014166 34537085 34934599 33823437 31644843 29516260 27809681 26672771 25927776
4583B5927776l45364p0402o6977k03436l50356p5467Q3707L47657M77906O96093
$$ 25927776 25582412 25512010 25445033 25241597 24891241 24815774 24899481 25247138 25725044 26421137
4573B6421137Q38918R15604J105694J276613J496813J435986J102944l1351j492941
$$ 26421137 27260055 28175659 29281353 30557966 32054779 33490765 34593709 34562358 33069417
4564C3069417k418372k466526j834546j420073r27596o73895l64343k73507k99826
$$ 33069417 30651045 28184519 26349973 24929900 24002304 23328409 22964066 22690559 22390733
4555B2390733n30222p71448q58349p54427o13466m98860n49812m74436l42184
$$ 22390733 21860511 21089063 20230714 19476287 18862821 18363961 17814149 17339713 16997529
4546A6997529m07364m11096k55192k43375k74943j38537q4793M2568J09387R6262
$$ 16997529 16590165 16179069 15923877 15680502 15405559 15267022 15182229 15224797 15334184 15430446
4536A5430446J48236K26838M58913M75582M78538O40007P32954P73084R93759
$$ 15430446 15578682 15805520 16264433 16740015 17218553 17858560 18591514 19364598 20358357
4527B0358357J117791J009967N97979n38895j128694j091492p19527m26395j94752
$$ 20358357 21476148 22486115 23084094 22545199 21416505 20325013 19605486 19179091 18984339
4518A8984339r772O0824K7603J36258K32063K39485L87391M92789O36865Q31493
$$ 18984339 18974567 19035391 19062994 19199252 19431315 19670800 20058191 20550980 21187845 22019338
4508B2019338R95238J156701J387091J607764J802142K062118K276864K474771
$$ 22019338 23014576 24171277 25558368 27166132 28968274 31030392 33307256 35782027
4500C5782027K226881J609495R92870J067563J853305K194985K059666J940467
$$ 35782027 38008908 39618403 40611273 41678836 43532141 45727126 47786792 49727259
4492D9727259K355046L364794M498762N529544N692266K849928l324461p377452
$$ 49727259 52082305 55447099 59945861 65475405 71167671 74017599 70693138 63315686
4484F3315686o856321m737557l376678l115409k660706k050704j369331r27848
$$ 63315686 56459365 51721808 48345130 45229721 42569015 40518311 39148980 38221132
4476C8221132n69128j35278L52238P70959J375606J988436K669802L139885L106537
$$ 38221132 37652004 37516726 37868964 38639923 40015529 42003965 44673767 47813652 50920189
4467E0920189K542507K293111K791322L723282M105423K761256j025539m995489
$$ 50920189 53462696 55755807 58547129 62270411 66375834 69137090 68111551 63116062
4459F3116062o289379n655178m849371m218772l192482k301999j720424j422861
$$ 63116062 56826683 51171505 46322134 42103362 38910880 36608881 34888457 33465596
4451C3465596j008415q48990o43273l07777q6427K94363L55251N45807P32934
$$ 33465596 32457181 31608191 30964918 30657141 30570714 30865077 31220328 31766135 32499069
4442C2499069Q93003J104352J240912J417059J268014J562334J998856K839331
$$ 32499069 33392072 34496424 35737336 37154395 38422409 39984743 41983599 44822930
4434D4822930L360815L921043M509440N083222N834064O209171N261853P59347
$$ 44822930 48183745 52104788 56614228 61697450 67531514 73740685 79002538 79761885
4426G9761885m833030o666867n254369l036476j136125M32624J640798K513079
$$ 79761885 74928855 68261988 63007619 59971143 58835018 59267642 60908440 63421519
4418F3421519L041210L775502M663089N467030N710489L142886k021348n614865
$$ 63421519 66462729 70238231 74901320 80368350 86078839 89221725 87200377 81585512
4410H1585512n031790k932950q81011R55826K367008K939127J728469k267503
$$ 81585512 76553722 73620772 72739761 73695587 76062595 79001722 80730191 78462688
4402G8462688o758107q006199o722454n037366l527411k272724j088041k67879
$$ 78462688 71704581 63698382 56975928 51938562 48411151 46138427 45050386 44782507
4394D4782507M08100J084939J497632J934680K430152L179810L788412L801621
$$ 44782507 45190607 46275546 47773178 49707858 52138010 55317820 59106232 62907853
4386F2907853J530261l597956p355602p354984n674815m109648l103395k455068
$$ 62907853 64438114 60840158 53484556 46129572 40454757 36345109 33241714 30786646
4378C0786646k088673j965722j902285j693370j485232j224973j005469p32414
$$ 30786646 28697973 26732251 24829966 23136596 21651364 20426391 19420922 18688508
4370A8688508o08832m67605k41925r6247l6619M6761K03350J09552J77662L88376
$$ 18688508 18079676 17612071 17370146 17273899 17237280 17284041 17487391 17596943 17774605 18162981
4360A8162981N16003L87157k70342j116033j463896j228030r28067o88300m56685
$$ 18162981 18678984 19066141 18795799 17679766 16215870 14987840 14059773 13371473 12914788
4351A2914788m86963m71654m62622m11401m13597k86383k00158j47359l6140m4001
$$ 12914788 12427825 11956171 11493549 11082148 10668551 10382168 10182010 10034651 9998511 9954510
4341I954510k979P5511K52849L03572K88086M87435N94919P15885P40885O84521
$$ 9954510 9951531 10027042 10279891 10583463 10871549 11358984 11953903 12669788 13410673 14095194
4331A4095194j02934q69583q54426o06301l94981m73134o86034q33455q35433
$$ 14095194 13992260 13122677 12268251 11661950 11266969 10793835 10107801 9274346 8438913
4322H438913o46578n34240m05834l82539l50199j69404k53101j72642j53307n5867
$$ 8438913 7792335 7258095 6852261 6469722 6119523 5950119 5697018 5524376 5371069 5315202
4312E315202l7796q8363j0620M2788R483J29334J24958K21283K50015K19254J25748
$$ 5315202 5277406 5189043 5178423 5221211 5230694 5360028 5484986 5706269 5956284 6175538 6301286
4301F301286j74087l68243n28316m59066l11432k30842k27827j90489j33777j98747
$$ 6301286 6127199 5758956 5230640 4771574 4460142 4229300 4001473 3810984 3677207 3478460
4291C478460j61027r5104o0809m9572o5880j57p1479q5963n6670j13560n1914
$$ 3478460 3317433 3222329 3161520 3111948 3046068 3045911 2974432 2888469 2831799 2718239 2666325
4280B666325n3222j5700k0838k3253k2862n9076q3074r8144r366j42410l7795
$$ 2666325 2613103 2597403 2576565 2553312 2530450 2471374 2388300 2290156 2280790 2138380 2100585
4269B100585N2851N0112p1887l7729o0277n8242n8966k8731k0330l467l3194j964
$$ 2100585 2153436 2203548 2131661 2093932 2033655 1975413 1916447 1887716 1867386 1863919 1830725 1828761
4257A828761p337n7853l4508m1757k7164J5880J3285K1344J1771n504o6291o4262
$$ 1828761 1821424 1763571 1729063 1687306 1660142 1676022 1689307 1710651 1722422 1716918 1650627 1586365
4245A586365l5811o988m0329m0781m5222L046j2550n4396l2087p1129l157J2170
$$ 1586365 1550554 1543566 1503237 1462456 1417234 1420280 1407730 1353334 1321247 1250118 1246961 1259131
4233A259131M7813o6966l8824k7695N4078n5582L8511j2905n3658p8731j8839
$$ 1259131 1306944 1239978 1201154 1173459 1227537 1171955 1210466 1197561 1143903 1065172 1046333
4222A046333j438J7368M7573K8910L3761M1519j9048M362j6147k0644l66l6454
$$ 1046333 1044895 1062263 1109836 1138746 1172507 1214026 1194978 1199340 1183193 1162549 1162183 1125729
4210A125729k8924l7632l0136n5202N309k0740p056l7091k5826p366m728R4279
$$ 1125729 1096805 1059173 1029037 973835 979144 958404 951348 914257 888431 881065 876337 970616
4198I70616L8775k5739j9188N8062n226p8456k5949j1575k673m3346j3001K7094
$$ 970616 1009391 983652 964464 1022526 1017300 938844 912895 901320 898647 855301 842300 869394
4186H69394J7619n9879P333n2306k0710L1287N7362K6713k1919o6454M1119K4685
$$ 869394 887013 827134 834467 782161 761451 792738 850100 876813 854894 788440 829559 854244
4174H54244m8428L622J6257J7449l3107J2799K868L7530j08512K7955m2968j400
$$ 854244 805816 809438 825695 843144 810037 822836 825704 863234 754722 782677 739709 738309
4162G38309O936j1303J04019p1280K0419l0300M7771n3053n4188K0384q7485N8722
$$ 738309 745245 733942 837961 766681 787100 756800 804571 751518 697330 717714 630229 688951
4150F88951K7659N4241p7076r7414l1652n2522L2440Q0970N1904M9322M6319J129
$$ 688951 716610 770851 693775 596361 564709 512187 544627 625597 677501 726823 773142 774271
4138G74271p1836o1676K9259n5484j5292O5705N2622k5527n4442P2556m4848m041
$$ 774271 702435 640759 670018 614534 599242 664947 717569 692042 637600 710156 665308 661267
4126F61267o893N7258N4737P5457J22294l7610j0400p0714m1328m3917k6891l1934
$$ 661267 654374 711632 766369 841826 964120 926510 916110 845396 804068 760151 733260 701326
4114G01326O881L0378K831p5636J3839m3096n2082l8951l3859J15689R020O4098
$$ 701326 708207 738585 741416 665780 679619 636523 584441 545490 511631 627320 636340 700438
4102G00438k7474M7500l89L419Q3996l0288R9882m6754J07053m1776o9945o5098
$$ 700438 672964 720464 720075 723494 807490 777202 877084 830330 937383 895607 825662 760564
4090G60564j3356k4304p1685K3525Q133m548K8341J4064Q87K3966k2668K9172
$$ 760564 747208 722904 651219 674744 682877 678329 706670 720734 721621 745587 722919 752091
4078G52091j0932k223k5382P271J5335P771r528k6903Q8519K1504n4510J6710
$$ 752091 741159 738936 713554 720825 736160 743931 734403 707500 796019 817523 763013 779723
4066G79723M149R8778K2088P5815O3086k9771n0417m8555M6442l3440o6978L9033
$$ 779723 783872 882650 904738 980553 1043639 1013868 963451 914896 961338 927898 860920 899953
4054H99953O5608n8941L6985p16p6866Q303M6286J7363L1545L7268M4734k4097
$$ 899953 965561 906620 943605 942889 866023 874326 920612 937975 969520 1006788 1051522 1027425
4042A027425J3563L2830l0711Q6156n6454j0379n7069K2421L104j30971M5256
$$ 1027425 1040988 1073818 1043107 1129263 1072809 1062430 1005361 1027782 1030886 899915 945171
4031I45171p9780Q1805p8349K3700J01892O6081M964Q2690J02867k3235P0518
$$ 945171 865391 947196 868847 892547 994439 1060520 1065484 1148174 1251041 1227806 1298324
4020A298324j6172O9347q8515q0810q906K6029o5734O52j5057o4023J6119j1011
$$ 1298324 1282152 1351499 1262984 1182174 1173268 1199297 1133563 1134215 1119158 1055135 1071254 1060243
4008A060243M1135O7315J364N2821o447r884l180p0528k4069M7599r9192m7473
$$ 1060243 1101378 1168693 1170057 1222878 1216431 1206547 1203367 1132839 1108770 1156369 1057177 1009704
3996A009704m1375L1862j1123q925j7731M599N207R80K2441l1204o1410l3786
$$ 1009704 968329 1000191 989068 980143 962412 967011 972218 973198 995639 964435 903025 869239
3984H69239Q752l3226j1930j7349k2122L518o890q489L5210Q250r617L3410n559
$$ 869239 877991 844765 832835 815486 793364 796882 789992 781503 816713 824963 815346 848756 843197
3971H43197N9280R9451l1870Q6362j1096K1094p89M5424P2073J9558m208L6907
$$ 843197 902477 1001928 970058 1056420 1045324 1066418 1065629 1111053 1183126 1202684 1198476 1235383
3959A235383J8042M4341M1826K2871j1010j2531k2518M7671M5759m5973K6988
$$ 1235383 1253425 1297766 1339592 1362463 1351453 1338922 1316404 1364075 1409834 1363861 1390849
3948A390849k4876K1179m6768p3805o3666j00310m1962n8966K6371k7847k8330
$$ 1390849 1365973 1387152 1340384 1266579 1202913 1102603 1060641 1001675 1028046 1000199 971869
3937I71869L4036m2282j6931l1034n0497l7077n7729o8039L337O3577j5302K4106
$$ 971869 1005905 963623 946692 915658 865161 828084 770355 702316 705653 769230 753928 778034
3925G78034N393Q684J3869q714P6330M1169N0987m805o5441k3012m657n7663R0639
$$ 778034 783427 792111 805980 797266 873596 914765 965752 960947 895506 872494 867837 810174 900813
3912I00813J9812K2883j0451m1946K6777K0491j0429M8754k3814L2402L9216j8591
$$ 900813 920625 943508 933057 891111 917888 938379 927950 976704 952890 985292 1024508 1005917
3900A005917N9152l1240j8636p7107n709N1330K5007j6402N0348J393n399J11041
$$ 1005917 1065069 1033829 1015193 938086 932377 983707 1008714 992312 1042660 1044053 1038654 1149695
3888A149695J7818Q964j0592l8392N1170J2999P0694K3310j6857r4234m9489R9906
$$ 1149695 1167513 1176477 1165885 1127493 1178663 1191662 1262356 1285666 1268809 1174575 1125086 1224992
3876A224992N6619l6011j11123K2525m327P965p8145N2660m7873J4265k1145j8331
$$ 1224992 1281611 1245600 1134477 1157002 1152675 1160640 1082495 1135155 1087282 1101547 1080402 1062071
3864A062071J23q5152m009q992K1578n6934M0342j4259Q4381r6669p1142P2668
$$ 1062071 1062194 977042 973033 964041 985619 928685 969027 954768 1039149 942480 871338 944006
3852I44006R230K8239M7681O2151K667k7824N6612L8362P2692J8948M914O4460
$$ 944006 953236 981475 1029156 1091307 1093974 1066150 1122762 1161124 1233816 1252764 1257678 1322138
3840A322138L3767k866N3491R1510k9194K9255N9394J01384R4573o750J3396j2086
$$ 1322138 1355905 1353039 1406530 1498040 1468846 1498101 1557495 1658879 1753452 1746702 1760098 1748012
3828A748012M6826l9697K0444O6822m660j20092Q7252P4586n778l0583q0597j0264
$$ 1748012 1794838 1755141 1775585 1842407 1837747 1717655 1804907 1879493 1873715 1843132 1762535 1752271
3816A752271l8800j05463N7992M459j14229l4031q0993p419K0356J3250o7580
$$ 1752271 1713471 1608008 1666000 1670459 1556230 1522199 1441206 1433787 1454143 1467393 1399813
3805A399813K3317q0359m7375L1963Q0395L799k6422P2230K1238p692K3663K0354
$$ 1399813 1423130 1342771 1295396 1327359 1407754 1411553 1385131 1457361 1478599 1470907 1494570 1514924
3793A514924m3712m9553r241R3770J16926R5049Q6595N4215J24426K6323q2959
$$ 1514924 1471212 1421659 1412418 1506188 1623114 1718163 1804758 1858973 1983399 2009722 1926763
3782A926763K4393j38816k13922j31528j01551l6018j48359o9575o3906o6469
$$ 1926763 1951156 1812340 1598418 1466890 1365339 1329321 1180962 1111387 1047481 981012
3772I81012l8779j6591N7634J885r370J4459M1728J223r7503O9197M2136N3140
$$ 981012 942233 925642 983276 985161 975791 990250 1031978 1033201 935698 1004895 1047031 1100171
3760A100171M6060K5358N6905o3950N1392J9563J15274J8766n212R1663P1351
$$ 1100171 1146231 1171589 1228494 1164544 1215936 1235499 1350773 1369539 1364327 1455990 1527341
3749A527341L1582j1077O9605K9304K144Q5528N3790L4737J8669L3434M4438m6831
$$ 1527341 1558923 1547846 1617451 1646755 1648899 1734427 1788217 1822954 1841623 1875057 1919495 1872664
3737A872664m0249M038m2646q2227m3228L344p645q592o5760k4694j1823q6060
$$ 1872664 1832415 1836453 1793807 1711580 1668352 1671696 1664051 1655459 1589699 1565005 1553182 1467122
3725A467122J0923j16998j8207q3211L2459M5346n7805K2924k112n5955M6875
$$ 1467122 1478045 1361047 1342840 1259629 1292088 1337434 1279629 1302553 1300441 1244486 1291361
3714A291361J0780o5041n5367O9748J9863m968M9010L0467L204m3100R7896j719
$$ 1291361 1302141 1237100 1181733 1251481 1271344 1266376 1315386 1345853 1349057 1305957 1403853 1402134
3702A402134R7146J58072N8831J51833J01784J80319J34386N5435J3228K8633
$$ 1402134 1499280 1657352 1716183 1868016 1969800 2150119 2284505 2339940 2353168 2381801
3692B381801L2795o0064j45594j53758j02988r4611j9528j1320k1188L7638l2778
$$ 2381801 2414596 2354532 2208938 2055180 1952192 1857581 1838053 1826733 1805545 1843183 1810405
3681A810405L3735j0383q4592J964j16478n6135m3489p0382Q726M8828j26287
$$ 1810405 1844140 1833757 1749165 1751129 1634651 1578516 1535027 1464645 1473371 1522199 1395912
3670A395912L8005q7362j22952p8497J4024k886o556P1621m2642p6108p7111J2604
$$ 1395912 1433917 1346555 1223603 1145106 1159130 1156244 1149688 1221309 1178667 1102559 1025448 1038052
3658A038052l6360j2158O2116m3898K6765K01L4097j1075j08942O979n3980J3153
$$ 1038052 1001692 989534 1051650 1007752 1034517 1034718 1068815 1057740 948798 955777 901797 914950
3646I14950O2525K9061K9439j1824N7842m8404N8863o2254O8013M041o233N0028
$$ 914950 977475 1006536 1035975 1024151 1081993 1033589 1092452 1030198 1098211 1102252 1096019 1146047
3634A146047m877k0908j14428M8185m5677m4799k6920L5937m8464k131j7318n712
$$ 1146047 1141170 1120262 1005834 1054019 1008342 963543 936623 972560 924096 921965 904647 898935
3622H98935n4111j8499k5138j24656l0816O0389l1396K2831J9865l5439n0412
$$ 898935 844824 826325 801187 676531 645715 706104 674708 697539 717404 681965 631553
3611F31553j1196j0397O48l7316m8566Q5880o3792J4392O5303M7279r5863p8046
$$ 631553 620357 609960 610608 573292 524726 610606 546814 561206 626509 673788 577925 499879
3599D99879N6730l2639M7204l8601Q6411j5289p2388P7609j7892K5339k0496Q521
$$ 499879 556609 523970 571174 532573 618984 603695 531307 608916 591024 616363 595867 604388
3587F04388j4963K7860M0800k6874n8275p8523k954q2114J13456K9581K3205N7844
$$ 604388 589425 617285 658085 631211 572936 494413 491459 409345 522801 552382 575587 633431
3575F33431j7392N7254J3619J2654m5041j6285j15532M1846M6522j1279l4273
$$ 633431 616039 673293 686912 699566 654525 638240 522708 564554 611076 599797 565524
3564E65524R823K8962L267k7206K4915O756j9924J01700P837J8260M8494L3471
$$ 565524 575347 604309 607576 580370 605285 612041 592117 693817 701654 719914 768408 801879
3552H01879N055k7232p1140J7019J1757O3041l1362n5645J1385o8132j2068j7173
$$ 801879 806934 779702 708562 725581 737338 800379 769017 713372 724757 656625 644557 627384
3540F27384K4790O1981Q60J0454r415J6070p697l9286o6636L5239p0611o0728
$$ 627384 652174 714155 715015 725469 716054 732124 724427 685141 618505 653744 583133 522405
3528E22405J01019k6204k9688k3656j1681j1955o3241J1380L5346Q0644O6636
$$ 522405 623424 597220 567532 543876 532195 520240 456999 468379 503725 584369 651005
3517F51005K7258l1382J0786m9035l5179K854j3224O6234j1198o255J76J5955
$$ 651005 678263 646881 657667 608632 573453 576307 563083 629317 618119 611864 612040 627995
3505F27995m9425l0684N293n8284P7926M0928J5210j6261j8652N4307l7116n0098
$$ 627995 578570 547886 553179 494895 572821 613749 628959 612698 594046 648353 611237 561139
3493E61139p6770O1037j06905O9901J7073k0494k6748m8336j800p185K422k2122
$$ 561139 484369 545406 438501 508402 525475 504981 478233 429897 428097 420912 423334 401212
3481D01212k061K2839O2413N4677K2622K1409o0806o5352p0148k0658N3471k7542
$$ 401212 399151 421990 484403 539080 561702 583111 522305 456953 386805 366147 419618 392076
3469C92076K4596O1266j04o8247k5572m1789K5256q238R0483R1399l1742n8977
$$ 392076 416672 477938 477834 409587 384015 342226 367482 359244 449727 541126 509384 450407
3457D50407N2406k5892o9526j758M2208p8804L5473k2371L9573M4624l6313r0245
$$ 450407 502813 476921 407395 405637 447845 369041 404514 382143 421716 466340 430027 339782
3445C39782N2989K4870K4906P6849N2057L3114o1521L1450o3072p4702k8818p782
$$ 339782 392771 417641 442547 519396 571453 604567 543046 574496 511424 436722 407904 400122
3433D00122j4822R480R1666p4144K7340K6327p3116M9428J6043N2402R405O3373
$$ 400122 385300 394780 486446 412302 439642 465969 392853 442281 458324 510726 520131 583504
3421E83504K3441K6987j25630k5739j18222L796J50r0274L636Q0307L7200J3579
$$ 583504 606945 633932 508302 482563 364341 368137 368287 278013 281649 361956 399156 412735
3409D12735K875p5003p375k9208P1612O6493j9535J4507n4795K511n052p4997
$$ 412735 415610 340607 333232 304024 375636 442129 422594 437101 382306 384817 379765 304768
3397C04768k4844K3629m5133O6130P8000K8853j6432J3845J6809Q936K3708l9186
$$ 304768 279924 303553 258420 324550 402550 431403 414971 428816 445625 454561 478269 439083
3385D39083L5913l7934O0992r664j4463n7433p1906J0345j1199M6764P9724J9216
$$ 439083 474996 437062 498054 488390 473927 416494 344588 354933 343734 390498 470222 489438
3373D89438O6366n4554K5653n3865K5833m7892K9076O160j6608N2230p117j3668
$$ 489438 555804 501250 526903 473038 498871 450979 480055 486215 469607 521837 514720 501052
3361E01052j3678L7354j5485o051M7352l0077J9175P9501o409L5688n3724L3447
$$ 501052 487374 524728 509243 503192 550544 520467 539642 619143 612734 648422 594698 628145
3349F28145O844M521o4068L0988o827L4951m408m9446p550Q053J9209Q7309j107
$$ 628145 634989 639510 575442 606430 599603 634554 630146 580700 573150 581203 600412 687721 686614
3336F86614N2581m4364r8021O3656j9672J008n4953l1318k808m4624K9742J7188
$$ 686614 739195 694831 596810 660466 640794 641802 586849 555531 552723 508099 537841 555029
3324E55029m724p7612O8091M3762J2017N499K5030l0429N0391N58n135K376N755
$$ 555029 550305 472693 540784 584546 596563 602062 627092 596663 647054 647612 642477 644853 650608
3311F50608m6310m9895k8804l1474N2144m8022P6716J6589M6648k402M1027M922
$$ 650608 604298 554403 525599 494125 546269 498247 574963 591552 638200 635798 676825 681747
3299F81747K3939J8716N6650L4012l9243k3190q634j20870o3070K1128P7363J46885
$$ 681747 705686 724402 781052 815064 775821 752631 743997 623127 560057 581185 658548 805433
3287H05433L5496k2185J378n4683j8796R9097J16920L1608O1143o7978L2056K3186
$$ 805433 840929 818744 820122 765439 746643 845740 962660 994268 1055411 987433 1019489 1042675
3275A042675m5924N2672N2650M4078Q5950O8244j6738L5617q5302P382J9808N1538
$$ 1042675 996751 1049423 1102073 1146151 1232101 1300345 1283607 1319224 1233922 1241304 1261112 1312650
3263A312650J00963J04989J82268Q9841N8864J71921K01773J93565K51727j0433
$$ 1312650 1413613 1518602 1700870 1790711 1849575 2021496 2223269 2416834 2668561 2658128
3253B658128k33797k57782k73824j68306j46085o5118j12121o4859K0582O0785
$$ 2658128 2424331 2166549 1892725 1724419 1578334 1513216 1401095 1336236 1356818 1417603
3243A417603n4503q3477n7044j09674l4294l9853L8246J1812L1069j0843l7393
$$ 1417603 1363100 1279623 1222579 1112905 1078611 1038758 1077004 1088816 1119885 1109042 1071649
3232A071649N6855J1424j8804O7822K724M1252R5778N3859O3691P837p7294K0623
$$ 1071649 1128504 1139928 1121124 1188946 1191670 1232922 1328700 1382559 1446250 1454087 1376793 1397416
3220A397416k9767L9205M8697O540O1127o3059L6651J25430l0109n678o238l1299
$$ 1397416 1367649 1406854 1455551 1462091 1523218 1460159 1496810 1622240 1592131 1586453 1580215 1548916
3208A548916l2065R2266l0091O4813p8578n4633m6129k9654M8788K1306l755R4460
$$ 1548916 1516851 1609117 1579026 1643839 1565261 1510628 1464499 1434845 1483633 1504939 1501184 1595644
3196A595644j7547q758Q3231K4324O0281j27062n9359j2856n0335M3147P6638
$$ 1595644 1578097 1569339 1652570 1676894 1737175 1610113 1550754 1537898 1487563 1530710 1607348
3185A607348K564P7778j6277O3891P1015P713k9039J37947Q2754J00285M1306
$$ 1607348 1609912 1687690 1671413 1735304 1806319 1814032 1784993 1922940 2005694 2105979 2147285
3174B147285P6001O185j01903P078P8392j6520R6948J24734K41109J9292M0093
$$ 2147285 2223286 2229471 2127568 2134646 2213038 2196518 2293466 2418200 2659309 2678601 2718694
3163B718694K0918n7497j09082j13L9842M0774K0425l1416J06933N686m5880J09724
$$ 2718694 2739612 2682115 2573033 2572920 2612762 2653536 2673961 2642545 2749478 2755164 2709284 2819008
3151B819008k2489J88143R2756P0197Q5974R8299L9769J1248M6045N9330K3035
$$ 2819008 2796519 2984662 3077418 3147615 3233589 3331888 3371657 3382905 3428950 3488280 3511315
3140C511315j9264J86164R6026O8238O5421J06755L1196J45275J33059K04396
$$ 3511315 3492051 3678215 3774241 3842479 3907900 4014655 4045851 4191126 4324185 4528581
3130D528581K04457J00012M5125P8746J6579R9322j8692J37362J46628q879O5700
$$ 4528581 4733038 4833050 4878175 4956921 4973500 5072822 5054130 5191492 5338120 5329241 5394941
3119E394941J68581J05753J29622K06689K42696J91275J58816N7041J91681J41987
$$ 5394941 5563522 5669275 5798897 6005586 6248282 6439557 6598373 6655414 6847095 6989082
3109F989082K08386K46426L06514L43896L10272L53274L37957K71626K00930L86576
$$ 6989082 7197468 7443894 7750408 8094304 8404576 8757850 9095807 9367433 9568363 9954939
3099I954939L46922L71041M06323M21063N20531M58016N45548N00585O02005O11859
$$ 9954939 10301861 10672902 11079225 11500288 12020819 12478835 13024383 13524968 14126973 14738832
3089A4738832M61061N79585N88140N72140M78030O11358O69896O71196O89304
$$ 14738832 15199893 15779478 16367618 16939758 17417788 18029146 18699042 19370238 20059542
3080B0059542P46228Q18161P99698Q50099P78523Q08773Q88610O91045P75084
$$ 20059542 20805770 21623931 22423629 23273728 24052251 24861024 25749634 26440679 27215763
3071B7215763Q15924P11927O90415O58151O36936O26058N92080O43317P45872
$$ 27215763 28031687 28743614 29434029 30092180 30729116 31355174 31947254 32590571 33336443
3062C3336443O15531N94237N77597M58575M03655K32627K30247K30549R2866J13065
$$ 33336443 33951974 34546211 35123808 35582383 35986038 36218665 36448912 36679461 36772327 36885392
3052C6885392P18l5799j13947j3966q5547m2150j16686j10057j07135k33803k73384
$$ 36885392 36886110 36850311 36736364 36722398 36636851 36594701 36478015 36367958 36260823 36027020 35753636
3041C5753636m28232m07968m34984m67254m88292l91822m70430m99353m46303
$$ 35753636 35325404 34917436 34482452 34015198 33526906 33135084 32664654 32165301 31718998
3032C1718998l57718l63818m05863k34325l43871k60427l09146m24320m24267
$$ 31718998 31361280 30997462 30591599 30357274 30013403 29752976 29443830 29019510 28595243
3023B8595243l65224m63052l77662k93428l29518j92440k26199j2994j01700r2990
$$ 28595243 28230019 27766967 27389305 27095877 26766359 26573919 26347720 26334726 26233026 26140036
3013B6140036L5229Q3507L10404J42691L0819L3042n6885l6290n8403R6523Q7235
$$ 26140036 26175265 26258772 26569176 26711867 26742686 26775728 26718843 26682553 26624150 26720673 26807908
3002B6807908J41302J99723K53465K58084K81927M45087M54833M87342N54231
$$ 26807908 26949210 27148933 27402398 27660482 27942409 28387496 28842329 29329671 29883902
2993B9883902N18604M46100L22337M49242N01330N32805P18470O62490P82617
$$ 29883902 30402506 30848606 31170943 31620185 32121515 32654320 33372790 34035280 34817897
2984C4817897Q41587P10659R77130J202397J383432J600953J810032J885871J816050
$$ 34817897 35659484 36370143 37347273 38549670 39933102 41534055 43344087 45229958 47046008
2975D7046008J543356J549306J580746J821143K065348K530557L281194M321718
$$ 47046008 48589364 50138670 51719416 53540559 55605907 58136464 61417658 65739376
2967F5739376N443090O336270O954577P898059R376584J1128990J2872682J0249647
$$ 65739376 71182466 77518736 84473313 92371372 101747956 112876946 125749628 135999275
2959A35999275j475402r778426p883446l042637R94821M547070Q321059J2284765
$$ 135999275 134523873 124745447 116862001 113819364 114814185 119361255 127682314 139967079
2951A39967079J6552900K0476451K3186187K5741356L0759256L7340863M3749771
$$ 139967079 156519979 176996430 200182617 225923973 256683229 294024092 337773863
2944C37773863M1449751P564598m5000355o5123937n2540194l6009646k5370109
$$ 337773863 379223614 386788212 341787857 276663920 224123726 188114080 162743971
2937A62743971j8476367j4261917j2042319j0762172r541879q329044p303763
$$ 162743971 144267604 130005687 117963368 107201196 97659317 89330273 82026510
2930H2026510o486512n723029m805964l859961l099083k614387k271862k105920
$$ 82026510 75539998 69816969 65011005 61151044 58051961 55437574 53165712 51059792
2922E1059792j840311j773606j660452j842606k106619k291841k153172j888870
$$ 51059792 49219481 47445875 45785423 43942817 41836198 39544357 37391185 35502315
2914C5502315j575504j325557j095863q51458q23023p77399p09098n64879m58060
$$ 35502315 33926811 32601254 31505391 30653933 29830910 29053511 28344413 27779534 27321474
2905B7321474l61680j03755o8987p0001j9453Q6022j10974o0257m618j21196q5054
$$ 27321474 26959794 26856039 26787052 26717051 26697598 26783620 26672646 26612389 26607771 26486575 26401521
2894B6401521q2468P3307K66964L28603L73996K07663K16732K58223L18451M50158
$$ 26401521 26319053 26392360 26659324 26987927 27361923 27569586 27786318 28044541 28362992 28813150
2884B8813150M98542N35671M85651N03701O19976P49691Q13783J003184J095256
$$ 28813150 29311692 29847363 30333014 30836715 31456691 32206382 33020165 34023349 35118605
2875C5118605J342618J482269J516761J697405J788927J922719K176131K447197
$$ 35118605 36461223 37943492 39460253 41157658 42946585 44869304 47045435 49492632
2867D9492632K706745L003655L295536L553000L624329L654195L624285L336362
$$ 49492632 52199377 55203032 58498568 62051568 65675897 69330092 72954377 76290739
2859G6290739K817651K042682J058054K1689j180987k281792l112651l691376
$$ 76290739 79108390 81151072 82209126 82230815 81049828 78768036 75655385 71964009
2851G1964009m094249m193084m048176l852988l647735l280148k986168k797271
$$ 71964009 67869760 63676676 59628500 55775512 52127777 48847629 45861461 43064190
2843D3064190k453595k239030k006251j831193j627204j495161j356676j206605
$$ 43064190 40610595 38371565 36365314 34534121 32906917 31411756 30055080 28848475
2835B8848475j065293j090817j103726j007861j077821r38262q01786o81406p19588
$$ 28848475 27783182 26692365 25588639 24580778 23502957 22564695 21762909 21081503 20361915
2826B0361915o11555m77085m01889m04833l43422m48612k36075l53328k82918
$$ 20361915 19750360 19273275 18871386 18466553 18123131 17674519 17438444 17085116 16802198
2817A6802198k70149k36644j78224k27540q5923k09431m4488r7106Q0840k2481
$$ 16802198 16532049 16295405 16117181 15889641 15803718 15594287 15549799 15452693 15533533 15511052
2807A5511052KM3144j7408N5377n8335O807J00522R4500K8380J08631N6664J70302
$$ 15511052 15511054 15554198 15536790 15592167 15533832 15540639 15641161 15735661 15764041 15872672 15929336 16099638
2795A6099638K12744J80092K70266K07511M12379L47095M50717L64527L78571
$$ 16099638 16312382 16492474 16762740 16970251 17382630 17729725 18180442 18544969 18923540
2786A8923540L85935L18877L71966L10575L40225K32469K35896K26479O0332J35975
$$ 18923540 19309475 19628352 20000318 20310893 20651118 20883587 21119483 21345962 21406294 21542269
2776B1542269K1511R1952O6196J57704P7131J4738q2330j48975j40653j94492
$$ 21542269 21563780 21655732 21721928 21879632 21956763 21971501 21889171 21740196 21599543 21405051
2766B1405051k45089k01411j74115k18188j08903j15621j70863j59657q9473r7490
$$ 21405051 21159962 20958551 20784436 20566248 20457345 20341724 20170861 20011204 19921731 19824241
2756A9824241O933L3212J6044r2775p4853j23137j41345j66145r5091k23181j71630
$$ 19824241 19831174 19864386 19880430 19787655 19712802 19589665 19448320 19282175 19187084 18963903 18792273
2745A8792273j55096j94977k46500k11630j39323k31251k21557k34942k38207
$$ 18792273 18637177 18442200 18195700 17984070 17844747 17613496 17391939 17156997 16918790
2736A6918790j87430k41386j34502l19843l76656m53175l71944l36615l96329
$$ 16918790 16731360 16489974 16355472 16035629 15658973 15205798 14833854 14497239 14100910
2727A4100910l28522l75789l50806k60528k68383l42541l17456j81981j33168
$$ 14100910 13772388 13396599 13045793 12785265 12516882 12174341 11856885 11674904 11541736
2718A1541736q3514j33481j19156j60739j48999q3132j32913j65278j16430p8467
$$ 11541736 11458222 11324741 11205585 11044846 10895847 10812715 10679802 10514524 10398094 10319627
2708A0319627p6582m4395n4184R8136j9377l418j6795R1553M5455J26182Q3924
$$ 10319627 10243045 10198650 10144466 10242602 10223225 10219807 10203012 10294565 10340020 10466202 10550126
2697A0550126J24636L464J02449J05051q118J54331J55769O0484J36837J14141
$$ 10550126 10674762 10678226 10780675 10885726 10877608 11031939 11187708 11248192 11385029 11499170
2687A1499170J27320K23086K20149J61568J36283J25344K13556K55930K17438
$$ 11499170 11626490 11849576 12069725 12231293 12367576 12492920 12706476 12962406 13179844
2678A3179844K17067K01165J91059J23411K34024K34438J95748K08856L00599
$$ 13179844 13396911 13598076 13789135 13912546 14146570 14381008 14576756 14785612 15086211
2669A5086211K02030K86991K88935K63768L49571L09099M39650L64511M00083
$$ 15086211 15288241 15575232 15864167 16127935 16477506 16786605 17226255 17590766 17990849
2660A7990849N03660M28959N76447N57287O05587O39445P32764O64678Q32677
$$ 17990849 18494509 18923468 19499915 20057202 20662789 21302234 22034998 22699676 23532353
2651B3532353Q95689R44393J019116J139402J219403J344562J467329J557632
$$ 23532353 24428042 25372435 26391551 27530953 28750356 30094918 31562247 33119879
2643C3119879J736898J856220K038797K297838K574019K793328L131897L425047
$$ 33119879 34856777 36712997 38751794 41049632 43623651 46416979 49548876 52973923
2635E2973923L618734L839347L997089M005755M001487L727604L300982K539609
$$ 52973923 56592657 60432004 64429093 68434848 72436335 76163939 79464921 82004530
2627H2004530J765395J104400O69902L42484P8144j31220k61987l19022l33436
$$ 82004530 83769925 84874325 85544227 85886711 85964855 85833635 85571648 85252626 84919190
2618H4919190l51230l42901m13238n90927p75590j164339j613902k038579k490780
$$ 84919190 84567960 84225059 83811821 83220894 82445304 81280965 79667063 77628484 75137704
2609G5137704k937525l389657l635113l663514l559896l298387k958470k694927
$$ 75137704 72200179 68810522 65175409 61511895 57951999 54653612 51695142 49000215
2601D9000215k259447k118347j717070j466088j301930j096081r13860o45531
$$ 49000215 46740768 44622421 42905351 41439263 40137333 39041252 38127392 37481861
2593C7481861n32424l39836k35689k2562M2133K39538L01256L33486M94748N38995
$$ 37481861 36949437 36609601 36373912 36351350 36393483 36633021 36934277 37267763 37762511 38301506
2583C8301506O63499Q53435Q80358R69571R52270J026361J004307J132413J077142
$$ 38301506 38965005 39818440 40698798 41668369 42620639 43647000 44651307 45783720 46860862
2574D6860862J132484J125683J167933J148624R46497R86850R25824R07837R24722
$$ 46860862 47993346 49119029 50286962 51435586 52382083 53368933 54294757 55202594 56127316
2565E6127316R68194Q72558Q34960O94076O06996M85631K78099K15480L5103j1363
$$ 56127316 57095510 57968068 58803028 59497104 60104100 60589731 60867830 61083310 61118413 61107050
2555F1107050m3704Q8422K2026j12152j62651j59081k20649l44173k67336l62491
$$ 61107050 61063346 61151768 61173794 61061642 60898991 60739910 60519261 60175088 59907752 59545261
2545E9545261m10548m35639m81354o09213o80362o79356o70444o91553n61802
$$ 59545261 59134713 58699074 58217720 57608507 56928145 56248789 55578345 54886792 54324990
2536E4324990o06020m79428n93189n72349o34139p25592o92765q79667p95836
$$ 54324990 53718970 53239542 52646353 52074004 51439865 50714273 50021508 49141841 48346005
2527D8346005r40073r83471r78976j100969j082098j153823j110205j222686j094616
$$ 48346005 47405932 46422461 45443485 44342516 43260418 42106595 40996390 39773704 38679088
2518C8679088j157610j156450j121553j013129j050071j124590r91796j020190
$$ 38679088 37521478 36365028 35243475 34230346 33180275 32055685 31063889 30043699
2510C0043699j057747j157441r80400j050610j000889r65081q49455q41400q12708
$$ 30043699 28985952 27828511 26848111 25797501 24796612 23831531 22982076 22140676 21327968
2501B1327968p31783p18306n54458n69389m89953l93858l86814l25999k68381
$$ 21327968 20596185 19877879 19323421 18754032 18264079 17870221 17483407 17157408 16889027
2492A6889027j95762k14738j84571k27125j40833j57519q0162n9542q4992p2961
$$ 16889027 16693265 16478527 16293956 16066831 15925998 15768479 15688317 15628775 15543783 15470822
2482A5470822j32515r9107r4352j10504j60076o9593j2488m5062l2747j49355
$$ 15470822 15338307 15239200 15144848 15034344 14874268 14804675 14792187 14747125 14714378 14565023
2472A4565023p6278j12822j88818j74127j43801k12374k74562j88077k32151l00191
$$ 14565023 14488745 14375923 14187105 14012978 13869177 13656803 13382241 13194164 12962013 12661822
2462A2661822l26299l04689k69975k60668l20531k43926l21186k55297l12722
$$ 12661822 12335523 12030834 11760859 11500191 11179660 10935734 10614548 10359251 10046529
2453A0046529k96614l91689l65826k74412l30769k99336k50641k80086l02526
$$ 10046529 9749915 9358226 8992400 8717988 8387219 8087883 7837242 7557156 7254630
2444G254630k55240k76668k72101k40393j51091j89562k82656j57871j30394k16681
$$ 7254630 6999390 6722722 6450621 6210228 6059137 5869575 5586919 5429048 5298654 5081973
2434E081973j57957j25926n7466m5413j94981j27365o4492j06653m7219r6413
$$ 5081973 4924016 4798090 4740624 4695211 4500230 4372865 4308373 4201720 4154501 4058088
2424D058088l4025q7459j74953j7599q6978j15878l6514o8568q3575p8200J5980
$$ 4058088 4024063 3936604 3761651 3744052 3657074 3541196 3504682 3436114 3352539 3274339 3290319
2413C290319n4623k4249j47550j05173l5916k2419o139n6254K3054l9837q7007
$$ 3290319 3235696 3211447 3063897 2958724 2922808 2900389 2894250 2837996 2861050 2821213 2734206
2402B734206l1563j03045n197n5203l0299J3386P4723k3823o1296n3963o1341
$$ 2734206 2702643 2599598 2594401 2539198 2508899 2522285 2597008 2573185 2511889 2457926 2396585
2391B396585m9135j22544P2339L82n4924K2074L565k6245j38218k9961m6758q1002
$$ 2396585 2347450 2224906 2297245 2297627 2242703 2264777 2268342 2242097 2103879 2073918 2027160 1946158
2379A946158l089L1828Q458r8254K6828l1108l2431p7775r6541m8428J7652N6112
$$ 1946158 1943069 1974897 1983355 1885101 1911929 1880821 1848390 1770615 1674074 1625646 1643298 1699410
2367A699410K6817j2447k7678m3863m6088l872L196o7606m3171K7841Q9675O8757
$$ 1699410 1726227 1713780 1686102 1642239 1596151 1592279 1595475 1527869 1484698 1512539 1602214 1670971
2355A670971l5989J7834o4524j5752k1047p7289L3175j1009n3240m35k901m6705
$$ 1670971 1634982 1652816 1588292 1572540 1551493 1474204 1507379 1496370 1443130 1442695 1439794 1393089
2343A393089l6235m0029r432M243k5831M5161Q4732N0725n2067p4106m955n1455
$$ 1393089 1356854 1316825 1307393 1311636 1285805 1330966 1415698 1466423 1414356 1340250 1335295 1283840
2331A283840k0044N1572M7721n0422J563k7819M2647J6727l1089n5487M6117K5311
$$ 1283840 1263796 1315368 1363089 1312667 1314230 1286411 1329058 1345785 1314696 1259209 1305326 1330637
2319A330637l5946N1313M8502J5009k654m0708n545j0763k0159m8398J7684n7061
$$ 1330637 1294691 1346004 1394506 1409515 1406861 1366153 1360608 1349845 1329686 1281288 1298972 1241911
2307A241911L2899K0484Q2582m9683q5115L7584l5651m218p0886P0783L52k2915
$$ 1241911 1274810 1295294 1377876 1328193 1243078 1280662 1245011 1240793 1169907 1240690 1241042 1218127
2295A218127J1387k2421r6953l8443P937j6801n6425O7566n0231k4443m7986j4336
$$ 1218127 1229514 1207093 1110140 1071697 1079634 1062833 1006408 1073974 1023743 999300 951314 936978
2283I36978k3533J7323O9237p607l9438m6793P8331N8877k8912J1003n387k2963
$$ 936978 913445 930768 1000005 992398 952960 906167 984498 1043375 1014463 1025466 1020079 997116
2271I97116l9726J8417N4698r981n9576P4208K0302o860L1223j748Q1071p144
$$ 997116 957390 975807 1030505 1020524 960948 1035156 1055458 1048598 1079821 1078073 1159144 1152000
2259A152000L7203l0673p42k2928k7023m5555l090k482n9580J3221R4436N9018
$$ 1152000 1189203 1158530 1157788 1134860 1107837 1062282 1059192 1056710 997130 1010351 1104787 1163805
2247A163805o4982L474Q959o674L4507o3147R0607K1332L8770m2827o3467j05364
$$ 1163805 1098823 1102297 1111256 1104582 1139089 1075942 1166549 1187881 1226651 1183824 1120357 1014993
2235A014993j08717K591M0333N3510J5257O4822j7532L2970k2378J9590o3206
$$ 1014993 906276 908867 949200 1002710 1017967 1082789 1065257 1098227 1075849 1095439 1032233
2224A032233J5043J0742r765P640l464n13m5729j648k9603l3940n457K7855R4354
$$ 1032233 1047276 1058018 1048253 1055893 1052429 1051916 1006187 1004539 974936 940996 935539 963394 1057748
2211A057748j6131L1304j00003l7336o2204L1119Q7244K3245p326R322n657l9977
$$ 1057748 1041617 1072921 972918 935582 873378 904497 991741 1014986 1007660 1016982 1011325 971348
2199I71348n3165L0789k4k9857K3084K2363R206L272L6624p3023J7562o4m134
$$ 971348 918183 948972 948948 919091 942175 964538 973744 977016 1013640 940617 958179 958115 953981
2186I53981J10372Q1764K4033j4486k6490K0131j6124K2417k8081J3855J0690
$$ 953981 1064353 1146117 1170150 1155664 1129174 1149305 1133181 1155598 1127517 1141372 1152062
2175A152062r743l7383L8557N0498Q7986K0449Q7047l6489m316R3868o1279r490
$$ 1152062 1142319 1104936 1143493 1193991 1281977 1302426 1389473 1352984 1348668 1442536 1381257 1371767
2163A371767J9078R36p7780K2795J03201k5591P6932J0021L9233J02899R1908
$$ 1371767 1390845 1391781 1314001 1336796 1439997 1414406 1491338 1501359 1540592 1643491 1735399
2152A735399O0132J9934K9357K8405r9695K8896Q6586L4727N9851N4036J08102
$$ 1735399 1795531 1815465 1844822 1873227 1773532 1802428 1889014 1923741 1983592 2037628 2145730
2141B145730J05504O1715N4547J38809M9465J65044J66609J80948J52243J41807
$$ 2145730 2251234 2312949 2367496 2506305 2555770 2720814 2887423 3068371 3220614 3362421
2131C362421J97565K01661K02858J23461q2955j82767p1867l0155L5865M5768
$$ 3362421 3559986 3761647 3964505 4087966 4005011 3822244 3750377 3720222 3756087 3801855
2121C801855k012j0441L314O5262Q198J9045K9557M4731j00769N3976L5463K8097
$$ 3801855 3799843 3789402 3792716 3857978 3866176 3885221 3914778 3959509 3858740 3912716 3948179 3976276
2109C976276L0528O5392K24707L7864K15710K99210K70249L28078L61505M00857
$$ 3976276 4006804 4072196 4296903 4334767 4550477 4849687 5119936 5448014 5809519 6210376
2099F210376M28049N46854N19072O45810P26224L64051J25288J53179N45756Q81976
$$ 6210376 6638425 7185279 7704351 8350161 9076385 9440436 9565724 9718903 10264659 11146635
2089A1146635J012791J232554J611569J853450K138167K193709R3799k864040
$$ 11146635 12159426 13391980 15003549 16856999 18995166 21188875 21282674 18418634
2081A8418634l422467k424539j580595j120638p10373m16171k40804k16888j77223
$$ 18418634 14996167 12571628 10991033 9870395 9160022 8743851 8503047 8286159 8108936
2072H108936l0123k9475n5591J01487K05663K58819L75197O09913P37739R18443
$$ 8108936 8078813 8049338 7993747 8095234 8300897 8559716 8934913 9544826 10282565 11201008
2062A1201008J054936J299175J503232J388659J653033K075442K534943L169195
$$ 11201008 12255944 13555119 15058351 16447010 18100043 20175485 22710428 25879623
2054B5879623K770875J7621k860769m202889m015428l161092k097283j387072
$$ 25879623 28650498 28668119 25807350 21604461 17589033 14427941 12330658 10943586
2046A0943586j060649p43098o19678m96711n72558m86059l83261l45797k43005
$$ 10943586 9882937 9139839 8520161 8023450 7450892 6964833 6581572 6235775 5992770
2037E992770j16986o9081O928J19193O8164J25033K79156L30622M33515N10712
$$ 5992770 5875784 5806703 5813631 5932824 6000988 6126021 6405177 6735799 7169314 7680026
2027G680026O14900P44858R29369J124033J024331k60751j769638j917473j433585
$$ 7680026 8294926 9039784 9969153 11093186 12117517 11856766 10087128 8169655 6736070
2018F736070r10411o74534m57654l51035k76518l25150k59220k32893k33702j77300
$$ 6736070 5825659 5151125 4693471 4342436 4065918 3740768 3481548 3248655 3014953 2837653
2008B837653j10355j34723k19686o8109j24529l1826q0205j36220j07083n1315
$$ 2837653 2727298 2592575 2372889 2304780 2180251 2148425 2068220 1932000 1824917 1773602
1998A773602l5163n9149k035r2240p1387l9727o1306j9464r4443j7539k078l2453
$$ 1773602 1738439 1679290 1677255 1585015 1513628 1473901 1412595 1393131 1298688 1281149 1279071 1246618
1986A246618L809j15676l0774o4892j1148n0053o9628o21l612K8592m4945N8166
$$ 1246618 1250427 1134751 1103977 1039085 1027937 977884 908256 907635 904023 932615 887670 945836
1974I45836n5014r6989p3595k1370j3113j2474j3673L8392o856p2643J9877J6761
$$ 945836 890822 793833 720238 698868 685755 673281 659608 698000 691144 618501 638378 655139
1962F55139K3577l7733L1790J091K7461k963J4918K0173q0823n6175j3475L0125
$$ 655139 678716 640983 672773 673864 701325 698362 713280 733453 652630 596455 582980 613105
1950F13105j1029l2846O5707j0740K3389n1924J2614L7904n6031o0291J7420L2541
$$ 613105 602076 569230 634937 624197 647586 595662 608276 646180 590149 529858 547278 579819
1938E79819k5457l7240p5161K8475K3631n226m0693n883m5269o7869M738M8487
$$ 579819 554362 517122 441961 470436 494067 488841 448148 442265 396996 329127 333865 382352
1926C82352n9359J1049O9625K0958J9716L3398j9523Q1703r7777l1955K8751J6
$$ 382352 322993 334042 403667 424625 444341 477739 458216 539919 442142 410187 438938 438954
1914D38954l3138j8594J0215k6751j00678k6236R5333J4171L0851l6046L0109
$$ 438954 405816 387222 397437 370686 270008 243772 339105 353276 384127 348081 378190
1903C78190n01o5574l9047J0835l3030j3906l707L6657P9512l2909q4732k6161
$$ 378190 377689 312115 273068 283903 250873 236967 233260 269917 349429 316520 231788 205627
1891B05627k5750n133M4096N6089O1465l2172n9815L3209m7264M8726k5414L9982
$$ 205627 179877 174744 218840 274929 336394 304222 244407 277616 230352 279078 253664 293646
1879B93646M9798N118P670j2167p0723n1461L5984k282L276M5540K7731L092m3240
$$ 293646 343444 348562 356232 344065 273342 221881 257865 255583 258859 304399 332130 335222 291982
1866B91982l2276k3264j64J7002k8146L4622M9151J13089m0012J0727l9507m5069
$$ 291982 259706 236442 236278 253280 225134 259756 308907 421996 381984 392711 353204 308135
1854C08135q0674J4924N218k9230J8229L122K9971n9661L3080K4435M6735k4681
$$ 308135 227461 242385 247603 218373 236602 239724 269695 210034 243114 267549 314284 289603
1842B89603L562m9347M1268P645L3129J2168j27284m4502L0089J08780l1436j4136
$$ 289603 293165 243818 285086 292731 325860 338028 210744 166242 196331 305111 273675 259539
1830B59539J2933l9289Q250K5871J4360P3552m0912n1357K2150l5636l3124p107
$$ 259539 272472 233183 241433 267304 281664 355216 314304 262947 285097 249461 216337 209230
1818B09230r578k1682m3042J3192Q2556J0428R899K8116o6732O1710j5091m9350
$$ 209230 199652 177970 134928 148120 230676 241104 251003 279119 212387 274097 259006 209656
1806B09656J1201l7650N2006j7049M0231O9708j04395J4387L0669k7715k8395
$$ 209656 220857 183207 235213 218164 258395 328103 223708 238095 268764 241049 212654
1795B12654J00286l1530M9053L0503M1770O2229k7004K2108j8703j8045m9149
$$ 212654 312940 281410 330463 360966 402736 464965 437961 460069 441366 423321 374172
1784C74172l9377K1377k64o0489L3524l3069l9420J29378M3172J8476o718q6955
$$ 374172 334795 356172 355908 295419 328943 295874 256454 385832 429004 447480 440762 353807
1772C53807K3587k592n032L1255J0537k56p9473j52045P0125Q867n1976J2036
$$ 353807 377394 374802 369770 401025 411562 411306 331833 179788 249913 258780 206804 218840
1760B18840R7886P9249O437J5896P6972k7452J6382K9673m6705l2825l7094k2304
$$ 218840 316726 395975 402412 418308 495280 467828 484210 513883 467178 434353 397259 374955
1748C74955M3776q0351k8926m7957k463o2549R695Q1088N2434J0568L3123l8102
$$ 374955 418731 338380 309454 261497 259034 196485 206180 287268 339702 350270 383393 345291
1736C45291k3732l1298M196j0301L991J555r7855R1536l5559P1140o733l3839
$$ 345291 321559 290261 294457 284156 288147 289702 191847 283383 247824 318964 312231 278392
1724B78392l8063l0245J00063L3201P5873q459n9979j7998j08304J0606m7467
$$ 278392 240329 210084 310147 343348 419221 410762 350783 332785 224481 235087 187620
1713A87620M6715k4627J444K6618O8611M9152k0837Q061l3952m8572P680O214
$$ 187620 234335 209708 211152 237770 306381 355533 334696 342757 308805 260233 267913 274127
1701B74127N5075j3620k8697o1163j3778N652j08104n761P3887J0025n682P4199
$$ 274127 329202 315582 286885 225722 211944 217596 109492 103731 177618 187643 181961 256160
1689B56160m535m6587n0559L0861K1007M1387k0785K0361L7821p6975l9429K000
$$ 256160 251625 205038 154479 185340 206347 247734 226949 247310 285131 208156 168727 170727
1677A70727R738o3604L841M9786o2610P0381j5259N8351l2942n0894l6721N755
$$ 170727 180465 116861 120702 170488 107878 178259 163000 221351 188409 137515 100794 106549
1665A06549O7467N1139L1014o2179o1389P066j1898r897o6011m1575j1037O2732
$$ 106549 174016 225155 256169 193990 132601 139667 127769 117872 51861 10286 -751 61981
1653F1981J6402J912J03866m6463n84n9183r006O5816k2589J0110K1749p254j5302
$$ 61981 78383 80295 184161 137698 137114 77931 68925 134741 112152 122262 144011 136757 121455
1640A21455p4265o357K0595j2564n5508R3790L1012O2965n3294k4445K273j4862
$$ 121455 47190 40833 61428 48864 -6644 87146 118158 181123 127829 103384 105657 90795
1628I0795m4697L7169l9229L6933L2541N609L5734l764q864l0635j8202P826m2384
$$ 90795 46098 83267 44038 80971 113512 119121 154855 151091 142227 111592 93390 101216 58832
1615E8832J364M6011l1729m0490Q220l018l2629j5207k0643P8349k502J00105
$$ 58832 60196 106207 74478 33988 42208 39190 6561 -8646 -29289 49060 46558 146663
1603A46663N2564p478q8169j07830J5661p1046K8658R8128k4614J205k9239n464
$$ 146663 199227 191749 103580 -4250 11411 -59635 -30977 67151 42537 43742 14503 9039
1591I039j9662l328K1020M6488l356K645K1368R1281K6576o5645j08674K66k4566
$$ 9039 -10623 -13951 7069 53557 50201 52846 74214 165495 192071 126426 17752 18018 -6548
1578f548K9171j2533O0299K5340n6782K1798j4355k0222N9735m6069O0736M786
$$ -6548 22623 10090 70389 95729 38947 60745 46390 26168 85903 39834 100570 105356
1566A05356l5138K854m9749N7771p2424l623K6506K4330q9510O0798k5707n512
$$ 105356 70218 73072 23323 81094 8670 5047 31553 55883 -33627 27171 1464 -4048
1554d048L5632k7772Q8688R984p8841p313k9730M1664L0781J3436r652n8645m6290
$$ -4048 31584 3812 92500 102484 23643 16330 -13400 28264 59045 72481 62829 4184 -42106
1541d2106K8939m0668R334K147l764L6804l354N2025L3191k3766j2478j03272
$$ -42106 -13167 -53835 -44501 -42354 -46118 -9314 -12668 39357 72548 48782 36304 -66968
1529f6968k0533O0129P7935J2509l6577N5891n6578n5385k0872Q4558q8097K4169
$$ -66968 -87501 -27372 50563 63072 26495 82386 25808 -29577 -50449 34109 -53988 -29819
1517b9819M7070M86J5774k6029R28N3436q9989J3814L918N8857L606J6979l6445
$$ -29819 17251 17737 33511 7482 8410 61846 -28143 -14329 -10411 48446 52052 69031 32586
1504C2586P706m7494J380L2909j7226O4756m5289M5838p2187J0536o813j723m513
$$ 32586 40292 -7202 -5822 27087 9861 74617 29328 75166 2979 13515 6702 4979 466
1491D66r115O3182Q4581L6272j6556N0557N580r8386k6518j2206j0336m6349J9054
$$ 466 -8649 54533 139114 175386 158830 209387 214967 116581 90063 77857 67521 21172 40226
1478D0226L7210j0583j255q1278j4302J08728l2332K1604P0979O0518p3131m3250
$$ 40226 77436 66853 65598 -15680 -29982 78746 46414 68018 138997 199515 126384 83134
1466H3134j0358O4415o0565p5523M0550j6487l6355j1653O4302R826J4843k1900
$$ 83134 72776 137191 76626 1103 41653 25166 -11189 -22842 41460 51286 66129 44229
1454D4229l4600K1067M33o1726M7852n058L4215J7027l5261K5397P7977o7998
$$ 44229 9629 30696 31129 -30597 17255 12197 46412 63439 28178 53575 131552 63554
1442F3554l7362n0405k9217O3451n444L3402J9933j1444L7359p4477p1707J2739
$$ 63554 26192 -24213 -53430 10021 4577 37979 57912 46468 83827 9350 -62357 -49618
1430d9618k9109j8436O0804J948O7597o173J6419O7930J3492k6524r1860Q84K2374
$$ -49618 -78727 -97163 -36359 -34411 33186 27013 43432 111362 124854 98330 6470 7354 29728
1417B9728P434l2563P2025j10138k9387L1652k0548Q1595j0450N9931M8038n0587
$$ 29728 37162 4599 76624 -33514 -62901 -31249 -51797 29798 19348 79279 127317 76730
1405G6730P2054j30899K2566N7002o9789k3364M7403m7058K1747m1729J8677L4239
$$ 76730 148784 17885 40451 97453 27664 4300 51703 4645 26392 -15337 3340 37579
1393C7579o0119J0238M9072n0168L507j1969O549J2843r3628J13541L7492n3875
$$ 37579 -22540 -12302 36770 -13398 -9891 -21860 -15311 -2468 -96096 17445 54937 1062
1381A062K8767J7869l0809k7615m7501O1579K2457j8460l222R757L5377q304n6961
$$ 1062 29829 47698 16889 -10726 -58227 3352 25809 7349 4127 13884 49261 40957 -16004
1368a6004N2087l8264l2597R961l904L8111M530o29M6850m2340m3810l0401K751
$$ -16004 36083 -2181 -34778 -24817 -28721 9390 13920 13291 60141 17801 -26009 -56410 -53659
1355e3659K6762j594M047L2935j4778j6376K5340o224J5690l4786r044L333j5969
$$ -53659 -26897 -28491 -24444 8491 -6287 -22663 2677 -3547 12143 -22643 -31687 -28354 -44323
1342d4323K664M837j3599j6319P2740l3836R3412j7859k9205J4154j7441O3508
$$ -44323 -41659 -36822 -50421 -66740 6000 -27836 65576 47717 18512 32666 15225 78733
1330G8733r6809K4275J2499m0158P0197J1421l4343m5114n6779L4524K0389N0409
$$ 78733 -18076 6199 18698 -21460 48737 60158 25815 -19299 -76078 -41554 -21165 29244
1318B9244K0767l1262L1795m769J1733l9032K2695M8344J9137r8304L3400L3008
$$ 29244 50011 18749 50544 45775 57508 18476 41171 89515 108652 10348 43748 76756
1306G6756k7550r443n1094P4342n3963k9402J30255K8097n9532J0339k560n649
$$ 76756 49206 39763 -11331 63011 9048 -20354 109901 137998 78466 88805 86245 80596
1294H0596o1146l7418J3404P4002K5772M051k1456k1487o2327l7277N7900M8011
$$ 80596 19450 -17968 -4564 69438 95210 99261 77805 56318 -6009 -43286 14614 62625
1282F2625p6970K8860k1054Q3585K336m5485P593p1594l33n4218K2832K8535P069
$$ 62625 -14345 14515 -6539 77046 79382 33897 41490 -30104 -30437 -84655 -61823 -33288 -26219
1269b6219J8095m3083j0469J9126j6577O0970J9314M5940o4432R892J938R9q2164
$$ -26219 -8124 -51207 -61676 -42550 -59127 1843 21157 67097 2665 12557 14495 14594 -67570
1256f7570p1248L4922j5542N8435O1151k2933P8068q5352J9841m8205K1056P336
$$ -67570 -138818 -103896 -119438 -61003 148 -22785 55283 -30069 -10228 -58433 -37377 -30041
1244c0041L3528L8K232j3101J0494l2243m6834J1713q499l4326J3247M8237J6826
$$ -30041 3487 3525 5757 -7344 3150 -29093 -75927 -64214 -72713 -107039 -93792 -45555 -28729
1231b8729M4078m7560O7042l3632N5841j11360p4538o872M6768O2837j0653P1583
$$ -28729 15349 -32211 34831 1199 57040 -54320 -128858 -135730 -88962 -26125 -36778 34805
1219C4805r032n7707L4892J5826L3088o3059O6653l1690R0665m99N600k3022j5648
$$ 34805 25773 -31934 2958 18784 51872 -11187 55466 23776 114441 113942 119542 96520 80872
1206H0872l9400m7389p5651M3577k1884M3874L2119R737m246l9220m1629P7709
$$ 80872 41472 -5917 -81568 -37991 -59875 -16001 16118 25855 21609 -17611 -59240 18469
1194A8469P2819p121J06589M1907k7159l1653o88p4441j04626p134N4800J7418
$$ 18469 91288 84167 190756 232663 205504 173851 173163 98722 -5904 -13038 41762 59180
1182E9180J0846l1088J4021l0774r175o2528L4867J1566R8354Q525R0304n6472
$$ 59180 70026 38938 52959 22185 13010 -49518 -14651 -3085 95269 103794 194098 137626
1170A37626o4564j18235J410J2767o12J43247K1732p176j01773q575O2262j1528
$$ 137626 73062 -45173 -43763 -30996 -31608 111639 133371 126195 24422 15847 78109 66581
1158F6581m721o9347J10023j3792L1891K1850L6889j18194q3163j9137L2033J7293
$$ 66581 61860 -7487 102536 88744 120635 142485 179374 61180 -21983 -41120 -9087 8206
1146H206Q089N7808p8078O9982r8292p3911M8021M7038j1915P920L0673M3510
$$ 8206 16295 74103 -3975 66007 -32285 -106196 -58175 -11137 -23052 -15132 15541 59051
1134E9051n4050M4780K9577l2302p2002R595R760O7896m6239k7342o82J6163j7848
$$ 59051 5001 49781 79358 47056 -24946 -15351 -5591 62305 16066 -11276 -11958 4205 -13643
1121a3643j2378m8142l349J209M8595L0708J4308J0278J4368n3035j0349k9353
$$ -13643 -26021 -74163 -77512 -76303 -27708 3000 17308 27586 41954 -11081 -21430 -50783
1109e0783L0394O7793n7630P1380m0283L9625j7080n1890O1087n587o7775N9101
$$ -50783 -20389 47404 -10226 61154 20871 60496 43416 -8474 52613 47026 -20749 38352
1097C8352Q3888L9699k7603l8375k2590j9382j12818O4773L9057J2748n7623L6681
$$ 38352 122240 161939 134336 95961 73371 53989 -58829 5944 45001 57749 126 36807
1085C6807J4976j9614M823M36K6637k2846j1804R1628K9710K0623j17125l5293
$$ 36807 51783 32169 36992 37428 64065 41219 29415 121043 150753 171376 54251 18958
1073A8958n5883k636q95J5743J35889m8174p3718j1632N8926o0503l5454O2122
$$ 18958 -36925 -39561 -40456 -24713 111176 63002 -10716 -22348 36578 -23925 -59379 2743
1061B743M7271J2974M1001L7104J0012l5675j11544L3720L6880p0697k3318m431
$$ 2743 50014 62988 103989 141093 151105 115430 3886 37606 74486 3789 -19529 -23960
1049b3960M0134k658N6928k9641P2906q0117L7795k4743Q3787l641j07315R5070
$$ -23960 16174 13516 70444 40803 113709 33592 71387 46644 130431 126790 19475 114545
1037A14545O453l1426q7002J09382N2748j11969J1520J4864O9764j8075Q0974
$$ 114545 120998 89572 2570 111952 164700 52731 64251 79115 148879 130804 211778
1026B11778R692N272o8750m0668L4005q692l908J520L899M6863m619k5235P1861
$$ 211778 221470 226742 157992 117324 151329 142637 138729 140249 144148 191011 186392 161157 233018
1013B33018p1554K2489l9615N9413L5663n067j6467j9814m3168k7790l1552M2223
$$ 233018 161464 183953 144338 203751 239414 234347 217880 198066 154898 127108 95556 137779
1001A37779L5651J3565L5912Q6678K6983o5586m7612J8752M6121J9690J4328R2630
$$ 137779 173430 186995 222907 309585 336568 270982 223370 242122 288243 307933 322261 414891
989D14891q4041m3216o4823P0783L3203M145O611R4044P2830k4385K5439n698
$$ 414891 330850 287634 222811 293594 326797 330942 337553 431597 504427 480042 505481 499783
977D99783k0682q2643L844J75896L8854n662K5619K8607n844r5784K8273m4920
$$ 499783 479101 396458 400302 576198 615052 609390 635009 663616 657772 561988 590261 545341
965E45341N5907k631M3461L963O103Q0818K9382J7582K2483m5192J8303O6617
$$ 545341 601248 598617 642078 646041 652144 732962 762344 779926 802409 757217 775520 842137
953H42137R5028j278K7474p6538N3703Q5045M3555Q5834L4630P638J00629O5053
$$ 842137 937165 935887 963361 886823 940526 1025571 1069126 1154960 1189590 1197228 1297857 1362910
941A362910J10882J1443R1341Q5179P650K7943R2018O1281p3410N9117J18691
$$ 1362910 1473792 1485235 1576576 1661755 1669405 1697348 1789366 1850647 1777237 1836354 1955045
930A955045J90181R0619J21679J71775K04102L31720L20718K95202K32055M4677
$$ 1955045 2145226 2235845 2357524 2529299 2733401 3065121 3385839 3681041 3913096 3957773
920C957773J39453Q0593M28636N45465O21112R70642J172407J439378J458464
$$ 3957773 4097226 4177819 4606455 5151920 5773032 6743674 7916081 9355459 10813923
911A0813923J651372K004418K533464L173551K829862j818825n204191l920715
$$ 10813923 12465295 14469713 17003177 20176728 23006590 21187765 15983574 12062859
903A2062859k448047j588987j230290q77826o21087n03506l97458l98074l98271
$$ 12062859 9614812 8025825 6795535 5917709 5296622 4793116 4395658 3997584 3599313
894C599313k73957l04970j79938j08781j45182k47081j78586j16517k8151j08010
$$ 3599313 3325356 3020386 2840448 2731667 2586485 2339404 2160818 2044301 2016150 1908140
884A908140o0310p7655j43138j82149j72412m9185R35l4830j51640j329j32652
$$ 1908140 1847830 1770175 1627037 1444888 1272476 1223291 1224226 1189396 1037756 1036427 903775
873I03775n9430j09813j2432r791o7052Q5437P2005N536m4249Q279n7854p8284
$$ 903775 844345 734532 722100 712309 645257 730694 802699 808235 763986 772265 714411 636127
861F36127q682k0154j9237K0278q8325p1888r187O4381p7419K0144P7774N41j3202
$$ 636127 627445 607291 588054 608332 520007 448119 438932 503313 425894 446038 523812 524353 511151
848E11151m6780K0740L5995n4126m2972r5110O6206l0431O3247p5165j7205q9519
$$ 511151 464371 485111 521106 466980 424008 328898 395104 364673 427920 352755 335550 246031
836B46031m510O5316m6869J2516k4449M719k9946J7996p419n8887N3126k1947
$$ 246031 241521 306837 259968 272484 248035 252754 222808 240804 233385 174498 227624 205677
824B05677k7851K1554N1762l7438m8556l0270l6332p7858O1759J19111l5030K0111
$$ 205677 177826 199380 251142 213704 165148 134878 98546 20688 82447 201558 166528 186639
812A86639l3871L2300n1952L2498m0433P0050k1671j8867j2676o9976l8128q949
$$ 186639 152768 185068 133116 165614 125181 195231 173560 154693 142017 72041 33913 24964
800B4964R748K9412o1937N1119J0481l0293L0239q2500l6103J03558K2069K0493
$$ 24964 34712 64124 2187 53306 63787 33494 63733 -18767 -54870 48688 70757 91250
788I1250n3295O4261r8565n7528r648K1456p4591L3793N4159l895N0129n48J07788
$$ 91250 37955 102216 3651 -53877 -63525 -42069 -116660 -82867 -28708 -32603 17526 16978 124766
775A24766q8522k015P847L4804P5216l7841l4621n2824l5420O924M8504q1583
$$ 124766 36244 34229 42076 76880 152096 114255 79634 26810 -8610 -1686 46818 -34765
763c4765K6388j617l7403L3031L7902M3495m7327P7601J8030p8752j03290J10571
$$ -34765 -8377 -9994 -47397 -14366 23536 67031 19704 97305 115335 36583 -66707 43864
751D3864m7755L6102M1872j959J29k0981M0841j2063Q098n1081J9055k5415L1534
$$ 43864 -3891 32211 74083 72124 72253 51272 92113 80050 88148 37067 56122 30707 62241
738F2241L5331k8655L8547l4861N3597o1718L1353k0927q605j4743p6155M3370
$$ 62241 97572 68917 107464 72603 126200 64482 95835 74908 66303 51560 -24595 18775
726A8775j0633N5324L6631L0919o0443o744p590K1648l0250K7408m259r9871n8483
$$ 18775 8142 63466 100097 131016 70573 63829 56239 77887 47637 75045 70786 -29085 -87568
713h7568J7850L8947J6740K9389m2978p6834r504M6492L4467j7891R3068k8196
$$ -87568 -69718 -30771 -14031 15358 -27620 -104454 -113958 -67466 -32999 -50890 42178 13982
701A3982l2843k0043k3965j1890L7646O185J247K7841n4881M5585o3958k62o8139
$$ 13982 -18861 -38904 -62869 -74759 -37113 -30928 -29681 -1840 -56721 -11136 -75094 -75356 -143495
688a43495O0932J02891M0494N909k7707n7568k3592K9744l8103j2033k6821R0941
$$ -143495 -82563 20328 60822 66731 39024 -18544 -42136 -12392 -50495 -62528 -89349 1592
676A592J0153k1074k2406n3975M5339l3706N9497l241J02001n2901L645m0343
$$ 1592 11745 -9329 -31735 -85710 -40371 -74077 -14580 -17821 84180 31279 34924 -5419
664e419m5878K270L500P0200K4574k253K4537L5577j7194j12649k8555N1257K6354
$$ -5419 -51297 -49027 -45527 24673 49247 46994 71531 107108 89914 -22735 -51290 -33 26321
651B6321J3779Q504J7513K4250k2834l2537l9882j447N321K6512k5814k9417J6100
$$ 26321 40100 48604 66117 90367 67533 34996 -4886 -6333 -1012 25500 -314 -29731 -13631
638a3631l6339O625o0770R521n8247R9630R2241m9215N258R1713q7082j6523q1633
$$ -13631 -49970 -43345 -104115 -94594 -152841 -53211 39030 -10185 -4927 86786 -296 -16819 -98452
625i8452M4464M2112j5232Q7125N9019J0449n0286N4914j6617q0532l4451M5765
$$ -98452 -53988 -11876 -27108 60017 119036 129485 79199 134113 117496 36964 2513 48278
613D8278J8655j30489P8748j5253p9807m27L4535Q5894N74l3780l0751j5349k8319
$$ 48278 66933 -63556 15192 -61 -79868 -80295 -45760 40134 40708 6928 -23823 -39172 -67491
600f7491l3342O122M2491n838O897J7875l080L0545K6404l5629J8976l8846K9929
$$ -67491 -100833 -94711 -52220 -58058 -51161 -33286 -36366 -5821 20583 -15046 3930 -34916 -4987
587d987L5m6605K1272K1211R745K4003K7669k7305J213J595q0201k2710K4100
$$ -4987 -4952 -51557 -30285 -9074 671 24674 52343 25038 26251 27846 -52355 -75065 -50965
574e0965K4794M9411K0545o113l836l8900L1126J6901k0163l3684k140k9860j7128
$$ -50965 -26171 23240 43785 37672 33836 -5064 26062 42963 22800 -10884 -13024 -42884 -60012
561f0012J1186p5882j506P315M0396n0158K2583Q3595k1647k4426J8497j4025
$$ -60012 -48826 -124708 -126214 -118899 -78503 -128661 -106078 -22483 -44130 -68556 -50059 -64084
549f4084k7009L2009J7712M3045m3413n4711Q1211j6805q1219k4937L8015K4649
$$ -64084 -91093 -59084 -41372 1673 -41740 -96451 -15240 -32045 -113264 -138201 -100186 -75537
537g5537N1150j1214K9867r153n2231k1391N3282M0614j0651o7884J3922J0008
$$ -75537 -24387 -35601 -5734 -14887 -67118 -88509 -35227 5387 -5264 -73148 -59226 -49218
525d9218L4623l9463l5522K5283l9432p763L5518N9832K5323J234m1463M8268
$$ -49218 -14595 -54058 -89580 -64297 -103729 -111492 -75974 -16142 9181 10415 -31048 17220
513A7220p5674J7355P761J0517l6157M4886j9804k0698n855q549L4619N062k5974
$$ 17220 -58454 -41099 -33338 -22821 -58978 -14092 -33896 -54594 -60449 -68998 -34379 -29317 -55291
500e5291L2414k7883O1736n258k3176j4633j773l7378k8605J403l459L108k332
$$ -55291 -22877 -50760 10976 5718 -17458 -32091 -33864 -71242 -99847 -98444 -101903 -98795 -101127
487a01127O617M7386l8581k2077N1393K3293L3660m6967l0820l1298j19321M6570
$$ -101127 -94510 -47124 -85705 -107782 -56389 -33096 564 -46403 -77223 -108521 -227842 -181272
475a81272P0999K2139Q0108j4717k3987p2461L9485l9134J5558L4540j0357n5797
$$ -181272 -110273 -88134 -8026 -22743 -46730 -119191 -79706 -118840 -103282 -68742 -79099 -134896
463a34896N30Q3642r939J0931q914m6434m1740n9421J21653O2992q952p1821L0162
$$ -134896 -134366 -50724 -60663 -49732 -58646 -105080 -146820 -206241 -84588 -21596 -30548 -102369 -72207
450g2207l2658L5863P250K2316l1462k0293L2383M4440n8316J1501j7171q003
$$ -72207 -104865 -69002 -61752 -39436 -70898 -91191 -58808 -14368 -72684 -61183 -78354 -86357
438h6357K4324Q076N0154p480J3504K3267m3121k664m940k3183K588L103O900
$$ -86357 -62033 -53957 -3803 -11283 2221 25488 -17633 -20297 -25237 -48420 -45832 -42729 -35829
425c5829P378N8306k4817k0160o2539M5995j871P971p476K6759k8340n1100L8414
$$ -35829 -28451 29855 5038 -15122 -77661 -31666 -33537 -25566 -33042 -6283 -34623 -85723 -47309
412d7309L779j77k3279l894J7606j6501q414m1405L0650n4302L7243k2039p781
$$ -47309 -43530 -43707 -66986 -70880 -53274 -69775 -78189 -119594 -88944 -143246 -106003 -128042 -135823
399a35823N6400O2028p0637J822l6652j9644k0085j6850L6447K306M1110J2685
$$ -135823 -79423 -17395 -88032 -86210 -122862 -142506 -162591 -179441 -142994 -140688 -99578 -86893
387h6893q847k2118J4467m2258k8818j4575K1919K495K2070r71j3512o4497m465
$$ -86893 -95740 -117858 -103391 -145649 -174467 -189042 -167123 -164628 -142558 -143529 -157041 -221538 -226003
374b26003O0917P012n3504M8720k313o384l543j960m5396K9974J6070K9158J5684
$$ -226003 -165086 -158074 -211578 -162858 -165171 -171555 -175098 -177058 -222454 -192480 -176410 -147252 -131568
361a31568J552M912N343k3222K8953R842K1577m007k6269m1758l8796J03267j3064
$$ -131568 -130016 -125104 -119761 -142983 -114030 -104188 -82611 -86618 -112887 -154645 -193441 -90174 -103238
348a03238j4465J9809p808j0109K5460M8533L8981k9336o2040n0766J05345k6224
$$ -103238 -117703 -97894 -105702 -115811 -90351 -41818 -2837 -32173 -94213 -144979 -39634 -65858
336f5858L7200p9064K8454l8458j9257P4305L7948k3261J0802n6260j7884k206
$$ -65858 -28658 -107722 -79268 -117726 -136983 -62678 -24730 -47991 -37189 -93449 -111333 -113539
324a13539K487L5551k1873J6509K46K9442l8818L9855K0232m0680o7037J0587
$$ -113539 -111052 -75501 -97374 -80865 -80619 -51177 -89995 -50140 -29908 -70588 -137625 -127038
312a27038K3082j09357K6417N6459q9687J5057N1598L1323m1603N0740L489O1764
$$ -127038 -103956 -213313 -186896 -130437 -220124 -205067 -153469 -122146 -163749 -113009 -109520 -47756
300d7756l1322K1488k1104n8067m3238k2683l05L7857k9133o2629m1397K6881
$$ -47756 -79078 -57590 -78694 -136761 -179999 -202682 -202987 -165130 -194263 -256892 -298289 -271408
288b71408J8341J04916k9892M9692R430M9031l5683o9766K3133l7401L1626q9026
$$ -271408 -253067 -148151 -178043 -128351 -118921 -69890 -105573 -175339 -152206 -189607 -157981 -247007
276b47007L9720m0116k0240o4859K0795K5131L879J05632Q6514R384j5693n0070
$$ -247007 -207287 -247403 -267643 -332502 -311707 -286576 -282697 -177065 -90551 -81167 -96860 -146930
264a46930l031k2334L8965l8455K7055l0357k2971M4091m9515J9119J1941q3503
$$ -146930 -149961 -172295 -133330 -171785 -144730 -175087 -198058 -153967 -203482 -184363 -172422 -255925
252b55925R805J7464R0261l0012L8241m4420l4715M197m226M5651J458K2576l4536
$$ -255925 -246120 -228656 -138395 -168407 -130166 -174586 -209301 -205104 -209330 -163679 -162221 -139645 -174181
239a74181J484O96K1898q795J5581j4710M1683M055J7013o249Q929p9374j8656
$$ -174181 -172697 -172001 -150103 -158898 -143317 -158027 -116344 -112289 -95276 -101525 -92596 -171970 -190626
226a90626J1486J1838J5482K8037j9101N654p039K5556J726N902o6832m409n4215
$$ -190626 -179140 -167302 -151820 -123783 -142884 -137230 -144269 -118713 -116987 -111085 -177917 -182326 -236541
213b36541L9186M3136l1752k263k9416o4208l6929J08506J4709j6928L5664J3431
$$ -236541 -197355 -154219 -185971 -188234 -217650 -281858 -318787 -210281 -195572 -212500 -176836 -163405
201a63405j3674N1096P1459k4962j0122l0532P225k3926L9086K5143l2529l4247
$$ -163405 -177079 -125983 -54524 -79486 -89608 -120140 -112915 -136841 -97755 -72612 -105141 -139388
189a39388K454J1051m7523K3688J5087M3617q6828O1506N7366J356m4383o296
$$ -139388 -136934 -125883 -173406 -149718 -134631 -91014 -177842 -116336 -58970 -57614 -101997 -108293
177a08293j4440m5920j3039N2612k0988l6096k2344m9729j3039K1064N4664N7067
$$ -108293 -122733 -168653 -181692 -129080 -150068 -186164 -208508 -258237 -271276 -250212 -195548 -138481
165a38481n3687P2567J980M9523m3930m2436k5584l9738L8211l8960J6247m516
$$ -138481 -192168 -119601 -117621 -68098 -112028 -154464 -180048 -219786 -181575 -220535 -204288 -208804
153b08804j5014K4667R1814l4230r968n2923m7476Q4255L4218L84R437K4697l0791
$$ -208804 -223818 -199151 -107337 -141567 -151535 -204458 -251934 -167679 -133461 -133077 -123640 -98943 -129734
140a29734o3442J8386o01o8185p629N9209l1455K4683K3495l7542J1349m0532
$$ -129734 -193176 -174790 -175391 -243576 -251205 -191996 -223451 -198768 -175273 -212815 -201466 -241998
128b41998K4541p275o852L4789m4721M7508L1677l6868l9193L735L2697l2545
$$ -241998 -217457 -224732 -231584 -196795 -241516 -194008 -162331 -199199 -238392 -234657 -201960 -234505
116b34505L2217l634L4827J4664j3438j0897r306j03n009O3668P925k1955n5229
$$ -234505 -202288 -205922 -171095 -156431 -169869 -180766 -190072 -190175 -195184 -131516 -123591 -145546 -200775
103b00775N2263k5845J4329p482Q105j1548p3642L6680j7099M5373m1242k6865
$$ -200775 -148512 -174357 -160028 -167510 -159405 -170953 -244595 -207915 -225014 -179641 -220883 -247748
91b47748n6197N2095M1016P0824L6945l8698j004n3503K7067m3920k4392j121
$$ -247748 -303945 -251850 -210834 -140010 -103065 -141763 -142767 -196270 -169203 -213123 -237515 -238636
79b38636O0504K4201J6762l6179M355j6754n8080j5337L5449L0892j8590N7386
$$ -238636 -178132 -153931 -137169 -173348 -168993 -185747 -243827 -259164 -223715 -192823 -211413 -154027
67a54027J2269O838p7724o1959o583p885L8088K3109K4422j7199M0802p274J4736
$$ -154027 -141758 -134920 -212644 -274603 -281186 -289071 -250983 -227874 -203452 -220651 -179849 -187123 -172387
54a72387O360j0983L4496p534J8090j5194r3689n2407j1050K6940J570K4643K2284
$$ -172387 -166027 -177010 -142514 -150048 -131958 -147152 -240841 -293248 -304298 -277358 -275788 -251145 -228861
41b28861K3936k6097L5062L4739J3445l8216k3610l116P932L6019K4629J7305
$$ -228861 -204925 -231022 -195960 -161221 -147776 -185992 -209602 -212718 -204786 -168767 -144138 -126833
29a26833R736m8598m4235o095m1811n427J1695K4953K0451j888j3218j8428L6058
$$ -126833 -117097 -165695 -209930 -216025 -257836 -263263 -251568 -226615 -206164 -208052 -221270 -239698 -203640
16b03640M730j9649M1041J2517l6810q266N0249j3504p1620j0361L4602j4019
$$ -203640 -198910 -218559 -177518 -165001 -201811 -210077 -159828 -173332 -244952 -255313 -220711 -234730
4b34730Q744J4906Q225p603
$$ -234730 -225986 -211080 -202855 -210458
0b10458
$$ -210458
$$ Imaginary data points
##PAGE= N=2
##DATA TABLE= (X++(I..I)), XYDATA
16383a712122L7852r384j1399l286J9895j0335J5685M3334L7342K0816O0630K6692
$$ -1712122 -1674270 -1683654 -1695053 -1698339 -1678444 -1688779 -1673094 -1629760 -1592418 -1571602 -1510972 -1484280
16371a484280P147K6403M6000N3321k3297k0241l8190J3486P7784K6059K2306
$$ -1484280 -1477133 -1450730 -1404730 -1351409 -1374706 -1394947 -1433137 -1419651 -1341867 -1315808 -1293502
16360a293502N1724L5n213N6077L4071J0180L8862J3029M6810M6215J5061M572
$$ -1293502 -1241778 -1241743 -1246956 -1190879 -1156808 -1146628 -1107766 -1094737 -1047927 -1001712 -986651 -982079
16348i82079J3643N1003n0819K1222j0644K3935L9072O9185P1804m1873M824j8638
$$ -982079 -968436 -917433 -968252 -947030 -957674 -933739 -894667 -825482 -753678 -795551 -790727 -809365
16336h09365L9113K5130M4610J8935K2971L7641O011K8020Q960l3834n5446L1488
$$ -809365 -770252 -745122 -700512 -681577 -658606 -620965 -614954 -586934 -577974 -611808 -667254 -635766
16324f35766P7785Q1652L3393P7776L4690j5755j4304J8186K120K9028m5579J2440
$$ -635766 -557981 -476329 -442936 -365160 -330470 -346225 -360529 -342343 -340223 -311195 -356774 -344334
16312c44334O5344K9884n723N2278J740k8469M0294N9041M6987j1960L2097n623
$$ -344334 -278990 -249106 -254829 -202551 -200811 -229280 -188986 -129945 -82958 -94918 -62821 -68444
16300f8444j5311l38M1665J1746M9781L5535l121M0397L4916k1015J9692k6962
$$ -68444 -83755 -84093 -42428 -30682 19099 54634 51513 91910 126826 105811 125503 98541
16288I8541J0424J8860k0707O4305N3971l4440P942n6633M4086O0891R2379q829
$$ 98541 108965 127825 107118 171423 225394 190954 198896 142263 186349 247240 339619 330790
16276C30790Q976r832k5298M3695N22q884M8104O074q51o663O1712j0747N0377
$$ 330790 339766 329934 304636 348331 348853 339969 388073 394147 393296 386633 448345 437598 487975
16263D87975l0706K0858L9031k3528Q1152l9332O224L9104j0205P1203L1221J775
$$ 487975 457269 478127 517158 493630 574782 535450 541674 580778 570573 641776 672997 674772
16251F74772J4109k9710j6813Q910k2748L5815R8766L250N3482j8513l6804M5092
$$ 674772 688881 659171 642358 651268 628520 664335 763101 766351 819833 801320 764516 809608
16239H09608l4726j3788J8754M2601K3836o770M5105L721J5700o1006K2911p856
$$ 809608 774882 761094 779848 822449 846285 839515 884620 888341 904041 843035 865946 858090
16227H58090M0897N6819M1308N8921q828K0399p6509l8044l9405M1347N4577L2570
$$ 858090 898987 955806 997114 1056035 1047207 1067606 991097 953053 913648 954995 1009572 1042142
16215A042142J6057l8512K4942N553K8132p0737Q9487N197j3650j978M7430J5184
$$ 1042142 1058199 1019687 1044629 1050182 1078314 1007577 1097064 1102261 1088611 1086633 1134063 1149247
16203A149247m3235j360J8516L9098o0978P5145P0717P88k8597l4312K3017P924
$$ 1149247 1106012 1104652 1123168 1162266 1101288 1176433 1247150 1247938 1219341 1185029 1208046 1215970
16191A215970K689M684P0091k7041q036j6954j7989O4133j14143j3400O7569K5739
$$ 1215970 1218659 1223343 1293434 1266393 1258357 1241403 1223414 1287547 1173404 1160004 1227573 1253312
16179A253312J9403P373Q289J7458N9993j5371O6649K6233j8849q127n2438R515
$$ 1253312 1272715 1280088 1288377 1305835 1365828 1350457 1417106 1443339 1424490 1416363 1363925 1373440
16167A373440p0303O8886J7905o2968n3091L5264Q9980m177N2832m274Q155K0783
$$ 1373440 1303137 1372023 1389928 1326960 1273869 1309133 1399113 1394936 1447768 1443494 1451649 1472432
16155A472432K2721K7585N783k7699q805p4969K7090m4892N6468l9262K233j5291
$$ 1472432 1495153 1522738 1528521 1500822 1492017 1417048 1444138 1399246 1455714 1416452 1418685 1403394
$$ [...]
##END NTUPLES=NMR SPECTRUM
##END=
