##TITLE=1H_CA-8795
 CDCl3, 8 sc, 
 25.11.2020
##JCAMPDX= 6.0         $$ Bruker NMR JCAMP-DX V2.0
##DATA TYPE= NMR SPECTRUM
##DATA CLASS= NTUPLES
##ORIGIN= UXNMR, Bruker Analytische Messtechnik GmbH
##OWNER= root
$$ XWIN-NMR		Version 3.5
$$ Wed Nov 25 12:15:47 2020 Russian Standard Time (UT+4h)  she@DPX200
##.OBSERVE FREQUENCY= 200.1315066352
##.OBSERVE NUCLEUS= ^1H
##.ACQUISITION MODE= SIMULTANEOUS
##.ACQUISITION SCHEME= undefined
##.AVERAGES= 8
##.DIGITISER RES= 18
##SPECTROMETER/DATA SYSTEM= spect
##.PULSE SEQUENCE= zg30
##.SOLVENT NAME= CDCl3
##.SHIFT REFERENCE= (INTERNAL, CDCl3, 0, 15.9761)
##AUDIT TRAIL= $$ (NUMBER, WHEN, WHO, WHERE, WHAT)
$$ ##TITLE= Audit trail, XWIN-NMR		Version 3.5
$$ ##JCAMPDX= 5.01
$$ ##ORIGIN= Bruker BioSpin GmbH
$$ ##OWNER= she
$$ F:/spectra/data/she/nmr/H-F/1/pdata/1/auditp.txt
$$ ##AUDIT TRAIL=  $$ (NUMBER, WHEN, WHO, WHERE, WHAT)
(   1,<2020-11-25 12:14:11.98 +0400>,<she>,<DPX200>,
      <created by zg, POWCHK disabled, PULCHK disabled
       configuration hash MD5:
       00 E9 B6 7A A2 85 ED C7 34 08 36 98 17 FE 4E 26
       data hash MD5: 16K
       18 98 35 EA 1E 1F 79 A8 12 C7 D0 D8 A9 7A 9D 8D>)
(   2,<2020-11-25 12:14:20.23 +0400>,<she>,<DPX200>,
      <Start of raw data processing
       efp BC_mod = 2 LB = 0.24 FT_mod = 6 PKNL = 1 PHC0 = -11146.07 PHC1 = 32.60089 SI = 16K 
       data hash MD5: 16K
       70 31 0B C7 03 E3 8D 1B 65 E8 6A F3 A3 81 BC 62>)
(   3,<2020-11-25 12:14:49.70 +0400>,<she>,<DPX200>,
      <pk PHC0 = 20.64628 PHC1 = -24.6 
       data hash MD5: 16K
       1D B2 E2 13 02 29 74 0E 12 E8 0F CC 06 80 97 DC>)
(   4,<2020-11-25 12:14:53.54 +0400>,<she>,<DPX200>,
      <abs ABSG = 5 
       data hash MD5: 16K
       E0 D6 E3 09 EF 9E EE 2E 1B B7 72 D3 CA EF 25 0C>)
$$ ##END=
$$ 
$$ hash MD5
$$ 24 12 B3 BF CC C1 66 49 79 0B CE A9 10 BE A6 AA
##$RELAX= 
##$RELAX= 
##$RELAX= 
##$RELAX= 
##$RELAX= 
##$RELAX= 
$$ Bruker specific parameters
$$ --------------------------
##$DU= <F:/spectra>
##$EXPNO= 1
##$NAME= <H-F>
##$PROCNO= 1
##$TYPE= <nmr>
##$USER= <she>
##$AMP= (0..31)
100 100 100 100 100 100 100 100 100 100 100 100 100 100 100 100 100 100 
100 100 100 100 100 100 100 100 100 100 100 100 100 100 
##$AQSEQ= 0
##$AQ_mod= 1
##$AUNM= <au_zg>
##$AUTOPOS= <>
##$BF1= 200.13
##$BF2= 200.13
##$BF3= 200.13
##$BF4= 200.13
##$BF5= 200.13
##$BF6= 200.13
##$BF7= 200.13
##$BF8= 200.13
##$BYTORDA= 1
##$CFDGTYP= 0
##$CFRGTYP= 5
##$CHEMSTR= <none>
##$CNST= (0..31)
1 1 145 1 1 1 1 1 1 1 1 1 1 1 1 1 1 1 1 1 1 1 1 1 1 1 1 1 1 1 1 1 
##$CPDPRG= <>
##$CPDPRG1= <>
##$CPDPRG2= <>
##$CPDPRG3= <>
##$CPDPRG4= <mlev>
##$CPDPRG5= <mlev>
##$CPDPRG6= <mlev>
##$CPDPRG7= <mlev>
##$CPDPRG8= <mlev>
##$CPDPRGB= <>
##$CPDPRGT= <>
##$D= (0..31)
0 1.2 0 0 0 0 0 0 0 0.06 0 0.03 0 0 0 0 0.0002 0 0 0 0 0 0 0 0 0 0 0 0 
0 0 0 
##$DATE= 1606292051
##$DBL= (0..7)
120 120 120 120 120 120 120 120 
##$DBP= (0..7)
150 150 150 150 150 150 150 150 
##$DBP07= 0
##$DBPNAM0= <>
##$DBPNAM1= <>
##$DBPNAM2= <>
##$DBPNAM3= <>
##$DBPNAM4= <>
$$ [...]
##$SUBNAM3= <"">
##$SUBNAM4= <"">
##$SUBNAM5= <"">
##$SUBNAM6= <"">
##$SUBNAM7= <"">
##$SUBNAM8= <"">
##$SUBNAM9= <"">
##$SW= 16.9725356469052
##$SWIBOX= (0..15)
0 0 2 0 0 0 0 0 0 0 0 0 0 0 0 0 
##$SW_h= 3396.73913043478
##$TD= 16384
##$TD0= 1
##$TE= 0
##$TE2= 300
##$TE3= 300
##$TEG= 300
##$TL= (0..7)
0 120 120 120 120 120 120 120 
##$TP= (0..7)
150 150 150 150 150 150 150 150 
##$TP07= 0
##$TPNAME0= <>
##$TPNAME1= <>
##$TPNAME2= <>
##$TPNAME3= <>
##$TPNAME4= <>
##$TPNAME5= <>
##$TPNAME6= <>
##$TPNAME7= <>
##$TPOAL= (0..7)
0.5 0.5 0.5 0.5 0.5 0.5 0.5 0.5 
##$TPOFFS= (0..7)
0 0 0 0 0 0 0 0 
##$TUNHIN= 0
##$TUNHOUT= 0
##$TUNXOUT= 0
##$USERA1= <user>
##$USERA2= <user>
##$USERA3= <user>
##$USERA4= <user>
##$USERA5= <user>
##$V9= 5
##$VALIST= <valist>
##$VCLIST= <CCCCCCCCCCCCCCC>
##$VD= 0
##$VDLIST= <DDDDDDDDDDDDDDD>
##$VPLIST= <PPPPPPPPPPPPPPP>
##$VTLIST= <TTTTTTTTTTTTTTT>
##$WBST= 1024
##$WBSW= 4
##$XGAIN= (0..3)
0 0 0 0 
##$XL= 0
##$YL= 0
##$YMAX_a= 5042
##$YMIN_a= -4023
##$ZGOPTNS= <>
##$ZL1= 120
##$ZL2= 120
##$ZL3= 120
##$ZL4= 120
##$ABSF1= 16.06726
##$ABSF2= -0.9054031
##$ABSG= 5
##$ABSL= 3
##$ALPHA= 0
##$AQORDER= 0
##$ASSFAC= 0
##$ASSFACI= 0
##$ASSFACX= 0
##$ASSWID= 0
##$AUNMP= <proc_1d>
##$AZFE= 0.1
##$AZFW= 0.1
##$BCFW= 0
##$BC_mod= 2
##$BYTORDP= 0
##$COROFFS= 0
##$CY= -3
##$DATMOD= 1
##$DC= 0
##$DFILT= <>
##$DTYPP= 0
##$F1P= 0
##$F2P= 0
##$FCOR= 1
##$FTSIZE= 16384
##$FT_mod= 6
##$GAMMA= 0
##$GB= 0
##$INTBC= 1
##$INTSCL= 2.992141e-10
##$ISEN= 128
##$LB= 0.24
##$LEV0= 0
##$LPBIN= 0
##$MAXI= 10000
##$MC2= 0
##$MEAN= 0
##$ME_mod= 0
##$MI= 1.114404
##$NCOEF= 0
##$NC_proc= -11
##$NLEV= 6
##$NOISF1= 3.799351
##$NOISF2= 2.8
##$NSP= 0
##$NTH_PI= 0
##$NZP= 0
##$OFFSET= 15.9761
##$PC= 1
##$PHC0= -11125.42
##$PHC1= 8.000891
##$PH_mod= 1
##$PKNL= yes
##$PPARMOD= 0
##$PSCAL= 0
##$PSIGN= 0
##$REVERSE= no
##$SF= 200.130007708106
##$SI= 16384
##$SIGF1= 3
##$SIGF2= 2
##$SINO= 5.538805
##$SIOLD= 16384
##$SREGLST= <1H.CDCl3>
##$SSB= 0
##$STSI= 16384
##$STSR= 0
##$SW_p= 3396.73913043478
##$SYMM= 0
##$S_DEV= 0
##$TDeff= 16384
##$TDoff= 0
##$TI= <>
##$TILT= no
##$TM1= 0
##$TM2= 0
##$TOPLEV= 0
##$USERP1= <user>
##$USERP2= <user>
##$USERP3= <user>
##$USERP4= <user>
##$USERP5= <user>
##$WDW= 1
##$XDIM= 16384
##$YMAX_p= 307950612
##$YMIN_p= -2053950
$$ End of Bruker specific parameters
$$ ---------------------------------
##NTUPLES= NMR SPECTRUM
##VAR_NAME=  FREQUENCY,     SPECTRUM/REAL,   SPECTRUM/IMAG
##SYMBOL=    X,             R,               I
##VAR_TYPE=  INDEPENDENT,   DEPENDENT,       DEPENDENT
##VAR_FORM=  AFFN,          ASDF,            ASDF
##VAR_DIM=   16384,         16384,           16384
##UNITS=     HZ,            ARBITRARY UNITS, ARBITRARY UNITS
##FACTOR=    0.207333158178281, 1,           1
##FIRST=     3197.29700973262, 0,            0
##LAST=      -199.442120702165, 0,           0
##MIN=       -199.442120702165, -2053950,    0
##MAX=       3197.29700973262, 307950612,    0
$$ Real data points
##PAGE= N=1
##DATA TABLE= (X++(R..R)), XYDATA
$$ [...]
$$ plain form
6198 -366093 24473 185440 23101 -43135 -205540 -79005 -131871 -298143 -219232 -41636
6188 -41636 242453 146261 40531 118933 218168 226166 131641 124887 -67486 -182968 -164442
6177 -164442 -77120 -129211 63123 243464 154102 148581 112126 -72317 -172830 -67881 23568
6166 23568 168036 36456 15276 29457 14027 228209 331903 234494 140109 287855 211992
6155 211992 -40448 358397 589018 756656 950454 767130 360889 387773 564004 270233
6145 270233 317294 450583 599144 815963 621085 382892 28563 91922 -7323 148206
6135 148206 298588 293233 190291 229107 264527 294950 308994 293793 349066 174922 88942
6124 88942 102905 156978 192014 327617 570 -124587 -184235 -151208 -220937 -21006 92372
$$ packed form
6198c66093L90566J60967j62339o6236j62405J26535n2866j66272P8911J77596
6188d1636K84089r6192j05730P8402R9235P998r4525o754j92373j15482J8526
6177a64442Q7322n2091J92334J80341q9362n521l6455j84443j00513J04949R1449
6166B3568J44468j31580k1180J4181j5430K14182J03694r7409r4385J47746p5863
6155B11992k52440L98845K30621J67638J93798j83324m06241K6884J76231k93771
6145B70233M7061J33289J48561K16819j94878k38193l54329O3359r9245J55529
6135A48206J50382n355j02942L8816L5420L0423J4044j5201N5273j74144q5980
6124H8942J3963N4073L5036J35603l27047j25157n9648L3027o9729J99931J13378
$$ plain form
6113 92372 -88513 -121003 118046 67632 -51088 -4993 45759 129492 -48733 -65499 49673
6102 49673 95359 -163104 -85924 -87424 -142730 -18694 48177 148833 84381 -116490 -387074
6091 -387074 -23208 -24324 -89035 186624 149771 -143615 -148769 -190662 -240100 -193717 -179277
6080 -179277 -125252 144222 135708 -55277 121822 253293 127955 -103420 -212273 -121070
6070 -121070 217444 148831 -11051 193449 12483 -78163 -203914 -130336 -351552 -392735
6060 -392735 -124032 -99866 -120524 22255 33366 7120 -36458 -230685 -144422 -88642 -114250
6049 -114250 57875 171127 -3793 -217216 -118283 105081 15154 -82064 -126836 -96603 -187724
6038 -187724 -231954 -169999 44616 -26703 -47021 115533 181098 -74486 -251520 -416806 -170804
$$ packed form
6113I2372j80885l2490K39049n0414j18720M6095N0752Q3733j78225j6766J15172
6102D9673M5686k58463P7180j500n5306J24036O6871J00656o4452k00871k70584
6091c87074L63866j116o4711K75659l6853k93386n154m1893m9438M6383J4440
6080a79277N4025K69474q514j90985J77099J31471j25338k31375j08853R1203
6070a21070L38514o8613j59882K04500j80966r0646j25751P3578k21216m1183
6060c92735K68703K4166k0658J42779J1111k6246m3578j94227Q6263N5780k5608
6049a14250J72125J13252j74920k13423R8933K23364q9927r7218m4772L0233r1121
6038a87724m4230O1955K14615p1319k0318J62554O5565k55584j77034j65286K46002
$$ plain form
6027 -170804 39127 -4970 -126491 86102 -228282 -560616 -343672 -331254 -297415 -112472
6017 -112472 -58277 36852 -50521 -37233 144246 257379 82954 -395700 -426117 -253274 -241528
6006 -241528 -311588 -18803 -39250 29876 -166062 -335782 -495871 -517025 -442409 -317036 13048
5995 13048 33665 215496 35266 -39367 42838 -288541 -293701 -14568 -168826 -126103 -134908
5984 -134908 -257429 -154609 -258262 -107877 -131689 -313345 -308365 -287608 -373202 -247294 -382502
5973 -382502 -342901 -144223 -167153 -266799 -466760 -521521 -422096 -217827 -180047 -265028 -248332
5962 -248332 -10338 94744 42189 -197813 -35093 27165 -118001 -183805 -401788 -307713
5952 -307713 -69158 -32311 20458 80372 -65656 -160839 -170233 -223407 -48209 116764 59521
$$ packed form
6027a70804K09931m4097j21521K12593l14384l32334K16944J2418L3839J84943
6017a12472N4195R5129q7373J3288J81479J13133j74425m78654l0417J72843J1746
6006b41528p0060K92785k0447O9126j95938j69720j60089k1154P4616J25373L30084
5995A3048K0617J81831j80230p4633Q2205l31379n160K79133j54258M2723q805
5984a34908j22521J02820j03653J50385k3812j81656M980K0757q5594J25908j35208
5973c82502L9601J98678k2930r9646j99961n4761R9425K04269L7780q4981J6696
5962b48332K37994J05082n2555k40002J62720O2258j45166o5804k17983R4075
5952c07713K38555L6847N2769N9914j46028r5183r394n3174J75198J64973n7243
$$ plain form
5941 59521 184273 35737 -243707 -270354 -209691 -215669 -141306 3320 34953 66600 93505
5930 93505 157958 30981 67384 -107750 -175332 -7406 74781 -32167 -19394 -25800 -64486
5919 -64486 -62618 -169243 -120441 -287910 -457432 -282821 2734 -103307 -239825 -367201
5909 -367201 -334290 -167344 -82703 -265479 -146681 -18325 3410 -191578 -327206 -411931
5899 -411931 -410049 -192323 -129117 -14562 -44683 -3576 5098 -4481 -143673 -286380 -188662
5888 -188662 -29956 -165284 -261488 -264300 -310469 -399436 -531634 -251109 -126058 -246268 -97154
5877 -97154 -121326 -3115 154133 -188950 -288787 -170748 -76885 19010 -20873 22464 145006
5866 145006 122146 11893 32316 39722 -35271 -103660 -167112 -171799 -61396 -38310 -65172 -130905
$$ packed form
5941E9521J24752j48536k79444k6647O0663n978P4363J44626L1633L1647K6905
5930I3505O4453j26977L6403j75134o7582J67926Q2187j06948J2773o406l8686
5919f4486J868j06625M8802j67469j69522J74611K85555j06041j36518j27376
5909c67201L2911J66946Q4641j82776J18798J28356K1735j94988j35628q4725
5899d11931J882K17726O3206J14555l0121M1107Q674r579j39192j42707R7718
5888a88662J58706j35328r6204k812m6169q8967j32198K80525J25051j20210J49114
5877i7154k4172J18211J57248l43083r9837J18039R3863R5895l9883M3337J22542
5866A45006k2860j10253K0423P406p4993o8389o3452m687J10403K3086k6862o5733
$$ plain form
5854 -130905 -276318 -245839 99360 -53953 -183638 -248055 -237703 -46017 -20548 35508 85779
5843 85779 -25440 -129978 -3232 126030 -82452 -209826 -265654 -241789 -24406 54591
5833 54591 274387 -16740 -81692 9740 -68918 -53264 -2250 49181 93849 337912 200159
5822 200159 -69399 -118570 -240474 -407369 -257910 -71407 88382 93800 114372 57136 -50925
5811 -50925 -18857 -177577 -242353 -317695 -189065 -104363 49812 131712 42444 -156168 -58547
5800 -58547 -149676 -349478 -441038 -430682 -124389 -66030 -15064 31093 -124840 -156343 -296487
5789 -296487 -473844 -397902 -151035 66779 136576 87487 125969 -65002 -91872 -103046 -366465
5778 -366465 -329807 -52849 28366 -66128 284254 213283 194194 144089 -27413 -326610 -198300
$$ packed form
5854a30905j45413L0479L45199j53313j29685o4417J0352J91686K5469N6056N0271
5843H5779j11219j04538J26746J29262k08482j27374n5828K3865K17383P8997
5833E4591K19796k91127o4952R1432p8658J5654N1014N1431M4668K44063j37753
5822B00159k69558m9171j21904j66895J49459J86503J59789N418K0572n7236j08061
5811e0925L2068j58720o4776p5342J28630Q4702J54175Q1900q9268j98612R7621
5800e8547r1129j99802r1560J0356L06293N8359N0966M6157j55933l1503j40144
5789b96487j77357P5942K46867K17814O9797m9089L8482j90971k6870j1174k63419
5778c66465L6658K76958Q1215r4494L50382p0971j9089n0105j71502k99197J28310
$$ plain form
5767 -198300 -121244 -344310 -37978 164409 159685 -50305 135421 284571 180278 171585 -21760
5756 -21760 -178482 -234207 -189483 -72355 -72881 -76624 304087 367584 44509 -18503 -1945 -21630
5744 -21630 6976 -91859 -99269 -45104 29754 117047 -82315 -27039 -105192 -505700 -292809
5733 -292809 78965 -57465 -180508 -173682 -209400 -145517 -63634 -530337 -458861 -54510 39080
5722 39080 88264 147575 347512 244052 250533 89162 -26692 -15447 31604 91413 -38091
5711 -38091 -235881 -173088 -183536 -55489 179130 117763 22693 -139200 -39616 -92192 -149494
5700 -149494 7813 72438 181199 186088 173145 140223 108005 95499 -180254 -256521 -129932
5689 -129932 90786 102979 129720 268159 157360 54123 -12247 -133046 -136873 -258254 -157040
$$ packed form
5767a98300P7056k23066L06332K02387m724k09990J85726J49150j04293q693j93345
5756b1760j56722n5725M4724J17128n26l743L80711O3497l23075o3012J6558j9685
5744b1630K8606r8835p410N4165P4858Q7293j99362N5276p8153m00508K12891
5733b92809L71774j36430j23043O826l5718O3883Q1883m66703P1476M04351R3590
5722C9080M9184N9311J99937j03460O481j61371j15854J1245M7051N9809j29504
5711c8091j97790O2793j0448J28047K34619o1367r5070j61893R9584n2576n7302
5700a49494J57307O4625J08761M889j2943l2922l2218j2506k75753p6267J26589
5689a29932K20718J2193K6741J38439j10799j03237o6370j20799l827j21381J01214
$$ plain form
5678 -157040 -1543 115011 151826 -95184 136352 232982 -52771 -186809 43047 79915
5668 79915 124344 320946 297548 137851 -108489 -148419 -170153 -333523 -203579 -395090 -251193
5657 -251193 27493 -119392 -248230 -135962 167759 163360 -146459 -67481 -105139 -275328
5647 -275328 -157698 82904 253846 154611 154383 -17383 -79396 -158388 -405753 -536218 -288337
5636 -288337 -228240 -241823 111777 184850 -26715 -99403 -120188 -149350 -31928 -6256 -26219
5625 -26219 237372 424096 278363 143154 23338 -114923 -311024 -495549 -391428 -232624
5615 -232624 -124282 -110695 226009 111164 44806 -13691 -381662 -455129 -217542 15990
5605 15990 -48300 -175641 71148 85895 -138278 -15579 -113509 -123812 9378 -229269 -211846
$$ packed form
5678a57040J55497J16554L6815k47010K31536R6630k85753j34038K29856L6868
5668G9915M4429J96602k3398j59697k46340l9930k1734j63370J29944j91511J43897
5657b51193K78686j46885j28838J12268L03721m399l09819P8978l7658j70189
5647b75328J17630K40602J70942r9235k28j71766o2013p8992k47365j30465K47881
5636b88337O0097j3583L53600P3073k11565p2688k0785k9162J17422K5672j9963
5625b6219K63591J86724j45733j35209j19816j38261j96101j84525J04121J58804
5615b32624J08342J3587L36704j14845o6358n8497l67971p3467K37587K33532
5605A5990o4290j27341K46789J4747k24173J22699r7930j0303J33190k38647J7423
$$ plain form
5594 -211846 2702 -36488 -133088 -8052 230881 44412 -232733 -188217 -234072 -450213
5584 -450213 -323110 -227696 -3437 40838 4601 240986 184536 1884 68061 28362 76443
5573 76443 95505 9313 -143599 -126516 -88957 -185031 -86306 -131537 -173574 -288473 -249150
5562 -249150 -137058 -73834 -144052 -167826 -233426 -489441 -442249 -345816 -228929 -212445 -253963
5551 -253963 -83247 117502 7091 -161452 -161218 -201682 -359867 -222997 -204684 -314105 -438821
5540 -438821 -684233 43220 362050 132922 -53157 -149205 -53698 48164 -32788 -93513
5530 -93513 -12053 -225750 -165828 30208 -146622 -263817 -212383 -117140 -128700 18134 37732
5519 37732 -95014 -68641 -125401 -101468 -258022 -18405 -11976 -186604 -319526 -114499 -192616
$$ packed form
5594b11846K14548l9190r6600J25036K38933j86469k77145M4516m5855k16141
5584d50213J27103R5414K24259M4275l6237K36385n6450j82652O6177l9699M8081
5573G6443J9062q6192j52912J7083L7559r6074R8725m5231m2037j14899L9323
5562b49150J12092O3224p0218k3774o5600k56015M7192R6433J16887J6484m1518
5551b53963J70716K00749j10411j68543K34m0464j58185J36870J8313j09421j24716
5540d38821k45412P27453L18830k29128j86079r6048R5507J01862q0952o0725
5530i3513Q1460k13697N9922J96036j76830j17195N1434R5243j1560J46834J9598
5519C7732j32746K6373n6760K3933j56554K39617O429j74628j32922K05027p8117
$$ plain form
5508 -192616 -90016 -2438 152870 171368 118103 402244 185942 -49951 31785 126911 -120394
5497 -120394 192066 187085 80242 75307 -90237 -165961 -47165 48619 -60674 -80693 230624
5486 230624 239887 143733 -783 31814 54036 -19208 139315 160894 108841 -64097 71759
5475 71759 201975 126192 -112126 -286405 -288515 -118753 -90488 -342678 -380323 -133845 -163815
5464 -163815 -132452 -17817 -173733 -163876 -202989 -180958 -239618 -298112 -115712 -130846 -187110
5453 -187110 -319595 -195821 -78037 -158539 -265084 -456733 -501291 -360443 -437161 -457975
5443 -457975 -361302 -332151 -189765 -174692 -148101 -320860 -261886 -22726 182406 95557 -26774
5432 -26774 14778 -40221 -32683 -212743 -100125 75661 -16297 -1191 210260 138589 -7916
$$ packed form
5508a92616J02600Q7578J55308J8498n3265K84141k16302k35893Q1736R5126k47305
5497a20394L12460m981j06843m935j65544p5724J18796R5784j09293k0019L11317
5486B30624R263r6154j44516L2597K2222p3244J58523K1579n2053j72938J35856
5475G1759J30216p5783k38318j74279k110J69762K8265k52190l7645K46478k9970
5464a63815L1363J14635j55916R857l9113K2031n8660n8494J82400j5134n6264
5453a87110j32485J23774J17784q0502j06545j91649m4558J40848p6718k0814
5443d57975R6673K9151J42386J5073K6591j72759N8974K39160K05132q6849j22331
5432b6774M1552n4999P538j80060J12618J75786r1958J5106K11451p1671j46505
$$ plain form
5421 -7916 -363779 -144193 -115303 -294540 -175165 -136922 -80239 14868 246630 249894 320924
5410 320924 104740 -88595 -61514 -95154 112207 109514 124104 295971 238076 26273 -98668
5399 -98668 -117815 -302346 -217459 -85806 -26586 69843 -33337 -165554 39166 -227735 -248723
5388 -248723 26830 96867 -32438 -165328 -96222 -49522 -43737 -100543 -103334 64269 -181279
5377 -181279 -273721 -139895 -126726 -336371 -340143 -133103 -75685 46471 -243578 -323177 -208706
5366 -208706 -258640 -250211 -138249 -73459 73407 236746 227269 197586 211530 37058 -16189
5355 -16189 -65351 -451433 -546181 -169720 157834 122389 -27545 15356 147506 23641 -183612
5344 -183612 -227230 31846 -95732 -66092 287727 276539 205983 119337 -9210 67934 -253880
$$ packed form
5421g916l55863K19586K8890j79237J19375L8243N6683R5107K31762L264P1030
5410C20924k16184j93335K7081l3640K07361k693J4590J71867n7895k11803j24941
5399i8668j9147j84531Q4887J31653N9220R6429j03180j32217K04720k66901k0988
5388b48723K75553P0037j29305j32890O9106M6700N785n6806k791J67603k45548
5377a81279r2442J33826J3169k09645l772K07040N7418J22156k90049p9599J14471
5366b08706m9934Q429J11962O4790J46866J63339r477k9683J3944j74472n3247
5355a6189m9162l86082r4748L76461L27554l5445j49934M2901J32150j23865k07253
5344a83612m3618K59076j27578K9640L53819j1188p0556q6646j28547P7144l21814
$$ plain form
5333 -253880 -399964 -113364 88220 124501 46143 74331 -174000 -110444 -81822 -138717 -84296
5322 -84296 -117348 -138611 -51016 91268 -186394 -306776 -157343 -120476 -209290 -260360 -209131
5311 -209131 -167765 -62597 -227466 -99032 157550 150508 -4865 38856 78339 -148992 -413808
5300 -413808 -384252 -206173 -254877 -94052 231898 157349 105344 -116371 -167012 -143144 -380497
5289 -380497 -156426 79436 161092 227749 30510 122793 231554 7150 -231217 -293729
5279 -293729 -277617 -78625 19088 77615 -1873 -240876 -336950 -246085 -413421 -551429 -428107
5268 -428107 -155272 -15900 -12828 -8729 117578 183333 -145177 -126956 -164583 -267469 -264364
5257 -264364 -25323 5627 -960 -208162 -178785 92012 -596 -107619 -131175 2738 -204036
$$ packed form
5333b53880j46084K86600K01584L6281p8358K8188k48331O3556K8622n6895N4421
5322h4296l3052k1263Q7595J42284k77662j20382J49433L6867q8814n1070N1229
5311b09131M1366J05168j64869J28434K56582p042j55373M3721L9483k27331k64816
5300d13808K9556J78079m8704J60825L25950p4549n2005k21715n0641K3868k37353
5289c80497K24071K35862Q1656O6657j97239R2283J08761k24404k38367o2512
5279b93729J6112J98992R7713N8527p9488k39003r6074R0865j67336j38008J23322
5268d28107K72835J39372L072M099J26307O5755l28510J8221l7627j02886L105
5257b64364K39041L0950o587k07202K9377K70797r2608j07023k3556J33913k06774
$$ plain form
5246 -204036 -278846 -56819 -1670 110384 145984 194595 288569 -25388 -171528 -312393 -112902
5235 -112902 157435 99846 280612 367801 182316 -253422 -436280 -315188 -143302 -258290
5225 -258290 -173694 67453 8931 18985 19584 -56898 -151518 -224483 -238222 -147227 -112614 15086
5213 15086 182279 526642 600453 313691 115073 -270583 -293306 -217416 57390 224242
5203 224242 28971 -356007 -162528 -108303 -112166 -1486 -77435 -191074 -196960 63033 187202
5192 187202 62483 -108171 3447 241365 247569 19264 39366 102924 72559 -185669 -388338
5181 -388338 -378180 -292450 -310815 -447144 -544719 -274034 -81525 -99841 -128645 -243309 -434738
5170 -434738 -290284 35 152715 296005 214704 91215 -32928 -117721 -169338 15308
$$ packed form
5246b04036p4810K22027N5149J12054L5600M8611R3974l13957j46140j40865J99491
5235a12902K70337n7589J80766Q7189j85485m35738j82858J21092J71886j14988
5225b58290Q4596K41147n8522J0054N99p6482r4620p2965j3739R0995L4613J27700
5213A5086J67193L44363P3811k86762j98618l85656k2723P5890K74806J66852
5203B24242j95271l84978J93479N4225l863J10680p5949j13639n886K59993J24169
5192A87202j24719j70654J11618K37918O204k28305K0102O3558l0365k58228k02669
5181c88338J0158Q5730j8365j36329r7575K70685J92509j8316k8804j14664j91429
5170d34738J44454K90319J52680J43290q1301j23489j24143q4793n1617J84646
$$ plain form
5160 15308 126318 65701 282327 216875 -85752 -435110 -384585 -155491 -106932 -213889 -254213
5149 -254213 5650 269314 332131 54324 -17601 61620 -12055 64473 205661 -20809 -25558
5138 -25558 142587 187061 79992 56419 109842 70831 -191021 -244373 -4276 45015 150505
5127 150505 199230 49325 6593 110231 108689 135615 330230 298900 -36563 87970 82940
5116 82940 -63363 -118076 75543 207574 107055 -89845 -201251 -219600 -198474 -139764 -161595
5105 -161595 127591 96656 -144667 -183187 -97652 -274240 -389108 -286704 -13728 61368
5095 61368 200680 475236 262884 239310 257003 70423 -45210 -89525 52760 59835 127868
5084 127868 21174 95866 166277 63127 -144300 -182100 -165482 259826 197608 125054 394590
$$ packed form
5160A5308J11010o0617K16626o5452l02627l49358N0525K29094M8559j06957m0324
5149b54213K59863K63664O2817k77807p1925P9221p3675P6528J41188k26470m749
5138b5558J68145M4474j07069k3573N3423l9011k61852n3352K40097M9291J05490
5127A50505M8725j49905m2732J03638j542K6926J94615l1330l35463J24533n030
5116H2940j46303n4713J93619J32031j00519j96900j11406j8349K1126N8710k1831
5105a61595K89186l0935k41323l8520Q5535j76588j14868J02404K72976P5096
5095F1368J39312K74556k12352k3574J7693j86580j15633m4315J42285P075O8033
5084A27868j06694P4692P0411j03150k07427l7800J6618M25308o2218p2554K69536
$$ plain form
5073 394590 325776 303773 179724 240553 208389 291091 248104 7413 9577 155258 -76707
5062 -76707 -16515 128083 74572 -124331 146122 -118431 -344751 -29923 97116 89403 113520
5051 113520 373459 662203 519023 360213 111458 -43204 -159906 89372 453864 468955
5041 468955 610312 378905 -40348 -65595 -127969 -185127 -92553 111422 101561 -46014 257620
5030 257620 239962 257964 403084 287846 220387 304408 335544 182631 450416 721192 431397
5019 431397 186501 233271 166730 -190298 -22971 372166 579500 505342 368180 256798
5009 256798 290733 382242 37597 -21137 139915 425137 528973 498966 641665 537451
4999 537451 180373 309395 262045 45408 185507 293277 245317 59031 294245 474085
$$ packed form
5073C94590o8814k2003j24049O0829l2164Q2702m2987k40691K164J45681k31965
5062g6707O0192J44598n3511j98903K70453k64553k26320L14828J27039p713K4117
5051A13520K59939K88744j43180j58810k48755j54662j16702K49278L64492J5091
5041D68955J41357k31407m19253k5247o2374n7158R2574K03975r861j47575L03634
5030B57620j7658J8002J45120j15238o7459Q4021L1136j52913K67785K70776k89795
5019D31397k44896M6770o6541l57028J67327L95137K07334p4158j37162j11382
5009B56798L3935R1509l44645n8734J61052K85222J03836l0007J42699j04214
4999E37451l57078J29022m7350k16637J40099J07770m7960j86286K35214J79840
$$ plain form
4989 474085 487624 409625 263679 83625 103023 165610 344968 477076 533398 425181 190642
4978 190642 225983 326379 207425 7003 173406 42665 65904 331610 253252 354222
4968 354222 361550 467209 262655 311917 206608 -133700 -32368 140250 -127542 -205907
4958 -205907 302691 307179 181722 188702 100792 -49482 -61614 -37294 152596 271525 124513
4947 124513 172682 34525 -93837 -62299 40909 79015 279535 53503 -139785 -100564
4937 -100564 -53793 -82667 30213 231597 255580 130319 467718 575985 247015 368144
4927 368144 228277 -10047 -126117 39315 -60406 -88160 24224 1619 -74250 -63504 17282
4916 17282 12516 3371 -1829 -80803 15188 200238 142663 -221883 -326331 -185365 -179068 82381
$$ packed form
4989D74085J3539p7999j45946j80054J9398O2587J79358J32108N6322j08217k34539
4978A90642L5341J00396j18954k00422J66403j30741K3239K65706p8358J00970
4968C54222P328J05659k04554M9262j05309l40308J01332J72618k67792p8365
4958b05907N08598M488j25457O980q7910j50274j2132K4320J89890J18929j47012
4947A24513M8169j38157j28362L1538J03208L8106K00520k26032j93288L9221
4937a00564M6771k8874J12880K01384K3983j25261L37399J08267l28970J21129
4927C68144j39867k38324j16070J65432r9721k7754J12384k2605p5869J0746Q0786
4916A7282m766r145n200p8974R5991J85050n7575l64546j04448J40966O297K61449
$$ plain form
4904 82381 347528 387729 440733 323546 196247 55465 11087 96275 180253 196416 336847
4893 336847 421522 280472 420809 252898 -207914 -111336 -52278 -66068 21267 216363 239356
4882 239356 227023 361106 260433 164665 162244 -25722 -97048 166291 360005 252316 132572
4871 132572 295090 101094 -207231 -143535 -93202 -24279 198220 135168 122834 74689 19926
4860 19926 21451 -39654 -106189 -87164 -220894 -53299 250448 79136 121919 122886 153167 112770
4848 112770 208300 293939 88937 28980 249203 41612 -80146 190357 326940 99738
4838 99738 -4702 -148511 -242140 -130660 -22448 -119335 1897 251885 300388 36394
4828 36394 282483 372157 160674 -64007 40652 241515 304762 428666 238049 185779
$$ packed form
4904H2381K65147M0201N3004j17187j27299j40782m4378Q5188Q3978J6163J40431
4893C36847Q4675j41050J40337j67911m60812R6578N9058j3790Q7335J95096K2993
4882B39356j2333J34083j00673r5768k421j87966p1326K63339J93714j07689j19744
4871A32572J62518j93996l08325O3696N0333O8923K22499o3052j2334m8145n4763
4860A9926J525o1105o6535J9025j33730J67595L03747j71312M2783R67L0281m0397
4848A12770R5530Q5639k05002n9957K20223k07591j21758K70503J36583k27202
4838I9738j04440j43809r3629J11480J08212r6887J21232K49988M8503k63994
4828C6394K46089Q9674k11483k24681J04659K00863O3247J23904j90617n2270
$$ plain form
4818 185779 147937 129263 -55310 75635 219726 74793 19224 202016 67040 101568
4808 101568 286957 244194 175033 212270 265570 237542 154092 108042 127381 -101565 -67730
4797 -67730 68565 10105 16522 -8842 -150223 -100010 332789 85650 -78077 32408 84010
4786 84010 96965 82765 170404 220872 80364 226153 366900 102599 36611 246720 189359
4775 189359 158525 102270 -48085 23195 218262 287543 -37990 18043 26635 -92165 -229272
4764 -229272 -182874 -35252 -47285 114148 239346 191085 145886 322035 80531 -36318
4754 -36318 105702 303383 326275 460610 328503 356209 209639 107265 75123 -40847
4744 -40847 180916 231551 7805 189868 388212 216869 282044 223730 84905 -64554
$$ packed form
4818A85779l7842j8674j84573J30945J44091j44933n5569J82792j34976L4528
4808A01568J85389m2763o9161L7237N3300k8028q3450m6050J9339k28946L3835
4797f7730J36295n8460O417k5364j41381N0213M32799k47139j63727J10485N1602
4786H4010J2955j4200Q7639N0468j40508J45789J40747k64301o5988K10109n7361
4775A89359l0834n6255j50355P1280J95067O9281l25533N6033Q592j18800j37107
4764b29272M6398J47622j2033J61433J25198m8261m5199J76149k41504j16849
4754c6318J42020J97681K2892J34335j32107K7706j46570j02374l2142j15970
4744d0847K21763N0635k23746J82063J98344j71343O5175n8314j38825j49459
$$ plain form
4734 -64554 -341842 -402089 -132177 -11243 73267 155673 65258 47696 21995 40544 221919
4723 221919 161063 149700 282761 417471 442804 219681 78053 41095 33589 92643 164689
4712 164689 251885 190941 92869 -249756 -141359 -141657 28151 19663 46109 128233 -2085
4701 -2085 -7023 132668 194926 91227 110997 147766 41351 4052 252324 157944 -23097
4690 -23097 47598 194297 93692 83478 15475 33663 340381 213885 30746 104126 157064
4679 157064 -85890 -43649 95989 113628 180937 375408 410542 -37208 327 4179 -89186
4668 -89186 -100393 345159 382121 272625 315923 140082 -37512 60863 72605 99548 267537
4657 267537 325571 166396 -58869 29808 94489 97729 -109467 97355 153423 64865 176730
$$ packed form
4734f4554k77288o0247K69912J20934Q4510Q2406r0415j7562k5701J8549J81375
4723B21919o0856j1363J33061J34710K5333k23123j41628l6958p506N9054P2046
4712A64689Q7196o0944r8072l42625J08397k98J69808q488K6446Q2124j30318
4701b085m938J39691O2258j03699J9770L6769j06415l7299K48272r4380j81041
4690b3097P0695J46699j00605j0214o8003J8188L06718j26496j83139P3380N2938
4679A57064k42954M2241J39638J7639O7309J94471L5134m47750L7535L852r3365
4668h9186j1207M45552L6962j09496M3298j75841j77594R8375J1742K6943J67989
4657B67537N8034j59175k25265Q8677O4681L240k07196K06822N6068q8558J11865
$$ plain form
4646 176730 185731 47592 253595 380702 294743 283346 200257 -75818 21461 209018 45237
4635 45237 -6042 270035 456069 495935 542067 709053 576164 518528 370951 68910 -35714
4624 -35714 123072 62682 319409 511545 339777 270855 31838 -3601 -19167 -216984 -73175
4613 -73175 435664 512060 338603 663434 700678 584356 572774 409844 501655 508897 541063
4602 541063 557767 373342 510453 757229 660603 755607 806178 718258 406109 526019 885793
4591 885793 751138 941981 1164651 1201144 1418573 1397993 1458082 1389632 1440033 1323908 1279838
4580 1279838 1321018 1314735 1197969 1249789 1007429 856169 858450 867331 731600 613081 848666
4569 848666 697078 807787 688263 680781 686626 686532 553691 588584 744600 918394 1260157
$$ packed form
4646A76730R001j38139K06003J27107q5959j1397q3089k76075R7279J87557j63781
4635D5237n1279K76077J86034L9866M6132J66986j32889n7636j47577l02041j04624
4624c5714J58786o0390K56727J92136j71768o8922k39017l5439j5566j97817J43809
4613g3175N08839P6396j73457L24831L7244j16322j1582j62930R1811P242L2166
4602E41063J6704j84425J37111K46776r6626R5004N0571q7920l12149J19910L59774
4591H85793j34655J90843K22670L6493K17429k0580O0089o8450N0401j16125m4070
4580A279838M1180o283j16766N1820k42360j51260K281Q881j35731j18519K35585
4569H48666j51588J10709j19524p482N845r4j32841L4893J56016J73794L41763
$$ plain form
4558 1260157 1100927 1154163 1111625 912556 865225 886463 771038 797120 736152 669996 590224
4547 590224 636684 581869 691293 729957 810655 761334 742862 879170 941436 987599 938704
4536 938704 751296 653069 792421 810614 713247 617775 705409 840224 760455 861685 938927
4525 938927 972574 1069327 1099850 1075517 1019429 933279 952335 1006797 827809 662502 670229
4514 670229 841882 777343 784271 840043 645103 628491 687459 409740 517540 610729 633919
4503 633919 720691 1086953 756163 568118 894566 732554 741785 674600 698894 1085285 1388054
4492 1388054 1322568 1222813 1251198 1360876 1203980 1116950 942018 827877 965163 995819
4482 995819 1047160 965395 1058951 771601 801280 608571 709347 962646 931111 841545 968701
$$ packed form
4558A260157j59230N3236m2538j99069m7331K1238j15425K6082o0968o6156p9772
4547E90224M6460n4815J09424L8664Q0698m9321j8472J36308O2266M6163m8895
4536I38704j87408r8227J39352J8193r7367r5472Q7634J34815p9769J01230P7242
4525I38927L3647R6753L0523k4333n6088q6150J9056N4462j78988j65307P727
4514F70229J71653o4539O928N5772j94940j6612N8968k77719J07800R3189K3190
4503F33919Q6772L66262l30790j88045L26448j62012R231o7185K4294L86391L02769
4492A388054o5486r9755K8385J09678j56896q7030j74932j14141J37286L0656
4482I95819N1341q1765R3556k87350K9679j92709J00776K53299l1535q9566J27156
$$ plain form
4471 968701 1047759 862875 1013821 1275008 1038246 809378 664265 567713 901624 976301
4461 976301 1013590 914348 955232 1022567 1044286 948882 723631 828292 814099 895495 988817
4450 988817 777794 880714 1171185 1062778 1020560 884184 735299 973769 1311912 1327121
4440 1327121 1236567 1248660 1241540 1332618 1468598 1306618 1156537 1195883 1231270 1167454 1244986
4429 1244986 1563469 1441581 1262804 1257194 1059447 1262249 1386715 1387393 1648989 1489483
4419 1489483 1639756 1690254 1480610 1656079 1879898 1459676 1197534 1441665 1495121 1514547
4409 1514547 1623177 1554386 1571740 1433062 1641369 1684514 1843440 1912957 1729022 1725938 1775572
4398 1775572 1747684 1950270 2060269 2131517 2083086 1822017 2000357 2092749 1966615 1735469
$$ packed form
4471I68701P9058j84884J50946K61187k36762k28868j45113r6552L33911P4677
4461I76301L7289r9242M0884O7335K1719r5404k25251J04661j4193Q1396R3322
4450I88817k11023J02920K90471j08407m2218j36376j48885K38470L38143J5209
4440A327121r0554J2093p120R1078J35980j61980j50081L9346L5387o3816P7532
4429A244986L18483j21888j78777n610j97747K02802J24466O78K61596j59506
4419A489483J50273N0498k09644J75469K23819m20222k62142K44131N3456J9426
4409A514547J08630o8791J7354j38678K08307M3145J58926O9517j83935l084M9634
4398A775572k7888K02586J09999P1248m8431k61069J78340R2392j26134k31146
$$ plain form
4388 1735469 1816268 1648481 1810697 2048952 2123261 2355494 2332091 2156503 2010142 2277657
4378 2277657 2443498 2375152 2206532 2375005 2540856 2608002 2578968 2559119 2748459 2927143
4368 2927143 2843419 2763781 2751803 2773412 3056195 3144892 3314083 3168178 3333530 3515675
4358 3515675 3507404 3283760 3290206 3588456 3559323 3689218 4037240 3925062 3967251 4240538 4374214
4347 4374214 4491484 4410284 4551638 4682755 4972732 4935474 4994931 5234391 5373308 5539760
4337 5539760 5652661 5814874 5864458 6108500 6276258 6530462 6759004 6889111 7112534 7365602
4327 7365602 7392897 7352696 7350687 7757918 8073777 7988024 8343684 8443948 8442514 8582255 8583875
4316 8583875 8774234 9147946 9195153 9637101 9958506 9905589 10120627 10460127 10736122 11143085
$$ packed form
4388A735469Q0799j67787J62216K38255P4309K32233k3403j75588j46361K67515
4378B277657J65841o8346j68620J68473J65851O7146k9034j9849J89340J78684
4368B927143q3724p9638j1978K1609K82783Q8697J69191j45905J65352J82145
4358C515675q271k23644O446K98250k9133J29895L48022j12178M2189K73287J33676
4347D374214J17270q1200J41354J31117K89977l7258N9457K39460J38917J66452
4337E539760J12901J62213M9584K44042J67758K54204K28542J30107K23423K53068
4327G365602K7295m0201k009M07231L15859q5753L55660J00264j434J39741J620
4316H583875J90359L73712M7207M41948L21405n2917K15038L39500K75995M06963
$$ plain form
4306 11143085 11375736 11537785 11986414 12339236 12917076 13601366 14058160 14624757 15345089
4297 15345089 15863600 16537619 17287857 17923230 18704261 19735011 20524450 21573812 22805143
4288 22805143 24138667 25486342 26733272 28325047 29930947 31741291 33715219 35846782
4280 35846782 38167489 40840554 44116997 47635436 51694130 56762762 62456860 69017814
4272 69017814 77283161 87086115 99333741 113911357 129422999 144741148 160805552
4265 160805552 176750015 186780289 189293588 188876802 186334974 176452802 160275234 142849362
4257 142849362 126616739 110771435 95857272 82876340 72198738 63769441 56646692
4250 56646692 50440488 45593259 41462144 37753818 34494660 31699636 29351638 27112904
$$ packed form
4306A1143085K32651J62049M48629L52822N77840O84290M56794N66597P20332
4297A5345089N18511O74019P50238O35373P81031J030750P89439J049362J231331
4288B2805143J333524J347675J246930J591775J605900J810344J973928K131563
4280C5846782K320707K673065L276443L518439M058694N068632N694098O560954
4272F9017814Q265347R802954J2247626J4577616J5511642J5318149J6064404
4265A60805552J5944463J0030274K513299m16786k541828r882172j6177568j7425872
4257A42849362j6232623j5845304j4914163j2980932j0677602q429297p122749
4250E6646692o206204m847229m131115l708326l259158k795024k347998k238734
$$ plain form
4242 27112904 25145618 23310912 21925366 20807707 19766522 18706180 17773162 16890855
4234 16890855 16136248 15448654 14869066 14510127 13905860 13431070 12988830 12253614 11564148
4225 11564148 11342024 11009449 10498144 10172877 9902129 9586962 9046555 8941681 8588751
4216 8588751 8440783 7945508 7654812 7423236 7292644 7073425 6818882 6551476 6546603 6180197
4206 6180197 6024850 6137108 5871080 5411099 5270471 5359563 5191250 5317075 5112264 4734424
4196 4734424 4347186 4036105 4090782 4290778 4325347 4371275 4201349 4179592 4134255 3963305
4186 3963305 3925698 3890798 3948317 3709780 4019771 4031715 4013189 4066945 3876675 3760389 3166313
4175 3166313 2949596 3105305 3180306 3112071 3079627 2790282 2963147 3144117 2893663 2642641
$$ packed form
4242B7112904j967286j834706j385546j117659j041185j060342r33018q82307
4234A6890855p54607o87594n79588l58939o04267m74790m42240p35216o89466
4225A1564148k22124l32575n11305l25267k70748l15167n40407j04874l52930
4216H588751j47968m95275k90696k31576j30592k19219k54543k67406m873l66406
4206F180197j55347J12258k66028m59981j40628Q9092j68313J25825k04811l77840
4196D734424l87238l11081N4677J99996L4569M5928j69926k1757m5337j70950
4186C963305l7607l4900N7519k38537L09991J1944j8526N3756j90270j16286n94076
4175C166313k16717J55709P5001o8235l2444k89345J72865J80970k50454k51022
$$ plain form
4165 2642641 2826953 2199001 2107181 2327539 2331527 2371969 2589553 2507519 1984280 2136471
4155 2136471 1969468 1881137 1838938 1883824 1897210 1693409 1802268 2095194 1840220 1853691
4145 1853691 1840659 1584152 1467102 1520792 1707334 1511942 1594578 1497232 1649617 1772079
4135 1772079 1556826 1227504 1030158 1024543 1029887 852002 1264493 1329848 1201128 1116159 1040756
4124 1040756 926479 914126 1072380 870118 765809 693343 954685 1154979 975785 1110132
4114 1110132 1083209 957343 1133661 935985 741079 942445 845116 685479 826349 1017133
4104 1017133 686988 436019 412451 402918 237345 175702 275601 221897 657511 770300 446514
4093 446514 446233 584899 722293 760561 666060 636554 477746 543268 585010 962449 927027
$$ packed form
4165B642641J84312o27952r1820K20358L988M0442K17584q2034n23239J52191
4155B136471j67003q8331m2199M4886J3386k03801J08859K92926k54974J3471
4145A853691j3032k56507j17050N3690J86542j95392Q2636r7346J52385J22462
4135A772079k15253l29322j97346n615N344j77885M12491O5355j28720q4969p5403
4124A040756j14277j2353J58254k02262j04309p2466K61342K00294j79194J34347
4114A110132k6923j25866J76318j97676j94906K01366r7329j59637J40870J90784
4104A017133l30145k50969k3568r533j65573o1643R9899n3704M35614J12789l23786
4093D46514k81J38666J37394L8268r4501k9506j58808O5522M1742L77439l5422
$$ plain form
4082 927027 839572 744225 493361 351157 422744 394740 493975 513415 589680 325405 463764
4071 463764 526121 376325 564885 287601 201054 320392 581209 434176 341466 629757
4061 629757 546391 517663 587454 513662 365473 162450 280442 286521 132425 325960 526003
4050 526003 524742 473985 305203 48585 74065 75991 67283 343790 407421 16077 193120
4039 193120 455911 685580 448864 229442 204982 -153184 -69647 143987 494274 589913
4029 589913 299655 276636 203790 202632 303344 145679 -20843 -40896 223000 206373 378977
4018 378977 368006 204252 93790 163824 118161 157828 343698 315459 182588 250152 267729
4007 267729 402755 617806 392630 34283 202413 167202 61258 26709 253179 336790
$$ packed form
4082I27027q7455r5347k50864j42204P1587k8004R9235J9440P6265k64275J38359
4071D63764O2357j49796J88560k77284q6547J19338K60817j47033r2710K88291
4061F29757q3366k8728O9791p3792j48189k03023J17992O079j54096J93535K00043
4050E26003j261n0757j68782k56618K5480J926q708K76507O3631l91344J77043
4039A93120K62791K29669k36716k19422k4460l58166Q3537K13634L50287R5639
4029E89913k90258k3019p2846j158J00712j57665j66522k0053K63896j6627J72604
4018C78977j0971j63754j10462P0034m5663L9667J85870k8239j32871O7564J7577
4007B67729J35026K15051k25176l58347J68130l5211j05944l4549K26470Q3611
$$ plain form
3997 336790 456952 216730 206281 155433 74951 327839 105874 190527 266591 392547 257107
3986 257107 306988 217483 99152 -210218 -110974 -123704 -45715 55155 -61141 -70418 154129
3975 154129 170917 269664 321995 89463 28728 196962 355764 420249 472421 508872 604805
3964 604805 207722 54112 331646 553625 380891 477613 442073 370729 354277 362661 284779
3953 284779 356685 553175 317623 260467 526746 346830 397652 769416 990911 1210833
3943 1210833 1182334 1227141 1308036 1379041 1167036 1106221 1138105 1146495 1247183 974267 878784
3932 878784 800247 600188 569599 391442 488429 320787 34562 378889 472213 371935
3922 371935 602246 534437 282999 216425 156597 111309 283916 337336 288417 279550 158208
$$ packed form
3997C36790J20162k40222j0449n0848q0482K52888k21965Q4653P6064J25956j35440
3986B57107M9881q9505j18331l09370R9244j2730P7989J00870j16296r277K24547
3975A54129J6788R8747N2331k32532o0735J68234J58802O4485N2172L6451R5933
3964F04805l97083j53610K77534K21979j72734R6722l5540p1344j6452Q384p7882
3953B84779P1906J96490k35552n7156K66279j79916N0822L71764K21495K19922
3943A210833k8499M4807Q0895P1005k12005o0815L1884Q390J00688k72916r5483
3932H78784p8537k00059l0589j78157R6987j67642k86225L44327R3324j00278
3922C71935K30311o7809k51438o6574n9828m5288J72607N3420m8919q867j21342
$$ plain form
3911 158208 371541 258052 215845 243914 26164 -49835 117855 160084 60949 209399 257140
3900 257140 61262 203135 79729 19011 179447 62692 80064 32125 68135 116867 312481
3889 312481 321371 279723 280293 116029 43770 136302 175850 61535 43831 216431 332903
3878 332903 338189 487473 300030 -33732 24053 -60212 -32204 91296 60557 185631 431900
3867 431900 206275 -38991 55304 175989 97034 -13708 -114300 -116110 204448 205139 162642
3856 162642 181497 156423 78618 165715 276539 414420 262832 179712 259824 166767 199627
3845 199627 254579 -13968 -21660 127671 140967 -68927 -140538 160811 142390 70680 -158737
3834 -158737 -90868 -17174 26659 -174105 -320020 -311420 -151004 -9399 158807 373464 252539
$$ packed form
3911A58208K13333j13489m2207K8069k17750p5999J67690M2229r9135J48450M7741
3900B57140j95878J41873j23406o0718J60436j16755J7372m7939L6010M8732J95614
3889C12481Q890m1648N70j64264p2259R2532L9548j14315j7704J72600J16472
3878C32903N286J49284j87443l33762N7785q4265K8008J23500l0739J25074K46269
3867D31900k25625k45266R4295J20685p8955j10742j00592j810L20558O91m2497
3856A62642J8855k5074p7805Q7097J10824J37881j51588q3120Q0112r3057L2860
3845A99627N4952k68547p692J49331J3296k09894p1611L01349j8421p1710k29417
3834a58737O7869P3694M3833k00764j45915Q600J60416J41605J68206K14657j20925
$$ plain form
3823 252539 188538 190045 131213 281830 289332 535955 398858 23681 77752 34961 83606
3812 83606 188544 179723 -194156 -224636 24268 60347 159714 12407 -240353 13301 170255
3801 170255 148093 1814 266722 441692 513759 704823 562559 328873 253796 201267
3791 201267 23870 41368 20303 136766 129900 152302 126124 -37086 -4679 -49447 -74537
3780 -74537 -19095 75559 161191 265028 143338 100638 113359 88213 -4400 27263 220336
3769 220336 193077 397413 161697 -165031 -222765 -271445 -399978 -302376 -198955 -78138
3759 -78138 -123906 -104974 149743 -24828 -144773 -401104 -436272 -293101 -178990 -219890 131037
3748 131037 246857 30371 -91556 -82171 -44335 25201 -58067 -100198 35776 -134373 -53511
$$ packed form
3823B52539o4001J507n8832J50617P502K46623j37097l75177N4071m2791M8645
3812H3606J04938q821l73879l0480K48904L6079R9367j47307k52760K53654J56954
3801A70255k2162j46279K64908J74970P2067J91064j42264k33686p5077n2529
3791B01267j77397J7498k1065J16463o866K2402k6178j63210L2407m4768k5090
3780g4537N5442R4654Q5632J03837j21690m2700J2721k5146r2613L1663J93073
3769B20336k7259K04336k35716l26728n7734m8680j28533R7602J03421J20817
3759g8138m5768J8932K54717j74571j19945k56331l5168J43171J14111m0900L50927
3748A31037J15820k16486j21927R385L7836O9536q3268m2131J35974j70149Q0862
$$ plain form
3737 -53511 14668 72473 57732 157026 197611 174993 5726 101692 267643 42682 -18966
3726 -18966 -14486 -105352 -56654 53498 85224 -17937 -151994 -204211 -304278 -236170 -149690
3715 -149690 -153284 -15908 -116600 -238686 -328294 -496674 -464049 -427703 -212999 72020 148793
3704 148793 81463 147901 186245 -17708 -41447 91208 171817 234434 130423 132213 52173
3693 52173 198741 75140 -139683 -174109 -54481 -139331 -162135 -58162 11198 129892 164024
3682 164024 -31923 69380 135980 12352 193443 45666 265274 117553 -107124 23044
3672 23044 78456 54902 -43366 -94056 19923 -65307 -345608 -450088 -346140 -391547 -170335
3661 -170335 17143 -34375 256677 237613 162408 -176854 -307034 -86349 35344 217996
$$ packed form
3737e3511O8179N7805j4741R9294M0585k2618j69267R5966J65951k24961o1648
3726a8966M480r0866M8698J10152L1726j03161j34057n2217j00067O8108Q6480
3715a49690l594J37376j00692j22086q9608j68380L2625L6346K14704K85019P6773
3704A48793o7330O6438L8344k03953k3739J32655Q0609O2617j04011J790q0040
3693E2173J46568j23601k14823l4426J19628q4850k2804J03973O9360J18694L4132
3682A64024j95947J01303O6600j23628J81091j47777K19608j47721k24677J30168
3672B3044N5412k3554r8268n0690J13979q5230k80301j04480J03948m5407K21212
3661a70335J87478n1518K91052j9064p5205l39262j30180K20685J21693J82652
$$ plain form
3651 217996 123376 -26976 143988 17060 -52895 48528 -78387 -56974 -129043 90335
3641 90335 141879 226334 103207 44116 163087 102673 10003 -167725 75248 270259 95421
3630 95421 211539 167187 256148 144365 -140350 -121569 -85282 -98746 -104793 -14881 -3837
3619 -3837 107922 153076 -38863 -60901 71329 67964 92325 -51171 -27326 -189231 -59373
3608 -59373 172583 -1230 -29955 126238 59092 -44014 -66154 55848 100552 148432 13095
3597 13095 168103 483565 417251 236235 46117 31616 -9050 8223 123810 69413 -21192
3586 -21192 279293 127074 7621 302940 156405 -81455 27589 -72534 -64633 333774
3576 333774 294630 144928 56646 -71476 -411587 -405638 -293927 -339096 -57439 -73450 -23995
$$ packed form
3651B17996r4620j50352J70964j26928o9955J01423j26915K1413p2069K19378
3641I0335N1544Q4455j23127n9091J18971o0414r2670j77728K42973J95011j74838
3630I5421J16118m4352Q8961j11783k84715J8781L6287j3464o047Q9912J1044
3619c837J11759M5154j91939k2038J32230l365K4361j43496K3845j61905J29858
3608e9373K31956j73813k8725J56193o7146j03106k2140J22002M4704M7880j35337
3597A3095J55008L15462o6314j81016j90118j4501m0666J7273J15587n4397r0605
3586b1192L00485j52219j19453K95319j46535k37860J09044j00123P901L98407
3576C33774l9144j49702q8282j28122l40111N949J11711m5169K81657j6011M9455
$$ plain form
3565 -23995 209501 127158 -18552 -49668 -46457 48899 270120 291146 265775 527897 346180
3554 346180 12237 109075 106799 86174 135548 122269 -265213 -475743 -369824 -389292 -201249
3543 -201249 -21376 -192659 -243188 -154531 -101940 -200520 -187147 -336718 -167543 5648 66953
3532 66953 341302 85431 14162 -73951 -225767 -185792 -87400 12296 228324 337895 379234
3521 379234 286160 361391 82546 -163927 -147296 -139449 -143602 -69377 80644 229314 190796
3510 190796 100070 -125627 -387066 -475609 -280604 49040 -46711 64025 48192 -325551
3500 -325551 -317386 -81470 -70591 -206270 29197 -34166 -187477 102835 21108 -76340 69136
3489 69136 229819 239918 62397 194684 91760 -7198 -82459 106042 239648 405566
$$ packed form
3565b3995K33496q2343j45710l1116L211R5356K21221K1026k5371K62122j81717
3554C46180l33943R6838k276k0625M9374j3279l87482k10530J05919j9468J88043
3543b01249J79873j71283n0529Q8657N2591r8580J3373j49571J69175J73191O1305
3532F6953K74349k55871p1269q8113j51816L9975R8392R9696K16028J09571M1339
3521C79234r3074P5231k78845k46473J6631P847m153P4225J50021J48670l8518
3510A90796r0726k25697k61439q8543J95005L29644r5751J10736j5833l73743
3500c25551Q165K35916J0879j35679K35467o3363j53311K90312q1727r7448J45476
3489F9136J60683J0099j77521J32287j02924r8958p5261J88501J33606J65918
$$ plain form
3479 405566 395972 217046 354500 192835 26638 224118 119967 193889 275408 231589 529082
3468 529082 425043 506404 516695 134504 -71709 3196 -58073 58099 386875 644435
3458 644435 658921 519011 216493 163596 4700 138886 -84837 -300190 158132 439193
3448 439193 372643 209470 194496 42222 -112548 -9787 176538 389622 609724 499572
3438 499572 247124 118245 310132 432366 244669 227621 125876 227415 350092 542367
3428 542367 147986 178096 403131 236205 167626 221688 69125 212806 215332 153558 228684
3417 228684 210903 286595 419000 523293 457343 747421 736267 579573 675780 395736 314501
3406 314501 331781 330200 409910 554966 509508 257810 192659 436994 324108 377676 801696
$$ packed form
3479D05566r594j78926J37454j61665j66197J97480j04151P3922Q1519m3819K97493
3468E29082j04039Q1361J0291l82191k06213P4905o1269J16172L28776K57560
3458F44435J4486j39910l02518n2897j58896J34186k23723k15353M58322K81061
3448D39193o6550j63173j4974j52274j54770J02761J86325K13084K20102j10152
3438D99572k52448j28879J91887J22234j87697j7048j01745J01539J22677J92275
3428E42367l94381L0110K25035j66926o8579N4062j52563J43681K526o1774P5126
3417B28684j7781P5692J32405J04293o5950K90078j1154j56694R6207k80044q1235
3406C14501J7280j581P9710J45056m5458k51698o5151K44335j12886N3568M24020
$$ plain form
3395 801696 1036736 835052 678560 798762 743246 1072439 1248569 1456651 1541146 1628946
3385 1628946 1646032 1506235 1629410 1837147 1632931 1687399 1816643 2032417 1855659 1811094
3375 1811094 1532195 1259694 1273900 1081320 1104603 966276 1002231 955694 917801 1187239
3365 1187239 1062119 1062047 738260 615195 415081 249903 373635 659436 665730 974035 811587
3354 811587 446488 375947 623893 793868 797054 949951 735293 829100 978905 792392
3344 792392 535304 704623 1003512 790466 630827 741510 737287 735538 704473 593282 582637
3333 582637 904701 996954 844979 735292 743078 805614 1026438 1091741 1032697 962866 944589
3322 944589 928685 1019001 1117681 1207425 1160279 962714 972244 1059980 1077817 1329700 1354762
$$ packed form
3395H01696K35040k01684j56492J20202n5516L29193J76130K08082Q4495Q7800
3385A628946J7086j39797J23175K07737k04216N4468J29244K15774j76758m4565
3375A811094k78899k72501J4206j92580K3283j38327L5955m6537l7893K69438
3365A187239j25120p2l23787j23065k00114j65178J23732K85801O294L08305j62448
3354H11587l65099p0541K47946J69975L186J52897k14658R3807J49805j86513
3344G92392k57088J69319K98889k13046j59639J10683m223j749l1065j11191j0645
3333E82637L22064R2253j51975j09687P786O2536K20824O5303n9044o9831j8277
3322I44589j5904R0316R8680Q9744m7146j97565R530Q7736J7837K51883K5062
$$ plain form
3311 1354762 1318310 1067013 835773 787240 806104 980959 1091829 1397201 1333088 1377088
3301 1377088 1447666 1208790 1335376 1087323 1080243 1547391 1507282 1393482 1381748 1366103 1390217
3290 1390217 1281863 1271460 1544729 1655387 1452469 1416961 1183626 1198214 1478203 1539942
3280 1539942 1691832 1714174 1414948 1602040 1728719 1574430 1458442 1371185 1381419 1562793
3270 1562793 1887287 2032441 2161684 2070068 1880087 1830224 1561325 1634651 1527309 1603868
3260 1603868 1735279 1754561 1771384 1844440 1784530 1718937 1459264 1281986 1395098 1572269
3250 1572269 1821796 2042793 2274912 2188778 1989364 1556426 1539905 1712572 1961382 2109436
3240 2109436 2242478 2381642 2236622 2101130 2386734 2314883 2197679 2289495 2203584 2344070
$$ packed form
3311A354762l6452k51297k31240m8533J8864J74855J10870L05372o4113M4000
3301A377088P0578k38876J26586k48053p080M67148m0109j13800j1734j5645K4114
3290A390217j08354j0403K73269J10658k02918l5508k33335J4588K79989O1739
3280A539942J51890K2342k99226J87092J26679j54289j15988q7257J0234J81374
3270A562793L24494J45154J29243r1616j89981m9863k68899P3326j07342P6559
3260A603868J31411J9282J6823P3056n9910o5593k59673j77278J13112J77171
3250A572269K49527K20997K32119q6134j99414m32938j6521J72667K48810J48054
3240B109436J33042J39164j45020j35492K85604p1851j17204R1816q5911J40486
$$ plain form
3230 2344070 2390008 2367949 2580145 2718114 2435076 2405991 2311726 2339516 2566654 2285932
3220 2285932 2359160 2504952 2696487 3010777 2861554 2663881 2624484 2481667 2760265 2833208
3210 2833208 2749844 2840322 2832297 2991913 2932048 2959438 2932380 3160452 3084340 2901813 2770550
3199 2770550 3040435 3307896 3293231 3672538 3745228 3654325 3562114 3355750 3279162 3381397
3189 3381397 3156883 3327862 3524260 3998763 4158846 4250387 4155563 3957037 3931523 3858774
3179 3858774 3966703 4219355 4485881 4708843 4742340 4827107 4903514 5107063 5160910 4973067
3169 4973067 5069004 5496207 5761014 5892224 5838455 5734926 5867684 5805408 6130383 6423890
3159 6423890 6382312 6536542 7078046 7074300 7069534 7259597 7616811 7949091 7777878 7907837
$$ packed form
3230B344070M5938k2059K12196J37969k83038k9085r4265K7790K27138k80722
3220B285932P3228J45792J91535L14290j49223j97673l9397j42817K78598P2943
3210B833208q3364R0478q025J59616n9865K7390k7058K28072p6112j82527j31263
3199B770550K69885K67461j4665L79307P2690r0903r2211k06364p6588J02235
3189C381397k24514J70979J96398M74503J60083R1541r4824j98526k5514p2749
3179C858774J07929K52652K66526K22962L3497Q4767P6407K03549N3847j87843
3169D973067R5937M27203K64807J31210n3769j03529J32758o2276L24975K93507
3159F423890m1578J54230N41504l746m766J90063L57214L32280j71213J29959
$$ plain form
3149 7907837 8318274 8463961 8523817 8752004 8992325 9182385 9629002 9576671 9853658 10277212
3139 10277212 10414935 10519654 10751388 11206759 11479661 11759312 12241460 12286528 12354290 12541413
3129 12541413 12743207 12756783 12950349 13290476 13423155 13813975 13944374 14405718 14830777 14978802
3119 14978802 15176600 15374956 15409731 15971188 16513126 17083440 17628918 18263560 18870313 19456491
3109 19456491 20423604 21221236 21909974 22920074 23808870 24944500 26066814 27341323 28597116
3100 28597116 29902178 31557248 33178619 34707296 36444733 38635526 40716694 43198342
3092 43198342 46028853 48474508 51577387 54919511 58383784 62189513 66138833 71076790
3084 71076790 76982361 83632612 91646311 101433826 113358279 127623060 144977347 166483402
$$ packed form
3149G907837M10437J45687N9856K28187K40321J90060M46617n2331K76987M23554
3139A0277212J37723J04719K31734M55371K72902K79651M82148M5068O7762J87123
3129A2541413K01794J3576J93566L40127J32679L90820J30399M61344M25059J48025
3119A4978802J97798J98356L4775N61457N41938N70314N45478O34642O06753N86178
3109A9456491R67113P97632O88738J010100Q88796J135630J122314J274509J255793
3100B8597116J305062J655070J621371J528677J737437K190793K081168K481648
3092D3198342K830511K445655L102879L342124L464273L805729L949320M937957
3084G1076790N905571O650251Q013699R787515J1924453J4264781J7354287K1506055
$$ plain form
3076 166483402 192703121 222334638 249870597 271495619 291047898 307836112 307950612
3069 307950612 290467277 267117258 242978812 214909526 184584829 156974681 134205634
3062 134205634 115963008 101494261 89662471 80005505 71982711 65163594 59406862 54327575
3054 54327575 50155081 46338609 42979066 39962339 37395719 35378952 33168395 31369903
3046 31369903 29749469 27974155 26429100 25189133 23942082 22698187 21722294 20802730
3038 20802730 20266517 19614022 18731618 17940190 17303722 16692798 16010721 15135713 14867003
3029 14867003 14535065 13934379 13435504 12974185 12397379 12079888 11639133 11156059 10783911
3020 10783911 10353409 9918264 9972439 9615488 9272073 9041548 8740650 8659270 8374492 8232388
$$ packed form
3076A66483402K6219719K9631517K7535959K1625022J9552279J6788214J14500
3069C07950612j7483335k3350019k4138446k8069286l0324697k7610148k2769047
3062A34205634j8242626j4468747j1831790r656966q022794o819117n756732n079287
3054E4327575m172494l816472l359543l016727k566620k016767k210557j798492
3046C1369903j620434j775314j545055j239967j247051j243895r75893r19564
3038B0802730n36213o52495q82404p91428o36468o10924o82077q75008k68710
3029A4867003l31938o00686m98875m61319n76806l17491m40755m83074l72148
3020A0783911m30502m35145N4175l56951l43415k30525l00898q1380k84778j42104
$$ plain form
3010 8232388 7861114 7524870 7289411 7091812 7231610 7220805 7052177 6790268 6567866 6090702
3000 6090702 6185232 6297902 6258985 6198503 6306839 6081016 5829713 5967259 5679477 5589604
2990 5589604 5395852 5291455 5079059 5237990 5440509 5379332 5240377 5144432 4768354 4628520
2980 4628520 4696805 4419743 4480945 4766428 4493509 4255412 4208982 4304719 3987578 3852403
2970 3852403 3520221 3406691 3460208 3385964 3384335 3378550 3139736 2930243 3060048 2832779 2778153
2959 2778153 2832266 2799364 2643327 2573493 2738234 2858674 2857727 2637750 2595940 2755782 2902967
2948 2902967 2756692 2308512 2234816 2401446 2326683 2261072 2382609 2133813 2230544 2182941
2938 2182941 1705686 1766109 2039952 2216696 2341783 2336057 2208021 2080207 2258420 1958166
$$ packed form
3010H232388l71274l36244k35459j97599J39798j0805j68628k61909k22402m77164
3000F090702R4530J12670l8917o0482J08336k25823k51303J37546k87782q9873
2990E589604j93752j04397k12396J58931K02519o1177j38955r5945l76078j39834
2980D628520O8285k77062O1202K85483k72919k38097m6430R5737l17141j35175
2970C852403l32182j13530N3517p4244j629n785k38814k09493J29805k27269n4626
2959B778153N4113l2902j56037o9834J64741J20440r47k19977m1810J59842J47185
2948B902967j46275m48180p3696J66630p4763o5611J21537k48796R6731m7603
2938B182941m77255O0423K73843J76744J25087n726j28036j27814J78213l00254
$$ plain form
2928 1958166 1639699 1964130 2160683 1974292 1876497 1737960 1994955 2187437 2180659 2021240
2918 2021240 1977835 1819561 1647514 1751407 1834469 1811903 1703981 1585873 1749348 1565664
2908 1565664 1551054 1443672 1236632 1433226 1542933 1582621 1541714 1444310 1043764 1262939
2898 1262939 1220999 1223945 1356889 1380079 1289657 1220515 1049746 996451 1072103 1354459 1469134
2887 1469134 1493659 1590886 1298764 1188950 1039228 929868 1097448 1380380 1370367 1461959
2877 1461959 1455416 1143051 1095661 920901 733922 752726 762528 1083439 1107105 1198642 1305913
2866 1305913 1221814 1167618 1004475 950286 1029683 915213 885951 1166887 1313542 1403295 1421297
2855 1421297 1138236 580581 434763 780984 1023726 868613 769228 833284 1191689 1458089
$$ packed form
2928A958166l18467L24431J96553j86391r7795j38537K56995J92482o778j59419
2918B021240m3405j58274j72047J03893Q3062k2566j07922j18108J63475j83684
2908A565664j4610j07382k07040J96594J09707L9688m0907r7404m00546K19175
2898A262939m1940K946J32944K3190r0422o9142j70769n3295P5652K82356J14675
2887A469134K4525R7227k92122j09814j49722j09360J67580K82932j0013R1592
2877A461959o543l12365m7390j74760j86979J8804R802L20911K3666R1537J07271
2866A305913q4099n4196j63143n4189P9397j14470k9262K80936J46655Q9753J8002
2855A421297k83061n57655j45818L46221K42742j55113r9385O4056L58405K66400
$$ plain form
2845 1458089 1444437 1267743 1356090 1375449 1384545 1479768 1318197 1330596 1369839 1231054 1162328
2834 1162328 1136458 1262274 1246308 1124022 1056175 929827 786769 677728 891218 953137
2824 953137 1321018 1227206 1013678 980261 870209 975791 957747 859108 1020490 1210806
2814 1210806 1214994 1015891 1055485 1085789 813742 644517 597431 979022 995013 1112256 1110697
2803 1110697 859923 958695 747183 705208 678429 734695 775455 1083214 1399555 1338854 1513600
2792 1513600 1292742 1027231 1028070 925848 1085462 1028789 1072123 1200248 1164828 1274471 1035710
2781 1035710 922469 990185 1231111 1282349 1081454 1299540 1485767 1478829 1422743 1462759 1768092
2770 1768092 1464440 1600648 1756079 1821692 1873305 2107297 2150778 1955707 2244660 2646828
$$ packed form
2845A458089j3652j76694Q8347J9359R096R5223j61571J2399L9243j38785o8726
2834A162328k5870J25816j5966j22286o7847j26348j43058j09041K13490O1919
2824I53137L67881r3812k13528l3417j10052J05582j8044r8639J61382J90316
2814A210806M188j99103L9594L0304k72047j69225m7086L81591J5991J17243j559
2803A110697k50774R8772k11512m1975k6779N6266M0760L07759L16341o0701J74746
2792A513600k20858k65511Q39j02222J59614n6673M3334J28125l5420J09643k38761
2781A035710j13241O7716K40926N1238k00895K18086J86227o938n6086M0016L05333
2770A768092l03652J36208J55431O5613N1613K33992M3481j95071K88953M02168
$$ plain form
2760 2646828 2643207 2798275 2850274 2745097 3001126 3125490 2992334 2552866 2543108 2416202
2750 2416202 2181507 2284228 2296087 2103385 1775187 1714472 1547130 1577715 1779326 1754440
2740 1754440 2035421 1795485 1586905 1618560 1569179 1628126 1668722 1664736 1617233 1703525 1679724
2729 1679724 1522774 1523351 1738802 1668622 1749270 1711041 1765740 1859873 2008033 1905072 1673644
2718 1673644 1785750 1734321 1748414 2003538 2033181 1834049 1965912 1884828 1758199 1813114
2708 1813114 2083383 2065896 2005662 1918280 2080876 1791872 1942116 2092242 1865892 1836203
2698 1836203 1949336 2236810 2309811 2252325 2160768 1968528 2072452 2043476 2029445 2103106 2149665
2687 2149665 2066636 2278275 2388096 2432191 2420700 2122665 1811219 1872073 1992212 2042648
$$ packed form
2760B646828l621J55068N1999j05177K56029J24364j33156m39468r758j26906
2750B416202k34695J02721J1859j92702l28198o0715j67342L0585K01611k4886
2740A754440K80981k39936k08580L1655m9381N8947M0596l986m7503Q6292k3801
2729A679724j56950N77K15451p0180Q0648l8229N4699R4133J48160j02961k31428
2718A673644J12106n1429J4093K55124K9643j99132J31863q1084j26629N4915
2708A813114K70269j7487o0234q7382J62596k89004J50244J50126k26350k9689
2698A836203J13133K87474P3001n7486r1557j92240J03924k8976j4031P3661M6559
2687B149665q3029K11639J09821M4095j1491k98035l11446O0854J20139N0436
$$ plain form
2677 2042648 2346583 2174417 2195977 2098975 1804451 1975300 2086065 1832926 1938055 2291128
2667 2291128 2358442 2162999 2304034 2254428 2334397 2324804 2310549 2250314 2305391 2427410 2643331
2656 2643331 2871980 2514220 2240625 2216329 2218996 2269373 2111853 1940477 1967734 1946866 2077654
2645 2077654 2178016 2104779 1993882 2024194 1903023 1949550 2140468 2129512 2161222 2065739 2093954
2634 2093954 2218070 2108652 2288570 2253616 1979541 1785465 1748606 1899842 1857422 1989459
2624 1989459 1855800 1850485 1769328 2007379 2201726 1719880 1658277 1532651 1474188 1802056
2614 1802056 1978359 1716234 1605829 1495754 1331099 1259906 1459173 1474576 1556875 1838295
2604 1838295 1669361 1694435 1561584 1784230 1635959 1527125 1434699 1313467 1451307 1489755
$$ packed form
2677B042648L03935j72166K1560r7002k94524J70849J10765k53139J05129L53073
2667B291128O7314j95443J41035m9606P9969r593j4255o0235N5077J22019K15921
2656B643331K28649l57760k73595k4296K667N0377j57520j71376K7257k0868J30788
2645B077654J00362p3237j10897L0312j21171M6527J90918j0956L1710r5483K8215
2634B093954J24116j09418J79918l4954k74075j94076l6859J51236m2420J32037
2624A989459j33659n315q1157K38051J94347m81846o1603j25626n8463L27868
2614A802056J76303k62125j10405j10075j64655p1193J99267J5403Q2299K81420
2604A838295j68934K5074j32851K22646j48271j08834r2426j21232J37840L8448
$$ plain form
2594 1489755 1564106 1682511 1382304 1201604 1010023 903429 998589 1044931 1271123 1164134
2584 1164134 1437049 1497092 1504302 1368253 1008861 762304 781069 1106576 1062351 1519453
2574 1519453 1626086 1390208 1407763 1056427 927879 1090243 1268096 1132277 918416 1009579
2564 1009579 1029801 988732 1066800 1291795 1329087 885786 837617 939740 722757 794255 937323
2553 937323 1081550 1486447 1235758 929718 1045577 1132869 918848 672963 557491 550939
2543 550939 621352 766607 669397 625506 719838 765363 616281 595827 495476 305771 446248
2532 446248 511052 954462 893082 689235 440949 537782 558256 542550 625424 528562 661725
2521 661725 839593 822784 565846 764997 899216 502473 376762 601738 400800 659167
$$ packed form
2594A489755P4351J18405l00207j80700j91581j06594R5160M6342K26192j06989
2584A164134K72915O0043P210j36049l59392k46557J8765L25507m4225M57102
2574A519453J06633k35878J7555l51336j28548J62364J77853j35819k13861R1163
2564A009579K0222m1069P8068K24995L7292m43301m8169J02123k16983P1498J43068
2553I37323J44227M04897k50689l06040J15859Q7292k14021k45885j15472o552
2543E50939P0413J45255r7210m3891R4332M5525j49082k0454j00351j89705J40477
2532D46248O4804M43410o1380k03847k48286R6833K0474j5706Q2874r6862J33163
2521F61725J77868j6809k56938J99151J34219l96743j25711K24976k00938K58367
$$ plain form
2511 659167 816610 569368 692472 894793 958231 1022399 934947 787185 589246 448970
2501 448970 351140 225688 503147 762736 644460 645078 710475 575185 320860 226816 237628
2490 237628 472818 540807 696063 866262 886570 971811 970509 909528 676581 564654 451787
2479 451787 388662 493573 604526 688735 352048 212473 325218 154353 182534 40553
2469 40553 122454 492861 550732 589181 600531 668337 288354 -38107 146187 154070 323510
2458 323510 415734 439716 447230 684560 765742 630229 500288 203153 174864 246925 253059
2447 253059 187873 170055 515443 809535 587571 411533 368751 214889 88120 139640
2437 139640 212404 215161 296352 452367 631757 599832 382418 50972 -124583 122894 369682
$$ packed form
2511F59167J57443k47242J23104K02321O3438O4168q7452j47762j97939j40276
2501D48970r7830j25452K77459K59589j18276O18O5397j35290k54325r4044J0812
2490B37628K35190O7989J55256J70199K0308Q5241j302o0981k32947j11927j12867
2479D51787o3125J04911J10953Q4209l36687j39575J12745j70865K8181j41981
2469D0553Q1901L70407N7871L8449J1350O7806l79983l26461J84294P883J69440
2458C23510R2224K3982P514K37330Q1182j35513j29941k97135k8289P2061O134
2447B53059o5186j7818L45388K94092k21964j76038m2782j53862j26769N1520
2437A39640P2764K757Q1191J56015J79390l1925k17414l31446j75555K47477K46788
$$ plain form
2426 369682 272916 466805 739013 775697 701670 603978 416248 56893 80605 39616 -14251
2415 -14251 93311 609549 821972 516582 302897 115167 235017 264657 51028 228231
2405 228231 214062 379906 364790 412760 635003 489227 485684 234845 159225 174606 425541
2394 425541 599387 651318 588838 519444 612212 445238 278708 253061 -33637 -127877 226953
2383 226953 504870 790564 642662 501898 382174 350046 617531 362642 218320 359151
2373 359151 507867 495032 702733 691757 586714 627150 523006 61285 358604 437959
2363 437959 176042 399969 585585 399690 178772 474951 399249 273164 199207 172171
2353 172171 170706 509659 812495 530715 467113 758624 866825 876190 775577 827484 709631
$$ packed form
2426C69682r6766J93889K72208L6684p4027r7692j87730l59355K3712m0989n3867
2415a4251J07562N16238K12423l05390k13685j87730J19850K9640k13629J77203
2405B28231j4169J65844j5116M7970K22243j45776l543k50839p5620J5381K50935
2394D25541J73846N1931o2480o9394R2768j66974j66530k5647k86698r4240L54830
2383B26953K77917K85694j47902j40764j19724l2128K67485k54889j44322J40831
2373C59151J48716j2835K07701j0976j05043M0436j04144m61721K97319P9355
2363D37959k61917K23927J85616j85895k20918K96179p5702j26085p3957k7036
2353A72171j465L38953L02836k81780o3602K91511J08201R365j00613N1907j17853
$$ plain form
2342 709631 643891 698080 612814 532087 337480 679482 758081 518438 648298 708613 884801
2331 884801 997492 837930 642442 578073 547834 427074 785457 904736 629311 512113
2321 512113 445741 636528 581010 501434 720897 579750 532434 829699 828265 733070 788191
2310 788191 586679 393043 776812 849423 925157 1226860 959152 814573 656200 478678
2300 478678 475124 629835 701127 605088 623458 775033 1083709 1005298 778230 703509 712203
2289 712203 739835 485032 482285 877817 1087527 1131201 996858 572721 667942 768142 562885
2278 562885 530312 641823 748704 760569 1160033 893805 701685 763409 426903 279920
2268 279920 422004 581726 715017 830608 731634 784492 1068221 963904 1089970 1076813
$$ packed form
2342G09631o5740N4189q5266q0727j94607L42002P8599k39643J29860O0315J76188
2331H84801J12691j59562j95488o4369l0239j20760L58383J19279k75425j17198
2321E12113o6372J90787n5518p9576K19463j41147m7316K97265j434r5195N5121
2310G88191k01512j93636L83769P2611P5734L01703k67708j44579j58373j77522
2300D78678l554J54711P1292r6039J8370J51575L08676p8411k27068p4721Q694
2289G12203K7632k54803k747L95532K09710M3674j34343m24137R5221J00200k05257
2278E62885l2573J11511J06881J1865L99464k66228j92120O1724l36506j46983
2268B79920J42084J59722J33291J15591r8974N2858K83729j04317J26066j3157
$$ plain form
2258 1076813 1223544 1300821 960959 1147014 1529193 1436730 1142957 1117495 1006969 933228
2248 933228 919662 911340 792042 754405 987090 1266940 1326601 1290920 1340067 1113314 1126901
2237 1126901 1112703 1100009 1200309 1409715 1539029 1452238 1497287 1606085 1534335 1501837 1629933
2226 1629933 1620028 1448536 1657216 1655419 1792925 2314914 1944364 1545439 1508506 1721223
2216 1721223 1597892 1745821 2117468 1888701 1906840 2141380 1907964 1808028 2016520 2198312
2206 2198312 2132746 2389133 2647238 2488583 2735811 2989410 3002592 2802358 2945883 3376176
2196 3376176 3505966 3547395 3877550 4079514 4119595 4099509 4120381 4236448 4395768 4691340
2186 4691340 4990500 5222213 5371971 5520693 5608963 5982189 6215002 6297041 6759685 7228524
$$ packed form
2258A076813J46731P7277l39862J86055L82179r2463k93773k5462j10526p3741
2248I33228j3566q322j19298l7637K32685K79850N9661l5681M9147k26753J3587
2237A126901j4198j2694J00300K09406J29314q6791M5049J08798p1750l2498J28096
2226A629933r905j71492K08680j797J37506N21989l70550l98925l6933K12717
2216A721223j23331J47929L71647k28767J8139K34540k33416r9936K08492J81792
2206B198312o5566K56387K58105j58655K47228K53599J3182k00234J43525M30293
2196C376176J29790M1429L30155K01964M0081k0086K0872J16067J59320K95572
2186D691340K99160K31713J49758J48722Q8270L73226K32813Q2039M62644M68839
$$ plain form
2176 7228524 7744673 8112200 8393323 8674356 8735881 8702030 8657658 8261169 7598588 7202660
2166 7202660 6508485 6068502 5664711 4868353 4589669 4832410 4456285 4317872 4158238 4032851
2156 4032851 3683945 3594608 3604863 3622203 4048776 4249840 3957082 3540637 3307895 2990894
2146 2990894 2695635 2581095 2494514 2436226 2581857 2671398 2652454 2322842 2186074 2316137
2136 2316137 2312013 2089148 2206808 2327302 1964531 2154897 2476956 1942249 1710115 1801753
2126 1801753 1493300 1448414 1619032 1623948 1479096 1629485 1660369 1482171 1675216 1560796
2116 1560796 1467069 1448172 1581749 1619183 1434125 1508723 1468617 1258746 1030692 1285150
2106 1285150 1333085 1181996 1318176 1208253 1223287 1180958 1000142 767692 662005 849075
$$ packed form
2176G228524N16149L67527K81123K81033O1525l3851m4372l96489o62581l95928
2166G202660o94175m39983m03791p96358k78684K42741l76125j38413j59634j25387
2156D032851l48906q9337J0255J7340M26573K01064k92758m16445k32742l17001
2146B990894k95259j14540q6581n8288J45631Q9541j8944l29612j36768J30063
2136B316137m124k22865J17660J20494l62771J90366L22059n34707k32134R1638
2126A801753l08453m4886J70618M916j44852J50389L0884j78198J93045j14420
2116A560796r3727j8897J33577L7434j85058P4598m0106k09871k28054K54458
2106A285150M7935j51089J36180j09923J5034m2329j80816k32450j05687J87070
$$ plain form
2096 849075 611102 528675 901273 949504 818429 812082 746110 746882 743072 798181 798385 775306
2084 775306 1051165 1092383 897801 669331 691930 547449 596372 684422 588105 554748 547122
2073 547122 614559 533867 332172 626789 218268 347805 760182 747659 667867 657946 526335
2062 526335 398260 714666 600002 574773 825377 663581 670014 482312 388941 352580 339434
2051 339434 403235 363136 491913 517338 415368 285819 173660 274730 511118 551099
2041 551099 382787 413586 573695 416718 668353 637136 293566 294902 218517 149638 398135
2030 398135 296271 38534 292739 501017 252367 176073 378845 480735 580249 646890
2020 646890 492252 34586 -14686 385384 371683 672005 641026 769450 679638 497597
$$ packed form
2096H49075k37973q2427L72598M8231j31075o347o5972P72l810N5109K04k3079
2084G75306K75859M1218j94582k28470K2599j44481M8923Q8050r6317l3357p626
2073E47122O7437q0692k01695K94617m08521J29537M12377j2523p9792r921j31611
2062E26335j28075L16406j14664k5229K50604j61796O433j87702r3371l6361j3146
2051C39434O3801m0099J28777K5425j01970j29549j12159J01070K36388L9981
2041E51099j68312L0799J60109j56977K51635l1217l43570J336p6385o8879K48497
2030C98135j01864k57737K54205K08278k48650p6294K02772J01890R9514O6641
2020F46890j54638m57666m9272M00070j3701L00322l0979J28424q9812j82041
$$ plain form
2010 497597 272170 6245 111776 179350 -127414 86388 221644 465311 333958 257402
2000 257402 289306 -71599 56310 197939 298632 186867 220950 428375 476184 533303
1990 533303 529498 373177 171559 -19575 258932 153041 217359 383704 307362 376452 219694
1979 219694 -69474 -295926 -52212 21776 -68111 186759 -24932 -11505 171541 304451
1969 304451 259918 350154 436842 258803 244186 321983 184408 86216 203861 379308 655492
1958 655492 491554 209113 82530 47615 73433 63359 38560 91909 230836 57385 143407
1947 143407 54055 -151843 -116227 -252953 -74769 46966 201690 242053 202382 254525 184005
1936 184005 74301 -180867 -106703 223744 116229 188268 338480 437253 475859 393579 79224
$$ packed form
2010D97597k25427k65925J05531O7574l06764K13802J35256K43667j31353p6556
2000B57402L1904l60905J27909J41629J00693j11765L4083K07425M7809N7119
1990E33303l805j56321k01618j91134K78507j05891O4318J66345p6342O9090j56758
1979B19694k89168k26452K43714P3988q9887K54870k11691J3427J83046J32910
1969C04451m4533R0236Q6688j78039j4617P7797j37575r8192J17645J75447K76184
1958F55492j63938k82441j26583l4915K5818j0074k4799N3349J38927j73451Q6022
1947A43407q9352k05898L5616j36726J78184J21735J54724M0363l9671N2143p0520
1936A84005j09704k55168P4164L30447j07515P2039J50212R8773L8606q2280l14355
$$ plain form
1925 79224 -72839 116167 268356 67261 61270 192877 217633 116809 162318 124395 72257
1914 72257 326123 273087 581256 618293 325554 160353 153748 54916 -14219 160905 199155
1903 199155 76828 277280 163621 -13692 -78655 -50981 49116 22949 172640 256290
1893 256290 202142 291730 336359 -18434 -227693 -44070 -119109 -196370 -126985 38086 56607
1882 56607 -196704 -156951 -221324 -351561 -105057 -105287 -337089 -253923 -82815 -247379 -291752
1871 -291752 -292464 -226630 -197522 -139318 54195 275824 224946 347076 347585 203365 257817 294619
1859 294619 280869 193316 227050 55894 17754 228989 278561 426989 375493 578827 597138
1848 597138 349678 397324 466445 668849 796567 958235 871786 754060 785227 711265 313118
$$ packed form
1925G9224j52063J89006J52189k01095n991J31607K4756j00824M5509l7923n2138
1914G2257K53866n3036L08169L7037k92739j65201o605r8832o9135J75124L8250
1903A99155j22327K00452j13659j77313o4963K7674J00097k6167J49691Q3650
1893B56290n4148Q9588M4629l54793k09259J83623p5039p7261O9385J65071J8521
1882E6607k53311L9753o4373j30237K46504k30k31802Q3166J71108j64564m4373
1871b91752p12O5834K9108N8204J93513K21629n0878J22130N09j44220N4452L6802
1859B94619j3750q7553L3734j71156l8140K11235M9572J48428n1496K03334J8311
1848E97138k47460M7646O9121K02404J27718J61668q6449j17726L1167p3962l98147
$$ plain form
1837 313118 421142 512366 391575 574098 704548 630693 542841 569849 419949 354065 334435
1826 334435 372425 628112 692205 793309 710105 1085295 1234588 1199496 1199668 978703 882754
1815 882754 1093568 1254912 1222598 1142243 1337004 1113656 885004 744681 438811 381909
1805 381909 501887 650380 846779 893384 719325 803171 828889 901502 1007396 921751 961230
1794 961230 1093525 1114652 1176138 1106646 1042393 1083401 762349 671234 861850 1016400 1135249
1783 1135249 1247757 1196776 1191245 1188227 910263 919052 812677 716599 900385 1059994 1222931
1772 1222931 911668 869106 1147862 928477 1007102 891212 689405 813105 999757 823243
1762 823243 699202 600073 559365 754934 882307 605975 368898 457174 611501 475793
$$ packed form
1837C13118J08024R1224j20791J82523J30450p3855q7852K7008j49900o5884j9630
1826C34435L7990K55687O4093J01104q3204L75190J49293l5092J72k20965r5949
1815H82754K10814J61344l2314q0355J94761k23348k28652j40323l05870n6902
1805C81909J19978J48493J96399M6605j74059Q3846K5718P2613J05894q5645L9479
1794I61230J32295K1127O1486o9492o4253M1008l21052r1115J90616J54550J18849
1783A135249J12508n0981n531l018k77964Q789j06375r6078J83786J59609J62937
1772A222931l11263m2562K78756k19385P8625j15890k01807J23700J86652j76514
1762H23243j24041r9129m0708J95569J27373k76332k37077Q8276J54327j35708
$$ plain form
1752 475793 597697 711334 707053 862718 663047 464162 268313 -8494 219061 302130
1742 302130 374329 373482 232250 137311 91382 -24844 67959 84875 169406 136217 116216 257378
1730 257378 284753 353184 234239 171411 69799 93982 149902 213798 272160 231842 -43773
1719 -43773 23053 209271 40307 -244912 -454911 -391491 -122750 110876 75585 10568 -98409
1708 -98409 -133134 -281898 -200546 -51333 36097 196545 45367 68317 -160188 -200601 -169644
1697 -169644 -379571 -379904 8560 54716 -123855 -172411 -52190 -200658 -122000 -158673 -82239
1686 -82239 296978 -45436 -295414 -351440 -287251 -132622 -53919 -97503 -1191 85973 25443
1675 25443 100959 69227 -163706 -109858 -145860 -210433 -378179 -287903 -89557 -183037 55821
$$ packed form
1752D75793J21904J13637m281J55665j99671j98885j95849k76807K27555Q3069
1742C02130P2199q47j41232r4939m5929j16226R2803J6916Q4531l3189k0001J41162
1730B57378K7375O8431j18945o2828j01612K4183N5920O3896N8362m0318k75615
1719d3773O6826J86218j68964k85219k09999O3420K68741K33626l5291o5017j08977
1708i8409l4725j48764Q1352J49213Q7430J60448j51178K2950k28505m0413L0957
1697a69644k09927l33L88464M6156j78571m8556J20221j48468P8658l6673P6434
1686h2239L79217l42414k49978n6026O4189J54629P8703m3584R6312Q7164o0530
1675B5443P5516l1732k32933N3848l6002o4573j67746R0276J98346r3480K38858
$$ plain form
1664 55821 -14080 -210395 -165983 -87643 -190345 -355192 -244067 -386849 -420202 -223373 -245149
1653 -245149 -183293 -183817 -312024 -208746 -194748 -296566 -127116 -153789 -22781 -15693 -214142
1642 -214142 -190299 -1465 115814 14468 17024 -223475 -142134 64344 -59501 -156116 73777
1631 73777 92717 -99446 -96959 -362323 -133986 -91666 -8550 -5501 -42074 -28163 172423
1620 172423 105005 -163950 -246580 -340738 -437097 -146296 105526 -79867 -130543 49718 -87738
1609 -87738 -353592 -123210 -190344 -358898 -236621 -167194 -153205 196078 212001 -26385 -235277
1598 -235277 -112147 -218191 -396168 -119823 157485 27488 -122275 27383 -9224 -142327
1588 -142327 -208096 -221133 -161349 -88823 -47472 -65061 -254035 -161512 -34336 -200870 161452
$$ packed form
1664E5821o9901j96315M4412P8340j02702j64847J11125j42782l3353J96829k1776
1653b45149O1856n24j28207J03278J3998j01818J69450k6673J31008P088j98449
1642b14142K3843J88834J17279j01346K556k40499Q1341K06478j23845r6615K29893
1631G3777J8940j92163K487k65364K28337M2320Q3116L049l6573J3911K00586
1620A72423o7418k68955q2630r4158r6359K90801K51822j85393n0676J80261j37456
1609h7738k65854K30382o7134j68554J22277O9427J3989L49283J5923k38386k08892
1598b35277J23130j06044j77977K76345K77308j29997j49763J49658l6607j33103
1588a42327o5769j3037N9784P2526M1351j7589j88974R2523J27176j66534L62322
$$ plain form
1577 161452 101193 -153476 3589 238159 83906 -74070 -85842 -104962 -213329 -240603
1567 -240603 -428414 -564253 -495166 -593804 -541495 -253828 -73674 -459598 -380610 -267518
1557 -267518 -376708 -390541 -253250 -249316 -211889 65176 391587 229863 12335 -26017 -44654
1546 -44654 -381708 -356812 -489088 -516493 -140303 -47964 -46774 -195267 -12229 -326656 -496103
1535 -496103 -700974 -653625 -415492 -191475 -74820 -84918 -131532 175016 170577 -179018 -164481
1524 -164481 -16358 132989 -6806 83634 -153892 -234944 -110741 -275769 -353318 -279484
1514 -279484 -208833 -595580 -352492 -59790 -116369 -115228 -77374 -208334 -80673 340025 249123
1503 249123 -179017 -201844 128017 61716 -21348 -5190 9282 -49291 -69491 -201239 -400399
$$ packed form
1577A61452o0259k54669J57065K34570j54253j57976j1772j9120j08367k7274
1567b40603j87811j35839O9087r8638N2309K87667J80154l85924P8988J13092
1557b67518j09190j3833J37291L934L7427K77065L26411j61724k17528l8352j8637
1546d4654l37054K4896j32276k7405L76190R2339J190j48493J83038l14427j69447
1535d96103k04871M7349K38133K24017J16655j0098m6614L06548m439l49595J4537
1524a64481J48123J49347j39795R0440k37526q1052J24203j65028p7549P3834
1514b79484P0651l86747K43088K92702n6579J141L7854j30960J27661M20698r0902
1503B49123m28140k2827L29861o6301q3064J6158J4472n8573k0200j31748j99160
$$ plain form
1492 -400399 -252992 -198685 -237106 -441721 -201499 159277 73775 -58327 -85074 -137149 94978
1481 94978 179809 -53408 -220231 -58569 -165819 -225622 210945 237220 18205 -105745
1471 -105745 28645 -71079 -213009 -178659 -10818 -55048 24657 66819 -136852 -231858 37625
1460 37625 57963 -29853 185304 -20742 -203317 87596 -36642 -372767 -320928 -154684
1450 -154684 -369405 -381250 -352437 -483817 -533730 -87039 114337 -56180 67035 320991
1440 320991 313575 -40198 -200569 24873 -18929 105770 191972 -70135 -232577 -43979
1430 -43979 -183801 -460500 -190454 -192456 -437242 -223811 -114605 -305499 -137820 230562
1420 230562 80414 -258549 -128421 -170757 -556701 -310753 -50939 285601 469238 291570
$$ packed form
1492d00399J47407N4307l8421k04615K40222L60776q5502j32102k6747n2075K32127
1481I4978Q4831k33217j66823J61662j07250n9803M36567K6275k19015j23950
1471a05745J34390r9724j41930L4350J67841m4230P9705M2162k03671r5006K69483
1460C7625K0338q7816K15157k06046j82575K90913j24238l36125N1839J66244
1450a54684k14721j1845K8813j31380m9913M46691K01376j70517J23215K53956
1440C20991p416l53773j60371K25442m3802J24699Q6202k62107j62442J88598
1430d3979j39822k76699K70046k002k44786K13431J09206j90894J67679L68382
1420B30562j50148l38963J30128m2336l85944K45948K59814L36540J83637j77668
$$ plain form
1410 291570 -355316 -300091 132305 1418 -278762 -228076 52206 -32742 -59149 -21147 -76325
1399 -76325 -55912 161961 -177181 -418314 -295150 160880 -20235 -152833 2753 -30940
1389 -30940 -125662 -246758 -322475 -244924 -282519 -114958 -68978 -105906 28466 117391 -48274
1378 -48274 -25997 176080 -162180 -238359 -299689 -300088 77210 223436 -162744 -501381 -60750
1367 -60750 139206 -181948 -451889 -336768 -378025 -324096 -177006 -337634 -237783 68201
1357 68201 87570 -224431 -162393 -282608 -206939 -138863 101012 46139 151518 202546 -27396
1346 -27396 -356369 -519420 -224097 -337075 -178040 15056 95547 -87351 -7637 -35854
1336 -35854 -200078 -388283 -345262 -328377 -96603 33132 180112 -129488 -137619 -57417 -80715
$$ packed form
1410B91570o46886N5225M32396j30887k80180N0686K80282q4948k6407L8002n5178
1399g6325K0413K17873l39142k41133J23164M56030j81115j32598J55586l3693
1389c0940r4722j21096p5717P7551l7595J67561M5980l6928J34372Q8925j65665
1378d8274K2277K02077l38260p6179o1330l99L77298J46226l86180l38637M40631
1367f0750J99956l21154k69941J15121m1257N3929J47090j60628R9851L05984
1357F8201J9369l12001O2038j20215P5669O8076K39875n4873J05379N1028k29942
1346b7396l28973j63051K95323j12978J59035J93096Q0491j82898P9714k8217
1336c5854j64224j88205M3021J6885K31774J29735J46980l09600q131Q0202k3298
$$ plain form
1325 -80715 -53019 -54902 -321444 -320762 64214 148100 -396856 -199513 9651 -431372 -233404
1314 -233404 -317318 -532947 -137242 4591 -237984 -337397 -132553 -141985 -458775 -98206
1304 -98206 59426 -192310 -317005 -210641 -226347 -332607 -228459 -147894 -295105 -66489
1294 -66489 163499 63913 -276996 -431153 -472663 -403970 15244 258304 -74328 -12596 27999
1283 27999 -63012 -377768 -261544 -191801 -337229 -180630 -101763 -319918 -307389 96107 -164187
1272 -164187 -304138 -13045 -78658 77859 56984 -94479 -422362 -146572 267088 -2287
1262 -2287 -320687 -36259 132656 13852 33154 79278 -146835 -54609 275047 -19380 -26175
1251 -26175 -141046 -238987 -339677 -197239 97503 -186861 -432799 -95504 -4773 126698
$$ packed form
1325h0715K7696j883k66542O82L84976Q3886n44956J97343K09164m41023J97968
1314b33404q3914k15629L95705J41833k42575r9413K04844r432l16790L60569
1304i8206J57632k51736j24695J06364j5706j06260J04148Q0565j47211K28616
1294f6489K29988r9586l40909j54157m1510O8693M19214K43060l32632O1732M0595
1283B7999r1011l14756J16224O9743j45428J56599P8867k18155J2529M03496k60294
1272a64187j39951K91093o5613J56517k0875j51463l27883K75790M13660k69375
1262b287l18400K84428J68915j18804J9302M6124k26113R2226L29656k94427o795
1251b6175j14871r7941j00690J42438K94742k84364k45938L37295R0731J31471
$$ plain form
1241 126698 174777 41466 -102595 -108234 -14775 -344110 -409073 -142160 224203 56994 139884
1230 139884 185087 58236 -49799 -184109 -698757 -621627 -142970 -86028 58686 215628
1220 215628 -31663 -41543 133598 -44776 -380533 -414358 151121 181906 11947 283676
1210 283676 160577 26416 -5657 -4896 -12175 77441 34000 -108321 -94153 87097 96507 -93655
1198 -93655 -208156 -92381 132294 -59861 -16842 -47887 -843 -60168 -54000 -152916 90227
1187 90227 -21909 -261356 -249827 -73173 -296082 -319855 85417 68305 -86839 51445
1177 51445 266796 86634 -29577 -151131 -309634 -288492 70663 51035 -250435 -115741
1167 -115741 -191486 -252252 -229271 -227195 -230741 -256454 -129763 -11997 16592 237936 142546
$$ packed form
1241A26698M8079j33311j44061n639R3459l29335o4963K66913L66363j67209Q2890
1230A39884M5203j26851j08035j34310n14648P7130M78657N6942J44714J56942
1220B15628k47291r880J75141j78374l35757l3825N65479L0785j69959K71729
1210B83676j23099j34161l2073P61p279Q9616m3441j42321J4168J81250R410j90162
1198i3655j14501J15775K24675j92155M3019l1045M7044n9325O168r8916K43143
1187I0227j12136k39447J1529J76654k22909k3773M05272j7112j55144J38284
1177E1445K15351j80162j16211j21554j58503K1142L59155j9628l01470J34694
1167a15741p5745o0766K2981K076l546k5713J26691J17766K8589K21344r5390
$$ plain form
1156 142546 -63681 -216216 67919 18928 -65231 115299 147899 -11616 217164 284066
1146 284066 218314 191585 -51830 -430366 -431446 -204897 -36599 62634 -110325 -40215 -161709
1135 -161709 -373092 -25053 -81975 -72583 392021 607445 297655 -63551 97348 96640 37253
1124 37253 -5799 49492 75232 409163 294727 102870 -3352 30162 -124919 105444 458828
1113 458828 503962 316822 94350 -31642 68547 265690 307740 389612 357862 623961
1103 623961 574153 329563 181553 209718 259344 312856 159138 -61245 261233 496043
1093 496043 459927 225530 236568 53153 155001 79136 67183 367402 326167 251899 387309
1082 387309 293171 260770 336705 270323 310676 469916 316485 207970 328106 -21042 111594
$$ packed form
1156A42546k06227j52535K84135m8991q4159J80530L2600j59515K28780O6902
1146B84066o5752k6729k43415l78536j080K26549J68298R9233j72959P0110j21494
1135a61709k11383L48039n6922R392M64604K15424l09790l61206J60899p08n9387
1124C7253m3052N5291K5740L33931j14436j91857j06222L3514j55081K30363L53384
1113D58828M5134j87140k22472j25992J00189J97143M2050Q1872l1750K66099
1103F23961m9808k44590j48010K8165M9626N3512j53718k20383L22478K34810
1093D96043l6116k34397J1038j83415J01848p5865j1953L00219m1235p4268J35410
1082C87309r4138l2401P5935o6382M0353J59240j53431j08515J20136l49148J32636
$$ plain form
1071 111594 299353 350193 145939 348712 385952 121110 72188 219515 382806 405725
1061 405725 260195 94020 207808 268743 435817 290646 290600 119520 288035 399210 273233
1050 273233 142990 320412 555436 370392 446701 169489 375388 578119 537379 519353
1040 519353 589201 601329 696922 750765 588433 517275 442994 692479 792160 932299 781843
1029 781843 856895 855182 807620 576865 538529 577900 664397 983824 1107931 1159669 997526
1018 997526 850392 524684 508603 891720 1052123 976969 1320439 1606345 1449263 1171793
1008 1171793 1055828 1229209 1166139 1240110 1208870 1400073 1635328 1760027 1708715 1723173
998 1723173 1510048 1544985 1918103 2050624 2113916 2097498 2325676 2526513 2618980 2423986
$$ packed form
1071A11594J87759N0840k04254K02773L7240k64842m8922J47327J63291K2919
1061D05725j45530j66175J13788O0935J67074j45171m6j71080J68515J11175j25977
1050B73233j30243J77422K35024j85044P6309k77212K05899K02731m0740j8026
1040E19353O9848J2128R5593N3843j62332p1158p4281K49485R9681J40139j50456
1029G81843P5052j713m7562k30755l8336L9371Q6497L19427J24107N1738j62143
1018I97526j47134l25708j6081L83117J60403p5154L43470K85906j57082k77470
1008A171793j15965J73381o3070P3971l1240J91203K35255J24699n1312J4458
998A723173k13125L4937L73118J32521O3292j6418K28178K00837R2467j94994
$$ plain form
988 2423986 2768331 2966933 2877514 3128408 3688461 3949520 3929111 4212939 4509550 5009869
978 5009869 5498555 5423508 5680656 6279790 6529805 6958888 7616928 8361386 9368433 10827376
968 10827376 12387965 14356947 16885199 19808767 23472576 28375375 32882632 32377536
960 32377536 27680691 22250628 18387196 15681122 13408999 11254255 9478222 7896609
952 7896609 6999359 6548993 6022283 5674874 5331140 4646452 4322810 4080882 3521417 3341176
942 3341176 3043658 3036979 3126929 3202238 2738708 2511764 2303263 1947339 1756667 1465719
932 1465719 1469094 1615332 1578167 1503692 1681199 1530776 1213476 1166672 1222044 1141087 1150750
921 1150750 1206671 1099550 1091046 1278997 968809 974443 1084768 997936 977471 799935 722950
$$ packed form
988B423986L44345J98602q9419K50894N60053K61059k0409K83828K96611N00319
978E009869M88686p5047K57148N99134K50015M29083O58040P44458J007047J458943
968A0827376J560589J968982K528252K923568L663809M902799M507257n05096
960C2377536m696845n430063l863432k706074k272123k154744j776033j581613
952G896609q97250m50366n26710l47409l43734o84688l23642k41928n59465j80241
942C341176k97518o679Q9950P5309m63530k26944k08501l55924j90672k90948
932A465719L375J46238l7165p4475J77507j50423l17300m6804N5372q0957R663
921A150750N5921j07121q504J87951l10188N634J10325q6832k0465j77536p6985
$$ plain form
910 722950 969403 1105478 1063412 809955 633634 521530 632730 616712 416084 174686
900 174686 189256 452029 516781 437464 580663 662173 712241 807144 722262 559245 641009
889 641009 811404 672539 690851 584526 697509 482100 378405 423439 318252 171199
879 171199 83023 -70616 208066 321921 312905 302044 421379 642950 653949 458683 188727
868 188727 421132 440395 117879 105036 246161 272852 203761 485039 282273 305319 514336
857 514336 372414 51100 77783 -48074 -100178 36240 101395 43878 34620 -102741 -373107
846 -373107 -283255 -64399 -33005 71346 197901 352282 683849 470777 431045 239756
836 239756 83997 -51906 -368146 -512041 -121067 184543 48645 30577 -243050 -22163
$$ packed form
910G22950K46453J36075m2066k53457j76321j12104J11200j6018k00628k41398
900A74686J4570K62773O4752p9317J43199Q1510N0068R4903q4882j63017Q1764
889F41009J70395j38865J8312j06325J12983k15409j03695M5034j05187j47053
879A71199q8176j53639K78682J13855r016j0861J19335K21571J0999j95266k69956
868A88727K32405J9263l22516j2843J41125K6691o9091K81278k02766K3046K09017
857E14336j41922l21314K6683j25857n2104J36418O5155n7517r258j37361k70366
846c73107Q9852K18856L1394J04351J26555J54381L31567k13072l9732j91289
836B39756j55759j35903l16240j43895L90974L05610j35898j8068k73627K20887
$$ plain form
826 -22163 -211980 -251220 -312993 -7504 285085 399074 421638 206869 210202 174802 -113912
815 -113912 -190259 -221902 -369271 -196366 -147634 109186 61484 153120 -265388 -255672 -250570
804 -250570 -349137 -279331 -26884 218152 241589 296451 367946 173867 -91569 -189002 -331476
793 -331476 -188739 -173989 -12802 13768 143587 10162 -26993 -3631 -144732 -37514 -351185
782 -351185 -264259 -204048 -322153 -380767 -72421 48144 190239 143643 4549 -61313 -89694
771 -89694 -43484 117006 280539 270626 344871 155355 -175109 -456705 -538866 -537047 -432756
760 -432756 -112174 -234747 -247586 -42829 -45328 -105441 -120244 -417564 -398380 -316495 -252535
749 -252535 -28694 204241 420878 365467 21082 -118032 57775 62370 -251850 -225315 -41010
$$ packed form
826b2163j89817l9240o1773L05489K92589J13989K2564k14769L333l5400k88714
815a13912p6347l1643j47369J72905M8732K56820m7702R1636m18508R716N102
804b50570r8567O9806K52447K45036K3437N4862P1495j94079k65436r7433j42474
793c31476J42737J4750J61187K6570J29819j33425l7155K3362j41101J07218l13671
782c51185Q6926O0211j18105n8614L08346J20565J42095m6596j39094o5862k8381
771h9694M6210J60490J63533r913P4245j89516l30464k81596q2161J819J04291
760d32756L20582j22573j2839K04757k499o0113j4803k97320J9184Q1885O3960
749b52535K23841K32935K16637n5411l44385j39114J75807M595l14220K6535J84305
$$ plain form
738 -41010 95375 186463 47669 -178842 -97853 -209733 -216849 -271300 -289757 -74760 -40632
727 -40632 -351126 -414691 -112120 178319 96552 -182801 -21454 -4085 -48116 -70029 -26317
716 -26317 44224 317626 79180 -111703 9746 43677 -263978 -281890 -301551 -32555 67086
705 67086 -129018 -148634 155032 315463 154574 -185586 -163975 55153 47638 61250 11803
694 11803 109841 178565 278090 -7802 10353 3258 -31521 95241 -118813 32454 207661
683 207661 325041 154529 187707 95933 164625 94353 264803 294830 157962 31784 -211674
672 -211674 -90016 45836 109076 148376 253797 197665 47389 53345 -98733 -67136 81797
661 81797 43583 117792 -33807 -196489 -229790 -151458 -193258 -340302 -99550 -145857 -114596
$$ packed form
738d1010J36385R1088j38794k26511Q0989j11880p116n4451j8457K14997L4128
727d0632l10494o3565L02571K90439q1767k79353J61347J7369m4031k1913M3712
716b6317P0541K73402k38446j90883J21449L3931l07655j7912j9661K68996R9641
705F7086j96104j9616L03666J60431j60889l40160K1611K19128p515J3612m9447
694A1803R8038O8724R9525k85892J8155p095l4779J26762k14054J51267J75207
683B07661J17380j70512L3178r1774O8692p0272J70450L0027j36868j26178k43458
672b11674J21658J35852O3240L9300J05421n6132j50276N956j52078L1597J48933
661H1797l8214P4209j51599j62682l3301P8332m1800j47044K40752m6307L1261
$$ plain form
650 -114596 -14798 106789 99358 88894 94620 70540 -216414 -587775 -538129 -224887 90900
639 90900 134244 245590 -126558 -160320 -285641 -372504 -314651 -118497 16102 135020 147553
628 147553 -51918 34549 112549 -29560 -147293 -72238 -167318 -77607 -123750 -212204 -64470
617 -64470 -133279 -267321 23307 -61254 -323882 -287153 -565541 -491846 -276357 -168761 -214102
606 -214102 -150162 -187198 -177041 -324731 -298742 -69238 19715 181817 159555 -177901 56338
595 56338 322564 219752 227523 -246153 -287734 14239 -251687 -255601 -152161 -207889 -96953
584 -96953 128526 -171947 -97749 -80388 -273592 -122421 225360 309438 366138 192718 -43862
573 -43862 -90017 -204243 -244086 -75080 251218 337677 212468 -83581 -257308 -182822 -39197
$$ packed form
650a14596R9798J21587p431j0464N726k4080k86954l71361M9646L13242L15787
639I0900M3344J11346l72148l3762j25321q6863N7853J96154J34599J18918J2533
628A47553j99471Q6467P8000j42109j17733P5055r5080Q9711m6143q8454J47734
617f4470o8809j34042K90628q4561k62628L6729k78388P3695K15489J07596m5341
606b14102O3940l7036J0157j47690K5989K29504Q8953J62102k2262l37456K34239
595E6338K66226j02812P771m73676m1581L01973k65926l914J03440n5728J10936
584i6953K25479l00473P4198J7361j93204J51171L47781Q4078N6700j73420k36580
573d3862m6155j14226l9843J69006L26298Q6459j25209k96049j73727P4486J43625
$$ plain form
562 -39197 11497 121095 40731 382204 415387 201152 -62767 -186577 186973 -22050 -135616
551 -135616 -64293 24142 115102 191157 78972 165179 249857 29154 222155 1787 -247256
540 -247256 -55970 152789 129582 217959 -131993 -311176 -259513 -65444 41821 120332 173538
529 173538 -70894 -18809 -114363 -290786 -96270 -77988 -166051 81990 14951 -115744 -59430
518 -59430 6911 -189389 100127 194147 -254468 3580 238083 83405 -40883 22911 -192805
507 -192805 279688 339340 308366 205541 171622 109501 19146 -24075 -60620 -143986 -49470
496 -49470 171392 -122529 -198033 -56211 95071 -248697 -303922 -247365 -138662 -196863 -22253
485 -22253 194359 250823 98696 -8518 -132726 -148326 167095 189240 255762 394377 328915
$$ packed form
562c9197N0694J09598q0364L41473L3183k14235k63919j23810L73550k09023j13566
551a35616P1323Q8435R0960P6055j12185Q6207Q4678k20703J93001k20368k49043
540b47256J91286K08759k3207Q8377l49952j79183N1663J94069J07265P8511N3206
529A73538k44432N2085r5554j76423J94516J8282q8063K48041o7039j30695N6314
518e9430O6341j96300K89516R4020m48615K58048K34503j54678j24288O3794k15716
507a92805M72493N9652l0974j02825l3919o2121r0355m3221l6545q3366R4516
496d9470K20862k93921p5504J41822J51282l43768n5225N6557J08703n8201J74610
485b2253K16612N6464j52127j07214j24208j5600L15421K2145O6522J38615o5462
$$ plain form
474 328915 947 -154959 -225155 70738 34905 12236 3050 -149682 46536 53377 -103122
463 -103122 -361958 -242878 -175637 74330 335068 326399 129579 94422 -136004 -329948 -311792
452 -311792 123965 181179 217545 272466 132539 298508 117553 -54117 -142758 91029 26983
441 26983 -17913 69335 175868 261122 8722 -262584 -191280 -181254 -402240 -124646 -143502
430 -143502 30722 397409 278607 75918 111679 74258 106456 22149 -88839 138182 184589
419 184589 39748 -190964 -153283 -146252 301322 196084 81980 168857 12860 -167849 -122533
408 -122533 -108929 -158353 -16040 57056 79304 -85915 -11648 -29494 -12419 175978 119252
397 119252 66614 356102 295059 137671 111363 -18723 -206494 -210203 -99178 194283 255458
$$ packed form
474C28915l27968j55906p0196K95893l5833k2669r186j52732J96218O841j56499
463a03122k58836J19080O7241K49967K60738q669j96820l5157k30426j93944J8156
452c11792M35757N7214L6366N4921j39927J65969j80955j71670q8641K33787o4046
441B6983m4896Q7248J06533Q5254k52400k71306P1304J0026k20986K77594j8856
430a43502J74224L66687j18802k02689L5761l7421L2198q4307j10988K27021M6407
419A84589j44841k30712L7681P031M47574j05238j14104Q6877j55997j80709M5316
408a22533J3604m9424J42313P3096K2248j65219P4267j7846J7075J88397n6726
397A19252n2638K89488o1043j57388k6308j30086j87771l709J11025K93461O1175
$$ plain form
386 255458 26995 -28035 8963 -161136 -341201 -325848 -283510 -148454 -5306 35776 131662
375 131662 63228 -227577 -268782 -365849 -381930 -340478 -57472 317449 288127 316142 346741
364 346741 217675 -46563 -163830 -88205 167688 283153 140079 239391 137689 94529
354 94529 -260005 -561597 -264511 -83867 24759 62309 148818 152929 132753 -17718 -153805
343 -153805 -79870 -102267 31045 35768 -32033 138253 442084 343557 -15261 -304102 -284776
332 -284776 56907 81204 -196726 -145312 151493 144639 -58991 -74298 -102657 -137150 201980
321 201980 281966 123129 15019 17936 -375320 -270109 9314 88700 121234 204786 -56828
310 -56828 104108 263663 -20167 12986 -13312 228108 402853 190480 114285 348793 143456
$$ packed form
386B55458k28463n5030L6998j70099j80065J5353M2338J35056J43148M1082R5886
375A31662o8434k90805m1205r7067j6081M1452K83006L74921k9322K8015L0599
364C46741j29066k64238j17267P5625K55893J15465j43074R9312j01702m3160
354I4529l54534l01592K97086J80644J08626L7550Q6509M111k0176j50471j36087
343a53805P3935k2397J33312M723o7801J70286L03831r8527l58818k88841J9326
332b84776L41683K4297k77930N1414K96805o854k03630j5307k8359l4493L39130
321B01980P9986j58837j08110K917l93256J05211K79423P9386L2534Q3552k61614
310e6828J60936J59555k83830L3153k6298K41420J74745k12373p6195K34508k05337
$$ plain form
299 143456 -133597 -159299 -236403 -85921 117634 114019 47822 -189512 -142425 -162148 -455386
288 -455386 -608459 -284356 50653 147966 164430 -26659 -27607 38670 -22442 -70020 -131952
277 -131952 167967 156003 134311 150061 76593 -188687 18435 106697 197953 312769 87545
266 87545 -42157 89680 -182300 -353901 -209270 -203441 63349 286222 211235 208540 344592
255 344592 4526 -180271 -114582 -94334 -132564 54932 271799 473702 300964 85060
245 85060 103289 -31284 -191534 -277622 -173507 117972 209165 161641 35894 -113620 -182583
234 -182583 -68297 -114325 -191595 -104307 110279 118292 101222 133318 81389 -40886 11463
223 11463 59413 282666 501252 287436 140738 66677 211406 277068 47230 -133348 -168565
$$ packed form
299A43456k77053k5702p7104J50482K03555l615o6197k37334M7087j9723k93238
288d55386j53073L24103L35009R7313J6464j91089r48O6277o1112m7578o1932
277a31952K99919j1964k1692J5750p3468k65280K07122Q8262R1256J14816k25224
266H7545j29702J31837k71980j71601J44631N829K66790K22873p4987k695J36052
255C44592l40066j84797O5689K0248l8230J87496K16867K01903j72738k15904
245H5060J8229j34573j60250q6088J04115K91479R1193m7524j25747j49514o8963
234a82583J14286m6028p7270Q7288K14586Q013j7070L2096n1929j22275N2349
223A1463M7950K23253K18586k13816j46698p4061J44729O5662k29838j80578l5217
$$ plain form
212 -168565 25245 30887 -77932 80154 125879 109279 -17085 -134404 -66433 83679 -30968
201 -30968 -234086 -125219 44036 5548 36522 12864 36929 223086 421180 204601 -69786
190 -69786 -106780 -121466 -2501 201898 318669 451948 447114 239133 49397 -294290 -359272
179 -359272 -238066 -100963 93081 412393 314740 84815 -129546 -279085 -129349 24189
169 24189 -205235 -32515 97102 266382 241786 78563 33712 -59720 -52769 -145761 -194755
158 -194755 -252361 -89565 180930 92839 -18192 86364 188701 209373 -206445 -46427
148 -46427 86398 292928 487222 -56369 -358021 -236396 -156338 -28768 188801 -10835
138 -10835 -29962 -459 -173063 -72743 -40748 -192716 17773 291217 251522 295527 311891
$$ packed form
212a68565J93810N642j08819J58086M5725j6600j26364j17319O7971J50112j14647
201c0968k03118J08867J69255l8488L0974k3658K4065J86157J98094k16579k74387
190f9786l6994j4686J18965K04399J16771J33279m834k07981j89736l43687o4982
179c59272J21206J37103J94044L19312r7653k29925k14361j49539J49736J53538
169B4189k29424J72720J29617J69280k4596j63223m4851r3432O951r2992m8994
158a94755n7606J62796K70495q8091j11031J04556J02337K0672m15818J60018
148d6427J32825K06530J94294n43591l01652J21625Q0058J27570K17569j99636
138a0835j9127K9503j72604J00320L1995j51968K10489K73444l9695M4005J6364
$$ plain form
127 311891 -20042 -73023 216878 135778 212628 69804 284687 287480 214199 97669 -1912
116 -1912 -43354 -83711 37863 227908 73336 58108 236694 204634 188155 127042 89149
105 89149 105525 86297 -31360 17904 386775 428962 181113 56295 62770 75300 -35067
94 -35067 45016 147490 55999 -153183 -49428 1769 -217045 -77447 153226 149787 266419
83 266419 124618 41852 -392 107702 100503 230701 286246 112192 23779 169230 -83345
72 -83345 -365888 -327658 -70687 170144 310979 298275 302201 307941 -89563 -7440 -65121 -267648
60 -267648 -77131 562 -25154 34512 164109 -55911 27226 73614 -75930 -36046 37676
49 37676 -104698 -58231 258959 403604 363142 184472 114779 -74754 -34731 10757 41873
$$ packed form
127C11891l31933n2981K89901q1100P6850j42824K14883K793p3281j16530r9581
116a912m1442m0357J21574J90045j54572j5228J78586l2060j6479o1113l7893
105H9149J6376j9228j17657M9264L68871M2187k47849j24818O475J2530j10367
94c5067Q0083J02474r1491k09182J03755N1197k18814J39598K30673l439J16632
83B66419j41801q2766m2244J08094p199J30198N5545j74054q8413J45451k52575
72h3345k82543L8230K56971K40831J40835j2704L926N740l97504Q2123n7681k02527
60b67648J90517P7693k5716N9666J29597k20020Q3137M6388j49544L9884P3722
49C7676j42374M6467L17190J44645m0462j78670o9693j89533M0023M5488L1116
$$ plain form
38 41873 185475 171252 327528 151844 32855 91276 -37668 -229490 -24368 343023 102836
27 102836 197631 177796 -36373 150519 173207 23408 -162827 -102599 -7078 76036 155493
16 155493 73753 131719 190644 207501 144292 -12031 91302 135573 -75177 73443 293076
5 293076 169958 51242 115347 148454 -27278
0 -27278
$$ packed form
38D1873J43602j4223J56276j75684j18989N8421j28944j91822K05122L67391k40187
27A02836R4795j9835k14169J86892K2688j49799j86235O0228R5521Q3114P9457
16A55493q1740N7966N8925J6857o3209j56323J03333M4271k10750J48620K19633
5B93076j23118j18716O4105L3107j75732
0b7278
$$ Imaginary data points
##PAGE= N=2
##DATA TABLE= (X++(I..I)), XYDATA
$$ plain form
16383 -648859 -650112 -450627 -532602 -536410 -577820 -566886 -830968 -867476 -687199 -601705 -511699
16372 -511699 -555413 -489163 -487486 -547039 -592323 -759614 -825040 -569205 -461682 -406529 -350463
16361 -350463 -208857 -329237 -317618 -462185 -483039 -487501 -308519 -115687 -405033 -453744
16351 -453744 -326223 -456598 -442588 -358473 -309630 -389851 -498991 -357112 -375699 -326610 -255543
$$ packed form
16383f48859j253J99485q1975l808m1410J0934k64082l6508J80277Q5494R0006
16372e11699m3714O6250J677n9553m5284j67291o5426K55835J07523N5153N6066
16361c50463J41606j20380J1619j44567k0854m462J78982J92832k89346m8711
16351d53744J27521j30375J4010Q4115M8843q0221j09140J41879j8587M9089P1067
$$ [...]
##END NTUPLES=NMR SPECTRUM
##END=
