##TITLE=1H_CA-8794-1
 DMSO, 8 sc, 
 26.11.2020
##JCAMPDX= 6.0         $$ Bruker NMR JCAMP-DX V2.0
##DATA TYPE= NMR SPECTRUM
##DATA CLASS= NTUPLES
##ORIGIN= UXNMR, Bruker Analytische Messtechnik GmbH
##OWNER= root
$$ XWIN-NMR		Version 3.5
$$ Thu Nov 26 11:43:11 2020 Russian Standard Time (UT+4h)  she@DPX200
##.OBSERVE FREQUENCY= 200.1315066352
##.OBSERVE NUCLEUS= ^1H
##.ACQUISITION MODE= SIMULTANEOUS
##.ACQUISITION SCHEME= undefined
##.AVERAGES= 8
##.DIGITISER RES= 18
##SPECTROMETER/DATA SYSTEM= spect
##.PULSE SEQUENCE= zg30
##.SOLVENT NAME= DMSO
##.SHIFT REFERENCE= (INTERNAL, DMSO, 0, 16.0341)
##AUDIT TRAIL= $$ (NUMBER, WHEN, WHO, WHERE, WHAT)
$$ ##TITLE= Audit trail, XWIN-NMR		Version 3.5
$$ ##JCAMPDX= 5.01
$$ ##ORIGIN= Bruker BioSpin GmbH
$$ ##OWNER= she
$$ F:/spectra/data/she/nmr/H-F/1/pdata/1/auditp.txt
$$ ##AUDIT TRAIL=  $$ (NUMBER, WHEN, WHO, WHERE, WHAT)
(   1,<2020-11-26 11:41:37.45 +0400>,<she>,<DPX200>,
      <created by zg, POWCHK disabled, PULCHK disabled
       configuration hash MD5:
       00 E9 B6 7A A2 85 ED C7 34 08 36 98 17 FE 4E 26
       data hash MD5: 16K
       32 FC C9 B7 64 36 18 14 21 FC D9 28 3E 77 97 FF>)
(   2,<2020-11-26 11:41:40.18 +0400>,<she>,<DPX200>,
      <Start of raw data processing
       efp BC_mod = 2 LB = 0.24 FT_mod = 6 PKNL = 1 PHC0 = -11054.63 PHC1 = 18.80088 SI = 16K 
       data hash MD5: 16K
       65 94 7F F1 52 96 5D 36 83 CE 73 74 25 23 49 2B>)
(   3,<2020-11-26 11:42:01.23 +0400>,<she>,<DPX200>,
      <pk PHC0 = 4.713887 PHC1 = -10.2 
       data hash MD5: 16K
       1E 86 28 5B 1F C8 07 75 DD 75 0F 2D 73 8F 2E 37>)
(   4,<2020-11-26 11:42:05.43 +0400>,<she>,<DPX200>,
      <abs ABSG = 5 
       data hash MD5: 16K
       5B 28 48 E7 21 31 67 13 FA 72 62 74 56 DD 91 06>)
(   5,<2020-11-26 11:42:27.82 +0400>,<she>,<DPX200>,
      <abs ABSG = 5 
       data hash MD5: 16K
       2D 43 81 3E 1D 5A 27 6F 44 47 A4 B5 7A 44 32 B6>)
$$ ##END=
$$ 
$$ hash MD5
$$ 2F A4 7B B1 38 9E 94 D7 07 C3 F9 14 75 38 5C 13
##$RELAX= 
##$RELAX= 
##$RELAX= 
##$RELAX= 
##$RELAX= 
##$RELAX= 
$$ Bruker specific parameters
$$ --------------------------
##$DU= <F:/spectra>
##$EXPNO= 1
##$NAME= <H-F>
##$PROCNO= 1
##$TYPE= <nmr>
##$USER= <she>
##$AMP= (0..31)
100 100 100 100 100 100 100 100 100 100 100 100 100 100 100 100 100 100 
100 100 100 100 100 100 100 100 100 100 100 100 100 100 
##$AQSEQ= 0
##$AQ_mod= 1
##$AUNM= <au_zg>
##$AUTOPOS= <>
##$BF1= 200.13
##$BF2= 200.13
##$BF3= 200.13
##$BF4= 200.13
##$BF5= 200.13
##$BF6= 200.13
##$BF7= 200.13
##$BF8= 200.13
##$BYTORDA= 1
##$CFDGTYP= 0
##$CFRGTYP= 5
##$CHEMSTR= <none>
##$CNST= (0..31)
1 1 145 1 1 1 1 1 1 1 1 1 1 1 1 1 1 1 1 1 1 1 1 1 1 1 1 1 1 1 1 1 
##$CPDPRG= <>
##$CPDPRG1= <>
##$CPDPRG2= <>
##$CPDPRG3= <>
##$CPDPRG4= <mlev>
##$CPDPRG5= <mlev>
##$CPDPRG6= <mlev>
##$CPDPRG7= <mlev>
##$CPDPRG8= <mlev>
##$CPDPRGB= <>
##$CPDPRGT= <>
##$D= (0..31)
0 1.2 0 0 0 0 0 0 0 0.06 0 0.03 0 0 0 0 0.0002 0 0 0 0 0 0 0 0 0 0 0 0 
0 0 0 
##$DATE= 1606376496
##$DBL= (0..7)
$$ [...]
##$SUBNAM3= <"">
##$SUBNAM4= <"">
##$SUBNAM5= <"">
##$SUBNAM6= <"">
##$SUBNAM7= <"">
##$SUBNAM8= <"">
##$SUBNAM9= <"">
##$SW= 16.9725356469052
##$SWIBOX= (0..15)
0 0 2 0 0 0 0 0 0 0 0 0 0 0 0 0 
##$SW_h= 3396.73913043478
##$TD= 16384
##$TD0= 1
##$TE= 0
##$TE2= 300
##$TE3= 300
##$TEG= 300
##$TL= (0..7)
0 120 120 120 120 120 120 120 
##$TP= (0..7)
150 150 150 150 150 150 150 150 
##$TP07= 0
##$TPNAME0= <>
##$TPNAME1= <>
##$TPNAME2= <>
##$TPNAME3= <>
##$TPNAME4= <>
##$TPNAME5= <>
##$TPNAME6= <>
##$TPNAME7= <>
##$TPOAL= (0..7)
0.5 0.5 0.5 0.5 0.5 0.5 0.5 0.5 
##$TPOFFS= (0..7)
0 0 0 0 0 0 0 0 
##$TUNHIN= 0
##$TUNHOUT= 0
##$TUNXOUT= 0
##$USERA1= <user>
##$USERA2= <user>
##$USERA3= <user>
##$USERA4= <user>
##$USERA5= <user>
##$V9= 5
##$VALIST= <valist>
##$VCLIST= <CCCCCCCCCCCCCCC>
##$VD= 0
##$VDLIST= <DDDDDDDDDDDDDDD>
##$VPLIST= <PPPPPPPPPPPPPPP>
##$VTLIST= <TTTTTTTTTTTTTTT>
##$WBST= 1024
##$WBSW= 4
##$XGAIN= (0..3)
0 0 0 0 
##$XL= 0
##$YL= 0
##$YMAX_a= 615868
##$YMIN_a= -575696
##$ZGOPTNS= <>
##$ZL1= 120
##$ZL2= 120
##$ZL3= 120
##$ZL4= 120
##$ABSF1= 16.03411
##$ABSF2= -0.9385548
##$ABSG= 5
##$ABSL= 3
##$ALPHA= 0
##$AQORDER= 0
##$ASSFAC= 0
##$ASSFACI= 0
##$ASSFACX= 0
##$ASSWID= 0
##$AUNMP= <proc_1d>
##$AZFE= 0.1
##$AZFW= 0.1
##$BCFW= 0
##$BC_mod= 2
##$BYTORDP= 0
##$COROFFS= 0
##$CY= -3
##$DATMOD= 1
##$DC= 0
##$DFILT= <>
##$DTYPP= 0
##$F1P= 0
##$F2P= 0
##$FCOR= 1
##$FTSIZE= 16384
##$FT_mod= 6
##$GAMMA= 0
##$GB= 0
##$INTBC= 1
##$INTSCL= 2.992141e-10
##$ISEN= 128
##$LB= 0.24
##$LEV0= 0
##$LPBIN= 0
##$MAXI= 10000
##$MC2= 0
##$MEAN= 0
##$ME_mod= 0
##$MI= 1.114404
##$NCOEF= 0
##$NC_proc= -6
##$NLEV= 6
##$NOISF1= 3.799351
##$NOISF2= 2.8
##$NSP= 0
##$NTH_PI= 0
##$NZP= 0
##$OFFSET= 16.03411
##$PC= 1
##$PHC0= -11049.92
##$PHC1= 8.600881
##$PH_mod= 1
##$PKNL= yes
##$PPARMOD= 0
##$PSCAL= 0
##$PSIGN= 0
##$REVERSE= no
##$SF= 200.129996098426
##$SI= 16384
##$SIGF1= 3
##$SIGF2= 2
##$SINO= 5.538805
##$SIOLD= 16384
##$SREGLST= <1H.CDCl3>
##$SSB= 0
##$STSI= 16384
##$STSR= 0
##$SW_p= 3396.73913043478
##$SYMM= 0
##$S_DEV= 0
##$TDeff= 16384
##$TDoff= 0
##$TI= <>
##$TILT= no
##$TM1= 0
##$TM2= 0
##$TOPLEV= 0
##$USERP1= <user>
##$USERP2= <user>
##$USERP3= <user>
##$USERP4= <user>
##$USERP5= <user>
##$WDW= 1
##$XDIM= 16384
##$YMAX_p= 376382004
##$YMIN_p= -1446104
$$ End of Bruker specific parameters
$$ ---------------------------------
##NTUPLES= NMR SPECTRUM
##VAR_NAME=  FREQUENCY,     SPECTRUM/REAL,   SPECTRUM/IMAG
##SYMBOL=    X,             R,               I
##VAR_TYPE=  INDEPENDENT,   DEPENDENT,       DEPENDENT
##VAR_FORM=  AFFN,          ASDF,            ASDF
##VAR_DIM=   16384,         16384,           16384
##UNITS=     HZ,            ARBITRARY UNITS, ARBITRARY UNITS
##FACTOR=    0.207333158178281, 1,           1
##FIRST=     3208.90619474688, 0,            0
##LAST=      -187.832935687898, 0,           0
##MIN=       -187.832935687898, -1446104,    0
##MAX=       3208.90619474688, 376382004,    0
$$ Real data points
##PAGE= N=1
##DATA TABLE= (X++(R..R)), XYDATA
$$ [...]
14042e44643K90431Q4001j7300l1427J85096P3143j2429j87242J52513R5777k78507
14031a90587J60653K6954Q3048N3420j96322m4407k5057p7436K7150l2588J47562
14020f7610L9808J85917L527j83752J41025M9018j75791O8898r4930j60278j42948
14009c37116J59198L06590j9796k49458O1751L2946n0423J30543j17571k09676
13999b93012O3778L2120J16702O2079q0910k6342J01915J0954J0442k75126J25283
13988a52117R2012m2801q348k4134j07008M9569q098N0667j61845j2635K0216
13977c04522P9425K29997l1468r2992o1567j13103P5433N6424n5102j57004J1447
13966c63032J56717J1675J3233k3639J47602N9063l9277m2080k38446m086J29100
$$ plain form
14042 -544643 -254212 -170211 -187511 -218938 -33842 39301 26872 -160370 -7857 87920 -190587
14031 -190587 -29934 -2980 80068 133488 -62834 -107241 -132298 -209734 -182584 -215172 -67610
14020 -67610 -27802 158115 161642 -22110 118915 167933 -7858 61040 -33890 -194168 -337116
14009 -337116 -177918 128672 108876 -140582 -78831 -45885 -96308 34235 -83336 -293012
13999 -293012 -229234 -197114 -80412 -18333 -99243 -125585 -23670 -12716 -2274 -277400 -152117
13988 -152117 -60105 -102906 -111254 -135388 -242396 -192827 -200925 -150258 -312103 -324738 -304522
13977 -304522 -225097 4900 -26568 -119560 -181127 -294230 -218797 -162373 -217475 -374479 -363032
13966 -363032 -206315 -194640 -181407 -205046 -57444 1619 -37658 -79738 -318184 -322270 -193170
13955a93170l434J7367j78560j02098J72667J38930m2812J9192m7331J44734J7530
13944e6985J54009J59099j14830n9999j53779P4241r3079j78447k2855N1492K17499
13933b3634O2564j8974p3951q1675J71516O2834k97397K7973m7003K91389q2364
13922h722j34286K04828j61680j4033J64139O9470Q224j88930k6462p5152J14628
13911d7976L9100j5617j69916k8635p2558R008L0088j13521n1131J39142K24634
13900e7382J06594j20669l1889K00393N9208k07680j28935L00400j72681j5569
13890f8210R0397j70830K0623J6344L5165n1025J07950o5522Q4525J4764j84611
13879a70430l1004J00796K9787l3568K22903N7679m7872j36731M3844M4476j05771
$$ plain form
13955 -193170 -196604 -179237 -357797 -459895 -287228 -148298 -191110 -171918 -219249 -74515 -56985
13944 -56985 97024 256123 141293 81294 -72485 1756 -91323 -269770 -292625 -241133 -23634
13933 -23634 38930 19956 -53995 -135670 35846 98680 -198717 -170744 -217747 73642 -8722
13922 -8722 -143008 61820 -99860 -113893 50246 119716 127940 -60990 -87452 -162604 -47976
13911 -47976 -8876 -24493 -194409 -223044 -295602 -286594 -256506 -370027 -421158 -282016 -57382
13900 -57382 49212 -71457 -103346 97047 156255 -51425 -180360 120040 -52641 -68210
13890 -68210 22187 -148643 -128020 -111676 -76511 -127536 -19586 -85108 -583 14181 -170430
13879 -170430 -201434 -100638 -70851 -104419 118484 176163 128291 -8440 35404 79880 -25891
13868b5891m9553l8404K03341L9300j32911J08958J5300j52431O9641j1340o409
13857A9601j54393q35J65711r3538K46928r6892n7120J36267Q50J0525J0463q7236
13845A00331J44584q8726k20109K3853P0497j79755k8819J50643M5678j9715R8712
13834I7174k7918p5561J39744j45744m7162r5398k51009J17971M9046J17309p7168
13823a98716J1096K30440j4165J39039N1110j96684K8953K2605L6387j75113j50866
13812b15914j8086m7670r0002J27981N7512J0704J02238k7514J01752j4445N8306
13801D4862k5488j64585j29028P5769q0065P5703J78768k07125K13026j5484j62594
13790a96241M9241K903J08797N1874J148k3105M6418n2703K16733l02986o8575
$$ plain form
13868 -25891 -75444 -113848 89493 128793 -4118 104840 120140 -32291 37350 26010 19601
13857 19601 -134792 -135627 30084 -63454 183474 86582 29462 165729 166579 177104 187567 100331
13845 100331 244915 156189 -63920 -40067 30430 -149325 -178144 -27501 18177 -1538 97174
13834 97174 69256 -6305 133439 -12305 -59467 -154865 -405874 -287903 -238857 -121548 -198716
13823 -198716 -187620 42820 28655 167694 218804 22120 51073 73678 110065 -65048 -215914
13812 -215914 -234000 -281670 -371672 -243691 -186179 -175475 -73237 -100751 1001 -13444 44862
13801 44862 19374 -145211 -274239 -198470 -278535 -202832 -24064 -231189 -18163 -33647 -196241
13790 -196241 -147000 -144097 -35300 16574 17722 -5383 41035 -11668 205065 -97921 -166496
13779a66496j6697j8727J79924j02207J96279J90268l3520r1930m5665J7982o4423
13768D4788k63278m1258J04485M9225M3521J7988M5149j0855k36257J0936J66577
13757f8979J11297j5413m7337j30400j7297J52783R9331r6613q5005N7176m3321
13746h3778N1936m1022K7777l5118j0164j1924J84351K3901j52130L3631o7079
13735g9619k2492n2323q8986N9388m4084R3469j7899j9494L4755j69615J26124
13724a80776K03253L8380L928j04246N5274K11342o0863k79768k1239P8069j1529
13713f8175o1606p6542J09451P9632K1675l31017J5015J85535Q6968j6860m8440
13702a04364n4990M12r6732J2010J34341J06004k6870j44894Q5282k62140J01598
$$ plain form
13779 -166496 -183193 -201920 -21996 -124203 72076 262344 228824 136894 91229 109211 44788
13768 44788 -218490 -259748 -155263 -106038 -62517 -44529 620 -10235 -246492 -235556 -68979
13757 -68979 42318 26905 -20432 -150832 -168129 -15346 83985 -12628 -97633 -40457 -83778
13746 -83778 -31842 -72864 -45087 -80205 -90369 -102293 82058 105959 -46171 -12540 -79619
13735 -79619 -102111 -154434 -243420 -184032 -228116 -134647 -152546 -172040 -137285 -306900 -180776
13724 -180776 22477 60857 64785 -39461 15813 227155 166292 -113476 -134715 -56646 -68175
13713 -68175 -129781 -206323 -96872 -17240 4435 -326582 -311567 -126032 -39064 -55924 -104364
13702 -104364 -159354 -158942 -255674 -243664 -109323 -3319 -30189 -175083 -89801 -351941 -250343
13691b50343L9850J02892L8001k85117J97252P4596k0411j32173Q9977J04463
13681d1013n0938j32657K22585n2187J4377P8848k40665J03965j48441M6485K83364
13670H3723j73859m4470p2884K53646K15940k00926J8043p5371M5349k519p71
13659D5901p6737k31244q1563L60875m3401J65168j44232j86187k4566o0605J74234
13648a02357r5894q8916K61662J54835k53568n7314J03635P1427L5063n5058p3856
13637a00341m1918j14838J77046J92459k3767J25770p6541k02771J40015r7406
13627b2292L873M1433k79263P4840K298q2176N0260j58601J25788K4372l8714
13616b58182L9742k9162J62345j20288J15495L2764j9236M2464n3537k0056J9682
$$ plain form
13691 -250343 -210493 -107601 -69600 -354717 -157465 -82869 -103280 -235453 -145476 -41013
13681 -41013 -91951 -224608 -2023 -54210 -39833 39015 -201650 -97685 -246126 -199641 83723
13670 83723 -90136 -134606 -207490 46156 262096 61170 79213 3842 49191 46672 45901
13659 45901 -30836 -262080 -343643 17232 -26169 138999 -5233 -191420 -215986 -276591 -102357
13648 -102357 -198251 -287167 -25505 129330 -124238 -181552 -77917 -6490 28573 -26485 -100341
13637 -100341 -142259 -257097 -80051 112408 88641 214411 137870 -64901 75114 -22292
13627 -22292 -18419 23014 -256249 -181409 -179111 -261287 -211027 -369628 -243840 -219468 -258182
13616 -258182 -218440 -247602 -85257 -205545 -90050 -57286 -76522 -34058 -87595 -107651 -87969
13605h7969o5052J23021J61897J06274O6199j97690o9037q6870Q5539k3124k74088
13594b60900J77770R6001N622j887l3338p4542N6883K82983m6173k06538m4703
13583d8822P9676K345q2049j32535J6094J34713J30669J0788l00332k0614J14992
13572i5075j6936j9106k3440J19712O3225m9340P8869P0642j82203O0304O3186
13561F9838n5737n7744j91361K6M0473Q1659K73216k67538J30997l4161p1410
13550h1742J60386j49339j51870K3451n2537Q8990m251Q8682Q5590n7912l7020
13539h7572L5669K76741j32448r5105J69305M9933m7285p5990K0738m8338M2406
13528A08054q3734n6605j51463L2808J02710J73743P0850j23289M8440j36039
$$ plain form
13605 -87969 -153021 -30000 131897 238171 304370 106680 37643 -49227 36312 13188 -260900
13594 -260900 -83130 12871 18493 16606 -16732 -91274 -34391 248592 202419 -4119 -48822
13583 -48822 30854 33199 -48850 -181385 -165291 -30578 100091 110879 -189453 -210067 -95075
13572 -95075 -112011 -131117 -154557 -34845 28380 -20960 57909 128551 -53652 6652 69838
13561 69838 14101 -43643 -235004 -234978 -194505 -112846 160370 -107168 23829 -10332 -81742
13550 -81742 78644 -70695 -222565 -199114 -251651 -162661 -166912 -78230 7360 -50552 -87572
13539 -87572 -51903 224838 92390 -2715 166590 216523 169238 93248 113986 65648 108054
13528 108054 24320 -32285 -183748 -150940 -48230 125513 196363 73074 121514 -14525
13518a4525j44706M2149j68201n6206K4507q535O5541J50425J98417N0938J28257
13507B68061n4318o3293m7500j48024K07022o9223k54797O9775k9343L28612n6008
13496A50964j56836P0580N5672K48287j39791k11249N4196k13100J64622j5743
13486G602l11588O1520K78459J9300j70548j92391J47479K079J50427p9499r2900
13475a80060M1101L0222m3405r4497m7117K24927J86326k2558j4302J3741K10514
13464C04892q9753O411n0143j46504p4817m5839J82422n0798p4439R9966R774
13453G1172j27176L2026j68595M8416l0839p1051j5738q6134P3475l3250O7061
13442b40633P3177K0086j2995o9832k86Q9194K9564k1067M0106P5935m0858J16939
$$ plain form
13518 -14525 -159231 -117082 -285283 -341489 -316982 -325517 -259976 -109551 88866 139804 268061
13507 268061 213743 150450 102950 -45074 161948 92725 -162072 -92297 -121640 206972 150964
13496 150964 -5872 64708 120380 368667 228876 17627 71823 -141277 23345 7602
13486 7602 -303986 -242466 35993 55293 -115255 -307646 -160167 -158088 -7661 -87160 -180060
13475 -180060 -138959 -108737 -152142 -246639 -293756 -68829 117497 94939 80637 94378 304892
13464 304892 215139 221550 171407 24903 -49914 -95753 86669 35871 -38568 61398 71172
13453 71172 -56004 -23978 -192573 -144157 -174996 -246047 -261785 -347919 -274444 -307694 -240633
13442 -240633 -167456 -147370 -160365 -230197 -230483 -141289 -111725 -132792 -92686 -16751 -57609 59330
13430E9330M1475l1881O114j31678j74177K37031m3411j5221J2212j06389J50261
13419C666k7805j62849k54469K5260L09971j70750j699Q5948Q9609L0917r1644
13408a63845J99721j68074k41464J37093j13983j32730P3945J61823R2239J2525
13398a42750O4080J84820k04441P4986j19399J5373J23860j58794j09081K0514
13388b50832M606o0986k2509J91701n2679K05553r5319j01658P0229j20466p1424
13377c03784o4177l1417Q7668L8434j34523N8092K2249J70921N0320j30375L3813
13366b02779J14793J1898R4065j4477k29352j57961J97763L999j78001J40142
13356b19910K32447j39721R6975m480j41699l6128n2643j3088j19561j58640o354
$$ plain form
13430 59330 100805 68924 75038 -56640 -230817 6214 -37197 -52418 -40206 -146595 3666
13419 3666 -24139 -186988 -441457 -416197 -106226 -276976 -278675 -192727 -103118 -72201 -163845
13408 -163845 35876 -132198 -373662 -236569 -350552 -483282 -409337 -247514 -155275 -142750
13398 -142750 -78670 106150 -98291 -23305 -142704 -127331 -3471 -162265 -271346 -250832
13388 -250832 -246226 -307212 -329721 -138020 -190699 14854 -80465 -182123 -111894 -232360 -303784
13377 -303784 -367961 -399378 -311710 -273276 -407799 -349707 -327458 -156537 -106217 -236592 -202779
13366 -202779 -87986 -76088 17977 3500 -225852 -383813 -186050 -182051 -360052 -219910
13356 -219910 12537 -127184 -30209 -34689 -176388 -212516 -265159 -278247 -397808 -556448 -562802
13345e62802J8217R9253j00089K23760O087j7064R9735L9739j6627L1570J00687
13334g7534j39031M9355O7244j08386R689N5433N3551P6460j13971m0971L12642
13323A44481k61839p4118K6836m5576o6877K05668N6630o6616o5580J01679K969
13312d2343J36534j7370l11315j4049o8894Q6052m0800k43599l7616L7210K00223
13301c15967K26172j39155J61639J38605L3502P5867j33901m6905j95786o1220
13291b57149K68460J5574o8312n2032J71074J2122j53667J2505o7603n1717N8394
13280a12351P513k1587j73570j15474Q6374P729K26715J71625k32177J77880o1997
13269c9320K31441N3949l55507N8927l0032j7815P6882n5815j07478j29285L59722
$$ plain form
13345 -562802 -544585 -445332 -545421 -321661 -315574 -332638 -232903 -193164 -209791 -178221 -77534
13334 -77534 -216565 -167210 -99966 -208352 -198663 -143230 -89679 -13219 -127190 -168161 144481
13323 144481 -117358 -191476 -164640 -210216 -277093 -71425 -14795 -81411 -146991 -45312 -42343
13312 -42343 94191 76821 -234494 -248543 -317437 -231385 -272185 -515784 -553400 -516190 -315967
13301 -315967 -89795 -228950 -67311 71294 104796 180663 46762 -143 -195929 -257149
13291 -257149 11311 26885 -41427 -93459 77615 89737 -63930 -51425 -119028 -170745 -112351
13280 -112351 -104838 -126425 -299995 -415469 -329095 -321366 -94651 76974 -155203 22677 -39320
13269 -39320 192121 246070 -109437 -50510 -80542 -98357 -21475 -77290 -184768 -314053 45669
13258D5669J44183k3660k3179L6821R0398J9181k48124m2891j36339J41881M5002
13247D8942j81864o4305k1509K61637K27818j27348j02590J3266o1483O4761n8588
13236a263j03290K1927k74028K5519O2866J67322m8085n551J13254J8335J68635
13225A45641L2859k47348L2345J06183m5244k1150k22216j13762J60102J85047
13215A2457N706L6163q4763P4675P3703K5744n9584q8991k6597m7356J9448J09404
13203E0009q0634J3839o5408J73834Q1380j12363q8621J2083L7925k19322q6832
13192b84110l23P6624J21674J02293M6831j24074p8138J9860K41798O056j88644
13181f0153j01280L05866j36113l3012J53682n5957r8093J06492O2065j36283
$$ plain form
13258 45669 189852 166192 143013 179834 270232 289413 41289 -1602 -137941 3940 48942
13247 48942 -132922 -197227 -218736 42901 270719 143371 40781 54047 -7436 57325 -1263
13236 -1263 -104553 -82626 -356654 -331135 -268269 -100947 -149032 -154583 -41329 -22994 145641
13225 145641 178500 -68848 -36503 69680 24436 3286 -218930 -332692 -172590 12457
13215 12457 18163 54326 -30437 44238 117941 143685 84101 -4890 -31487 -78843 -59395 50009
13203 50009 -30625 -16786 -82194 91640 173020 60657 -27964 -15881 22044 -197278 -284110
13192 -284110 -284433 -207809 -86135 16158 62989 -61085 -139223 -119363 122435 128491 -60153
13181 -60153 -161433 144433 8320 -24692 128990 73033 -25060 81432 143497 7214
13171G214l59058J88632K5874j09424J93335L4504l9286J07399j43674j10954
13161b05438k7529l447Q2264J35788n2134P2745O097j37091K8327j0782j68023
13150b79223J34298J9511j03596M7536J64258k6524M2353o1528n9287J8622P4675
13139b8905n4048j87328J64879O6953o1917P9329O254J6810k389j16315J42876
13128B6199j40074q5791J2377o0034q0061J00574R3265j10453N7200O349R6478
13117h3971J10703K7539K06653j84114j22869Q9219J40062k45771J69880j60994
13107e3663n0662J574J5976k1375k4778J2264J11710r2540r1198j6831m3397p2471
13095c25391j5669M9880K27769j99678J20157K16262r2901P6979R738q8853K0488
$$ plain form
13171 7214 -351844 -163212 -137338 -246762 -53427 -18923 -58209 49190 -94484 -205438
13161 -205438 -232967 -236414 -154150 -18362 -70496 2249 8346 -128745 -100418 -111200 -279223
13150 -279223 -144925 -125414 -229010 -181474 -17216 -43740 -1387 -62915 -122202 -103580 -28905
13139 -28905 -82953 -270281 -105402 -38449 -100366 -21037 -14783 2027 -362 -116677 26199
13128 26199 -113875 -199666 -187289 -247323 -327384 -226810 -133545 -243998 -186798 -180449 -83971
13117 -83971 26732 54271 260924 76810 -46059 43160 183222 -62549 107331 -53663
13107 -53663 -104325 -102751 -86775 -108150 -132928 -120664 -8954 -101494 -192692 -209523 -252920 -325391
13095 -325391 -341060 -291180 -63411 -263089 -142932 73330 -19571 57408 67146 -21707 -1219
13084a219j50549n7283K9875p1115K6496R2164o0333K1635P5309J56704k18071
13073a56387L9477J09212Q417K8008j02548n8948r4546n7831J27785q972p4498
13062b40831r5860J4546P4925r5168O2855J14976l6027m7194N1915Q6931K1851
13051h7081p8438m0290N0128J31299j63416j1873l4176K17129J3523M1267o6256
13040b8184p9898m4841J2588q6590P1890k0543M4653J41816j4594j82450Q1902
13029a04251q9045j659J08604l6334l1042J35068j18196J54392P2489J5034j14357
13018i297k8427j04968J06724k32184O7105J22808n9598J16377L2333m2120J78021
13007A46774k7570O6128o4344j80484L9762m9761j24892O9333l3085M1611J67596
$$ plain form
13084 -1219 -151768 -209051 -179176 -250291 -223795 -131631 -191964 -170329 -95020 61684 -156387
13073 -156387 -116910 -7698 719 28727 -73821 -132769 -227315 -285146 -157361 -166333 -240831
13062 -240831 -336691 -322145 -247220 -342388 -279533 -164557 -200584 -247778 -195863 -108932 -87081
13051 -87081 -165519 -205809 -155681 -24382 -187798 -199671 -233847 -16718 -3195 38072 -28184
13040 -28184 -108082 -152923 -140335 -226925 -155035 -175578 -130925 10891 -3703 -186153 -104251
13029 -104251 -193296 -194955 -86351 -122685 -153727 -18659 -136855 17537 90026 105060 -9297
13018 -9297 -37724 -142692 -35968 -268152 -201047 -78239 -137837 -21460 10873 -31247 146774
13007 146774 119204 185332 120988 -59496 -19734 -69495 -194387 -125054 -158139 -116528 51068
12996E1068q5925O6381p8N701J16659p9817P3249o4251k46660J29318j55713m151
12984a94219l4951J06988L2058J71704R695j56615J7121K48033j21270K1625q6980
12973A3189j28624j23506Q7078r277R8476Q5873j15527o3506N7671n8590L9390
12962a17353q3514n6741o2387K28254N3937M92K91j60620J20370p6147r8040J25518
12950a25940Q2406j2754N2496j05399k01057O8718N9624J5450k8219K6033p9720
12939b48362J05254j03562M6393J21504N9350j87902k0670J43909j56382n5366
12929b95834J82952j7734r2596J73383K3438j49982K50859O132j60326k0110o0008
12918a59826n4050q8107J26015p2357J00650J88059J31256j72348j6462l49N7774
$$ plain form
12996 51068 -34857 31524 31446 37147 153806 73989 147238 82987 -163673 -34355 -190068 -194219
12984 -194219 -229170 -122182 -90124 81580 91275 -65340 -48219 199814 78544 100169 13189
12973 13189 -115435 -238941 -151863 -161140 -62664 23209 -92318 -155824 -98153 -156743 -117353
12962 -117353 -200867 -257608 -319995 -91741 -37804 -37312 -37021 -197641 -77271 -153418 -251458 -125940
12950 -125940 -43534 -56288 -3792 -109191 -310248 -241530 -181906 -166456 -194675 -168642 -248362
12939 -248362 -143108 -246670 -200277 -78773 -19423 -207325 -227995 -84086 -240468 -295834
12929 -295834 -112882 -130616 -223212 -49829 -26391 -176373 74486 80618 -79708 -99818 -159826
12918 -159826 -213876 -301983 -175968 -248325 -147675 40384 171640 -708 -17170 -17519 40255
12907D0255J7069j17275O3308J1985j71292K6359L1237q7685J573K25296r5438
12896e4608J94573K2663J04581j41937o6741j25790j69768L9199p0338j54900
12886d23066L7795m1749Q0948L26639N1628k63848J87328J26546j14281p8046
12876a10106J18202j33015j27327P7505J07823M6722j21647J3118J09940L2031
12866A3246r4256j53959Q7550R494j18410J75492p2524M5843M1231j32404P6956
12855a21741p3643k17075J83070R4905P9304J34610N1506j61175l8359k8895J47454
12844D9961P8004R829k13110J5085K15662M003j08021m5266K6487J05322J72965
12833C10921k09732r0849J24025N3057n0411q2694o1339p062O9874m5856M7175
$$ plain form
12907 40255 57324 -59951 3357 15342 -155950 -129591 -98354 -186039 -184466 40830 -54608
12896 -54608 139965 162628 267209 125272 58531 -67259 -237027 -197828 -268166 -423066
12886 -423066 -385271 -427020 -346072 -19433 32195 -231653 -44325 82221 -32060 -110106
12876 -110106 8096 -124919 -252246 -174741 -66918 -20196 -141843 -128725 -18785 13246
12866 13246 -81010 -234969 -147419 -137925 -256335 -80843 -153367 -107524 -66293 -198697 -121741
12855 -121741 -195384 -412459 -229389 -134484 -55180 79430 130936 -30239 -68598 -97493 49961
12844 49961 127965 137794 -75316 -60231 155431 159434 51413 6147 32634 137956 310921
12833 310921 101189 10340 134365 187422 137011 54317 -7022 -14084 55790 9934 57109
12822E7109j1354R347j51709L7268K04035k39225n3688j7546m9307J50041R3582
12811B8553K3041j12679J52543k7105Q774l6753j1358j44003J9275o576j3Q2105
12799b4196o2104K02927N4833r1344m7012j11193O9574l26446J02548J98407q4536
12788a18542l4552L3243J07660J15126n8008n5932J54084k5091j04021N6620Q1167
12777A51754j94172Q7642K19121k58402p1371j22352L4689K89348r965j4586j19205
12766g499K17048R3410k62094o432p6796q9327j2553j00880J40558O3757R389
12755c1419K07995P4596j56641R5923j09966j41825j08493R8417j33650j22257
12745c27320n0804j5326Q7506J65536m3770N7761J34219J81605j44730L2496k6089
$$ plain form
12822 57109 45755 55102 -96607 -59339 144696 -94529 -148217 -165763 -215070 -65029 28553
12811 28553 51594 -61085 91458 64353 73127 36374 25016 -118987 -99712 -106288 -106301 -24196
12799 -24196 -86300 116627 171460 80116 33104 -78089 -8515 -334961 -232413 -34006 -118542
12788 -118542 -153094 -119851 -12191 102935 44927 -11005 143079 117988 13967 70587 151754
12777 151754 -42418 45224 264345 5943 -65428 -187780 -153091 136257 126292 111706 -7499
12766 -7499 209549 302959 40865 34433 -42363 -131690 -144243 -245123 -104565 -40808 -31419
12755 -31419 176576 251172 94531 190454 80488 -61337 -169830 -71413 -205063 -327320
12745 -327320 -378124 -393450 -305944 -140408 -184178 -126417 7802 189407 44677 77173 51084
12734E1084j77462K24040J4090j03442Q5973P9137j83625N2522q8524k7271J99844
12723A26366q0525J09143j97130P3286P2602j43583p6778j1882J44572Q7829J84624
12712B88524o2008k29203r0551n344R9591p428J05060L2890r3929P3560R2545
12701B03707j56264J1659J0071j53948n0839j84671k27J00705J10330L31086k24934
12690c325J11620j61584k03009J22735k2403J61085L4653m6811n2930j20037J7026
12679a62980K12206k0675J51370k72241q3572J51447j40863L1107j82572K8866
12669b87907L81863p1180O2861j37200j53129j14076K37757J05111j52784j7540
12659a46224J38357o4672J57705N7971k905j36198J07254O3165k0614q6414j92571
$$ plain form
12734 51084 -126378 97662 111752 8310 94283 173420 -10205 42317 -46207 -73478 126366
12723 126366 45841 154984 -42146 31140 103742 -39841 -116619 -128501 16071 103900 288524
12712 288524 226516 -2687 -93238 -98582 1009 -6419 98641 131531 37602 111162 203707
12701 203707 47443 59102 69173 -84775 -135614 -320285 -320512 -219807 -109477 221609 -3325
12690 -3325 108295 -53289 -256298 -133563 -155966 5119 39772 -7039 -59969 -180006 -162980
12679 -162980 49226 28551 179921 -92320 -175892 -24445 -165308 -134201 -316773 -287907
12669 -287907 93956 22776 85637 -51563 -204692 -318768 -81011 24100 -128684 -146224
12659 -146224 -7867 -72539 85166 143137 140232 4034 111288 174453 153839 67425 -125146
12648a25146k31727J49836M6332J8069k4483k83278K88099J35835J87901j2351
12638A49087j77658J21896l17668K09068P7386l75290J55308k4150L1270R0537
12628f0214j38816K74364p0148q9598R5060q5043r676k53155j372N7495j07785
12617c88888k8045r1721m3504K94261o9340L4642j4022j19817J94537J298M1872
12606a88727n3133Q0386K41372m08856k5297m5j91667K11207L5114n0166l7407
12595c87219P3158K05973j3240K03052j69296k06127l0851o1468N7147n5051j00545
12584d84467o6782J97182L68871n5976P1226R0550o9824J39059j06466j72147
12574h8774o8087o3518J95516R1654k24683Q9091k2145J4062M0359m2865J33558
$$ plain form
12648 -125146 -356873 -207037 -160705 -142636 -167119 -450397 -162298 -26463 161438 149087
12638 149087 -28571 93325 -224343 -15275 62111 -313179 -157871 -182021 -150751 -60214
12628 -60214 -199030 75334 5186 -84412 10648 -74395 -84071 -337226 -338598 -281103 -388888
12617 -388888 -416933 -508654 -552158 -257897 -327237 -292595 -306617 -426434 -231897 -230599 -188727
12606 -188727 -241860 -161474 79898 -328958 -354255 -354300 -545967 -334760 -299646 -349812 -387219
12595 -387219 -314061 -108088 -121328 81724 -87572 -293699 -324550 -386018 -328871 -383922 -484467
12584 -484467 -551249 -354067 14804 -41172 30054 120604 50780 189839 83373 -88774
12574 -88774 -156861 -220379 -24863 66791 -157892 -68801 -90946 -76884 -36525 -79390 54168
12563E4168q1061K53095j4985r0181J42816k69293Q6962J4612j49892R0737r4442
12552e7464O7623p4879n4087L17749J1403k58478K00210o7930p4197n5608J02700
12541E7042L8822j38703q1431N1717N0024J04490j38236j00690Q2249J37144J30764
12530A93192j7554j43827p1365K47212j01091k8263j17964j12611n3577L5981
12520a69867j07000k2710J18444M2068J21297o7020J4002O2796P7671j74203p3190
12509a77712J94403m8094j10186j65031n0232K44669j2159q8304J77276o7591
12499a02961K32352j367j8804J8439L8696J18231l05455j40342O9777j15512R2650
12488a14296K47339L0780j3673J19325N265J15972r9952j24679K45912Q399k51233
$$ plain form
12563 54168 -26893 226202 211217 121036 263852 -5441 81521 96133 -53759 36978 -57464
12552 -57464 10159 -64720 -118807 198942 210345 -48133 152077 84147 9950 -45658 57042
12541 57042 95864 -42839 -124270 -72553 -22529 81961 -56275 -156965 -74716 62428 193192
12530 193192 175638 31811 -39554 207658 106567 78304 -39660 -152271 -205848 -169867
12520 -169867 -276867 -299577 -181133 -139065 -17768 -84788 -70786 -7990 69681 -104522 -177712
12509 -177712 16691 -31403 -141589 -306620 -356852 -112183 -124342 -212646 -35370 -102961
12499 -102961 129391 128024 109220 127659 166355 284586 -20869 -161211 -91434 -206946 -114296
12488 -114296 133043 163823 150150 269475 274740 390712 290760 166081 411993 420392 169159
12477A69159p7419o1891R5786p9641J64100j8876j53958L4672P7095J55886r7181
12466B07732J5219j72662M2917O8594N2706j47455k84463M6643J43072K48756
12456B21059n7037l1659J64547j19929N4906j25973j9294J56234n4811r327l50233
12445a71517m4605R2802P7734j36912r7661N9408J24251J18727j87264N5659P7579
12434c1799r8623K8932j47026j6695P8707l6422J59879R9434j06981L1628N6558
12423A7592N0988K05842j73178K2404j38955R6632J23480j81730J07849l1485
12413I9439p2945o2179p6071l9897J58555R3982j34334n0017k151Q6203J55974
12402A56559J34425p596j81542j02357j34799o264J9064M0676j44697p5109K54188
$$ plain form
12477 169159 91740 29849 125635 45994 210094 191218 37260 71932 149027 304913 207732
12466 207732 222951 50289 93206 161800 214506 67051 -217412 -170769 -27697 221059
12456 221059 164022 132363 296910 176981 231887 105914 86620 242854 188043 178716 -171517
12445 -171517 -216122 -123320 -45586 -182498 -280159 -220751 -96500 22227 -165037 -109378 -31799
12434 -31799 -130422 -101490 -248516 -265211 -186504 -222926 -63047 36387 -70594 -38966 17592
12423 17592 68580 274422 101244 123648 -15307 81325 204805 23075 130924 99439
12413 99439 26494 -35685 -111756 -151653 6902 100884 -33450 -83467 -85618 585 156559
12402 156559 290984 283388 101846 -511 -135310 -141574 -122510 -81834 -226531 -301640 -47452
12391d7452L3944j75479K5942R9105j01435L63374J6442k27667j20223m3404J17266
12380e9587j4489j72064o3686j77031K09623K11326p2924O8596N0987j43421J49347
12369a3323o0641j20598Q203J33508j04560n793M8916j70592P2331R2396J33396
12358A3243j05829M480L8749o8355J40687L4242k35825J69269o8486K19515J38643
12347B80333j58417P8929j1409k3052J46982l3119k9918p4066P8196m0881k54516
12336d0938o0756R38O5902j03390j82359R7135K0058n9866M44698J25953q0525
12325B26850j49341L0710J18723j70487L3872q8416P1727K7962N7118j00299m3746
12314A4673O6922J74191N8220j00656J65105l5819j99501j90559r1998O925n1786
$$ plain form
12391 -47452 -13508 -188987 -163045 -63940 -165375 197999 214441 -13226 -133449 -176853 -59587
12380 -59587 -74076 -246140 -309826 -486857 -277234 -65908 -138832 -70236 -19249 -162670 -13323
12369 -13323 -73964 -194562 -186359 -52851 -157411 -163204 -114288 -284880 -212549 -120153 13243
12358 13243 -92586 -88106 -49357 -117712 22975 57217 -178608 -9339 -77825 141690 280333
12347 280333 121916 200845 189436 166384 313366 280247 250329 176263 254459 213578 -40938
12336 -40938 -101694 -100756 -34854 -138244 -320603 -223468 -203410 -263276 181422 307375 226850
12325 226850 77509 108219 226942 56455 90327 1911 73638 101600 158718 58419 14673
12314 14673 81595 255786 314006 213350 378455 342636 143135 -47424 -139422 -132497 -184283
12303a84283Q3136K12888M0284k07518l5220J52510j1310P0355L5680j52524J00633
12292A04631N1869k5492j39701k68806K52813K20317l2859L8313P1308J2631j65154
12281A19870J07230L8927j39354J36732J0992j47824k8932K6154j02603P3544
12271I4736P5989o4326j9543p377J46409K4226j13934r0474O8301K28574j97530
12260A45051P07O9364q2428P3809N267j4122Q0883p3878R8195Q0464p7240j18226
12248A87846k9392j08731j30630J19819R880j01640J51343K14626j1186j51707
12238A50228j2118k909m8801J83015j14533r4260k3127j42681R8446m8050r8833
12227a53623J9291K64460N3493j39545j19887N4521P6156n2108o6133J03886j5792
$$ plain form
12303 -184283 -101147 111741 152025 -55493 -90713 61797 50487 120842 156522 3998 104631
12292 104631 156500 131008 -8693 -277499 -24686 195631 162772 201085 272393 285024 119870
12281 119870 227100 266027 126673 263405 274397 126573 97641 123795 21192 94736
12271 94736 170725 106399 86856 79479 225888 250114 136180 45706 114007 342581 145051
12260 145051 145758 215122 132694 206503 211770 197648 278531 204653 302848 383312 306072 187846
12248 187846 158454 49723 -80907 38912 48792 -52848 98495 313121 301935 150228
12238 150228 138110 135201 86400 269415 154882 60622 37495 -105186 -6740 -54790 -153623
12227 -153623 -134332 130128 183621 44076 -75811 -21290 54866 2758 -63375 40511 24719
12216B4719j38419n3198L9533J27566J3677k39336K9278K89654l3598J44870j26649
12205G8097n7293P98o0006j0283j71816q6856J86412q1219J65664m9450j38739
12194b24691M5602L4708l587O2431J23428L456j02758J13918m1161Q2882l6457
12183E7771p0361L4795j28678J07682n1578j35187J22459Q1573j01028J04287
12173B1735O045P5877n728k03701o2729J11670R3916j07368j63287n076q0189
12162c18835K33354N4333o6320n8142P1120L71871r3499j79974o7537k29191K99546
12151A6726j22794j57733J74697j48895J21866L6999Q720N1596k2354M0604j22522
12140a23090K3009o650j24671k820m7092N2497K03240q5032j4968K6268n9428
$$ plain form
12216 24719 -113700 -166898 -127365 201 13878 -225458 -196180 93474 59876 204746 78097
12205 78097 20804 21602 -38404 -48687 -220503 -307359 -120947 -202166 -36502 -85952 -224691
12194 -224691 -179089 -144381 -147968 -85537 37891 41347 -61411 52507 11346 94228 57771
12183 57771 -12590 22205 -106473 1209 -50369 -185556 -63097 18476 -82552 21735
12173 21735 27780 103657 97929 -105772 -168501 -56831 37085 -70283 -233570 -238646 -318835
12162 -318835 -85481 -31148 -97468 -155610 -84490 287381 193882 13908 -53629 -282820 16726
12151 16726 -106068 -263801 -89104 -237999 -116133 -79134 -70414 -18818 -41172 -568 -123090
12140 -123090 -100081 -106731 -231402 -234222 -281314 -228817 -25577 -110609 -125577 -99309 -158737
12129a58737J17639P270r2508k1269O0910J38216m4362K4824j40453l9030Q6063
12118f1437r0785J45549J04527q2512R8267k277j80769P8345O4507o1217j9213
12107g015J60226N4324n5235l6156j63193O2774J52113r6152j33156j95326K72031
12096A5235K45243J51821M072k76516O4567q6545J7701J93491k47367L4796P5400
12085A91898l3719J30479k386K0604l6292j55551N6644j71241p4049P4447o4370
12074f3536n1391J09901J95434o7554j5413J6133l4899J40339j74608J61027J52962
12063C68395o2900j6542J7239l2385Q3986j1789R820j12976l7486J21342k3687
12052C03017n4150J53773L9447M5053r636j9889k2079j80371m6409p6547K30847
$$ plain form
12129 -158737 -41098 -33828 -126336 -147605 -86695 51521 7159 31983 -108470 -147500 -61437
12118 -61437 -152222 -6673 97854 15342 113609 111332 -69437 8908 73415 12198 -7015
12107 -7015 153211 207535 152300 116144 -47049 15725 167838 71686 -61470 -256796 15235
12096 15235 260478 412299 416371 139855 204422 117877 135578 329069 81702 116498 191898
12085 191898 158179 288658 286272 306876 270584 115033 171677 436 -73613 834 -63536
12074 -63536 -114927 -5026 190408 122854 107441 123574 88675 229014 54406 215433 368395
12063 368395 305495 288953 306192 273807 357793 346004 355824 242848 205362 326704 303017
12052 303017 248867 402640 442087 487140 477504 457615 435536 255165 208756 132209 363056
12041C63056p3987q0620L2439J06918O4500K19206j23897j50679q3423J28698
12031D02211n8445q4921K9114k22907J05152K55013k59846L3864J7475p6732L46299
12020D86277K5142j95949N647O4723m404r9892J41281j89262q643J61746J11372
12009D98038o9153r5467J13915n2987j029R0942j55195K2956n2838j8611l90M3403
11997C23584m1724j1472R0322L9131j3404j77113j7115l8009J50579Q3194j24653
11986B63320r757M6679j9049J16237m3201J01004j4049j42393p5324k7543p9492
11975A16432n278N4056Q0872o8465O4337P3908m280j3521j50659j30645R3939
11964A10696J06910J58541N5389j65844q4898N6736m8981n0199q8269J04827m337
$$ plain form
12041 363056 289069 208449 240888 347806 412306 631512 507615 356936 273513 402211
12031 402211 343766 258845 287959 65052 170204 425217 165371 199235 216710 139978 486277
12020 486277 511419 315470 321117 385840 381436 281544 422825 233563 224920 386666 498038
12009 498038 428885 333418 447333 394346 393317 484259 329064 352020 299182 280571 280181 323584
11997 323584 281860 270388 360710 399841 386437 209324 192209 154200 304779 387973 263320
11986 263320 253563 300242 281193 397430 354229 455233 441184 298791 223467 195924 116432
11975 116432 111154 165210 246082 177617 241954 315862 311582 298061 147402 16757 110696
11964 110696 217606 376147 431536 265692 180794 237530 188549 138350 50081 154908 150571
11953A50571l5477Q2298M3869L1835J43751j37154p2076O5680J03819q7922j57427
11942A31767p6340J96133r3524L3543m3553M7754R5318j35723j61763P3513o128
11931F0997J97877n8115j95564K34600j44391R3759K86885k10174R5790q8721
11921B72943k82758J81434O754K6608q9949R593J09852j3620j7838j8895r0053
11910I4071O8333q1902L5319K0915J35948K2426j47789j62755M7620K5972J68745
11899B26903N2879N6095n6852J02958l3486J45687j44340k38983J23982Q0090
11889C14933j2153r6570q7399K872J10281R3594J4532p4580K7440J34072P6103
11878E03125j0281j01192J32671k19521j5177K10507m5645j37447l9414j62417
$$ plain form
11953 150571 115094 197392 241261 273096 416847 279693 207617 273297 377116 289194 131767
11942 131767 55427 251560 158036 191579 148026 195780 291098 155375 -6388 67125 60997
11931 60997 258874 200759 5195 239795 95404 189163 476048 265874 361664 272943
11921 272943 -9815 171619 178373 204981 115032 124625 234477 220857 203019 184124 94071
11910 94071 162404 80502 115821 136736 272684 295110 147321 -15434 32186 58158 226903
11899 226903 279782 335877 279025 381983 348497 494184 349844 110861 234843 314933
11889 314933 302780 206210 118811 121683 231964 325558 340090 265510 292950 427022 503125
11878 503125 492844 391652 524323 304802 289625 500132 454487 317040 277626 115209
11868A15209J07295J16818j3644n2379j6889J7851K10556p1492j65746o0384J10184
11857B97379J60168j85973j12430L7345q651K93096O7850j74931K0984o2669J74047
11846E06215o7966j60642L6375l0915M7542J04669n1375n9113L865j14401N7843
11835B72097L18334r5120o0372k6501J79848R4319n9644j2815l1300j10103Q1248
11824E49991m4316j86694j80731P9880P6132K49702K3815N8448j85620K27648
11814F68255Q4433k4786j11982k6126o3194J21432j25097j41971J64648J48539
11804F94151K5370J6691m4779j99812N9879K35414o1157q1249k0958j90190P928
11793D41288p5737l9669j4774j47724L1360J93739J74193K7470K1929M0053k75599
$$ plain form
11868 115209 222504 339322 325678 273299 256410 274261 484817 413325 247579 187195 297379
11857 297379 457547 271574 159144 196489 187838 480934 548784 373853 394837 332168 506215
11846 506215 438249 277607 313982 283067 330609 435278 383903 324790 328655 214254 272097
11835 272097 590431 495311 434939 408438 588286 682605 622961 610146 578846 468743 549991
11824 549991 505675 318981 138250 218130 294262 543964 567779 626227 440607 668255
11814 668255 752688 727902 615920 589794 526600 648032 522935 380964 545612 694151
11804 694151 719521 736212 691433 491621 551500 786914 725757 644508 623550 433360 441288
11793 441288 365551 325882 311108 163384 194744 388483 562676 590146 612075 652128 376529
11782C76529J03154N6676l81120R305N706j17233J70347L5502J15498J16393k0557
11771D70200M3757N0453K81500m2425j52565p7132j65470p3834k68696Q6682O8285
11760B20755J57887L4897k19711j2515K29558q3353J49223R6500k04204n5396
11750C13641J29872J2686j01941K8500J32995j44243M3681J08221l0502m2058
11740D50852J17561R6268J53690Q163r5613j07139M1908n4643r3392R8844l4710
11729E81789P7419J64219r1666J13577j40137j3516k3490M6548J08919J1368j07901
11718G27129j05794K0504o8502j12607j9765j83483O2650K12912j10814o4049
11708C58181j73020J10597J24816R8514J08067j99475p1667K15127k11540P9839
$$ plain form
11782 376529 479683 536359 155239 164544 170250 53017 223364 258866 374364 490757 470200
11771 470200 513957 564410 845910 803485 650920 573788 408318 334484 65788 152470 220755
11760 220755 378642 413539 193828 181313 410871 327518 476741 573241 369037 313641
11750 313641 443513 456199 354258 382758 515753 371510 415191 523412 492910 450852
11740 450852 568413 664681 818371 826534 730921 623782 665690 611047 517655 616499 581789
11729 581789 659208 823427 731761 845338 705201 691685 668195 714743 823662 835030 727129
11718 727129 621335 641839 573337 460730 440965 257482 320132 533044 422230 358181
11708 358181 185161 295758 420574 519088 627155 427680 356013 571140 359600 439439
11698D39439j74940j64825K55582j43539P1045K08508j03070j01176J01199Q4774
11688D72997n1296J7031Q2746M3768J0736k88774K7911j33034L927m7521n9577
11677G8914L13944q3839M4470K65231q3417o4010j4214n5356n3371j19133k0696
11666B08523J5139O4947j6524K63327J47650j6538J9069Q2196j77798R5845K7864
11655G13700j4293l06578j21286L07833j5412p0618n2606j02512O0105m9734J56738
11644E05337j0176p7291J22198P4257k39066j50049j35889K39654O423M7846p6995
11633C06249l3303K85008P2636q8903J34668p7655J2365p5794l0567J22177k90773
11622C36108O1062o1066J46614K35770l1655K9178q0371J57232J09997j39560
$$ plain form
11698 439439 264499 99674 355256 211717 282762 491270 388200 287024 388223 472997
11688 472997 421701 438732 521478 565246 575982 287208 315119 182085 186012 138491 78914
11677 78914 392858 309019 353489 618720 535303 471293 457079 401723 348352 229219 208523
11666 208523 223662 288609 272085 535412 683062 666524 685593 767789 589991 685836 713700
11655 713700 699407 392829 271543 579376 563964 493346 440740 338228 398333 348599 505337
11644 505337 495161 417870 540068 614325 375259 225210 89321 328975 335398 383244 306249
11633 306249 272946 557954 630590 541687 676355 598700 611065 535271 504704 626881 336108
11622 336108 397170 336104 482718 718488 686833 716011 635640 792872 902869 763309
11612G63309J275j07986l2184J03737j4376P9880r1973Q0850J45068L2937P0833
11601A031370j54918l5145O2R8310J679j86696Q2915J64521q0015R9785r227o5274
11589I47367O5675k4600Q8140P5890j8919J21046n3743M4784o1143j14645j49083
11578I20769j75971j8936J46818l4912Q7475j05016K61448J2773J27804q7543
11568A134709m6925L8076O9529P2126O0267k470j49509n6990R3760m8493j01048
11557A063032J07410J04677J2583K8025J36488k37148K450J12497p6131J19915
11547A373798j15080j12788K3596n2418J05122L1588o1762J29164k1014J89391
11537A489597M6048j20842p5684R5572J33974n3191k03311p9519J00442n8729
$$ plain form
11612 763309 764584 656598 624414 728151 713775 793655 701682 782532 927600 960537 1031370
11601 1031370 876452 841307 841369 939679 941358 754662 837577 1002098 922083 1021868 1012641 947367
11589 947367 1013042 988442 1076582 1152472 1133553 1254599 1200856 1245640 1184497 1069852 920769
11578 920769 744798 725862 872680 837768 925243 820227 1081675 1094448 1222252 1134709
11568 1134709 1087784 1125860 1195389 1267515 1327782 1325312 1175803 1118813 1212573 1164080 1063032
11557 1063032 1170442 1275119 1287702 1315727 1452215 1215067 1217517 1330014 1253883 1373798
11547 1373798 1258718 1145930 1169526 1117108 1222230 1253818 1192056 1321220 1300206 1489597
11537 1489597 1535645 1414803 1339119 1434691 1568665 1515474 1312163 1232644 1333086 1274357
11527A274357N3240M4563o589K33229J4632j04222m4975O7851j9578m9348q982
11516A454178q5708J46087m5969P7050r4278o3724J61996n7837M2570J41115J67591
11505A843071Q4795k81670m7684m6824o4150n0983j44028N6530J48230N3543K29412
11494A780242l3893l4324J16897J3490n0711p8608m0586K35941k5646N853k07021
11483A681634n8591J52114L4951O3007q120m5624J03792q7829R2232q7440j16156
11472A723970R2113k211m8393l5446j72070J24629J17279N6301j82425J54030
11462A827777r1648j77287J18506K56331L0746k08780n6638P0021k7914l3516
11452A707598j70823k2761J91857M3745l8105j5542q6212J32398m4645j74221
$$ plain form
11527 1274357 1327597 1372160 1365571 1598800 1613432 1509210 1464235 1532086 1512508 1463160 1454178
11516 1454178 1368470 1514557 1468588 1545638 1451360 1387636 1549632 1491795 1534365 1675480 1843071
11505 1843071 1927866 1646196 1598512 1551688 1487538 1436555 1292527 1349057 1497287 1550830 1780242
11494 1780242 1746349 1712025 1828922 1842412 1791701 1713093 1672507 1908448 1882802 1888655 1681634
11483 1681634 1623043 1775157 1810108 1873115 1864995 1819371 1923163 1835334 1927566 1840126 1723970
11472 1723970 1816083 1813872 1765479 1730033 1557963 1682592 1799871 1856172 1673747 1827777
11462 1827777 1736129 1558842 1677348 1933679 1964425 1755645 1699007 1769028 1741114 1707598
11452 1707598 1536775 1514014 1705871 1749616 1711511 1695969 1609757 1742155 1697510 1523289
11442A523289R9667j62808L5751K8690j98982Q5955M223p8904K7795M3149K09861
11431A617686j4286j32599p3777N0091J03320L1840J8497o0937l94165m473K11102
11420A352299p4617j39643J94990K59379o3727k23915J04824K0061J08114m9447
11410A488318k6702l2965j95635k1947K02333j95647k2420j06331L36368J10026
11400A535398k4414K9989Q4283j51096J83741j76724J17593r1427M191L4667r6390
11389A449811o9036o859K96379n2094r5022L80053j15164R2911K68953j44342
11379B005590J4839j82465n5522j38698j98192J44532O1643r8340L34309j25084
11369A762612J16814J21617j38430N8126r4328J02562q0661j53821K7300o0669
$$ plain form
11442 1523289 1622956 1460148 1495899 1524589 1325607 1411562 1415785 1336881 1364676 1407825 1617686
11431 1617686 1603400 1470801 1397024 1447115 1550435 1582275 1600772 1539835 1145670 1141197 1352299
11420 1352299 1277682 1138039 1333029 1592408 1528681 1304766 1409590 1429651 1537765 1488318
11410 1488318 1461616 1428651 1233016 1211069 1413402 1217755 1195335 1089004 1425372 1535398
11400 1535398 1510984 1540973 1625256 1474160 1657901 1481177 1598770 1507343 1511534 1546201 1449811
11389 1449811 1380775 1373916 1670295 1618201 1523179 1903232 1788068 1880979 2149932 2005590
11379 2005590 2020429 1837964 1782442 1643744 1445552 1590084 1651727 1553387 1887696 1762612
11369 1762612 1879426 2001043 1862613 1920739 1826411 1928973 1848312 1694491 1721791 1661122
11359A661122P0053J47449q0911K35225q9719l9670J96240N0155N8767k82644
11349A926067J18157J7287k05006P1050m3026o7031J64297R0177K02742k02791
11339B071923J58554J05457k7802q0729K31500q5384j91402j07684M5534j8323
11329B101644J63492o828K9788m1344k1547J89590J35521k11977L1641j12789
11319B257191P7848M6693q9433K84857j9807N7076J35814L5841K18020k616J29019
11308C130503O214r4294r0926J21796n1872K3082K6364l3047n6779K76730n362
11297C252409q0760O6008L1947J77373J43036k20361j12458R2219K3541R949L8056
11286C420959R4775r2962j7237J78544J41923p2250O7612k34386K8381O9262N0589
$$ plain form
11359 1661122 1731175 1878624 1797713 2032938 1943219 1903549 2099789 2149944 2208711 1926067
11349 1926067 2044224 2061511 1856505 1927555 1884529 1817498 1981795 2071972 2274714 2071923
11339 2071923 2230477 2335934 2308132 2227403 2458903 2373519 2182117 2074433 2119967 2101644
11329 2101644 2265136 2258308 2288096 2246752 2225205 2414795 2550316 2338339 2369980 2257191
11319 2257191 2335039 2381732 2292299 2577156 2557349 2614425 2750239 2786080 3004100 3001484 3130503
11308 3130503 3136717 3042423 2951497 3073293 3021421 3044503 3070867 3037820 2981041 3257771 3252409
11297 3252409 3171649 3237657 3269604 3446977 3590013 3369652 3257194 3349413 3372954 3382903 3420959
11286 3420959 3515734 3422772 3405535 3584079 3726002 3653752 3721364 3486978 3515359 3584621 3635210
11275C635210P4245o5368J24135J29300j9096J23974j17241J82405N7796n4220
11265D071140r22R2109r1077Q0224K6278n158j03825J5034P7379J38485J57623
11254D457290j13288q7237J34216O7925M1857j93716m7712J28938J21737J00955
11244D610965J84440N1663J0246R9732K47977L5346p4613j08774O378M8531J21056
11233E232947R8848r0473J6840K90751j36461K27549p9931l05484J13969J77012
11223E545567J06630K17180j63099N1134P0582J07576J99941j37948l0524J04559
11213F071598M6971L16358j41562r8059L14397m9095J78505m3136k7218P237R522
11202F585518L19411J98553L0136r307J56895M7567J29591J81091k07723n1435
$$ plain form
11275 3635210 3709455 3644087 3768222 3897522 3878426 4002400 3885159 4067564 4125360 4071140
11265 4071140 4070218 4162327 4071250 4151474 4177752 4172594 4068769 4083803 4161182 4299667 4457290
11254 4457290 4344002 4256765 4390981 4458906 4500763 4307047 4259335 4388273 4510010 4610965
11244 4610965 4795405 4847068 4857314 4957046 5205023 5240369 5165756 5056982 5063360 5111891 5232947
11233 5232947 5331795 5241322 5258162 5548913 5412452 5640001 5560070 5254586 5368555 5545567
11223 5545567 5652197 5869377 5706278 5757412 5827994 5935570 6135511 5997563 5967039 6071598
11213 6071598 6118569 6434927 6293365 6195306 6509703 6460608 6639113 6595977 6568759 6575996 6585518
11202 6585518 6904929 7103482 7133618 7124311 7281206 7328773 7458364 7639455 7431732 7380297
11192G380297J36779R7123P8383O5956K3876R8114l9080K29379J1873L0654K57946
11181H371300J35048j7117Q2596r4084K33329K29083K27861Q0642J20319K99499
11171I668476J50237j60394R5135J05032J43630L1825K28371Q3567P8901L32420
11161A0757200J10114O4883L04069j20616L4599R2777K34915J97190J86034L8566
11151A1899731K93217P9810K23426R7364N2045K07356R1766J83079K10374L3842
11141A3372010p207J59827L30739K57802j75364O9143L49136J95632L72849K58912
11131A5183479J31297J4261K35616K65101K41004K91536q4508R4769J88376M10863
11121A6971794J61902K84973J37241K43842M02478K22759J41669n2203J05303
$$ plain form
11192 7380297 7517076 7614199 7692582 7758538 7782414 7880528 7841448 8070827 8082700 8113354 8371300
11181 8371300 8506348 8489231 8571827 8477743 8711072 8940155 9168016 9248658 9368977 9668476
11171 9668476 9818713 9658319 9753454 9858486 10002116 10033941 10262312 10345879 10424780 10757200
11161 10757200 10867314 10932197 11236266 11115650 11150249 11243026 11477941 11675131 11861165 11899731
11151 11899731 12192948 12272758 12496184 12593548 12645593 12852949 12944715 13127794 13338168 13372010
11141 13372010 13364803 13524630 13855369 14113171 13937807 14006950 14356086 14551718 14924567 15183479
11131 15183479 15314776 15329037 15564653 15829754 16070758 16362294 16277786 16372555 16560931 16971794
11121 16971794 17133696 17418669 17555910 17799752 18202230 18424989 18566658 18514455 18619758
11112A8619758M28782J29344K07773K84942J47438K60872M48339K92812M50233
11103B1270293J71685K81092J58169M41764M66816L6653J79693J92621J52082
11094B3350868M01461L94189N2968L76264N53735M83359N33266K65948K18601
11085B6630659N33512M63245K60112K65702K58448L21875L17341N08863M86754
11076C0046511M85217N28781O06775N32071O21845K98375N80170M62109L35708
11067C4497562K99865P34802M09949N31513N49581N50979P82953P41971P21101
11058C9820276N29944O41570J008822R64239N35125M48830O84879J001845P68800
11049D6404330O98868Q01839Q91752J013469R96049J110101R84127J009169J198974
$$ plain form
11112 18619758 19048540 19177884 19385657 19670599 19818037 20078909 20527248 20820060 21270293
11103 21270293 21441978 21723070 21881239 22323003 22789819 22826472 23006165 23198786 23350868
11094 23350868 23752329 24146518 24199486 24575750 25129485 25612844 26146110 26412058 26630659
11085 26630659 27164171 27627416 27887528 28153230 28411678 28733553 29050894 29559757 30046511
11076 30046511 30531728 31060509 31667284 32199355 32821200 33119575 33699745 34161854 34497562
11067 34497562 34797427 35532229 35942178 36473691 37023272 37574251 38357204 39099175 39820276
11058 39820276 40350220 40991790 42000612 42964851 43499976 43948806 44633685 45635530 46404330
11049 46404330 47103198 47905037 48796789 49810258 50806307 51916408 52900535 53909704 55108678
11040E5108678R64490J199214J237210J083542J150111J248814J203679J139879
11032F4335617J345303J503482J509504J604830J398545J393985J702595J880692
11024G6674553J416494J681913J674569J863477K021260J929449J935047J899786
11016I1096548K036417K436035K454271K248271K148129K371778K758321K717057
11008A10266827K782693K683306K592787K828056L208610L464973L223934L396590
11000A34447776L496759L779821L799632L870233L903638M054986M371633M606198
10992A66330676M749560M876954M773115M895607N368676N707942N601619N911016
10984B08215165N788423O156599O571480O484813O903733O865999O932006P435925
$$ plain form
11040 55108678 56073168 57272382 58509592 59593134 60743245 61992059 63195738 64335617
11032 64335617 65680920 67184402 68693906 70298736 71697281 73091266 74793861 76674553
11024 76674553 78091047 79772960 81447529 83311006 85332266 87261715 89196762 91096548
11016 91096548 93132965 95569000 98023271 100271542 102419671 104791449 107549770 110266827
11008 110266827 113049520 115732826 118325613 121153669 124362279 127827252 131051186 134447776
11000 134447776 137944535 141724356 145523988 149394221 153297859 157352845 161724478 166330676
10992 166330676 171080236 175957190 180730305 185625912 190994588 196702530 202304149 208215165
10984 208215165 214003588 220160187 226731667 233216480 240120213 246986212 253918218 261354143
10976B61354143P291115P380974P487845P427184P451509P461114P311792P116845
10968C20282521P070269O857894O734560O351750N597599N058934M788000M221929
10960C66963456L325311K633428J822010J212370M25429l48771j263060k025849
10952C72744324k856897l468555l882528m520746n302940n670769o212794o663313
10944C34165782o743515p084671p350978p498343p637571p521762p551164p624816
10936B75152962p289709p376574p063169o971393o938013o903818o694712o598008
10928B19317566o101061o136393o135537n789044n526058n311978n079809n308225
10920A73929461m604688m849560m558515m408461m248234m104180l811976l701533
$$ plain form
10976 261354143 268645258 276026232 283514077 290941261 298392770 305853884 313165676 320282521
10968 320282521 327352790 334210684 340945244 347296994 352894593 357953527 362741527 366963456
10960 366963456 370288767 372922195 374744205 375956575 376382004 376033233 374770173 372744324
10952 372744324 369887427 366418872 362536344 358015598 352712658 347041889 340829095 334165782
10944 334165782 327422267 320337596 312986618 305488275 297850704 290328942 282777778 275152962
10936 275152962 267863253 260486679 253423510 246452117 239514104 232610286 225915574 219317566
10928 219317566 213216505 207080112 200944575 195155531 189629473 184317495 179237686 173929461
10920 173929461 169324773 164475213 159916698 155508237 151260003 147155823 143343847 139642314
10912A39642314l630414l580862l522651l331669l207904l146392k862744l053128
10904A13306550k810963k333267k594421k539502k533993k399639k273563k265609
10896I3555593k200321k137129j925840j992808j837304j622846j740578j768951
10888G8329816j700819j697339j553015j457499j368157j466465j445010j116436
10880F6525076j216631j270705j139281j254511j106016j083273j316479p50665
10872E7387515j327907j126891o95650r16112o20625r59720j080496p69183p20785
10863D9170146n63633r41812q66098q27971n84469n67632p64254q31161o57950
10854D2565166n49924m97409p14809p19342o97610n73764m13576p49425m70553
$$ plain form
10912 139642314 136011900 132431038 128908387 125576718 122368814 119222422 116359678 113306550
10904 113306550 110495587 108162320 105567899 103028397 100494404 98094765 95821202 93555593
10896 93555593 91355272 89218143 87292303 85299495 83462191 81839345 80098767 78329816
10888 78329816 76628997 74931658 73378643 71921144 70552987 69086522 67641512 66525076
10880 66525076 65308445 64037740 62898459 61643948 60537932 59454659 58138180 57387515
10872 57387515 56059608 54932717 54237067 53320955 52700330 51740610 50660114 49890931 49170146
10863 49170146 48606513 47664701 46798603 45970632 45386163 44818531 44054277 43223116 42565166
10854 42565166 42015242 41517833 40803024 40083682 39386072 38812308 38398732 37649307 37178754
10845C7178754m70509q48322n22601o24496m72311l54753l44408o39732m87765
10836C2413857k03150m29274p17473m43053m45377k36356k50915p24848n65364
10827B8398047m90326l28257k30431o09883j60333l77422k77386m23495m83218
10818B5017296j96516n49929l96779k23484n23976j37886j53413l20631l89190
10809B2125492m48625O6532k23649m74146l71485m49709j19671k48148l61737
10800A9494854k72948m05895k43746j70965k18114j33055j45171k84141l25740
10791A7295079l70185J8696q9800k07304n02755j66943j34049k51077j12454k66393
10781A5212815j39425R6221k89849j02346l34921j67348j18896l32633k39325
$$ plain form
10845 37178754 36708245 35859923 35337322 34712826 34240515 33885762 33541354 32901622 32413857
10836 32413857 32210707 31781433 31063960 30620907 30175530 29939174 29688259 28963411 28398047
10827 28398047 27907721 27579464 27349033 26739150 26578817 26201395 25924009 25500514 25017296
10818 25017296 24820780 24270851 23874072 23650588 23126612 22988726 22835313 22514682 22125492
10809 22125492 21676867 21743399 21519750 21045604 20674119 20224410 20104739 19856591 19494854
10800 19494854 19221906 18816011 18572265 18401300 18183186 18050131 17904960 17620819 17295079
10791 17295079 16924894 16943590 16853790 16646486 16143731 15976788 15842739 15591662 15479208 15212815
10781 15212815 15073390 15169611 14879762 14777416 14442495 14275147 14156251 13823618 13584293
10772A3584293k04977k94723n0997r6252k09921k33621N9463j68432m51106p9614
10762A1854113O9331j81224j16570m62612k02893P6039n0476q1179k78703k53272
10752A0372554L7373k06611k9205j61579j23394o2821m08017J1272k9973k48738
10742I150861o1737j78840j34552r9576l21719j39235k03367j08422J04093J09829
10732H117335j97765q5061k10121r5105l988l5553k33157j07328P0682o3650n8590
10721G097699l2393j58883l25446j42636J12422L1333r175n1181j60841K39950
10711F600849j2383k05059j21276l556Q9931o8920m2889k18747j71256M8188n9380
10700E835502P2165j0006k26660J52519j66921J99366O53k06188Q6673k32403
$$ plain form
10772 13584293 13379316 13084593 13033596 12937344 12727423 12493802 12553265 12384833 11933727 11854113
10762 11854113 11923444 11742220 11625650 11163038 10960145 11036184 10985708 10904529 10625826 10372554
10752 10372554 10409927 10203316 10174111 10012532 9889138 9826317 9418300 9429572 9399599 9150861
10742 9150861 9089124 8910284 8775732 8676156 8354437 8215202 8011835 7903413 8007506 8117335
10732 8117335 7919570 7834509 7624388 7529283 7525295 7489742 7256585 7149257 7219939 7156289 7097699
10721 7097699 7065306 6906423 6580977 6438341 6550763 6582096 6572921 6521740 6360899 6600849
10711 6600849 6588466 6383407 6262131 6258575 6348506 6279586 6236697 6017950 5846694 5894882 5835502
10700 5835502 5907667 5897661 5671001 5823520 5656599 5855965 5856618 5650430 5737103 5504700
10690E504700r973j7788l19906M3097j67829Q4592J22777j07299j7589O1031j83493
10679D992320Q5965M4962j16499k02365k77172R8923j82280P7545J26435P6207
10669D724041j08476p8544Q5681j31513K23953r0942k73158p7481r0846r5814
10659D086901J66132J19812o4457j66944M9301p2277l3258k4353j72182R8863
10649C987538q239o8076L3781j21773N2469J16572j30503m5533j10022N1127p7183
10638C680158j23843Q3958N9330q6317r4995k5241J24785r7926p3669p4893m2143
10627C329204j20986K09599Q292j87533J37011j14500j56543j8322K21984M3753
10617C351959M3298k01892j09085M7727r6421r6211N1809J8430l36831k62292
$$ plain form
10690 5504700 5494727 5476939 5157033 5200130 5032301 5116893 5239670 5132371 5114782 5175813 4992320
10679 4992320 5078285 5123247 5006748 4804383 4527211 4626134 4443854 4521399 4647834 4724041
10669 4724041 4615565 4537021 4622702 4491189 4715142 4624200 4351042 4273561 4182715 4086901
10659 4086901 4253033 4372845 4308388 4141444 4190745 4118468 4085210 4060857 3888675 3987538
10649 3987538 3979299 3911223 3945004 3823231 3875700 3992272 3861769 3816236 3706214 3757341 3680158
10638 3680158 3556315 3640273 3699603 3613286 3518291 3493050 3617835 3519909 3446240 3371347 3329204
10627 3329204 3208218 3417817 3426109 3238576 3375587 3261087 3104544 3086222 3308206 3351959
10617 3351959 3395257 3193365 3084280 3132007 3035586 2939375 2991184 3009614 2672783 2410491
10607B410491k7458n4161J51879K52981N4257k0564r9986L21117j4080k17361
10597B757115k44560p4499N53M2500J8850o1168q1649j27167P1076K9280Q6981
10586B417312j39706p4876K77605n4155J25232J08571j75095j72685j82292r4560
10576B035351N2623l42J22108r2502l9481L3372J26529J83125R0333j53057n1340
10565B306719r8318k11792J8983j80904r9803J74293J32961K18362j69110j0991
10555B080400J80418q0394Q1734j45939j13111j79575L8575J0779j71878q7907
10545A613102L1643j28311M6409Q3088J92211j40428K28689M8201j88567m9571
10535A736466p1067j05220j42706j17425J25639k5567k42917O6507J35690K86760
$$ plain form
10607 2410491 2383033 2328872 2480751 2733732 2787989 2767425 2667439 2988556 2974476 2757115
10597 2757115 2512555 2438056 2438609 2481109 2499959 2438791 2357142 2229975 2301051 2330331 2417312
10586 2417312 2277606 2202730 2480335 2426180 2551412 2659983 2484888 2312203 2129911 2035351
10576 2035351 2087974 2087632 2209740 2117238 2077757 2111129 2237658 2420783 2511116 2358059 2306719
10565 2306719 2208401 1996609 2015592 1834688 1734885 1909178 2042139 2260501 2091391 2080400
10555 2080400 2260818 2180424 2262158 2116219 2003108 1823533 1862108 1872887 1701009 1613102
10545 1613102 1644745 1516434 1562843 1645931 1838142 1697714 1926403 1974604 1786037 1736466
10535 1736466 1665399 1560179 1417473 1300048 1425687 1400120 1157203 1223710 1359400 1646160
10525A646160n8165J3015k0932k33867k2006l1595l864p825k07407J75451l9835
10514A209130l4223R7571j28894k4484j79146J94876K39764j67325L9498j82401
10504A064366q063O4789P0917P2548m9192j12541J2809n9558Q8974j80717J47236
10493A111568K66644k11684K6799l1879m6255k4795J21565K84992J45811j33405
10483A509361N4629k90242J1832J65830J64302J1087l02933L1186J45934J14223
10473A615209j16861k07781L6416K30272J23215L668j70318N4641j5578k09557
10463A343326J71434j5529L908J20202l3169K03998J6011l5449j50348j91732
10453A432652J63049R5690n8217k17782r5761Q9943K16211j59271n4470J6335
$$ plain form
10525 1646160 1587995 1601010 1580078 1346211 1324205 1292610 1288746 1280921 1073514 1248965 1209130
10514 1209130 1174907 1272478 1143584 1119100 939954 1134830 1374594 1207269 1246767 1064366
10504 1064366 1056303 1121092 1192009 1264557 1215365 1102824 1115633 1056075 1145049 964332 1111568
10493 1111568 1378212 1166528 1193327 1161448 1115193 1090398 1211963 1496955 1642766 1509361
10483 1509361 1563990 1273748 1285580 1451410 1615712 1626799 1323866 1355052 1500986 1615209
10473 1615209 1498348 1290567 1326983 1557255 1680470 1684138 1513820 1568461 1552883 1343326
10463 1343326 1514760 1499231 1503139 1623341 1590172 1794170 1810181 1774732 1624384 1432652
10453 1432652 1595701 1691391 1633174 1415392 1319631 1409574 1625785 1466514 1412044 1428379
10443A428379O5746J02272j44791k05050j08497K35534K74404p2018j41841r3951
10433A340187M2598K9078M249J00646r645j29278J41l6861N0950L2719l3511P4297
10421A465570j96547j47379p5640N0483J65326J70001n9995j9838J5436N2995
10411A420412K38125o5299k10292L7341L746j14162R3439j08683p2231R8544J65648
10400A486588j25174n1367K4691r6245j33904K84156k21937j29341J30203q2150
10390A085520K59272l7381m5138j04298m6678R4300M4449L2463j79725j90219
10380I12565l6198j20941K02611N9758k48221Q1545K97095j30362L9185n5370
10370A001667j08473M2853n8867j67913j76035J74938L3407O0147J74550k03554
$$ plain form
10443 1428379 1494125 1596397 1451606 1246556 1138059 1373593 1647997 1575979 1434138 1340187
10433 1340187 1382785 1411863 1416112 1516758 1507113 1377835 1377976 1341115 1392065 1424784 1391273 1465570
10421 1465570 1269023 1121644 1046004 1096487 1261813 1431814 1371819 1351981 1367417 1420412
10411 1420412 1658537 1593238 1382946 1420287 1424033 1309871 1403310 1294627 1222396 1320940 1486588
10400 1486588 1361414 1310047 1334738 1238493 1104589 1388745 1166808 1037467 1167670 1085520
10390 1085520 1344792 1307411 1262273 1157975 1111297 1205597 1250046 1282509 1102784 912565
10380 912565 876367 755426 958037 1017795 769574 851119 1148214 1017852 1057037 1001667
10370 1001667 893194 936047 877180 709267 533232 708170 741577 801724 976274 772720
10360G72720j7989l255j51517J69402K40680q984j97167Q224j07906l5986J80426
10349H48648j37430K709j24702j9043K26031K07592r0654r6066j43625J71857
10339H45317J0767j19202J14160m8208j5888j40728o5198K62o7032o9343J76261
10328F21168J22146j1675J40198j87855k4256j25014q618j63202n1401o5220K30029
10317D76300J8235j28338J28931j46378J52590P7589m0634n7196k41903P4115
10307C13311J27453j33787N997q4199j0394Q3564l8271R7030j04680j9309J34604
10296C71319p0690j30284j35739J54677R1730r2532n7751q806n8070o0740J04985
10285A08099J39813j64564j11710J00479J59203R7755R907q2196k486o1544M0244
$$ plain form
10360 772720 754731 751476 599959 769361 1010041 1001057 803890 812114 704208 668222 848648
10349 848648 711218 713927 589225 570182 796213 1003805 913151 817085 673460 845317
10339 845317 856084 736882 851042 802834 786946 646218 581020 581282 514250 444907 621168
10328 621168 743314 731639 871837 683982 659726 534712 526094 362892 311491 246271 476300
10317 476300 494535 366197 495128 348750 501340 578929 538295 481099 239196 313311
10307 313311 440764 306977 312974 228775 218381 301945 263674 360704 256024 236715 371319
10296 371319 300629 170345 34606 189283 281013 188481 130730 121924 63854 3114 108099
10285 108099 247912 83348 -28362 72117 231320 329075 338982 256786 254300 192756 233000
10274B33000k0081r593n3942J98837m3679j85052O2872K7656j15472m5755K8823
10263G7614N1330k1537P9112N3171k0336r3083n5j7559J43133o2330O3016p8447
10251A74029k34813R2430K32215J46419q0188N3922o2251O2666K3889k02760L4714
10240B40272l25523l180R3165m2111j1724L2511M9449K19773J1217o0866M8354
10229B51337P640m0187k8904k707J5558k99199O137J50492n0377J36696J31387
10218B77873M4113l3238J26012p0535k44270P4351j3557n167j6304j85652m7855
10207i4229R5282P5825Q3944J8929o6313Q5188K2543R8946L3809M9726j52660
10196B50990O6005m0862j35286J03117j80966K571K30769K5897J9175j24523J40404
$$ plain form
10274 233000 212919 203326 149384 348221 304542 119490 182362 210018 94546 48791 77614
10263 77614 128944 107407 186519 239690 219354 126271 126216 108657 251790 189460 252476 174029
10251 174029 -60784 31646 263861 410280 330092 384014 321763 384429 408318 205558 240272
10240 240272 -85251 -88431 4734 -37377 -49101 -16590 32859 252632 263849 202983 251337
10229 251337 258977 218790 189886 187179 202737 -96462 -90325 60167 9790 146486 277873
10218 277873 321986 288748 414760 344225 99955 174306 160749 155582 139278 -46374 -94229
10207 -94229 1053 76878 160822 179751 113438 198626 221169 320115 353924 403650 250990
10196 250990 316995 276133 140847 243964 62998 65569 296338 322235 341410 216887 357291
10185C57291J88696K70178j4345l28761j01389r6354R3219L0692m14004O5677
10175E0900J55836j2877Q8660J6981n7204K01742j16919P8348j58220J599q9085
10164A59761p6118k04899K8102J91399J40426L8449P7552q8757k154J48917q359
10153D04319p5683L2418R398j29094j30180J67333m1936J7836M0370p1002J93854
10142D17633r0896k2120k2360j43536J48966P885r5784Q6509k8489J46686l6535
10131C67959k3884M7517j62240J19195M6331n2316J583j66138M0674K6831O5541
10120C11053q2381m5888N1044R8664K36557n6476k48969J0388J03J99177q236
10109D65036n8406j66520N6133R7016N0757n4930o4309p3213R40j8006Q0116P918
$$ plain form
10185 357291 545987 816165 801820 473059 371670 275316 368535 399227 -14777 50900
10175 50900 206736 193859 282519 299500 242296 444038 327119 405467 247247 248846 159761
10164 159761 83643 -121256 -93154 98245 238671 277120 354672 265915 263761 412678 404319
10153 404319 328636 361054 370452 241358 111178 278511 236575 254411 294781 223779 417633
10142 417633 326737 304617 282257 138721 287687 295572 199788 286297 257808 404494 367959
10131 367959 344075 391592 229352 348547 394878 342562 344145 178007 218681 245512 311053
10120 311053 228672 182784 233828 332492 569049 512573 263604 273992 274095 473272 465036
10109 465036 406630 240110 296243 393259 444016 389086 324777 251564 252504 234498 314614 322532
10097C22532j45323o6758J2268k7540J58161J27655q0211r4739K04691M4084o2520
10086C92300J02248k0237j51062Q0503Q5969m1218k7486l55045K9101J41808N8561
10075B95442N6829j73834J4174n0643l3068J86808m4451k75353J84982j847q8698
10064G0341K1945m8704n3853R3547Q8084m8824k14979j9282r6732J95538O8491
10053E5572j68981J02259k2721n7310L37015J66751r4345k93569r703K5319l6062
10042D225M3227k19331J57995J58655j35980L3308k933j35283J46967J6698k8359
10031C9189j49710q5040J47489J18958K03859N0992j23466P5277j33963q1874
10021F1711q9340j52892J68427J12512P1340q5159L9342J94825j43210P1059q8304
$$ plain form
10097 322532 177209 110451 122719 95179 253340 380995 300784 206045 410736 454820 392300
10086 392300 494548 474311 323249 403752 489721 448503 421017 65972 95073 236881 295442
10075 295442 352271 178437 192611 141968 108900 295708 251257 -24096 160886 159039 70341
10064 70341 92286 43582 -10271 83276 171360 122536 -92443 -111725 -208457 -12919 55572
10053 55572 -113409 -11150 -33871 -91181 245834 412585 318240 24671 14968 40287 4225
10042 4225 47452 -171879 -13884 144771 8791 42099 39166 -96117 50850 67548 39189
10031 39189 -110521 -195561 -48072 70886 274745 325737 202271 277548 143585 61711
10021 61711 -27629 -180521 -12094 100418 171758 86599 125941 320766 177556 248615 160311
10010A60311j84033j1653J52742J3237J3505q6091J5901J18320N5246l3310N0425
9999B64600k42365l230j7216L635k3870O0006j32489J55365o319L350K322j66011
9987a02222J71393k1020m9730j96442k39500L85935j5075M4795O3856k24059J42336
9976c9733J36599K07961n1473k00064j29718o1707R7719J98053j91441k15298
9966b49102p4886J4529K79270J20062j55175j5663q4792K10821Q7805j29949J42135
9955A45055K9891m6762l7896r0870l1056J14732Q7637j11045M9514o1192M8164
9944I6172j59774P2548J14860j08854l0551J31678L3501l301p4024J5320k8729
9933E8846j56384m1901j778K67617n5304j28791P6966K42330Q913p8796L7657
$$ plain form
10010 160311 -23722 -35375 117367 130604 144109 58018 73919 192239 247485 214175 264600
9999 264600 22235 19005 1789 5424 -18446 41560 -90929 64436 58117 61467 63789 -102222
9987 -102222 69171 48151 -1579 -198021 -437521 -51586 -66661 -21866 41990 -182069 -39733
9976 -39733 96866 304827 253354 53290 -76428 -138135 -40416 157637 -33804 -249102
9966 -249102 -323988 -309459 -30189 89873 -65302 -80965 -165757 45064 132869 2920 145055
9955 145055 174946 128184 90288 -582 -31638 83094 170731 59686 109200 48008 96172
9944 96172 -63602 8946 123806 14952 -15599 116079 149580 146279 72255 87575 58846
9933 58846 -97538 -139439 -141217 126400 71096 -57695 19271 261601 270514 191718 229375
9922B29375k49494m7512q867J11267Q4371k223j34445o6301R2364k3757J72603
9911A57381M8939o6340k34748J04932R5554J623n6370m4546J28080J35614j28335
9900A41784j22285m784o9245J72695J24466K3427j74954N1196J9822k3418J5420
9889A54124p8189j15324j6006m53N4861J04375J31390k01461k1341R4984J04749
9878B11709J5550j54297q215m0359K9067k35052O96K02792P002j07458R8789r7535
9866g7311J88438J57827k72953N2909j2936J45987K6039k50279K3702K7708J7587
9855B6718J24219k70465R3970J39437m0544j3217k18972k9076R874Q9227J5134
9844g3695k2161R5543j43249M2805K34510j41860P2515r5850k54912O2813K33840
$$ plain form
9922 229375 -20119 -67631 -76498 34769 119140 116917 -17528 -83829 8535 -15222 157381
9911 157381 206320 139980 -94768 10164 105718 107341 50971 6425 134505 270119 141784
9900 141784 19499 14715 -54530 118165 242631 266058 91104 142300 162122 138704 154124
9889 154124 75935 -39389 -55395 -55848 -987 103388 234778 33317 11976 106960 211709
9878 211709 227259 72962 64747 24388 53455 -181597 -180901 21891 28893 -78565 20224 -77311
9866 -77311 111127 268954 -3999 48910 35974 181961 208000 -42279 -18577 9131 26718
9855 26718 150937 -119528 -25558 113879 73335 60118 -158854 -187930 -178056 -88829 -73695
9844 -73695 -95856 -313 -143562 -100757 133753 -8107 64408 -31442 -286354 -223541 10299
9833A0299J73279K63713k99554o1237J07742O6780m2563j40776q4874k14223j8002
9822b39416K94176K6887n6615K75259Q6085J14970m8934J4196k68976K1338o7118
9811A51852j12992j17911k02194R7365K07921J26199Q6401j35486J3069K29275
9801C43499N7353j10636k40214l3882j02763k1472J68194k10810J20983q0695
9791a10443j68930o2651J92390J35355o2040J0618j95871J42897p6397P2022L0128
9780i2922o4650j36620R1811K13566j73677L0582Q4695m3077J12818k1934J37848
9769A38440O1832m7396j16138q4576J10734j88359j2503j57004N0177K19743K3489
9758a561J09650L5194m0559J49432k4200k22744j9352p4573j20475M5932K90144
$$ plain form
9833 10299 183578 447291 147737 86500 194242 261022 218459 77683 -7191 -221414 -239416
9822 -239416 54760 81647 25032 300291 386376 501346 452412 466608 197632 218970 151852
9811 151852 38860 -79051 -281245 -183880 24041 150240 236641 101155 114224 343499
9801 343499 400852 290216 50002 16120 -86643 -108115 60079 -150731 -29748 -110443
9791 -110443 -279373 -342024 -149634 -14279 -76319 -65701 -261572 -118675 -195072 -123050 -92922
9780 -92922 -157572 -294192 -202381 11185 -162492 -131910 -47215 -90292 22526 592 138440
9769 138440 200272 152876 36738 -47838 62896 -125463 -137966 -294970 -244793 -25050 -1561
9758 -1561 108089 143283 102724 252156 227956 5212 -14140 -88713 -209188 -163256 126888
9747A26888j23172j50725J42586n6227K02793N8976k95625P619J5963K2327J7467
9736c1130R909P2149J15365l6288N7989j468M2369j41689p2923p1387j06269R7410
9724f5963J89933O5032k04509j15385J41778l7986J56976j13293o0266L1676j36915
9713a48922L4375k7931o8261n8205M1944J24550J17984o4720j36964P7867L2217
9702g6066k889M3357k0382p6772Q2073J02638J2291M4752j70997J06109P4590
9691A18704k4839q5904j7907J2258o1581j28393L39131j7597p6277Q4860j41643
9680H12J25238Q4773j54814l27273R5035K22097q421q4366P341Q9896J23281l6369
9668A37230j70345J9603n174J01877r5239R9441r0322L514P443n6836P682j55324
$$ plain form
9747 126888 3716 -147009 -4423 -60650 142143 201119 -94506 -86887 -70924 -48597 -31130
9736 -31130 -21221 50928 166293 130005 187994 186526 228895 87206 14283 -57104 -163373 -65963
9724 -65963 123970 189002 -15507 -130892 10886 -27100 129876 16583 -43683 -12007 -148922
9713 -148922 -114547 -142478 -210739 -268944 -227000 -102450 15534 -49186 -186150 -108283 -76066
9702 -76066 -78955 -35598 -55980 -132752 -50679 51959 64250 109002 -61995 44114 118704
9691 118704 93865 7961 -9946 2312 -59269 -187662 151469 133872 57595 142455 812
9680 812 126050 210823 56009 -271264 -176229 45868 37447 -46919 -39578 50318 173599 137230
9668 137230 -33115 -13512 -18686 83191 -12048 87393 -2929 585 8028 -48808 -41126 -196450
9656a96450J82714N7200j08683Q109K10948M5692P4177o6106k92285j8600J2586
9645i0698J4334l6526j44615J7977M5690K06267j01760r4930Q4030k43459L15708
9634b7982Q7024j82859n1010N0636N0107J4868j39817k5659O9400M1318N3239
9623f0735o4596K75801j46863j6342j9927j60154P2820J57589o1393n2095r3613
9612a69508J51976n8419j5755J0349q317J16499L4462J44327j06728O4739o8500
9601I5125j08679j0033P0898p1007M6294j32247K42639O0177J22922j13037j35100
9590F7952Q5409j1630o5258P3710P0891N0231R5299j30674j62150J5632N7571
9579A46983q7947P0826k3524m9993J91K69234l3200q2501Q462j79248j1550J8210
$$ plain form
9656 -196450 -13736 43464 -65219 -57110 153838 199530 273707 207601 -84684 -103284 -90698
9645 -90698 -76364 -112890 -257505 -239528 -193838 12429 -89331 -184261 -100231 -343690 -27982
9634 -27982 59042 -123817 -174827 -124191 -74084 -59216 -199033 -224692 -155292 -113974 -60735
9623 -60735 -125331 150470 3607 -12735 -32662 -192816 -119996 37593 -23800 -75895 -169508
9612 -169508 -17532 -75951 -91706 -81357 -89674 26825 61287 205614 98886 163625 95125
9601 95125 -13554 -23587 47311 -23696 22598 -109649 132990 193167 316089 203052 67952
9590 67952 153361 141731 76473 150183 221074 271305 366604 235930 73780 89412 146983
9579 146983 59036 129862 106338 56345 56536 325770 292570 210069 218531 39283 27733 45943
9567D5943J1350j97148n6141M8526o6886R3228J66121J13525O6313r8562r3968
9556C2301p4837r7100J11746R898j2521N6615j55762P5450O8480p2141P4803j27580
9544a10648r8369k1958J84710m9780R838q1833L8923j8532J13553Q9885r8867
9533d3078r6310k8875j16612J51693q677K9853J78058L453l9136n2191j36625
9522a58447k8280J66737j34749J78508p8804k18561Q7128J95660K9837N336M3995
9511H8360p9701J59789J35079P4973j75553q5833m0788m954L7409K8680k60451
9500a22990J51211j95386M9630m004J75726J84828j69112o6350N4261j48098J51248
9489F0964J26641j06250N3874M3022l9269l3523J86073j25221p2948j3938p3925
$$ plain form
9567 45943 57293 -139855 -195996 -147470 -214356 -121128 44993 158518 224831 126269 32301
9556 32301 -42536 -139636 -27890 -17992 -30513 26102 -129660 -54210 14270 -57871 16932 -110648
9544 -110648 -209017 -230975 -46265 -96045 -86207 -168040 -129117 -147649 -34096 55789 -43078
9533 -43078 -139388 -168263 -284875 -133182 -141859 -112006 66052 69505 30369 -21822 -158447
9522 -158447 -186727 -19990 -154739 23769 -55035 -273596 -186468 9192 39029 44365 88360
9511 88360 8659 168448 303527 378500 202947 117114 76326 71372 108781 137461 -122990
9500 -122990 28221 -167165 -117535 -121539 54187 239015 69903 3553 57814 -90284 60964
9489 60964 187605 81355 135229 178251 138982 105459 291532 166311 93363 79425 5500
9478E500m5082K00494j27238p246Q4911J9456k15608J63483L8303j46494K5171
9467d350k82422o6082J07003M0438N6794O7748J64495l1045L1260K4842j9556
9456H9125J3357j5875j54538l127p6662K0917l5138J48767J52219n6662j87088
9445a04705J99250q858p7086j70408J41465K61489o2771j70482N5051j47470O1629
9434b2896M1451L72j66709J11765N5160K1360P927j18552m5254K98690j25831
9423E7483o2528j39961j00389J06555K7210K77762n4768m8865J52482m4649K4225
9412A94557k239K7262j69041j49207n761n5395k926J0372r302M2334K37495J52407
9400B70556p5541j21842P5572l4190J30575j19124n6530j19982J8397m9949J40994
$$ plain form
9478 5500 -39582 160912 33674 26428 111339 130795 -84813 78670 116973 -29521 -4350
9467 -4350 -286772 -352854 -245851 -205413 -148619 -80871 83624 52579 83839 108681 89125
9456 89125 102482 86607 -67931 -71058 -147720 -126803 -161941 -13174 139045 82383 -104705
9445 -104705 94545 85687 8601 -161807 -20342 241147 178376 7894 62945 -84525 -22896
9434 -22896 18555 18927 -147782 -36017 19143 40503 48430 -70122 -115376 183314 57483
9423 57483 -5045 -145006 -245395 -138840 -111630 166132 111364 62499 214981 170332 194557
9412 194557 192318 219580 50539 -98668 -104429 -159824 -162750 -152378 -161680 -119346 118149 270556
9400 270556 195015 73173 148745 114555 245130 126006 69476 -50506 -32109 -82058 58936
9389E8936j36983O3467j1333K47831N5271j22581N0784o6813j02933J43310j34
9378A78822o42m5364M3472J6659J7709K22J3825p1432N4494j62799L1498j87261
9366a10797M8513Q3087j67271O6476J1553J88542J21840k29014N2533r8212J56466
9355A23716L0299q1841J00628k5248m6707O5753j32014J48971N767q6260l457
9344I9607p6526J02939j19124N0341J02296k29697J00813L8572p0737K2102j84617
9333a64031J24552P0197N0304R882m6295J81928o473N2002q2040k39160O591j51364
9321a93907M9667J26801J34649k08376J26912Q7184J23605p2503N5661o5436l0937
9310A33320j06083l7799j7122r0973J38738P5733N7359j38940j58857K30202p5344
$$ plain form
9389 58936 -78047 -14580 -25913 221918 277189 154608 205392 138579 35646 178956 178822
9378 178822 178180 132816 176288 192947 210656 210878 224703 153271 207765 44966 76464 -110797
9366 -110797 -62284 20803 -146468 -79992 -68439 120103 241943 12929 65462 -32750 123716
9355 123716 154015 72174 172802 147554 100847 166600 34586 183557 189324 103064 99607
9344 99607 23081 126020 6896 57237 159533 -70164 30649 69221 -1516 20586 -164031
9333 -164031 -39479 30718 81022 90904 44609 226537 220064 272066 190026 -49134 -42543 -193907
9321 -193907 -144240 -17439 117210 -91166 35746 122930 246535 174032 229693 164257 133320
9310 133320 27237 -10562 -27684 -118657 20081 95814 153173 14233 -144624 85578 10234
9299A0234J253j736n7466o3711K0787Q2476p8505n4540O6610J07363j00317O047
9287f1505n7060k34K28372r8906J16638m9168j19052l8681J26262P4785k14545
9276i3094J03576J44483p7255j2084l7519J48252N1003R6567j55764j47802J717
9265B2080j849R3501O8968L112p8656q0002L3819o7601j4922q0118N407J44624
9253D8363o53Q056N8348j4733j38507J66774k4488j31297k7746J23226Q3872l0883
9241A20332J6893j10025m8220O2398q3008J04883j71019p1847N9886K72156j19437
9230C2992o4594J88595j10254j56282K1170K68042q6775k20026K9143P0991K2337
9219d661L13128j09217j71076j1819n1330J81890q6657l1896j0532j89095N6832
$$ plain form
9299 10234 11487 9751 -47715 -111426 -90639 -8163 -86668 -141208 -74598 32765 -67552 -61505
9287 -61505 -118565 -118799 109573 10667 127305 78137 -40915 -79596 46666 121451 -93094
9276 -93094 10482 154965 77710 65626 28107 176359 227362 323929 168165 20363 22080
9265 22080 20231 113732 182700 185812 107156 27154 60973 -6628 -21550 -101668 -96261 48363
9253 48363 47710 55766 114114 99381 -39126 127648 103160 -28137 -55883 67343 151215 120332
9241 120332 137225 27200 -21020 41378 -41630 63253 -107766 -179613 -119727 152429 32992
9230 32992 -31602 156993 46739 -109543 -88373 179669 92894 -127132 -97989 -26998 -4661
9219 -4661 308467 199250 28174 16355 -34975 146915 60258 28362 17830 -171265 -114433
9208a14433J28588l203n4627o2083J9835J73420J29016k4167j9732k13328J77162
9197A36448K8655Q2449r6330q9032o1062p5789N6693M0640l4274r2036P2943J09137
9185G8442m095N3568L082o8788P1315r5619n5358j7554Q8105n2968N3050J06631
9173A59811o6845J51426P6278p0923K6782m4495P1946j1970k42206J11129n8097
9162A02836r0186R0193K0511L04774k45126M6376J39614k76617L01132l8431k49122
9151A05954J31258r837m1588r3865j27478K00899R3601o823p6231N9124K12827
9140D47841p9169m7972J51933j56614j51094l5050O6426j17322J03889l0619J19823
9129B72072J71348j89061M9698k1329J3637J5011K2748J5454p1538j17695R5937
$$ plain form
9208 -114433 14155 10952 -43675 -105758 -85923 87497 216513 192346 172614 -40714 136448
9197 136448 165103 247552 151222 62190 1128 -74661 -17968 22672 -11602 -103638 -30695 78442
9185 78442 74347 127915 130997 62209 133524 37905 -17453 -35007 53098 130 53180 159811
9173 159811 92966 244392 320670 249747 276529 232034 303980 292010 49804 160933 102836
9162 102836 12650 102843 123354 428128 183002 229378 368992 92375 393507 355076 105954
9151 105954 237212 227375 185787 91922 -35556 165343 258944 252121 175890 235014 447841
9140 447841 368672 320700 472633 316019 164925 129875 196301 78979 182868 152249 272072
9129 272072 443420 254359 304057 282728 296365 311376 334124 349578 278040 160345 256282
9118B56282N8P0979l1682j19648r3454R8565J70264q6149j27278P3368J45128
9107C56433K36391O259j26573N8978o6329Q2555j71108l11937J07963P8711j51241
9096A00102J72835r4639J22416L35086j94652J7603k6289o1792m9301n095J98146
9085E14420K1448o5325q5887r569k6530J31262q46k10420K19985j88968L9066
9074C38636K09400k01515Q4112o5633m1979j26007j97378k0852N5922K19356J81514
9063D35576Q0744j40547J08420R0572R5876o0671k20608J99442P6668j29184j36123
9052D00165k68827l122K37683J36198l4925j83466r9690J14759J06322J98766
9042F03863j21556j22423l3126L3286J26752l4331j68393J326j0746J55327M0383
$$ plain form
9118 256282 256340 327319 295637 175989 82535 181100 351364 265215 137937 211305 356433
9107 356433 592824 599083 472510 531488 465159 547714 376606 64669 172632 251343 100102
9096 100102 272937 178298 300714 635800 441148 458751 432462 370670 321369 316274 514420
9085 514420 535868 470543 384656 375087 348557 479819 478973 268553 488538 299570 338636
9074 338636 548036 346521 430633 365000 323021 197014 -364 -21216 34706 254062 435576
9063 435576 516320 375773 484193 574765 670641 609970 389362 588804 665472 536288 400165
9052 400165 131338 128216 365899 502097 467172 283706 184016 298775 405097 603863
9042 603863 482307 359884 326758 360044 486796 452465 284072 285398 274652 429979 470362
9031D70362P6459m8228j20292p3894J15363o6532j15983p3381k9250J30723K6001
9020B91348j37570O7042J21775P7571L6727l1425J34395L1231k3209j1437J14320
9009F70768p8538r1043l8035l4956k89476J69318J45714r1640L9567J9159P2995
8998D93833K9162M1487R1762j44469j4790o3716k5208J41698L1265q2950m2253
8987D55821J01530n8539n3921J54710j85342M3092J48727n6653l6532M902Q5160
8976F02955Q3516j9778O6535r9819j22978J41512j6128k6635j82563m3540J62889
8965E45966J0687J61065n9982L6065m241j25881j59737K6312j56712j42312N4486
8954A85716J71567l2706J62763J67376k3419K98304j64157r5400j65922l08844
$$ plain form
9031 470362 546821 498593 378301 304407 419770 353238 237255 163874 134624 265347 291348
9020 291348 153778 220820 342595 420166 456893 425468 559863 591094 567885 556448 670768
9009 670768 592230 501187 463152 428196 138720 308038 453752 362112 401679 420838 493833
8998 493833 522995 564482 656244 511775 496985 433269 408061 549759 581024 498074 455821
8987 455821 557351 498812 444891 599601 414259 457351 606078 549425 512893 517795 602955
8976 602955 686471 666693 733228 633409 510431 651943 635815 609180 426617 383077 545966
8965 545966 556653 717718 657736 693801 689560 563679 403942 430254 273542 131230 185716
8954 185716 357283 324577 487340 654716 631297 929601 765444 670044 504122 195278
8944A95278K06212l8967J38887l9218j7344L48741q2566j14450J0629k40475M807
8933C71534J93716M951j34942M8557K45377J0767K2725k2143l04608M5428K22647
8922G04009m3435J27627k44574K30300L989o3826O7542k90323P0840J00767J17727
8911G80643L7899l75058J88968K21280j742j5386q2260K5803J80317j30109J60008
8900I90363R0853k85244l6039R0420J11227j17805k3946Q2624L3077M6965j91506
8889G90989J03859l6889q6032J0524j9086J04946r1268K7231L3670J59870q5346
8878I12468P0067J0573k2553K937Q4740N7492k35179J74804o6841l5343O6990
8867A020155l8665r2940j02340P2424K60475K3690j25684J41968k3106j23107
$$ plain form
8944 195278 401490 362523 501410 462192 444848 793589 711023 596573 607202 366727 371534
8933 371534 565250 570201 435259 483816 729193 739960 762685 740542 435934 481362 704009
8922 704009 660574 788201 543627 773927 777916 714090 781632 491309 562149 662916 780643
8911 780643 818542 443484 632452 853732 851990 836604 754344 780147 960464 830355 990363
8900 990363 1081216 795972 759933 850353 961580 843775 819829 902453 935530 982495 790989
8889 790989 894848 857959 771927 782451 763365 868311 777043 804274 837944 997814 912468
8878 912468 982535 993108 970555 973492 1058232 1115724 880545 1055349 988508 953165 1020155
8867 1020155 981490 888550 786210 858634 1119109 1142799 1017115 1159083 1135977 1012870
8857A012870r674j11658j510l8462m3861J79676J36816k5206P8898J04312j82981
8846A099220j10297N4417J97523k04764r7848N0018j8499J02607K5490j20873
8836I76994K77294j4203n4156j54999J00591L92019j53600p4031o22J5629K78850
8825A589766k54311l17190J41064J01136K05610j08634j41627J16198m4721M5574
8815A332865m638J24838n0917j98138J16486O3374N4194j5946q0130j9242K61172
8804A583918J94829j03080J1201o630j11090R1390J24149j11197l8690P3212N9572
8793A767584L0994k53126M0652r3815J76493L29372j13215m643n9994j93421J39137
8782A766018R4643J5993j20230M5232o563n7237Q7123M995j10815J13118J55282
$$ plain form
8857 1012870 1003196 891538 890028 851566 807705 987381 1124197 1098991 1177889 1282201 1099220
8846 1099220 988923 1043340 1240863 1036099 938251 988269 969770 1072377 1097867 976994
8836 976994 1254288 1240085 1185929 1030930 1131521 1523540 1369940 1295909 1295287 1310916 1589766
8825 1589766 1335455 1018265 1159329 1260465 1466075 1357441 1215814 1332012 1287291 1332865
8815 1332865 1328227 1453065 1402148 1204010 1320496 1383870 1438064 1422118 1341988 1322746 1583918
8804 1583918 1778747 1675667 1686868 1680238 1569148 1660538 1784687 1673490 1634800 1708012 1767584
8793 1767584 1798578 1545452 1586104 1492289 1668782 1998154 1884939 1880296 1820302 1626881 1766018
8782 1766018 1860661 1876654 1756424 1801656 1795093 1737856 1824979 1829974 1719159 1832277 1987559
8771A987559m034O1761Q4284J1530n4814p2704K16024q539M1792q835J43071o5653
8759B331442j52967R664P8099O3793M8243o4621j6466M0114J20484p8263j96810
8748B182712N752p1987J53532J90616l7091J52422R8044o9480J58666p4145o2354
8737B626687Q7356P2438k9107j27147J29783j40047J63667L40017j85661J70350
8727C108336j82267N048J13541K07618J96382N3845k22385l6837J85657J55899
8717C584837j62640j3446K7327J67686Q9577j718j48926P2074J12204K48690J58493
8706D134158j07179j26892l9839R191j1186N3351L49456j03327R7874L21160J6807
8695D593574P8782j01955K7297K11384M0846p7625j17708J71592J20187j14975
$$ plain form
8771 1987559 1983525 2045286 2129570 2141100 2086286 2013582 2229606 2221067 2262859 2254024 2397095 2331442
8759 2331442 2178475 2188139 2266238 2330031 2378274 2313653 2297187 2337301 2457785 2379522 2182712
8748 2182712 2188464 2116477 2270009 2460625 2423534 2575956 2674000 2604520 2763186 2689041 2626687
8737 2626687 2714043 2786481 2757374 2630227 2760010 2619963 2783630 3123647 2937986 3108336
8727 3108336 2926069 2931117 3044658 3252276 3448658 3502503 3280118 3243281 3428938 3584837
8717 3584837 3422197 3408751 3436078 3603764 3693341 3691623 3542697 3614771 3726975 3975665 4134158
8706 4134158 4026979 3900087 3860248 3869439 3858253 3911604 4261060 4157733 4255607 4576767 4593574
8695 4593574 4672356 4570401 4597698 4809082 4849928 4772303 4654595 4826187 4946374 4831399
8685D831399J83834L7021l020K15113k1968k3491J7685J39071J99600J69191n927
8674E738508j30184K3401k2739J70651J92952q4344N0426J59586o4291J6949J18300
8663F169215p8205J01552M9651P8403J42864j02003K37966j6585J53785J29363
8653F866006J3577O5921r3543O1937K98095K6029Q6894l9782J74541J69034R488
8642G638197K69716r6911R6882R2327q2358K3898o5455L08891Q7982K08831K70589
8631H752589M134K21240P9577O2536K21669K8370m6069O6488J16922J37621K21921
8620I866998J67157K02317k0168K34515J90480M16932L16416j41991J39317L1382
8610A1403355L4911K66875K4949L42286K5771K80150L03751J05842K15170K00306
$$ plain form
8685 4831399 5015233 5052254 5049234 5264347 5242379 5218888 5236573 5375644 5575244 5744435 5738508
8674 5738508 5608324 5631725 5608986 5779637 5972589 5888245 5938671 6098257 6033966 6050915 6169215
8663 6169215 6091010 6192562 6242213 6320616 6463480 6361477 6599443 6582858 6736643 6866006
8653 6866006 6879583 6945504 6851961 6913898 7211993 7238022 7324916 7285134 7459675 7628709 7638197
8642 7638197 7907913 7811002 7907884 8000211 7917853 7941751 7876296 8185187 8273169 8482000 8752589
8631 8752589 8756723 8977963 9057540 9120076 9341745 9370115 9324046 9390534 9507456 9645077 9866998
8620 9866998 10034155 10236472 10216304 10450819 10641299 11058231 11374647 11232656 11371973 11403355
8610 11403355 11438266 11705141 11730090 12072376 12098147 12378297 12682048 12787890 13003060 13203366
8600A3203366Q0220K83280K29348K11566O4749K49920P8151R5224K18664J52166
8590A4866654K28608K86457L30916L63908L02955J78374L20946K34914M02313
8581A7516045J17252K18962K71849K64372N50498K79398L11588L18416K66582
8572B0114962N23395K43518J42745L13259M44163M99444N03829J79339N13934
8563B3478588K82221L99803M81712L07108O23345M35377N69358K32830K66079
8554B7076421O13315N03150N53344O34330M54030M35294N91252M80490O19299
8545C1960925O71934O28192K95077N73028O75606O25350N77640N61482P02021
8536C7271255O59875O12663N89624M15208Q64355P21957O86338M92129O01861
$$ plain form
8600 13203366 13283586 13566866 13796214 14007780 14072529 14322449 14400600 14495824 14714488 14866654
8590 14866654 15095262 15381719 15712635 16076543 16379498 16557872 16878818 17113732 17516045
8581 17516045 17633297 17852259 18124108 18388480 18938978 19218376 19529964 19848380 20114962
8572 20114962 20638357 20881875 21024620 21337879 21782042 22281486 22785315 22964654 23478588
8563 23478588 23760809 24160612 24642324 24949432 25572777 26008154 26577512 26810342 27076421
8554 27076421 27689736 28192886 28746230 29380560 29834590 30269884 30861136 31341626 31960925
8545 31960925 32632859 33261051 33556128 34129156 34804762 35430112 36007752 36569234 37271255
8536 37271255 37931130 38543793 39133417 39548625 40412980 41134937 41821275 42313404 42915265
8527D2915265P53167N47261P49924M27434O43082Q67881P14988P18893N58151
8518D8896046P85891N42798L48344P35419P45417M20257N05438M01867N06546
8509E3888023M57999M89061L46043L27726L65292K00297J52594K48017J06053
8500E6581105L70308K13273N6947k9243p5430r1441l544o5579k17059l58082j30325
8489E6250930j24238k92825l84393l65534l43061o31534n50291n15952l61971
8480E2681131l56522p72031o61155m10892p14336m05425m90378p66951n07324
8471D7596117r20417o70130o00225n27419o51077r14562p13633o59142m41569
8462D1497943p05107r24932q14753o25207m59407n72272p58276o68054o69868
$$ plain form
8527 42915265 43668432 44215693 44965617 45393051 46036133 46904014 47619002 48337895 48896046
8518 48896046 49681937 50224735 50573079 51308498 52053915 52474172 52979610 53381477 53888023
8509 53888023 54346022 54835083 55181126 55508852 55874144 56074441 56227035 56475052 56581105
8500 56581105 56951413 57164686 57221633 57192390 57116960 57025519 57021975 56956396 56739337 56381255 56250930
8489 56250930 56126692 55833867 55449474 55083940 54740879 54109345 53559054 53043102 52681131
8480 52681131 52324609 51552578 50891423 50480531 49766195 49360770 48870392 48103441 47596117
8471 47596117 46675700 46005570 45405345 44877926 44226849 43312287 42598654 41939512 41497943
8462 41497943 40792836 39867904 39053151 38427944 37968537 37396265 36637989 35969935 35300067
8453C5300067l54020o49793o96206n51077o20227m64193n49943o73324l94695
8444C0346589n48742l10956n98189o43009l40615m85227o05218m37223o15382
8435B5762028m89070l31312k42354m25672l17438m54059m89976k48460m12609
8426B2351078o76354k17795m36330k51603q4959m44769m21039j57393l46961j47156
8416A9166719m98191l28301m20974l49751j38149j95958l51460n14595j84929
8407A6184411J43600k05943l26699k55425k19771l28365K7489k40721l16607k09876
8397A4252093m21943q2989j16049j65595k86370l15061o3634m7436l72164k02365
8387A2178487k43070q2719k9352j84454j55015j98606j78368r0800k34330j97886
$$ plain form
8453 35300067 34946047 34296254 33600048 33048971 32428744 31964551 31414608 30741284 30346589
8444 30346589 29797847 29486891 28888702 28245693 27905078 27419851 26814633 26377410 25762028
8435 25762028 25272958 24941646 24699292 24273620 23956182 23502123 23012147 22763687 22351078
8426 22351078 21674724 21456929 21020599 20768996 20684037 20239268 19818229 19660836 19313875 19166719
8416 19166719 18668528 18340227 17919253 17569502 17431353 17235395 16883935 16369340 16184411
8407 16184411 16328011 16122068 15795369 15539944 15320173 14991808 15019297 14778576 14461969 14252093
8397 14252093 13830150 13747161 13631112 13465517 13179147 12864086 12800452 12753016 12380852 12178487
8387 12178487 11935417 11852698 11823346 11638892 11483877 11285271 11106903 11016103 10781773 10583887
8377A0583887k70823K3248n3410p5552k07134k47972j14480q2260r5082R191m9852
8366I419761p5969j30589L6332k80377k08875j72974P2844j84425j24587j51804
8356H199337j75830p4611Q6307O4766k22236l84817j31941j639q2517k66370K9694
8345G040143J15021M621k22682j05130j5474j04690p6992Q0800j81751j13615
8335F420251j32315p2204J06741j17101j94447J89903J4n0250k02337j4246M7496
8324E981505k80004L7368o298N5886j27642j26530k33010q8059J24065p2699j35830
8313E128752j15499j15232J82501j23060k28783l8054k39941J31325J30075k70106
8303D441978m0825k52984j03592K35959K5555N5298k43474j6876R6626j363K9122
$$ plain form
8377 10583887 10313064 10336312 10282902 10207350 10000216 9752244 9637764 9555504 9460422 9469613 9419761
8366 9419761 9343792 9213203 9249535 8969158 8760283 8587309 8660153 8475728 8351141 8199337
8356 8199337 8023507 7948896 8035203 8099969 7877733 7492916 7360975 7359336 7276819 7010449 7040143
8345 7040143 7155164 7159785 6937103 6831973 6816499 6711809 6634817 6715617 6533866 6420251
8335 6420251 6287936 6215732 6322473 6205372 6010925 6200828 6200842 6150592 5948255 5934009 5981505
8324 5981505 5701501 5738869 5732571 5788457 5660815 5534285 5301275 5213216 5337281 5264582 5128752
8313 5128752 5013253 4898021 5080522 4957462 4728679 4690625 4450684 4582009 4712084 4441978
8303 4441978 4401153 4148169 4044577 4280536 4306091 4361389 4117915 4101039 4197665 4196302 4225424
8292D225424m21846Q477r2746m3069N8524j12349j59685Q4344M9284L1270j20167
8281C507461j54982j20771k8779J28618O0215k12014j10571l14822K34325J90662
8271C179342k26908j10800o9381Q8957L06908r4628k59910k80382L3926K62011
8261B829135M4250j25680p7006p8389O9617p562O3268q5484k60593J55375K06211
8250B733142J10486k74273n614o157Q6201J60070j80579k63753J16815P3797O2602
8239B612737j62346r6865q6800J19327J44835m1015j50410N9568p9043M2305o3519
8228B298774K2910M0242k4974r9397k26337J20649L1863k97291L06377r1960O2940
8217B143796M7822k64322O6890J76064J00690p1547l01300q29n8431J07651J32378
$$ plain form
8292 4225424 3803578 3812055 3719309 3676240 3734764 3622415 3462730 3547074 3596358 3627628 3507461
8281 3507461 3352479 3231708 3202929 3331547 3391762 3179748 3069177 2754355 2988680 3179342
8271 3179342 2952434 2841634 2772253 2861210 3168118 3073490 2813580 2533198 2567124 2829135
8261 2829135 2873385 2747705 2670699 2592310 2661927 2654365 2717633 2632149 2371556 2526931 2733142
8250 2733142 2843628 2569355 2563741 2557584 2643785 2803855 2623276 2359523 2476338 2550135 2612737
8239 2612737 2450391 2353526 2266726 2386053 2530888 2489873 2339463 2399031 2319988 2362293 2298774
8228 2298774 2321684 2361926 2336952 2237555 2011218 2131867 2163730 1866439 2172816 2080856 2143796
8217 2143796 2191618 1927296 1994186 2170250 2270940 2199393 1898093 1897264 1838833 1946484 2078862
8206B078862m45537L46738K09441n0878J70782k60340J05765K40503j72886L8598
8196B261048k19905J95150k1815J32800l726928o6454J925191L33890N24480k8716
8186A308741K06566j92835J41048k65764J41805K4407K58236k58755l2168J82883
8176A514164j67846N82r1408o5979N80625l8297o3460J0288N9876o0476j11375
8165A566694j07509n3519j5216O105k15677J00519R6244J448K67563j97179o8509
8154A380964J98816l5881j11130l38071Q0907n8291l631K71385j44332o9084J31693
8143A303345R6661L9719q3095j28767J3815n8289J02050p8896p0834J42454M135
8132A282298k7523J07559R9673p8393j75289o1289Q3531J58202j10783j12524
$$ plain form
8206 2078862 1633325 1980063 2189504 2138626 2309408 2049068 2154833 2395336 2222450 2261048
8196 2261048 2041143 2236293 2214478 2347278 -1379650 -1446104 479087 812977 1337457 1308741
8186 1308741 1515307 1322472 1463520 1197756 1339561 1363968 1622204 1363449 1331281 1514164
8176 1514164 1346318 1346900 1255492 1189513 1770138 1731841 1668381 1678669 1738545 1678069 1566694
8165 1566694 1459185 1405666 1390450 1396555 1180878 1281397 1377641 1379089 1646652 1449473 1380964
8154 1380964 1579780 1543899 1432769 1094698 1175605 1117314 1113683 1385068 1240736 1171652 1303345
8143 1303345 1400006 1439725 1356630 1227863 1241678 1183389 1285439 1206543 1135709 1278163 1282298
8132 1282298 1254775 1362334 1462007 1383614 1208325 1147036 1230567 1388769 1277986 1165462
8122A165462J18565J08392p5612r8810j05465m7517N0060Q0475K74j48688R1311
8111A138447k0283K56253j24480l03946J34755j7266m6488K49053m6436j62494
8101A057115J56929J23063N4775j20711j65445N4714K10677m1693j08902j8817
8091A201705n9148M6030K00486j80853k44133J94645K28740j26311k47088j55438
8081H58635J61152p0675j13170O1890k4667O5561K714J69655O7993k27770l2396
8070I18922q0043n3794K99664j04566k70320L5285j3196K03246R8530k95040M3569
8059G82257J51492l815Q4349q4547q6958r2560m305K03455p2281j83198K60560
8048I54449j61049J98679L722k04998O7267P6708N0057L7269q7874j08210N9566
$$ plain form
8122 1165462 1284027 1392419 1316807 1217997 1112532 1065015 1115075 1195550 1195824 1047136 1138447
8111 1138447 1118164 1374417 1249937 945991 1080746 1063480 1016992 1266045 1219609 1057115
8101 1057115 1214044 1337107 1391882 1271171 1105726 1160440 1371117 1329424 1220522 1201705
8091 1201705 1142557 1188587 1389073 1208220 964087 1158732 1387472 1261161 1014073 858635
8081 858635 1019787 949112 835942 897832 873165 938726 941440 1111095 1179088 951318 918922
8070 918922 838879 785085 1084749 980183 709863 745148 731952 935198 1033728 738688 782257
8059 782257 933749 929934 1014283 929736 842778 750218 745913 949368 877087 693889 954449
8048 954449 793400 992079 995801 790803 858070 934778 984835 1022104 934230 826020 885586
8037H85586j51551L35137j10286p4883m2327j50864L07907J23526k00853n5362
8027H66030j45830O9283P1952l9682j16474n0007O5974q9476r3502q29P549J39111
8015F84099J92401o9782j16660M8892j35574m1469J03742j51226m1897j9673o9835
8004C83018k8087J89748o8582j17400L5127J02760K33340P9024k93863k63652
7994B51433K71190j32259j8677J89092j78537p2100J11117n6939o9826q7260R8805
7983C06039M0807R9671j7129j45080M7254J15051o0909J70045k00851k45567K16056
7972C25387K02959K7195j80963k9992k5681j01476k7876L09401N7391j28624J59748
7961E87469K67712j76419n1704N4395j34398k46342o6578N2772j4717M1139K46789
$$ plain form
8037 885586 734035 1069172 958886 884003 841676 690812 998719 1122245 921392 866030
8027 866030 720200 789483 861435 821753 705279 655272 721246 631770 538268 537439 544988 684099
8015 684099 876500 806718 690058 738950 603376 561907 665649 514423 472526 452853 383018
8004 383018 354931 544679 476097 358697 393824 496584 729924 808948 515085 251433
7994 251433 522623 390364 371687 560779 382242 310142 421259 364320 294494 207234 306039
7983 306039 346846 446517 429388 284308 331562 446613 385704 555749 354898 109331 325387
7972 325387 528346 555541 374578 344586 318905 217429 189553 498954 556345 427721 587469
7961 587469 855181 678762 627058 681453 547055 300713 234135 286907 272190 313329 560118
7950E60118j16116k620k8268j4251J41672P4349j8977q9375l6403M6782j42873
7939C74038k4457j45465O1778J87868j3364q6604j30787j21683J63869j43501
7929A21692N9834j383j75190K13416n312J88020J10541k22568o8968n3056m6415
7918A20611K05578j29876o9100M9815J09086K18026k42902j72561K507l9782L0077
7907H1479j21400k12306K39081N9949j5175J51764j77476m1134L38578l1611j79236
7896I2513L03295j17423n9758O4195j09500J7317m6233P2400r5418j13753J07740
7885A15375O5403r7151L4905J15630J54629K12587k89841o2742j6442o1048L0708
$$ plain form
7950 560118 444002 441382 413114 398863 540535 614884 595907 506532 470129 516911 374038
7939 374038 349581 204116 265894 453762 440398 353794 223007 101324 265193 121692
7929 121692 181526 180143 4953 218369 213057 401077 511618 289050 220082 167026 120611
7918 120611 326189 196313 127213 177028 286114 504140 261238 88677 91184 51402 81479
7907 81479 -39921 -252227 -13146 46803 31628 183392 5916 -35218 303360 271749 92513
7896 92513 395808 278385 218627 282822 173322 190639 144406 216806 121388 7635 115375
7885 115375 180778 83627 118532 234162 388791 601378 311537 248795 232353 171305 202013
$$ [...]
##END NTUPLES=NMR SPECTRUM
##END=
