##TITLE=1H_CA-8790-2
 CDCl3, 8 sc, 
 30.10.2020
##JCAMPDX= 6.0         $$ Bruker NMR JCAMP-DX V2.0
##DATA TYPE= NMR FID
##DATA CLASS= NTUPLES
##ORIGIN= UXNMR, Bruker Analytische Messtechnik GmbH
##OWNER= root
$$ XWIN-NMR		Version 3.5
$$ Fri Oct 30 11:40:06 2020 Russian Standard Time (UT+4h)  she@DPX200
##.OBSERVE FREQUENCY= 200.1315066352
##.OBSERVE NUCLEUS= ^1H
##.DELAY= (6, 6)
##.ACQUISITION MODE= SIMULTANEOUS
##.ACQUISITION SCHEME= undefined
##.AVERAGES= 8
##.DIGITISER RES= 18
##SPECTROMETER/DATA SYSTEM= spect
##.PULSE SEQUENCE= zg30
##.SOLVENT NAME= CDCl3
##.SHIFT REFERENCE= (INTERNAL, CDCl3, 0, 15.7039)
##AUDIT TRAIL= $$ (NUMBER, WHEN, WHO, WHERE, WHAT)
$$ ##TITLE= Audit trail, XWIN-NMR		Version 3.5
$$ ##JCAMPDX= 5.01
$$ ##ORIGIN= Bruker BioSpin GmbH
$$ ##OWNER= she
$$ F:/spectra/data/she/nmr/H-F/1/audita.txt
$$ ##AUDIT TRAIL=  $$ (NUMBER, WHEN, WHO, WHERE, WHAT)
(   1,<2020-10-30 11:38:57.46 +0400>,<she>,<DPX200>,
      <created by zg, POWCHK disabled, PULCHK disabled
       configuration hash MD5:
       00 E9 B6 7A A2 85 ED C7 34 08 36 98 17 FE 4E 26
       data hash MD5: 16K
       8B E7 8C EA FA E4 7B 32 F9 85 DE D2 5E C9 95 46>)
$$ ##END=
$$ 
$$ hash MD5
$$ FF 9D 0C B4 3E 89 55 E0 BA 37 6C EC 64 22 AD CC
##$RELAX= 
##$RELAX= 
##$RELAX= 
##$RELAX= 
##$RELAX= 
##$RELAX= 
$$ Bruker specific parameters
$$ --------------------------
##$DU= <F:/spectra>
##$EXPNO= 1
##$NAME= <H-F>
##$PROCNO= 1
##$TYPE= <nmr>
##$USER= <she>
##$AMP= (0..31)
100 100 100 100 100 100 100 100 100 100 100 100 100 100 100 100 100 100 
100 100 100 100 100 100 100 100 100 100 100 100 100 100 
##$AQSEQ= 0
##$AQ_mod= 1
##$AUNM= <au_zg>
##$AUTOPOS= <>
##$BF1= 200.13
##$BF2= 200.13
##$BF3= 200.13
##$BF4= 200.13
##$BF5= 200.13
##$BF6= 200.13
##$BF7= 200.13
##$BF8= 200.13
##$BYTORDA= 1
##$CFDGTYP= 0
##$CFRGTYP= 5
##$CHEMSTR= <none>
##$CNST= (0..31)
1 1 145 1 1 1 1 1 1 1 1 1 1 1 1 1 1 1 1 1 1 1 1 1 1 1 1 1 1 1 1 1 
##$CPDPRG= <>
##$CPDPRG1= <>
##$CPDPRG2= <>
##$CPDPRG3= <>
##$CPDPRG4= <mlev>
##$CPDPRG5= <mlev>
##$CPDPRG6= <mlev>
##$CPDPRG7= <mlev>
##$CPDPRG8= <mlev>
##$CPDPRGB= <>
##$CPDPRGT= <>
##$D= (0..31)
0 1.2 0 0 0 0 0 0 0 0.06 0 0.03 0 0 0 0 0.0002 0 0 0 0 0 0 0 0 0 0 0 0 
0 0 0 
##$DATE= 1604043536
##$DBL= (0..7)
120 120 120 120 120 120 120 120 
##$DBP= (0..7)
150 150 150 150 150 150 150 150 
##$DBP07= 0
##$DBPNAM0= <>
##$DBPNAM1= <>
##$DBPNAM2= <>
##$DBPNAM3= <>
##$DBPNAM4= <>
##$DBPNAM5= <>
##$DBPNAM6= <>
##$DBPNAM7= <>
##$DBPOAL= (0..7)
0.5 0.5 0.5 0.5 0.5 0.5 0.5 0.5 
##$DBPOFFS= (0..7)
0 0 0 0 0 0 0 0 
##$DE= 6
##$DECBNUC= <off>
##$DECIM= 32
##$DECNUC= <off>
##$DECSTAT= 4
##$DIGMOD= 1
##$DIGTYP= 9
##$DL= (0..7)
0 120 120 120 120 120 120 120 
##$DP= (0..7)
150 150 150 150 150 150 150 150 
##$DP07= 0
##$DPNAME0= <>
##$DPNAME1= <>
##$DPNAME2= <>
##$DPNAME3= <>
##$DPNAME4= <>
##$DPNAME5= <>
##$DPNAME6= <>
##$DPNAME7= <>
##$DPOAL= (0..7)
0.5 0.5 0.5 0.5 0.5 0.5 0.5 0.5 
##$DPOFFS= (0..7)
0 0 0 0 0 0 0 0 
##$DQDMODE= 0
##$DR= 18
##$DS= 0
##$DSLIST= <SSSSSSSSSSSSSSS>
$$ [...]
##$SUBNAM2= <"">
##$SUBNAM3= <"">
##$SUBNAM4= <"">
##$SUBNAM5= <"">
##$SUBNAM6= <"">
##$SUBNAM7= <"">
##$SUBNAM8= <"">
##$SUBNAM9= <"">
##$SW= 16.9725356469052
##$SWIBOX= (0..15)
0 0 2 0 0 0 0 0 0 0 0 0 0 0 0 0 
##$SW_h= 3396.73913043478
##$TD= 16384
##$TD0= 1
##$TE= 0
##$TE2= 300
##$TE3= 300
##$TEG= 300
##$TL= (0..7)
0 120 120 120 120 120 120 120 
##$TP= (0..7)
150 150 150 150 150 150 150 150 
##$TP07= 0
##$TPNAME0= <>
##$TPNAME1= <>
##$TPNAME2= <>
##$TPNAME3= <>
##$TPNAME4= <>
##$TPNAME5= <>
##$TPNAME6= <>
##$TPNAME7= <>
##$TPOAL= (0..7)
0.5 0.5 0.5 0.5 0.5 0.5 0.5 0.5 
##$TPOFFS= (0..7)
0 0 0 0 0 0 0 0 
##$TUNHIN= 0
##$TUNHOUT= 0
##$TUNXOUT= 0
##$USERA1= <user>
##$USERA2= <user>
##$USERA3= <user>
##$USERA4= <user>
##$USERA5= <user>
##$V9= 5
##$VALIST= <valist>
##$VCLIST= <CCCCCCCCCCCCCCC>
##$VD= 0
##$VDLIST= <DDDDDDDDDDDDDDD>
##$VPLIST= <PPPPPPPPPPPPPPP>
##$VTLIST= <TTTTTTTTTTTTTTT>
##$WBST= 1024
##$WBSW= 4
##$XGAIN= (0..3)
0 0 0 0 
##$XL= 0
##$YL= 0
##$YMAX_a= 290719
##$YMIN_a= -269286
##$ZGOPTNS= <>
##$ZL1= 120
##$ZL2= 120
##$ZL3= 120
##$ZL4= 120
##$ABSF1= 10
##$ABSF2= 0
##$ABSG= 5
##$ABSL= 3
##$ALPHA= 0
##$AQORDER= 0
##$ASSFAC= 0
##$ASSFACI= 0
##$ASSFACX= 0
##$ASSWID= 0
##$AUNMP= <proc_1d>
##$AZFE= 0.1
##$AZFW= 0.1
##$BCFW= 1
##$BC_mod= 2
##$BYTORDP= 1
##$COROFFS= 0
##$CY= 11.3945322036743
##$DATMOD= 1
##$DC= 2
##$DFILT= <>
##$DTYPP= 0
##$F1P= 15.9154993809931
##$F2P= -4.1035820241983
##$FCOR= 0.5
##$FTSIZE= 0
##$FT_mod= 4
##$GAMMA= 1
##$GB= 0.15
##$INTBC= 1
##$INTSCL= 1
##$ISEN= 128
##$LB= 0.24
##$LEV0= 0
##$LPBIN= 0
##$MAXI= 10000
##$MC2= 0
##$MEAN= 0
##$ME_mod= 0
##$MI= 1.114404
##$NCOEF= 0
##$NC_proc= 0
##$NLEV= 6
##$NOISF1= 3.799351
##$NOISF2= 2.8
##$NSP= 1
##$NTH_PI= 0
##$NZP= 0
##$OFFSET= 15.70392
##$PC= 1
##$PHC0= -11046.92
##$PHC1= 10.80088
##$PH_mod= 1
##$PKNL= yes
##$PPARMOD= 0
##$PSCAL= 0
##$PSIGN= 0
##$REVERSE= no
##$SF= 200.130013532006
##$SI= 16384
##$SIGF1= 3
##$SIGF2= 2
##$SINO= 400
##$SIOLD= 16384
##$SREGLST= <1H.CDCl3>
##$SSB= 0
##$STSI= 0
##$STSR= 0
##$SW_p= 3612.71676300578
##$SYMM= 0
##$S_DEV= 0
##$TDeff= 0
##$TDoff= 0
##$TI= <>
##$TILT= no
##$TM1= 0
##$TM2= 0
##$TOPLEV= 0
##$USERP1= <user>
##$USERP2= <user>
##$USERP3= <user>
##$USERP4= <user>
##$USERP5= <user>
##$WDW= 1
##$XDIM= 8192
##$YMAX_p= 0
##$YMIN_p= 0
$$ End of Bruker specific parameters
$$ ---------------------------------
##NTUPLES= NMR FID
##VAR_NAME=  TIME,          FID/REAL,        FID/IMAG
##SYMBOL=    X,             R,               I
##VAR_TYPE=  INDEPENDENT,   DEPENDENT,       DEPENDENT
##VAR_FORM=  AFFN,          ASDF,            ASDF
##VAR_DIM=   8192,          8192,            8192
##UNITS=     SECONDS,       ARBITRARY UNITS, ARBITRARY UNITS
##FACTOR=    0.0002944,     1,               1
##FIRST=     0,             0,               0
##LAST=      2.4114304,     0,               0
##MIN=       0,             -269286,         0
##MAX=       2.4114304,     290719,          0
$$ Real data points
##PAGE= N=1
##DATA TABLE= (X++(R..R)), XYDATA
$$ plain form
0 0 0 0 0 0 0 0 0 0 0 0 0 0 8 -8 8 -8 8 -16 16 -24 24 -32 36 -42 48 -60 69 -80 92 -108 124 -140 157 -181
34 -181 204 -232 258 -291 326 -365 407 -454 504 -559 617 -683 754 -832 917 -1011 1114 -1228
52 -1228 1354 -1489 1644 -1819 2014 -2238 2493 -2791 3144 -3570 4096 -4761 5639 -6858 8684
67 8684 -11765 18421 -70230 89938 -41836 -269286 -64520 -33476 -120620 -50078 -80639 -173473
79 -173473 40078 36247 -178106 -69664 157787 -57760 -117533 113457 57558 -26531 79519
90 79519 63693 13488 156057 85732 -40829 165418 197942 -11490 41191 235199 86797
101 86797 10468 139352 97899 64015 129658 41568 -12674 177878 82464 -106850 63554
112 63554 147882 -36760 -59027 77670 1173 -19350 27562 -60165 -36482 84476 -31283
$$ packed form
0@%%%%%%%%%%%%Qj6J6j6J6k4L2m0M8n6O8p8R0j08J29j49J72k00K32k64K97l38
34a81L85m36M90n49O17o91P72q61R58j063J176j300J437j586J749j928K125k342
52a228K582k843L133l463L833m252M731n284N935o714P666q857J0400j2497J5542
67H684k0449L0186q8651J60168j31774k27450K04766L1044q7144P0542l0561r2834
79a73473K13551l831k14353J08442K27451k15547n9773K30990n5899q4089J06050
90G9519j5826n0205J42569p0325j26561K06247L2524k09432N2681J94008j48402
101H6797p6329J28884m1453l3884O5643q8090n4242J90552r5414j89314J70404
112F3554Q4328j84642k2267J36697p6497k0523M6912q7727K3683J20958j15759
$$ plain form
123 -31283 -129187 83117 57594 -118436 -9990 91704 -18268 -24156 54732 -4038 59387
134 59387 94104 -34390 5662 178235 75521 -63992 118951 158454 28230 55183 106634
145 106634 62012 110202 108711 -15873 91529 173879 10547 -34805 133284 94472 -43929
156 -43929 36303 51516 1418 31287 557 -77739 31783 53693 -122767 -58124 61002
167 61002 -48113 -117701 -4013 -23649 -86489 -24720 -55783 -74283 5089 -26841 -131686
178 -131686 -4421 54424 -107687 -70410 53154 -6668 -63473 13016 -11899 -13371 50554
189 50554 -28207 -47560 77352 57031 -88510 13181 100841 -21643 -31439 42225 14326
200 14326 2770 40747 -46103 -20538 84063 -19048 -93860 34689 58877 -83242 -35945
$$ packed form
123c1283r7904K12304k5523j76030J08446J01694j09972n888P8888n8770O3425
134E9387L4717j28494M0052J72573j02714j39513J82943L9503j30224K6953N1451
145A06634m4622M8190j491j24584J07402Q2350j63332m5352J68089l8812j38401
156d3929Q0232J5213n0098K9869l0730p8296J09522K1910j76460O4643J19126
167F1002j09115o9588J13688j9636o2840O1769l1063j8500P9372l1930j04845
178a31686J27265N8845j62111L7277J23564n9822n6805P6489k4915j472O3925
189E0554p8761j9353J24912k0321j45541J01691Q7660j22484r796P3664k7899
200A4326j1556L7977q6850K5565J04601j03111p4812J28549K4188j42119M7297
$$ plain form
211 -35945 29577 -35363 -30262 -8102 -60503 -21327 44319 -84547 -78369 61449 -8758 -112047
223 -112047 -8752 42093 -54255 -23444 -5983 -38496 18972 24709 -77724 -21163 96659
234 96659 -28774 -71037 55517 40630 -44302 11996 29736 -18415 43390 17397 -44924 35649
246 35649 73425 -51174 -30960 91888 3518 -48544 35297 30096 -24010 22663 1469 -36764
258 -36764 54551 20224 -72252 9928 80104 -46150 -56550 55251 8023 -33009 8907 -6629
270 -6629 -21044 46815 -15718 -75435 49131 48185 -72590 -26722 66310 -18457 -38846 20719
282 20719 -14007 -8310 28222 -28102 -43795 63330 6313 -83882 21276 54970 -43792 -31238
294 -31238 38304 -12379 -4577 17729 -36839 -3392 56228 -20011 -59807 60612 35757 -58885
$$ packed form
211c5945O5522o4940N101K2160n2401L9176O5646j28866O178J39818p0207j03289
223a12047J03295N0845r6348L0811J7461l2513N7468N737j02433N6561J17822
234I6659j25433m2263J26554j4887q4932N6298J7740m8151O1805k5993o2321Q0573
246C5649L7776j24599K0214J22848q8370n2062Q3841n201n4106M6673k1194l8233
258c6764R1315l4327r2476Q2180P0176j26254j0400J11801m7228m1032M1916j5536
270f629j4415O7859o2533n9717J24566r46j20775M5868R3032q4767k0389N9565
282B0719l4726N697L6532n6324j5693J07125n7017r0195J05158L3694r8762J2554
294c1238O9542n0683P802K2306n4568L3447N9620p6239l9796J20419k4855r4642
$$ plain form
306 -58885 2476 46711 -11333 -4751 24184 -22816 24593 42642 -42893 -17014 71386 4230
318 4230 -61675 38205 39262 -29746 -3247 16193 -16080 15843 16514 -55791 12017 53446 -44052
331 -44052 -48918 48090 8443 -55769 7625 7931 -17796 7262 -9050 -41410 26631 31064 -65465
344 -65465 -7885 59400 -15396 -43868 31898 14448 -17572 19935 -7401 -5796 44116 9718
356 9718 -48229 32296 57514 -40834 -14975 48799 6760 -20870 18759 -8394 -5572 32104
368 32104 -29851 -37194 39047 12145 -71566 -5598 31842 -42205 -35810 -115 -24398 -23056 1057
381 1057 -54162 -32570 30270 -39953 -70522 16068 15842 -63794 -18708 12938 -24675 -9009 -1237
394 -1237 -30096 4650 40574 -38302 -23128 59975 9335 -40811 26125 42585 -11851 18688
$$ packed form
306e8885O1361M4235n8044O582K8935m7000M7409J8049q5535K5879Q8400o7156
318D230o5905R9880J057o9008K6499J9440l2273L1923O71p2305O7808M1429r7498
331d4052m866R7008l9647o4212O3394L06k5727K5058j6312l2360O8041M433r6529
344f5465N7580O7285p4796k8472P5766j7450l2020L7507k7336J605M9912l4398
356I718n7947Q0525K5218r8348K5859O3774m2039k7630L9629k7153K822L7676
368C2104o1955p343P6241k6902q3711O5968L7440p4047O395L5695k4283J342K4113
381A057n5219K1592O2840p0223l0569Q6590k26p9636M5086L1646l7613J5666P772
394a237k8859L4746L5924p8876J5174Q3103n0640n0146O6936J6460n4436L0539
$$ plain form
406 18688 18368 -3883 36040 29021 -30494 11751 67933 -18422 -29353 44698 19142 -30555 6654
419 6654 8046 -20977 20033 -10360 -46557 14621 22086 -60133 -31205 37731 -27797 -46664 5949
432 5949 -6185 -30219 3152 -19290 -35272 33626 1937 -52269 14258 49786 -28993 -15877
444 -15877 48459 9941 3468 32509 14189 15259 60948 15428 -11577 71301 56654 -13123
456 -13123 29917 76019 15521 16511 49411 17744 31555 48871 2916 3096 68169 17673 -33274
469 -33274 37488 43194 -20019 -2426 31569 -9977 4069 13949 -29110 653 33042 -26337
481 -26337 -39087 39207 6949 -46301 2929 18916 -18480 -3645 10361 -22676 16518 24862
493 24862 -34007 -4509 49709 -4464 -33232 37389 23932 -14146 11861 14846 -3452 23397
$$ packed form
406A8688l20k2251L9923p019n9515M2245N6182q6355j0931P4051k5556m9697L7209
419F654J392k9023M1010l0393l6197O1178P465q2219K8928O8936o5528j8867N2613
432E949j2134k4034L3371k2442j5982O8898l1689n4206O6527L5528p8779J3116
444a5877O4336l8518o473K9041j8320J070M5689m5520k7005Q2878j4647o9777
456a3123M3040M6102o0498R90L2900l1667J3811J7316m5955J80O5073n0496n0947
469c3274P0762N706o3213J7593L3995m1546J4046R880m3059K9763L2389n9379
481b6337j2750P8294l2258n3250M9230J5987l7396J4835J4006l3037L9194Q344
493B4862n8869K9498N4218n4173k8768P0621j3457l8078K6007K985j8298K6849
$$ plain form
505 23397 16707 -29246 21734 40634 -26892 -19314 38875 2445 -31704 11206 -622 -14399
517 -14399 4443 -15873 -34534 10863 2620 -58095 -13191 18454 -35629 -44658 2449 -18124
529 -18124 -35113 -8252 -33028 -27082 7107 -23982 -55066 3949 9650 -51634 -22143 12373
541 12373 -17706 -25505 877 -20276 -11150 15147 -28168 -25201 26111 2616 -43005 6740 20156
554 20156 -25350 -8729 7828 -10174 -3630 9720 -25783 -6582 26788 -22144 -31182 22111
566 22111 10330 -36790 -244 10422 -16370 -1681 -3559 -19657 6325 18668 -34568 -13428
578 -13428 34549 -7596 -32260 12273 15783 -15814 7989 -107 -11044 21968 9188 -27705
590 -27705 9142 39143 -19008 -13033 30531 8148 -12386 13129 6973 -5948 25608 603
$$ packed form
505B3397o690m5953N0980J8900o7526P578N8189l6430l4149M2910j1828j3777
517a4399J8842k0316j8661M5397q243o0715M4904L1645n4083r029M7107k0573
529a8124j6989K6861k4776N946L4189l1089l1084N9015N701o1284K9491L4516
541A2373l0079p799K6382k1153R126K6297m3315K967N1312k3495m5621M9745J3416
554B0156m5506J6621J6557j8002O544J3350l5503J9201L3370m8932r038N3293
566B2111j1781m7120L6546J0666k6792J4689j878j6098K5982J2343n3236K1140
578a3428M7977m2145k4664M4533L510l1597K3803q096j0937L3012j2780l6893
590b7705L6847L0001n8151N975M3564k2383k0534K5515o156j2921L1556k5005
$$ plain form
602 603 -18391 25648 22372 -27245 956 36807 -10160 -10170 18784 3667 -3816 15574 -5518
615 -5518 -11313 31856 2833 -26481 18627 29324 -22352 -5356 28102 -3427 81 13758 -4875
628 -4875 2712 28984 -8088 -18276 34613 14091 -23149 10546 29275 -11498 -30 18515
640 18515 -7819 7993 16815 -14469 -3923 34640 -8216 -27775 24375 14797 -22304 -2341
652 -2341 15539 -10999 3147 3757 -23726 6251 21628 -24642 -22763 30192 -776 -29109 5291
665 5291 6501 -12058 1266 748 -19885 13320 12198 -29429 -4615 27127 -10173 -22853 20562
678 20562 2178 -13657 9820 760 -11210 12836 5971 -21794 14621 18825 -22196 -5580 27264
691 27264 -3858 -17637 16301 1814 -4324 12394 -4833 -13148 21126 8736 -28072 10205
$$ packed form
602F03j8994M4039l276m9617K8201L5851m6967j0K8954j5117p483J9390k1092
615e518n795M3169k9023k9314M5108J0697n1676J6996L3458l1529L508J3677j8633
628d875P587K6272l7072j0188N2889k0522l7240L3695J8729m0773J1468J8545
640A8515k6334J5812Q822l1284J0546L8563m2856j9559N2150r578l7101J9963
652b341J7880k6538J4146O10k7483K9977J5377m6270J879N2955l0968k8333L4400
665E291J210j8559J3324n18k0633L3205j122m1627K4814L1742l7300j2680M3415
678B0562j8384j5835K3477r060j1970K4046o865k7765L6415M204m1021J6616L2844
691B7264l1122j3779L3938j4487o138J6718j7227q315L4274j2390l6808L8277
$$ plain form
703 10205 23085 -13305 -10230 17150 -1100 -6680 12283 -8844 -2888 19726 -4382 -20854 18980
716 18980 13591 -25220 2139 17096 -6753 -6575 7959 -7730 -4 12958 -17736 -8842 21914
729 21914 -927 -27245 10109 13819 -18005 -3896 3837 -6112 2709 5224 -21129 50 21996
742 21996 -15279 -18398 15776 7753 -18106 5568 5018 -9356 8079 2285 -12814 8376 16240
755 16240 -18375 -1330 23155 -6371 -12479 13834 7314 -10107 10276 1261 -6977 13684 2746
768 2746 -17049 8071 19932 -18821 -5803 18205 -3420 -11664 5711 -786 -7238 11012 -8612
781 -8612 -13804 15253 5055 -25070 -271 19979 -13599 -8088 8635 -3931 -2898 8115 -9476
794 -9476 -7154 21107 -4152 -16865 14970 14718 -16216 67 18024 -5295 3233 9015 -5615
$$ packed form
703A0205J2880l6390L075K7380j8250n580J8963k1127N956K2614k4108j6472L9834
716A8980n389l8811K7359J4957k3849J78J4534j5689P726J2962l0694Q894L0756
729B1914k2841k6318L7354L710l1824J4109P733r949Q821K515k6353K1179K1946
742B1996l7275l119L4174q023k5859K3674n50j4374J7435n794j5099K1190P864
755A6240l4615J7045K4485k9526o108K6313o520j7421K0383r015q238K0661j0938
768B746j9795K5120J1861l8753J3018K4008k1625q244J7375o497o452J8250j9624
781h612n192K9057j0198l0125K4799K0250l3578N511J6723j2566J033J1013j7591
794i476K322K8261k5259j2713L1835k52l0934J6283J7957k3319Q528N782j4630
$$ plain form
807 -5615 4163 19696 -9405 -10164 25073 3970 -15404 9401 14933 -9673 1882 8054 -9282
820 -9282 7411 8676 -14512 -2808 21320 -9946 -18082 15278 2907 -14277 1454 5098 -10773
833 -10773 5615 2669 -17425 5074 12467 -14617 -8602 19902 -5410 -14134 11825 2532 -8927
846 -8927 5539 3668 -9578 12848 5442 -17881 6036 18473 -11117 -11519 17589 -835 -8570
859 -8570 6469 -2782 -6640 9212 -2638 -19399 11030 7350 -21772 -6063 11102 -10305 -14559
872 -14559 4722 -9774 -8393 3183 -12133 -15612 8042 -2960 -25630 3224 6153 -17308 -9141
885 -9141 5617 -9161 -8085 4349 -12018 -3728 9530 -8599 -15067 12680 5517 -18596 3298
898 3298 9075 -5730 -977 5865 -7510 2141 11371 -12173 -3547 14686 -1520 -14167 10108
$$ packed form
807e615R778J5533k9101p59L5237k1103j9374K4805N532k4606J1555O172j7336
820i282J6693J265k3188J1704K4128l1266q136L3360j2371j7184J5731L644j5871
833a0773J6388k946k0094K2499P393k7084O015K8504k5312q724K5959r293j1459
846h927J4466j871j3246K2426p406k3323K3917J2437k9590m02K9108j8424p735
859h570J5039r251l858J5852j1850j6761L0429l680k9122J5709J7165k1407m254
872a4559J9281j4496J381J1576j5316l479K3654j1002k2670K8854K929k3461Q167
885i141J4758j4778J076J2434j6367Q290J3258j8129o468K7747p163k4113K1894
898C298N777j4805M753O842j3375R651R230k3544Q626J8233j6206j2647K4275
$$ plain form
911 10108 6653 -12536 2265 3328 -5432 2109 4141 -13435 1924 12212 -13268 -8419 11743
924 11743 1121 -13121 5211 2717 -6292 5066 -620 -6864 7863 10057 -12588 2705 16828
937 16828 -4181 -3840 12025 6357 -2182 11458 3198 762 15074 5164 -5529 12327 17493 -6604
951 -6604 4686 17025 989 630 10300 3302 986 13288 -2833 -3077 15112 4168 -12064 4468
965 4468 12706 -8793 -973 5857 -3966 -777 4788 -7956 -4720 12704 -6823 -10403 9296 3929
979 3929 -12262 399 7426 -7114 1946 3087 -5522 2972 9807 -8478 -4649 16839 -722 -8159
993 -8159 8308 8609 -4643 4605 5346 -4499 9466 6289 -6905 2914 14872 -6013 -6403 13227
1007 13227 227 -5730 4936 2733 -6402 6135 517 -11341 5676 4461 -11863 -4252 10354
$$ packed form
911A0108l455j9189J4801J063q760P541K032j7576J5359J0288k5480M849K0162
924A1743j0622j4242J8332k494r009J1358n686o244J4727K194k2645J5293J4123
937A6828k1009L41J5865n668q539J3640q260k436J4312r910j0693J7856N166k4097
951f604J1290J2339j6036l59R670o998k316J2302j6121k44J8189j0944j6232J6532
965D468Q238k1499P820O830r823L189N565j2744L236J7424j9527l580J9699n367
979C929j6191J2661P027j4540R060J141q609Q494O835j8285L829K1488j7561p437
993h159J6467L01j3252R248P41r845J3965l177j3194R819J1958k0885l90J9630
1007A3227j3000n957J0666k203r135J2537n618j1858J7017j215j6324P611J4606
$$ plain form
1020 10354 -8986 -9982 5758 -4367 -8291 908 -3767 -10143 6350 -2769 -15577 2723 5570
1033 5570 -12374 -7363 9020 -5398 -6232 3446 -4903 -3541 6382 -3133 -10686 10945 3839 -12080
1047 -12080 1959 8902 -4915 -3192 8137 -4102 1146 6981 -5051 -3473 11004 287 -11354
1060 -11354 9223 6149 -7617 790 6152 -4445 -348 5879 -7582 1363 7957 -6051 -7523
1073 -7523 9255 1212 -11755 4263 3079 -5701 20 2462 -7361 1001 5445 -10624 -1261 7985
1087 7985 -4159 -8788 6546 1211 -8378 3108 386 -4296 2189 2766 -8019 2660 6664 -9213
1101 -9213 -1812 8430 -1490 -7592 5760 1256 -4078 3808 -1670 -3881 5225 3593 -10174 2468
1115 2468 8620 -6795 -4050 5128 -38 -4338 3951 -3926 -3212 6033 -3297 -7922 3396 4776 -9675
$$ packed form
1020A0354j9340r96J5740j0125l924R199m675o376J6493r119j2808J8300K847
1033E570j7944N011J6383j4418q34R678q349J362R923r515p553K1631p106j5919
1047a2080J4039O943j3817J723J1329j2239N248N835j2032J578J4477j0717j1641
1060a1354K0577l074j3766Q407N362j0597M097O227j3461Q945O594j4008j472
1073g523J6778q043j2967J6018j184q780N721K442r823Q362M444j6069R363R246
1087G985j2144m629J5334n335r589J1486k722m682O485N77j0785J0679M004j5877
1101i213P401J0242r920o102J3352m504n334P886n478k211R106j632j3767J2642
1115B468O152j5415K745R178n166m300Q289p877P14R245r330m625J1318J380j4451
$$ plain form
1130 -9675 -609 4546 -5145 -3031 1614 -3726 -3076 5413 -6335 -4677 6267 -1289 -8128 2351
1144 2351 4525 -7266 915 3163 -3091 563 3371 -3633 -551 9156 -4093 -2973 8245 2791
1158 2791 -4648 3990 5767 -3160 4828 3153 -1761 4370 6717 -4385 -224 10981 -2308 -2888
1172 -2888 6565 3250 -3111 3687 1324 -4440 5631 737 -5831 2323 6731 -6868 -4021 6740
1186 6740 -2939 -4256 2219 -93 -4454 3484 -1846 -7110 5338 1148 -7699 -116 7300 -5149
1200 -5149 -3516 4489 -2106 -591 3485 -1332 -3296 7819 727 -6349 5937 4893 -4441 643
1214 643 7546 -2794 700 5164 -2363 375 5523 -976 -4676 8158 392 -6555 3597 3601 -5809
1229 -5809 -1474 3984 -4952 -125 1708 -5884 -2288 4380 -4571 -8568 5458 -88 -7597 -814 1316
$$ packed form
1130i675R066N155r691K114M645n340O50Q489j1748J658J0944p556o839J0479
1144B351K174j1791Q181K248o254L654K808p004L082R707j3249J120J1218n454
1158B791p439Q638J777q927P988j675m914O131K347j1102M161J1205j3289n80
1172b888R453l315o361O798k363n764J0071m894o568Q154M408j3599K847J0761
1186F740r679j317O475k312m361P938n330n264J2448m190q847P583P416j2449
1200e149J633Q005o595J515M076m817j964J1115p092p076J2286j044r334N084
1214F43O903j0340L494M464p527K738N148o499l700J2834p766o947J0152Mr410
1229e809M335N458q936M827J833p592L596O668q951l997J4026n546p509O783K130
$$ plain form
1244 1316 -4856 -878 1174 -7127 1715 3947 -5610 -4035 6387 -535 -5929 4668 926 -2173
1258 -2173 2625 2542 -3174 3520 5044 -5280 2763 6939 -1804 -2231 7063 1143 -2772 5358 899
1273 899 -1104 3798 2313 -4345 3712 4669 -5880 755 5091 -1585 -3674 4258 -878 -2732 3475
1288 3475 -2054 -2629 3355 1781 -5893 2632 4328 -4362 -152 4024 -77 -1103 5020 -733 35
1303 35 5854 -62 -964 5564 4692 -3220 4566 6382 -286 1988 4383 1707 2031 6203 -1354 1013
1319 1013 6989 274 -2600 4211 4127 -3424 2068 1415 -1461 982 473 -4248 -1131 4271 -5052 -3864
1335 -3864 1973 -1692 -5318 -671 -1351 -5909 754 -2622 -5246 -792 117 -6176 -3203 2158 -5244
1350 -5244 -3049 1409 -1702 -4576 975 -767 -3885 2336 -1303 -3337 1731 2401 -5059 -992 4516
$$ packed form
1244A316o172L978K052q301Q842K232r557J575J0422o922n394J0597l742l099
1258b173M798q3n716O694J524j0324Q043M176q743m27R294n920l915Q130m459
1273H99k003M902j485o658Q057R57j0549O635M336o676k089P932n136j854O207
1288C475n529n75N984j574p674Q525J696q690M210M176m101j026O123n753P68
1303C5N819n916r02O528q72p912P786J816o668K274K395k676L24M172p557K367
1319A013N976o715k874O811q4p551N492o53k876K443n09m721L117N402r323J188
1335c864N837l665l626M647o80m558O663l376k624M454R09o293K973N361p402
1350e244K195M458l111k874N551j742l118O221l639k034N068O70p460M067N508
$$ plain form
1365 4516 -2576 -1518 1642 -315 -1670 2761 -1621 -3544 3849 -636 -4461 477 3173 -4666 -1532
1380 -1532 1697 -3699 -1066 523 -3039 -3346 2732 -3051 -5107 2529 -777 -4998 -1077 1714 -4431
1395 -4431 -702 742 -4108 -255 1604 -3306 -3302 4666 -1557 -4128 2555 1092 -2505 402 2273 -3111
1411 -3111 2354 2663 -3244 293 3978 -1194 -2597 5019 -260 -1718 2861 1336 -2298 1510 2548
1426 2548 -3530 2239 2487 -2881 -214 3961 -1827 -2964 4191 -838 -1836 1596 641 -2545 1493 1115
1442 1115 -4721 1984 2572 -2886 -1621 3864 -1131 -2515 2769 -1171 -487 2354 -6 -3266 3183
1457 3183 2169 -4133 979 2812 -855 -1141 3305 -1001 -942 3391 -1372 -764 2985 1129 -3211 2915
1473 2915 2779 -2701 1221 2038 -307 -311 3085 -1319 170 3429 -1291 -1162 2686 1367 -2733 2500
$$ packed form
1365D516p092J058L160j957j355M431m382j923P393m485l825M938K696p839L134
1380a532L229n396K633J589l562l07O078n783k056P636l306m221L921K791o145
1395d431L729J444m850L853J859m910MP968o223k571O683j463l597K907J871n384
1411c111N465L09n907L537L685n172j403P616n279j458M579j525l634L808J038
1426B548o078N769K48n368K667M175n788j137P155n029r98L432r55l186M038l78
1442A115n836O705N88n458J265N485m995j384N284l940O84K841k360l260O449
1457C183j014o302N112J833l667k86M446m306N9M333m763O08L749j856m340O126
1473B915j36n480L922Q17k345mL396m404J489L259m720J29L848j319m100N233
$$ plain form
1489 2500 1962 -1748 971 1381 -777 403 3144 -2011 22 3188 -866 -1492 2003 1376 -2343 2184
1505 2184 1021 -1196 1279 1477 -1248 294 3094 -2011 789 3354 59 -1018 2434 2147 -823
1520 -823 3009 908 199 3183 2480 -916 1606 4404 -473 1741 3428 1379 586 3085 1058 13
1536 13 3933 534 -97 2611 2658 -1432 1120 3142 -1585 851 1563 -256 -394 1818 -1566 -1814 2318
1553 2318 -1250 -2279 463 960 -3427 -590 178 -3095 -558 -567 -2449 -1855 1402 -2846 -2914 1298 -1500
1570 -1500 -2439 -448 391 -3034 137 254 -3150 56 489 -2209 -1434 2433 -2232 -2167 1538 -697 -1744
1587 -1744 -32 254 -2731 1339 47 -3208 -108 811 -2751 -2273 1595 -2621 -2258 515 -1752 -2848
1603 -2848 -268 -704 -4057 475 -682 -3506 -761 615 -3329 -2818 1937 -2380 -1633 499 -785 -1940
$$ packed form
1489B500n38l710K719M10k158J180K741n155K033L166m054o26L495o27l719M527
1505B184j163k217K475J98k725J542K800n105K800K565l295j077L452k87k970
1520h23L832k101p09K984p03l396K522K798m877K214J687k049p93K499k027j045
1536A3L920l399o31K708M7m090K552K022m727K436P12j819j38K212l384k48M132
1553B318l568j029K742M97m387K837P68l273K537rj882N94L257m248o8M212k798
1570a500r39J991Q39l425L171J17l404L206M33k698P75L867m665O5L705k235j047
1587a744J712K86k985M070j292l255L100R19l562M78L868m216L63K773k267j096
1603b848K580m36l353M532j157k824K745J376l944N11M755m317P47K132j284j155
$$ plain form
1619 -1940 1061 -157 -3136 1926 1077 -2008 38 2712 -706 -718 2522 -801 639 2239 -44 -1166
1635 -1166 3009 1535 -2007 1741 1499 -505 379 2108 -1204 27 2125 -1106 -245 1633 185 -2088
1651 -2088 2022 617 -2118 1062 575 -731 -173 1522 -1481 56 1824 -1433 -504 1472 574 -1748
1667 -1748 2269 876 -1091 1657 1021 -192 782 2294 -767 1179 2353 -273 103 1858 1139 -1097
1683 -1097 2409 846 -465 1397 998 -524 299 1578 -1868 655 1087 -1241 -1295 563 3 -2034
1699 -2034 731 -1224 -1140 356 -581 -2355 -423 634 -2974 -634 -128 -1138 -1570 -410 -1351 -1677 1084
1716 1084 -1530 -1236 -17 157 -1588 -629 381 -1796 319 -41 -1014 -932 966 -858 -1267 1080 -1007
1733 -1007 -440 183 236 -1612 696 483 -1540 716 471 -503 -163 1508 -1093 -23 1768 -342 -80
$$ packed form
1619a940L001j218k979N062q49l085K046K674l418j2L240l323J440J600k283j122
1635a166M175j474l542L748k42k004Q84J729l312J231K098l231Q61J878j448k273
1651b088M110j405k735L180m87j306N58J695l003J537J768l257R29J976q98k322
1667a748M017j393j967K748o36j213R74J512l061J946J174k626L76J755p19k236
1683a097L506j563j311J862l99j522Q23J279l446K523M32k328n4J858n60k037
1699b034K765j955Q4J496r37j774J932J057l608K340N06j010m32J160r41l26K761
1716A084k614K94J219J74j745R59J010k177K115l60r73Q2J898j824m09K347k087
1733a007N67O23N3j848K308k13k023K256k45r74L40J671k601J070J791k110K62
$$ plain form
1750 -80 1017 1254 -596 1596 842 -113 1568 929 198 792 2846 -181 713 2094 456 709 1511 1205
1768 1205 -386 2353 836 -358 1616 933 -429 -93 2311 -713 148 1119 -465 -72 950 -66
1784 -66 -1390 1899 208 -1227 631 1249 -471 -461 1518 -1226 553 1064 -249 -316 1683 533 -1316
1801 -1316 2096 597 -460 968 1358 -563 524 1974 -920 664 1358 303 -254 1319 152 -1037
1817 -1037 1793 -91 -1002 -177 888 -1178 -418 607 -1706 -151 177 -998 -1892 694 -650 -2009
1833 -2009 52 -631 -971 -578 417 -1936 -173 465 -1568 -101 722 141 -1027 1399 168 -297 1285
1850 1285 249 -72 939 1642 -614 896 1555 -170 272 1023 247 -580 1693 -103 -375 661 -137
1867 -137 -668 -332 490 -1700 -84 -58 -1565 -1193 -616 -899 -1754 158 -1614 -1541 -642 -866 -1359 -781 -256
$$ packed form
1750h0J097K37j850K192p54r55J681o39p31N94K054l027Q94J381j638K53Q02l06
1768A205j591K739j517j194J974o83j362L36K404l024Q61R71j584L93J022j016
1784f6j324L289j691j435J858O18j720J0J979k744J779N11j313o7J999j150j849
1801a316L412j499j057J428L90j921J087J450k894J584O94j055n57J573j167j189
1817a037K830j884r11Q25J065k066P60J025k313J555L28j175q94K586j344j359
1833b009K061o83l40L93R95k353J763O38k033J467Q23n81j168K426j231m65J582
1850A285j036l21J011P03k256J510O59j725M42P51p76q27K273j796k72J036p98
1867a37n31L36Q22k190J616K6j507L72N77k83q55J912j772P3Q99k24m93N78N25
$$ plain form
1886 -256 -2347 40 -105 -873 -674 47 -274 -512 1198 -584 112 955 771 -71 923 1383 -197 1264
1904 1264 878 833 621 1153 133 200 1470 -647 246 306 466 -725 101 -88 -1004 370 -998 -1338 -1019
1923 -1019 -75 -1566 -1455 -894 -1689 -979 -944 -1004 -1893 -259 -1048 -1528 -584 -805 -813 -924 -31 -1427 -193 331
1943 331 -1055 -438 288 295 -824 676 44 -66 716 -114 69 217 1339 -463 447 732 -171 369 262
1962 262 95 -495 1504 -219 -413 358 -30 -75 -45 470 -1064 599 378 -415 -143 504 88 -466 1399
1981 1399 -308 -177 778 956 46 413 1212 -354 1188 1012 567 652 1562 517 274 1759 452 974
1999 974 1072 1061 260 1086 1180 -676 983 1026 767 128 1270 -33 249 1538 -326 -110 123 858 -684
2018 -684 554 428 -674 444 378 -215 -334 1347 -15 -247 780 55 343 351 640 -501 813 575
$$ packed form
1886b56k091K387j45p68J99P21l21k38J710j782O96Q43j84q42R94M60j580J461
1904A264l86m5k12N32j020O7J270k117Q93O0J60j191Q26j89r16J374j368l40L19
1923a019R44j491J11N61p95P10L5o0q89J634p89m80R44k21qj11Q93j396J234N24
1943C31j386O17P26Pj119J500o32j10P82q30J83J48J122j802R10K85r03N40j07
1962B62j67n90J999j723j94P71l88m5L0N15j534J663k21p93K72O47m16n54J865
1981A399j707J31R55J78r10L67P99j566J542j76m45Q5R10j045k43J485j307N22
1999I74R8j1q01Q26R4j856J659M3k59o39J142j303K82J289j864K16K33P35j542
2018f84J238j26j102J118o6n93j19J681j362k32J027p25K88QK89j141J314k38
$$ plain form
2036 575 -93 561 355 118 -540 1250 -305 -24 510 -268 -188 -310 497 -907 355 -277 -591 -486 -482 -845
2056 -845 -1048 258 -1167 -707 -577 -713 -817 -371 -109 -1332 35 -461 -952 -643 -33 -600 -876 260
2074 260 -683 120 -195 -119 -467 -53 89 -502 637 -178 23 -92 189 -215 -515 370 -500 -88 -111 -97 -541
2095 -541 -159 -137 -914 41 -766 -538 -769 -124 -717 -478 -240 -863 -241 -587 249 -837 82 -376 -242 317
2115 317 -414 485 -33 698 -314 425 382 355 581 300 697 416 1262 330 608 1284 272 928 495 852
2135 852 470 1046 563 63 472 376 445 122 952 -404 358 331 -31 181 56 312 -633 465 -339 -66
2155 -66 -24 -255 -123 -656 520 -672 -9 52 10 -335 74 10 -693 409 -110 -193 261 101 -36 -262 453
2176 453 -588 -19 24 -205 -549 -46 159 -715 186 -331 -618 -467 90 -917 -806 123 -530 23 -407 -210
$$ packed form
2036E75o68O54k06k37o58J790j555K81N34p78Q0j22Q07j404J262o32l14J05Ml63
2056h45k03J306j425M60J30j36j04M46K62j223J367m96m91L09O10n67k76J136
2074B60r43Q03l15P6l48M14J42n91J139q15K01j15K81m04l00Q85q70M12k3J4m44
2095e41L82K2p77R55q07K28k31O45n93K39K38o23O22l46Q36j086R19m58J34N59
2115C17p31Q99n18P31j012P39m3k7K26k81L97k81Q46r32K78O76j012O56m33L57
2135H52l82N76m83n00M09r6O9l23Q30j356P62k7l62K12j25K56r45J098q04K73
2155f6M2k31J32n33J176j192O63O1m2l45M09o4p03J102n19q3M54j60j37k26P15
2176D53j041N69M3k29l44N03K05q74R01n17k87J51N57j007J11R29o53N53m30J97
$$ plain form
2196 -210 -922 61 -274 -772 111 -347 -209 -200 600 -644 -163 341 -207 87 143 436 -394 598 425 -85 550
2217 550 92 226 -13 1076 -173 304 368 -147 -170 30 483 -522 490 -61 -352 -86 -107 -104 -595 212
2237 212 -736 -210 -361 -330 -228 -38 91 -601 347 -358 -314 -356 84 -67 -386 522 -467 397 308 295 -39 265
2259 265 401 91 993 10 369 104 599 215 135 796 12 491 251 675 250 374 280 1 668 296 289
2280 289 -52 287 35 227 364 -63 375 31 360 -191 552 99 105 322 17 342 -249 172 -189 315 -10
2301 -10 -178 278 -160 330 -285 337 -146 -175 42 -185 -6 -512 7 -765 300 -289 -441 -298 -413 -457 -304
2322 -304 106 -413 -230 -113 -733 -217 -122 478 -510 -17 -157 -97 233 -299 179 48 572 -310 604 251 376
2343 376 121 203 358 -25 672 -175 -22 435 223 -109 -74 291 -521 342 -281 -232 -408 -175 -460 -753 -279
$$ packed form
2196b10p12R83l35m98Q83m58J38RQ00j244M81N04n48K94N6K93q30R92j73n10O35
2217E50m58J34k39J089j249M77O4n15k3K00M53j005J012n51k91K66k1Lm91Q07
2237B12r48N26j51L1J02J90J29o92R48p05M4m2M40j51l19R08r89Q64q9j3l34L04
2259B65J36l10R02r83L59k65M95l84q0O61p84M79k40M24m25J24r4k79O67l72p
2280B89l41L39k52J92J37m27M38l44L29n51P43m53OK17l05L25n91M21l61N04l25
2301a0j68M56m38M90o15O22m83k9K17k27J79n06N19p72J065n89j52J43j15m4J53
2322c04M10n19J83J17o20N16R5O00r88M93j40O0L30n32M78j31N24q82R14l53J25
2343C76k55Q2J55l83O97q47J53M57k12l32L5L65q12Q63o23M9j76K33k85k93M74
$$ plain form
2364 -279 -882 -252 -572 -483 -457 -514 -308 -859 -208 -219 -212 -586 -159 -179 -625 383 -200 200 -15 498 -66 578
2386 578 738 -208 359 386 851 107 812 484 400 850 120 312 185 947 -106 146 120 75 -5 -74 16 -625
2408 -625 158 -719 -352 43 -296 -573 -682 -361 -848 -173 -389 -612 -689 -230 -188 -771 199 -447 -76 -104 69
2429 69 -103 151 527 -90 449 681 678 350 520 918 498 1143 401 952 547 775 194 435 1034 389 950
2450 950 333 595 150 493 380 -275 140 -244 52 -328 118 -310 9 13 -615 21 -567 182 -441 144 -274
2471 -274 -566 -319 -322 228 -377 51 -410 41 -148 -103 52 1 413 -74 294 187 386 37 -117 337 83
2492 83 417 59 215 -104 287 332 -143 229 -150 506 -19 -61 198 10 142 -93 79 -359 331 -251 -131
2513 -131 -6 -130 104 -442 136 -353 272 -344 -101 -6 61 68 -463 191 3 123 125 -298 -81 -115 167 -523
$$ packed form
2364b79o03O30l20Q9K6n7K06n51O51j1Pl74M27k0m46J008n83M00k15N13n64O44
2386E78J60r46N67K7M65p44P05l28q4M50p30J92j27P62j053K52k6m5q0o9R0o41
2408f25P83q77L67L95l39k77j09L21m87O75k16k23p7M59M2n83R70o46L71k8J73
2429F9j72K54L76o17N39K32ll28J70L98m20O45p42N51m05K28n81K41N99o45N61
2450I50o17K62m45L43j13o55M15l84K96l80M46m28L19Mo28O36n88P49o23N85m18
2471b74k92K47lN50o05M28m61M51j89M5J55n1M12m87L68j07J99l49j54M54k54
2492H3L34l58J56l19L91M5m75L72l79O56n25m2K59j88J32k35J72m38O90n82J20
2513a31J25j24K34n46N78m89O25o16K43R5O7Pn31O54j88J20Km23K17l4K82o90
$$ plain form
2535 -523 74 -298 -106 -188 -149 -164 -197 -114 -627 -501 -614 -197 -699 -392 -316 -796 -478 -542 -518 -443 -277 -499 -386
2558 -386 -12 -324 -141 -302 206 -334 274 71 -199 391 244 375 227 514 174 196 434 332 688 394
2578 394 250 93 683 525 122 719 534 440 -78 227 -130 -89 152 36 -17 11 99 -304 198 23 135 52
2600 52 17 -165 -143 126 -266 -124 24 -226 -305 -86 412 -115 551 160 -122 -84 94 71 111 216 137 307 143
2623 143 164 69 350 552 -28 418 249 364 35 300 267 -175 274 37 147 179 160 20 106 144 -203 140
2645 140 -200 59 -370 183 -289 -18 -83 -371 166 -383 85 -155 108 -165 -209 4 -166 -12 -315 327 -386
2666 -386 -29 -26 -257 145 -305 190 -311 93 -109 -329 -159 -110 321 -261 7 -158 147 -136 -229 149 -186
2687 -186 465 -310 124 153 320 144 -88 51 -166 426 -142 67 -68 487 67 -225 256 25 309 -216
$$ packed form
2535e23N97l72J92q2L9j5l3Q3n13J26j13M17n02L07P6m80L18o4K4P5J66k22J13
2558c86L74l12J83j61N08n40O08k03k70N90j47J31j48K87l40K2K38j02L56k94
2578C94j44j57N90j58m03N97j85r4n18L05l57M1K41j16n3K8Q8m03N02j75J12q3
2600E2l5j82K2K69l92J42J48k50p9K19M98n27O66l91k82L8J78k3M0J05p9J70j64
2623A43K1r5K81K02n80M46j69J15l29K65l3m42M49k37J10L2j9j40Q6L8l47L43
2645A40l40K59m29N53m72K71o5k88N37n49M68k40K63k73m4K13j70J54l03O42p13
2666c86L57Lk31M02m50M95n01M04k02k20J70M9M31n82K68j65L05k83r3L78l35
2687a86O51p75M34K9J67j76k32J39k17N92n68K09j35N55m20k92M81k31K84n25
$$ plain form
2707 -216 136 -115 76 -51 -371 15 -168 196 -64 85 -294 -307 -180 -379 -35 -360 -109 -343 -218 -386
2727 -386 -163 -73 -588 210 -354 110 -81 216 -206 -3 297 77 488 237 480 223 311 481 224 363 632
2748 632 523 145 554 264 326 553 130 271 542 452 -202 422 246 215 199 -29 29 -348 113 -443 -244 -60
2770 -60 -241 -239 -277 -139 -325 -221 -469 -383 -118 -255 -174 -431 86 -380 -104 -111 53 -189 31 333 -260 218 -21
2793 -21 -8 109 522 25 112 334 -274 263 279 429 -276 165 196 -132 493 -61 179 123 253 -18 -173 269
2815 269 -122 -49 24 75 -268 106 75 -305 240 -148 -107 -438 21 -136 -150 -315 -330 131 -108 82 -553 3
2837 3 -109 -401 -88 -138 -278 -193 80 -251 -442 -151 -116 -180 -42 14 -210 225 -188 -292 -36 -128 -134 -304 -12
2860 -12 6 -174 -171 -91 -60 -37 106 -93 168 186 -87 57 0 57 -107 60 -358 288 239 17 15 -39 83 -91 327
$$ packed form
2707b16L52k51J91j27l20L86j83L64k60J49l79j3J27j99L44l25K51k34J25j68
2727c86K23R0n15P98n64M64j91K97m22K03L00k20M11k51K43k57Q8J70k57J39K69
2748F32j09l78M09k90O2K27m23J41K71r0o54O24j76l1j6k28N8l77M61n56J99J84
2770f0j81Kl8J38j86J04k48Q6K65j37Q1k57N17m66K76pJ64k42K20L02n93M78k39
2793b1J3J17M13m97Q7K22o08N37J6J50p05M41L1l28O25n54K40n6J30k71j55M42
2815B69l91P3P3N1l43L74l1l80N45l88M1l31M59j57j4j65j5M61k39J90o35N56
2837Cj12k92L13n0j40Q5K73l31j91K91L5o4J38N6k24M35m13j04K56r2oj70K92
2860a2J8j80LQ0L1K3J43j99K61J8k73J44n7N7j64J67m18O46m9k22kn4J22j74M18
$$ plain form
2885 327 -181 226 232 54 220 -97 171 -346 102 121 75 25 -43 -153 148 21 -102 98 -116 31 -181 114
2907 114 285 -141 200 -288 233 -228 -43 155 -212 196 -266 -2 148 98 -278 327 130 -298 146 -2
2927 -2 -107 -247 259 -168 233 159 -330 301 161 266 -79 426 190 90 75 252 118 -46 377 -119 370
2948 370 187 63 168 -86 229 -130 133 96 -146 -120 -220 -103 -158 104 -86 101 33 2 -168 -221 -13 -291
2970 -291 73 -238 -44 -63 -104 -300 -98 -94 -413 -119 -247 -65 -385 -333 -138 -98 -158 -271 -9 -242 159 -380
2992 -380 -352 374 99 312 25 275 57 403 208 -75 526 -9 287 192 319 -54 -18 314 -128 244 -246
3013 -246 130 -294 185 103 -232 174 -304 -71 -229 213 -249 -384 -94 -361 -220 -43 -190 -346 -30 -163
3033 -163 -394 -155 81 120 -340 120 -402 183 309 -72 311 332 511 274 518 23 414 557 483 336 187
$$ packed form
2885C27n08M07Oj78J66l17K68n17M48J9m6n0o8j10L01j27j23K00k14J47k12K95
2907A14J71m26L41m88N21m61J85J98l67M08m62K64J50n0l76O05j97m28M44j48
2927bj05j40N06m27M01p4m89O31j40J05l45N05k36j00j5J77j34j64M23m96M89
2948C70j83j24J05k54L15l59K63l7k42K6j00J17n5K62j90J87o8l1j70n3K08k78
2970b91L64l11J94j9m1j96K02Ml19K94j28J82l20N2J95M0o0j13K62k33M01n39
2992c80K8P26k75K13k87K50k18L46j95k83O01n35K96r5J27l73L6L32m42L72m90
3013b46L76m24M79q2l35M06m78K33j58M42m62j35K90k67J41J77j47j56L16j33
3033a63k31K39K36L9m60M60n22N85J26l81L83K1J79k37K44m95L91J43p4j47j49
$$ plain form
3054 187 416 233 600 427 363 502 431 275 -104 458 -112 278 13 116 35 -118 192 -590 177 -388 -325
3075 -325 -153 -114 -364 -584 -301 -598 -257 -144 -437 -339 -374 -319 -240 -203 -143 -108 -335 -27 51 -157 83 -17 353
3098 353 76 392 64 211 134 -42 302 307 326 -34 663 57 439 280 -274 62 218 156 -235 -119 -194 -224
3120 -224 -61 -206 -192 -429 123 -333 -225 -60 -608 -37 -266 -433 -511 -217 -318 -281 -182 -380 -124 -241 -36
3141 -36 -358 -30 -20 -121 117 151 191 -36 461 -240 -106 28 166 -60 284 229 -126 384 -41 12 30 200
3163 200 239 -302 166 -189 137 335 33 -60 82 52 -391 260 363 -205 -244 75 44 132 398 -52 32 -4 130
3186 130 -54 141 243 -62 481 68 205 -119 433 42 19 330 -15 103 38 273 16 57 316 -188 235
3207 235 0 -266 -210 176 -300 -333 -35 -140 -165 -541 177 -351 134 -216 -503 -23 68 -191 -237 35 -409 109
$$ packed form
3054A87K29j83L67j73o4J39p1j56l79N62n70L90k65J03q1j53L10p82P67n65O3
3075c25J72L9k50k20K83k97L41J13k93R8l5N5P9L7O0L5k27L08P8k08K40j00L70
3098C53k77L16l28J47p7j76L44NJ9l60O97o06L82j59n54L36J56o2l91J16p5l0
3120b24J63j45J4k37N52m56J08J65n48N71k29j67p8K94j01L7R9j98K56j17K05
3141c6l22L28J0j01K38L4M0k27M97p01J34J34J38k26L44n5l55N10m25N3J8J70
3163B00L9n41M68l55L26J98l02r3J42l0m43O51J03n68l9L19l1Q8K66m50Q4l6J34
3186A30j84J95J02l05N43m13J37l24N52l91k3L11l45J18o5K35k57M1K59n04M23
3207B35k35k66N6L86m76l3K98j05k5l76P18n28M85l50k87M80R1k59m6K72m44N18
$$ plain form
3229 109 437 -65 -113 114 -104 -66 440 -17 -117 26 396 48 320 437 -50 297 64 224 -12 237 193
3250 193 -235 237 -5 -87 -219 404 92 -22 241 -141 -43 -114 -201 -146 138 -26 -189 147 -323 -293 -331 -34
3272 -34 -86 -205 14 -351 120 -165 -220 -133 399 65 -217 -21 42 60 66 65 30 145 364 -36 -55 -9 47 -69 349
3297 349 -168 143 151 -158 -7 -55 180 -319 -46 107 -156 -209 -172 -278 -277 158 -202 -168 -35 -111 -80 -29 -13 -289
3321 -289 -36 -263 -37 75 180 -231 143 142 -212 169 -57 -30 -221 -146 235 -229 31 383 -109 -100 251 89
3343 89 -217 292 -116 347 -9 113 168 149 130 159 339 -151 3 -14 100 228 57 193 -159 91 170 -151
3365 -151 -347 115 -29 -545 265 -147 24 -232 239 -463 -217 129 -147 -71 170 -103 -170 213 18 -340 94
3386 94 -18 -78 -93 346 -46 110 412 -60 72 243 209 -243 265 144 -93 18 46 -5 87 198 -377 141
$$ packed form
3229A09L28n02m8K27k18L8N06m57j00J43L70l48K72J17m87L47k33J60k36K49m4
3250A93m28M72k42q2j32O23l12j14K63l82R8p1q7N5K84j64j63L36m70L0l8K97
3272c4n2j19K19l65M71k85n5Q7N32l34k82J96O3J8Ojl5J15K19m00j9M6N6j16M18
3297C49n17L11Ql09J51m8K35m99K73J53k63n3L7j06JM35l60L4J33p6L1N1J6k76
3321b89K53k27K26J12J05m11L74jl54L81k26K7j91P5L81m64K60L52m92RL51j62
3343H9l06N09m08M63l56J22N5j9j9K9J80m90J54j7J14J28j71J36l52K50P9l21
3365a51j96M62j44n16Q10m12J71k56M71p02K46L46k76P6K41k73o7L83j95l58M34
3386I4j12o0j5M39l92J56L02m72J32J71l4m52N08j21k37J11K8n1R2J11n75N18
$$ plain form
3408 141 162 69 1 78 65 -96 216 140 -223 341 161 -200 60 -30 50 -47 99 -15 -117 2 -249 -240 80 -232
3432 -232 -350 13 -25 -490 -169 303 -272 45 -569 -248 257 71 -533 -216 247 -132 -4 -144 68 -220
3452 -220 -84 -341 -105 -51 -176 -264 -268 136 -295 -53 152 -53 59 -348 65 -10 -331 -101 -284 -18 103 -263
3474 -263 -169 136 -259 -320 132 4 61 -68 75 -280 302 439 -83 212 165 73 -104 525 -144 261 67 47
3496 47 317 -149 29 -258 397 366 24 76 322 12 -26 314 -61 16 270 220 151 249 375 -453 266 181 -56
3519 -56 79 64 -211 50 256 -23 75 391 38 22 178 89 -94 508 78 78 277 1 148 257 313 -27 105
3542 105 146 122 83 412 168 -253 225 -120 -81 399 121 -60 108 136 -249 -81 47 57 -31 -76 -204 29 17
3565 17 -116 24 84 102 -275 -40 93 -166 -104 -145 -71 -102 246 -143 -210 114 -206 -342 -129 82 -60 22 105
$$ packed form
3408A41K1r3o8P7j3j61L12p6l63N64j80l61K60r0Q0r7J46j14j02J19k51RL20l12
3432b32j18L63l8m65L21M72n75L17o14L21N05j86o04L17M63l79J28j40K12k88
3452b20J36k57K36N4j25q8mM04m31K42K05k05J12m07M13p5l21K30j83K66J21l66
3474b63R4L05l95o1M52j28N7j29J43l55N82J37n22K95m7r2j77O29o69M05j94k0
3496D7K70m66J78k87O55l1l42N2K46l10l8L40l75P7K54n0o9R8J26q28P19q5k37
3519e6J35j5k75K61K06k79R8L16l53j6J56q9j83O02m30%J99k76J47J09N6l40J32
3542A05M1k4l9L29k44m21M78l45L9M80k78j81J68K8l85J68J28J0q8m5j28K33j2
3565A7j33J40O0J8l77K35J33k59O2m1P4l1L48l89o7L24l20j36K13K11j42Q2Q3
$$ plain form
3588 105 -84 -240 79 0 -304 175 -64 16 -15 -243 -94 -89 322 -256 122 -168 150 144 215 234 -78 292 -13
3611 -13 -278 173 -150 -111 -174 -62 -327 -127 -385 -230 87 140 -70 -284 -79 -278 -115 -85 114 -54 140 226
3633 226 -127 188 -92 -218 210 154 -17 207 186 20 166 21 215 -75 138 8 15 270 64 -73 -148 167
3655 167 -176 152 144 12 9 14 40 -1 253 39 -468 59 176 -9 -103 55 -203 283 -48 1 -29 165 -44 -72
3679 -72 146 -116 -409 -149 70 -50 -112 302 -316 -108 14 -107 266 -3 -28 -343 -28 85 -71 56 -8
3700 -8 -281 89 51 -149 365 -108 -41 -81 126 28 50 190 -125 251 63 81 -209 418 267 -158 207 77 228
3723 228 -121 170 -64 -104 271 -79 282 -68 54 -76 61 163 -263 139 -253 93 84 66 -19 101 -98 -299
3745 -299 -35 88 164 -266 141 -28 -88 144 -57 -41 -98 295 -202 132 434 -97 -198 88 304 -299 412
$$ packed form
3588A05j89j56L19p9l04M79k39Q0l1k28J49NM11n78L78k90L18oP1J9l12L70l05
3611a3k65M51l23L9o3J12k65K00k58J55L17N3k10k14K05j99J63L0J99j68J94Q6
3633B26l53L15k80j26M28n6j71K24k1j66J46j45J94k90K13j30PK55k06j37p5L15
3655A67l43L28qj32lNK6m1K54k14n07N27J17j85r4J58k58M86l31M9l0J94k09k8
3679g2K18k62k93K60K19j20o2M14o18K08J22j21L73k69k5l15L15J13j56J27o4
3700hk73L70l8k00N14m73O7m0K07r8K2J40l15L76j88J8k90O27j51m25L65j30J51
3723B28l49K91k34m0L75l50L61l50J22j30J37J02m26M02l92L46rj8q5J20j99k01
3745b99K64J23P6m30M07j69o0K32k01J6n7L93m97L34L02n31j01K86K16o03P11
$$ plain form
3766 412 -217 -36 60 308 241 104 96 -116 62 176 9 -161 201 63 42 263 203 310 162 57 -153 -37
3788 -37 254 -394 135 64 79 -209 15 54 -240 -35 93 -207 36 26 -36 -118 295 -96 -65 80 140 -203 297
3811 297 132 -29 48 -149 -156 -100 224 -140 -138 313 -114 110 -56 -88 -14 7 51 -78 250 17 -134 -67 213 -485
3835 -485 22 88 -3 240 106 40 51 55 -144 121 161 -62 95 -87 67 -132 76 221 37 275 190 -92 141
3858 141 273 -440 125 89 75 -267 134 136 182 373 243 -10 -87 185 -247 -22 322 121 -126 -45 102 -124
3880 -124 -5 -32 -301 60 -22 55 -58 222 -267 -84 3 -351 240 -87 -85 -237 362 163 -222 24 138 -30
3902 -30 27 80 -109 33 358 -331 -52 152 212 -251 2 60 -256 388 179 -100 -113 401 -150 -70 224 -268
3924 -268 -31 79 -108 -200 163 -26 -382 186 -49 212 142 -58 -221 180 96 -178 16 194 69 -296 280
$$ packed form
3766D12o29J81R6K48o7j37qk12J78J14j67j70L62j38k1K21o0J07j48j05k10J16
3788c7K91o48N29p1J5k88K24L9k94K05J28l00K43j0o2q2M13l91L1J45O0l43N00
3811B97j65j61P7j97pN6L24l64KM51m27K24j66l2P4K1M4j29L28k33j51O7K80o98
3835d85N07O6r1K43j34o6J1Mj99K65M0k23J57j82J54j99K08J45j84K38q5k82K33
3858A41J32p13N65l6j4l42M01KM6J91j30k53p7K72m32K25L44k01k47Q1J47k26
3880a24J19k7k69L61q2P7j13K80m89J83Q7l54N91l27Kj52N99j99l85K46J14j68
3902c0N7N3j89J42L25o89K79K04O0m63K53N8l16O44k09k79j3N14n51Q0K94m92
3924b68K37J10j87r2L63j89l56N68k35K61p0k00j63M01q4k74J94J78j25l65N76
$$ plain form
3945 280 -28 -60 24 -71 -100 114 179 -292 137 112 -6 -263 373 212 133 537 -17 141 67 -147 -229 133 -153
3968 -153 -192 -21 359 62 -90 -32 123 -124 61 92 -189 -106 24 -327 5 375 -291 111 149 -200 -72 128
3990 128 -140 81 103 -89 -155 153 186 -8 94 360 80 215 233 161 67 304 -124 130 352 -196 117 63
4012 63 234 -215 89 -32 112 242 162 -69 -132 147 -91 -316 434 -36 -180 394 51 -109 -10 -228 -159 -371
4034 -371 29 100 -10 260 -69 135 45 215 -228 197 149 -197 -111 -12 -344 156 321 8 -76 445 26 -115
4056 -115 227 -101 -368 247 -203 -337 114 -28 -150 158 457 -286 -79 100 36 79 64 -190 -237 194 46
4077 46 -540 -164 -3 -177 54 -47 6 209 238 -373 105 243 -246 -250 389 27 -79 232 59 -268 71 66
4099 66 -59 131 330 -79 -72 135 84 -50 233 57 -36 71 -39 30 61 268 -312 264 198 -317 -28 74 227
$$ packed form
3945B80l08l2Q4r5k9K14O5m71M29k5j18k57O36j61p9M04n54J58p4k14q2L62k86
3968a53l9J71L80k97j52N8J55k47J85L1k81Q3J30l51L32L70o66M02L8l49J28K00
3990A28k68K21K2j92o6L08L3j94J02K66k80J35J8p2r4K37m28K54K22n48L13n4
4012F3J71m49L04j21J44J30q0k31o3K79k38k25P50m70j44N74l43j60R9k18O9k12
4034c71M00P1j10K70l29K04r0J70m43M25m8l46Q6R9l32N00J65l13q4N21m19j41
4056a15L42l28k67O15m50j34M51j42j22L08K99p43K07J79o4M3j5k54m7M31j48
4077D6n86L76J61j74K31j01N3K03K9o11M78J38m89mO39l62j06L11j73l27L39n
4099F6j25J90J99m09PK07n1j34K83j76r3J07j10O9L1K07n80N76o6n15K89J02J53
$$ plain form
4122 227 -45 140 -32 62 164 8 96 49 96 -320 91 95 -141 27 106 58 -53 -342 161 167 152 -260 -33 146
4146 146 130 -243 -39 72 -323 -146 240 -72 0 40 -314 -144 4 50 -118 43 56 -317 32 -13 -3 17 146
4169 146 -106 -79 402 -326 100 -34 227 -271 109 42 -80 33 52 -203 -49 226 -308 10 237 -159 -48
4190 -48 14 -26 -240 86 45 -312 -179 -32 -6 -82 270 -239 -97 174 -46 -211 140 154 -177 -147 -91 -101 130
4213 130 475 -124 -23 372 -251 -65 84 87 135 101 -101 -115 199 -54 -145 34 -77 -239 -3 259 -329 117
4235 117 192 -78 17 133 14 -29 300 -79 -260 39 54 -137 34 179 -147 -72 186 -10 -281 60 -66 93
4257 93 220 -172 -44 107 138 -43 154 63 -476 -42 72 -275 -340 213 -127 -229 81 -137 -22 249 -57
4278 -57 -56 -141 19 -89 187 353 15 -84 124 -124 217 -9 -79 56 120 138 -362 399 161 -222 39 79 -90
$$ packed form
4122B27k72J85j72R4J02j56Q8m7M7m16M11Mk36J68P9m8j11k89N03Oj5m12K27J79
4146A46j6l73K04J11l95J77L86l12P2M0l54J70J48M6j68J61J3l73L49m5J0K0J29
4169A46k52K7M81p28M26j34K61m98L80o7j22J13J9k55J54K75n34L18K27l96J11
4190d8O2m0k14L26m1l57J33J47K6p6L52n09J42K71k20j65L51J4l31L0N6j0K31
4213A30L45n99J01L95o23J86J49LM8l4k02j4L14k53r1J79j11j62K36K62n88M46
4235A17P5k70R5J16j19m3L29l79j81K99J5j91J71J45l26P5K58j96k71L41j26J59
4257I3J27l92J28J51L1j81J97r1n39M34J14l47o5N53l40j02L10k18J15K71l06
4278e7Jq5J60j08K76J66l38r9K08k48L41k26p0J35O4J8n00P61k38l83K61M0j69
$$ plain form
4301 -90 -290 295 5 164 259 136 -20 98 -15 -185 235 -40 44 425 76 -106 -136 116 108 113 -21 56 -25
4324 -25 220 98 -262 141 -2 -87 33 -218 -228 -99 142 -214 -35 127 -95 -60 160 -56 -85 163 29 -9
4346 -9 -224 17 -168 -98 252 -204 -21 -144 21 -281 227 125 -78 129 -6 -50 26 -180 -292 176 130 -318
4368 -318 122 288 -150 -275 333 -94 -126 85 -74 -270 180 222 -132 104 162 -13 46 131 -6 -50 250 59
4390 59 -41 202 -72 -251 211 152 -228 112 56 150 43 -260 -186 -145 138 -225 -258 -88 -89 40 37 244 -56 86
4414 86 37 -156 126 205 -206 -197 305 -136 -184 -185 147 -39 84 98 -109 58 7 -89 115 132 -38 -276 273 106
4438 106 -28 233 -39 -176 -247 -151 -260 106 -39 -24 194 290 75 -96 278 195 -1 229 279 -41 19 98 -249
4461 -249 204 11 -4 10 -60 -101 258 266 -117 -85 -84 -59 47 335 9 -277 10 226 64 -44 299 -68 175
$$ packed form
4301i0k00N85k90J59R5j23j56J18j13j70M20k75Q4L81l49j82l0K52qNj34P7q1
4324b5K45j22l60M03j43q5J20k51j0J29K41l56J79J62k22L5K20k16k9K48j34l8
4346ik15K41j85P0L50m56J83j23J65l02N08j02k03K07j35m4P6k06j12M68m6m48
4368c18M40J66m38j25O08m27l2K11j59j96M50M2l54K36N8j75N9Q5j37m4L00j91
4390E9j00K43k74j79M62n9l80L40n6R4j07l03P4M1K83l63l3J70jJ29lK07l00J42
4414H6m9j93K82P9m11RN02m41m8jL32j86J23J4k07J67n1r6K04J7j70k38N49j67
4438A06j34K61k72j37p1R6j09L66j45J5K18R6k15j71L74q3j96K30N0l20O0P9l47
4461b49M53j93j5J4p0m1L59Ql83L2JK5J06K88l26k86K87K16j62j08L43l67K43
$$ plain form
4484 175 89 46 -177 97 -28 269 458 36 -79 -83 196 52 282 212 -385 295 209 -98 -239 226 163 -333
4506 -333 184 39 -6 73 -81 191 -26 97 -266 14 -47 -13 -87 135 336 -113 139 -135 -294 -93 194 -101
4528 -101 288 35 -348 81 131 -167 91 83 -46 -175 272 164 147 -207 -141 27 201 -79 -204 184 -36 -43
4550 -43 1 175 -244 -68 47 -193 -114 -29 109 -73 -15 64 -304 228 226 -300 -161 117 -129 42 426 -256 -251
4573 -251 45 158 5 158 -120 -110 153 250 -309 179 231 -171 8 164 -28 -384 103 186 -71 207 -21
4594 -21 -223 183 71 31 -76 174 21 -11 70 267 -257 -64 33 -198 84 138 -139 56 354 -304 -147 -169
4616 -169 -63 -111 219 -24 -266 33 -206 -373 43 -28 -143 64 186 -125 54 55 -10 -66 -25 -44 -22 176 -46
4639 -46 54 305 82 56 -21 160 -493 209 8 -182 16 5 -129 -230 -11 146 -86 -94 25 -280 -144 16
$$ packed form
4484A75q6m3k23K74j25K97J89m22j15mK79j44K30p0n97O80q6l07j41M65o3m96
4506c33N17j45m5P9j54K72k17J23l63K80o1L4p4K22K01m49K52k74j59K01K87k95
4528a01L89k53l83M29N0k98K58qj29j29M47j08j7l54O6J68J74k80j25L88k20p
4550d3M4J74m19J76J15k40P9Q5J38j82N8P9l68N32kn26J39K78k46J71L84o82N
4573b51K96J13j53J53k78J0K63R7n59M88N2m02J79J56j92l56M87Q3k57K78k28
4594b1k02M06j12m0j07K50j53l2Q1J97n24J93R7k31K82N4k77J95K98o58J57k2
4616a69J06m8L30k43k42K99k39j67M16p1j15K07J22l11J79Jo5n6M1j9K2J98k22
4639d6J00K51k23k6p7J81o53P02k01j90J98j1j34j01K19J57k32qJ19l05J36J60
$$ plain form
4661 16 -76 -57 -227 -176 38 129 -210 -179 264 -77 -131 218 20 -198 -92 -10 44 -68 67 -77 -41 136 139 -160
4685 -160 196 -177 -69 158 53 -9 176 67 -171 247 116 -165 7 -70 -226 -6 178 -266 230 -147 -78
4706 -78 -246 26 151 -257 142 73 -214 36 87 -64 19 332 -179 28 -123 17 -143 -87 128 -203 -19 -34
4728 -34 -106 -93 171 97 -101 -44 -71 177 89 83 -303 208 128 -150 309 14 106 -50 -59 17 279 114 -145 100 57
4753 57 -107 -189 220 -89 17 47 -266 -98 30 266 -156 -4 179 -22 -87 198 170 -377 114 35 -119 209
4775 209 -2 114 -94 98 -442 91 131 78 -57 69 -18 -301 210 65 -154 94 78 -210 135 139 -220 -104
4797 -104 19 59 -66 303 -171 4 222 -16 -134 155 87 79 6 128 -207 -77 -194 -254 8 119 -91 -276
4819 -276 10 -269 128 -48 -179 -57 23 59 -78 223 0 -163 -15 117 -5 -142 397 -7 -180 -41 -162
$$ packed form
4661A6r2J9j70N1K14R1l39L1M43l41n4L49j98k18J06Q2N4j12J35j44L6J77Lk99
4685a60L56l73J08K27j05o2J85j09k38M18j31k81J72p7j56K20J84m44M96l77O9
4706g8j68K72J25m08L99o9k87K50N1j51Q3L13n11K07j51J40j60N6K15l31J84j5
4728c4p2J3K64p4j98N7k7K48q8ol86N11q0k78M59k95R2j56rP6K62j65k59K45m3
4753E7j64q2M09l09J06L0l13J68J28K36m22J52J83k01o5K85k8n47M91p9j54L28
4775B09k11J16k08J92n40N33M0n3j35J26q7k83N11j45k19K48j6k88L45Ml59J16
4797a04J23M0j25L69m74J75K18k38j18K89o8qp3J22l35J30j17o0K62J11k10j85
4819b76K86k79L97j76j31J22Q0L6j37L01k23j63J48J32j22j37N39m04j73J39j21
$$ plain form
4840 -162 -205 40 -117 -252 -24 172 -258 94 297 177 -149 296 -84 -1 140 -103 -199 79 -65 -95 216
4861 216 -94 -94 -41 366 -208 -242 197 80 17 407 -154 -237 12 -83 63 -80 -33 52 -24 363 -162 75 -18 250
4885 250 -31 100 16 -205 184 4 -106 -194 44 -18 -188 -296 -237 -85 46 -143 53 184 262 106 164 12
4907 12 -299 0 384 47 69 404 178 296 144 223 82 52 -156 31 164 130 -64 116 73 -187 -100 270
4929 270 -21 -341 81 -113 -388 378 29 57 80 -66 -262 -171 15 -171 239 -96 -132 164 -41 -17 88 75
4951 75 -381 81 -52 -44 -141 118 27 -65 18 147 194 -127 371 254 -129 122 100 63 162 -45 -336 -21 49 -161
4975 -161 -29 -9 -85 -82 26 63 -13 -156 -115 -326 109 51 -132 112 -107 -44 -38 -252 -18 -182 57 -5 -82 54
4999 54 -51 198 98 80 -149 53 172 -188 -61 34 -164 119 43 48 -300 30 103 -243 -6 -130 -348 66
$$ packed form
4840a62m3K45j57j35K28J96m30L52K03j20l26M45l80Q3J41k43r6K78j44l0L11
4861B16l10%N3M07n74l4M39j17o3L90n61q3K49r5J46j43M7Q5p6L87n25K37r3K68
4885B50k81J31q4k21L89j80j10q8K38o2j70j08N9J52J31j89J96J31P8j56N8j52
4907A2l11K99L84l37K2L35k26J18j52P9j41l0k08J87J33l4j94J80m3k60Q7L70
4929B70k91l20M22j94k75P66l49K8K3j46j96R1J86j86M10l35l6K96k05K4J05j3
4951G5m56M62j33Qr7K59r1r2Q3J29M7l21M98j17l83K51k2l7R9k07k91L15P0k10
4975a61J32K0p6LJ08L7p6j43M1k11M35n8j83K44k19O3Ok14K34j64K39o2p7J36
4999E4j05K49j00j8k29K02J19l60J27R5j98K83p6Nl48L30P3l46K37j24k18M14
$$ plain form
5021 66 -126 -122 23 -12 -256 -174 303 -68 -140 170 -249 -114 154 176 -329 180 -28 -138 272 -161 -261 -184 73
5044 73 -74 112 41 285 -11 34 74 130 41 -178 -8 276 -11 -25 162 -28 93 -170 3 -198 33 181
5066 181 39 145 -16 24 8 40 -205 -321 46 152 -215 45 -154 -40 -150 143 -152 19 60 -114 -235
5087 -235 -2 203 11 407 -108 -39 222 147 42 7 61 -185 196 116 -85 182 236 139 -369 136 -124 175
5109 175 143 212 4 223 318 -135 124 -39 -200 246 126 123 -252 194 88 -220 68 103 -79 -18 307 -251
5131 -251 -21 229 77 -13 93 51 -230 -20 105 15 295 -120 -78 -11 -44 -101 144 4 102 -10 52 127 -129
5154 -129 72 -42 99 -131 372 -4 87 325 -124 -22 -41 91 -108 123 -181 -143 323 -336 -133 50 -156
5175 -156 -39 56 -5 -120 -121 -218 -240 -297 -180 101 -165 52 -31 141 71 189 -121 110 160 -430 -84 102 -100
$$ packed form
5021F6j92MJ45l5k44Q2M77l71p2L10m19J35K68K2n05N09k08j10M10m33j00P7K57
5044G3j47J86p1K44k96M5M0N6q9k19J70K84k87j4J87j90J21k63J73k01K31J48
5066A81j42J06j61M0j6L2k45j16L67J06l67K60j99J14j10K93k95J71M1j74j21
5087b35K33K05j92L96n15O9K61p5j05l5N4k46L81q0k01K67N4r7n08N05k60K99
5109A75l2O9k08K19R5m53K59j63j61M46j20ll75M46j06l08K88L5j82O1L25n58
5131b51K30K50j52r0J06m2k81K10J25r0K80m15M2O7l3n7K45j40R8j12O2P5k56
5154a29K01j14J41k30N03l76R1K38m49J02j9J32j99K31l04L8M66o59K03J83k06
5175a56J17R5o1j15jr7k2n7J17K81k66K17q3J72p0J18l10K31N0n90L46J86k02
$$ plain form
5198 -100 -77 153 -290 101 193 0 -111 -229 174 -68 342 137 27 -172 -128 -121 -92 150 -109 78 -78 44
5220 44 124 232 109 -14 47 77 138 168 72 -187 -15 94 19 -32 124 47 -87 38 102 -43 60 -128 -102 -66
5244 -66 -55 -124 -58 231 -341 -56 -146 51 -55 191 -83 7 65 -95 21 -24 21 24 71 118 -295 -1 -29 126 -143
5269 -143 14 127 -11 229 -74 435 -28 -65 -125 193 78 -368 -217 63 254 0 62 -84 81 204 186
5290 186 -35 -5 38 -214 -87 -36 85 -32 -88 226 -168 34 -25 124 155 6 -170 -12 135 194 -130 -110 -161
5313 -161 115 16 -253 112 57 -32 -97 129 -32 -79 -87 16 -69 -82 -205 60 126 -67 3 -209 79 -123 49 240
5337 240 -18 84 56 -87 30 -181 231 -124 -131 220 -58 175 380 -111 4 81 227 -66 110 118 -64 -155
5359 -155 335 203 -188 124 34 -134 -65 27 -76 13 77 -399 223 16 -137 -117 -124 -187 194 105 -179 398 -132
$$ packed form
5198a00K3K30m43L91R2j93j11j18M03k42M10k05j10j99M4PK9K42k59J87j56J22
5220D4Q0J08j23j23O1L0O1L0r6k59J72J09p5n1J56p7j34J25O4j45J03j88K6L6
5244f6J1o9O6K89n72K85r0J97j06K46k74R0N8j60J16m5M5LM7M7m13K94k8J55k69
5269a43J57J13j38K40l03N09m63l7o0L18j15m46J51K80J91k54O2j46J65J23j8
5290A86k21L0M3k52J27N1J21j17n6L14l94K02n9J49L1j49j76J58J47N9l24K0n1
5313a61K76r9k69L65n5q9o5K26j61m7qJ03q5j3j23K65O6j93P0k12K88k02J72J91
5337B40k58J02k8j43J17k11M12l55pL51k78K33K05m91J15P7J46k93J76Qj82r1
5359a55M90j32l91L12r0j68O9R2j03Q9O4m76O22k07j53K0po3L81q9k84N77n30
$$ plain form
5382 -132 -172 -169 -311 140 -192 -26 178 -12 -274 -136 -61 156 240 -273 -48 104 -74 -277 -89 60 -149 47
5404 47 75 74 25 25 -112 -164 6 4 191 159 -78 36 21 41 99 104 -5 -17 -218 176 56 -157 -53 -72 -54 242
5430 242 158 -280 -4 151 -65 37 -68 49 -250 278 16 -36 130 -173 -20 106 192 -44 303 48 -96
5451 -96 391 189 -143 -45 142 -42 105 125 -124 -88 146 -81 -140 183 -58 -86 -98 -62 7 -312 -67 -128 -155 549
5475 549 -147 -139 140 -73 -131 6 -245 -86 -152 16 301 80 -165 -40 -2 -96 -90 -93 49 -159 107 -34 -4 136
5499 136 -117 -35 178 0 -269 -264 73 248 -422 -88 -197 -75 -300 -108 -124 -79 241 -99 -150 -208 -200 -272 -11
5522 -11 -124 58 -20 190 224 114 53 144 91 -122 78 -22 217 27 -235 223 58 38 -278 -8 -34 -31 -79 -132
5546 -132 201 36 19 -153 31 -38 -117 -289 -236 29 20 -76 37 -68 -112 212 26 -163 167 -17 152 6 -153
$$ packed form
5382a32m0Lj42M51l32J66K04j90k62J38P5K17Q4n13K25J52j78k03J88J49k09J96
5404D7K8jm9%j37n2J70kJ87l2k37J14j5K0N8Nj09j2k01L94j20k13J04j9J8K96
5430B42q4m38K76J55k16J02j05J17k99N28k62n2J66l03J53J26Q6k36L47k55j44
5451i6M87k02l32R8J87j84J47K0k49L6K34k27n9L23k41k8j2L6O9l19K45o1k7P04
5475E49o96QK79k13n8J37k51J59o6J68K85k21k45J25L8r4OlJ42k08K66j41L0J40
5499A36k53Q2K13j78k69NL37J75o70L34j09J22k25J92j6M5L20l40n1n8Qp2K61
5522a1j13J82p8K10L4j10o1R1n3k13K00j00K39j90k62M58j65k0l16K70k6Lm8n3
5546a32L33j65j7j72J84o9p9j72N3K65rr6J13j05m4L24j86j89L30j84J69j46j59
$$ plain form
5569 -153 -74 -39 -6 188 291 -159 -38 180 -171 34 262 -35 19 156 -4 -65 395 99 122 -32 210 -37
5591 -37 16 43 135 -29 -10 -66 -3 214 17 -122 273 6 -249 -191 95 -284 13 16 -353 13 49 63 134 -167
5615 -167 -234 -143 73 -53 -127 291 121 -145 95 28 -268 148 196 -40 -239 228 26 -220 -10 272 -15 137
5637 137 5 53 -44 -154 12 -6 104 64 93 -114 242 214 -110 70 -225 91 -229 36 -122 -124 402 35 48
5660 48 -101 -9 -139 152 -180 27 -11 -311 -76 -180 121 189 -123 149 -179 126 -2 149 154 -51 -173 -48
5682 -48 47 -40 49 -88 -151 107 -92 -342 -105 42 15 91 77 -50 -25 164 -24 -101 71 -81 22 18 44 -4 16
5707 16 -93 12 116 194 2 -97 191 104 -54 97 -101 -113 77 -81 -258 -192 97 -270 -79 -286 106 -76
5729 -76 -32 -41 45 -23 29 -97 90 214 -107 33 -121 -89 56 160 303 -21 -120 89 -122 -117 -151 -169 11 270
$$ packed form
5569a53P9L5L3J94J03m50J21K18l51K05K28k97N4J37j60o1M60k96K3j54K42k47
5591c7N3K7R2j64J9n6O3K17j97j39L95k67k55N8K86l79K97Ll69L66L6J4P1l01
5615a67o7R1K16j26p4M18j70k66K40o7k96M16M8k36j99M67k02k46K10K82k87J52
5637A37j32M8r7j10J66j8J10m0K9k07L56k8l24J80k95L16l20K65j58kN26l67J3
5660D8j49R2j30K91l32K07l8l00K35j04L01O8l12K72l28L05j28J51Nk05j22J25
5682d8R5q7Q9j37o3K58j99k50K37J47k7P6j4j27K5J89j88p7J72j52J03mK6m8K0
5707A6j09J05J04P8j92r9K88q7j58J51j98j2J90j58j77O6K89l67J91k07L92j82
5729g6M4rQ6o8N2j26J87J24l21J40j54L2J45J04J43l24r9K09k11Nl4j8J80K59
$$ plain form
5753 270 -131 -73 -31 134 118 120 -14 149 278 -70 46 -10 -147 -161 -123 150 -114 -33 143 156 -165 36 -134
5776 -134 -73 147 49 10 34 -9 -218 38 -313 -159 -81 -231 -138 -385 -58 53 98 18 129 269 1 300 -81
5799 -81 35 -115 -61 91 112 -138 -48 304 239 -55 192 91 96 -178 32 107 138 -23 -305 -5 161 -12 -179
5822 -179 156 19 -8 11 -116 -137 103 120 -136 42 118 -54 52 -176 -261 165 1 -267 -73 -32 -102 -48 133
5845 133 -99 -298 -46 -143 -183 24 263 88 92 215 68 -213 155 169 -22 -146 -41 -180 33 240 143 -172
5867 -172 -90 36 8 214 -42 101 -230 -14 115 -223 -148 4 110 181 62 78 -164 34 -16 -40 335 6
5889 6 -172 11 -219 -86 100 76 19 -45 -96 -116 -43 223 196 -41 48 -31 -34 110 -29 -31 -138 52 220 -53 87
5914 87 92 315 -193 -26 140 322 101 -50 108 24 153 43 -162 -199 103 -50 79 129 24 77 -34 -145
$$ packed form
5753B70m01N8M2J65j6Kj34J63J29l48J16n6j37j4L8K73k64Q1J76J3l21K01j70
5776a34O1K20r8l9K4m3k09K56l51J54P8j50R3k47L27J11M5q0J11J40k68K99l81
5799h1J16j50N4J52K1k50R0L52o5k94K47j01Nk74K10P5L1j61k82L00J66j73j67
5822a79L35j37k7J9j27k1K40J7k56J78P6j72J06k28q5M26j64k68J94M1p0N4J81
5845A33k32j99K52r7m0K07K39j75MJ23j47k81L68J4j91j24J05j39K13K07r7l15
5867a72Q2J26k8K06k56J43l31K16J29l38P5J52J06P1j19J6k42J98n0k4L75l29
5889Fj78J83k30J33J86k4n7o4n1k0P3K66k7k37Q9p9lJ44j39kj07J90J68k73J40
5914H7NK23n08J67J66J82k21j51J58q4J29j10k05l7L02j53J29N0j05N3j11j11
$$ plain form
5936 -145 -111 220 70 -149 -103 -63 25 108 59 104 -60 255 195 261 114 -15 -115 210 164 201 -54 -15 231 58
5960 58 -41 35 299 -78 -179 47 77 93 111 -14 -110 -86 156 -56 -109 -110 205 -69 84 -270 -76 -55 5 292
5984 292 -83 106 -77 142 -112 46 -124 -6 -95 -55 -426 -8 -43 35 -34 47 137 0 26 184 230 -146 97
6007 97 -154 207 -103 54 17 -107 118 150 -56 221 112 -47 -63 -36 -103 33 53 25 127 58 73 116 -107 186
6031 186 -120 -113 167 -104 93 107 47 73 -74 -80 -115 -45 -6 -95 -167 94 8 145 127 122 250 148 132 -113 134 46
6057 46 14 80 91 208 -30 -111 -50 -107 42 -42 -63 -60 77 -28 74 -26 48 -32 -142 -76 12 208 127 -84 -84 -134
6083 -134 25 61 95 -31 67 -19 -316 28 -68 -306 -348 -52 -327 78 -14 -159 142 -87 156 55 73 -184 96
6106 96 -28 142 -82 96 -41 13 201 -46 70 145 -32 -90 62 -201 123 54 -43 -45 -103 15 243 -25 81
$$ packed form
5936a45L4L31j50k19M6M0Q8Q3m9M5j64L15o0O6j47j29j00L25m6L7k55L9K46j73
5960E8r9P6K64l77j01K26L0J6J8j25r6K4K42k12n3jL15k74J53l54J94K1O0K87
5984B92l75J89j83K19k54J58j70J18q9M0l71M18l5P8o9Q1R0j37K6J58M6l76K43
6007I7k51L61l10J57l7j24K25L2k06K77j09j59j6K7o7J36K0k8J02o9J5M3k23K93
6031A86l06PK80k71J97J4o0K6j47ol5P0L9q9p2K61q6J37j8nJ28j02j6k45K47q8
6057D6l2O6J1J17k38q1O1n7J49q4k1LJ37j05J02j00P4q0j10O6Q8J96q1k11%n0
6083a34J59L6L4j26R8q6k97L44r6k38m2K96k75M05r2j45L01k29K43j01J8k57K80
6106I6j24J70k24J78j37N4J88k47J16P5j77n8J52k63L24o9r7kn8J18K28k68J06
$$ plain form
6129 81 132 -22 -51 -4 -22 49 112 -112 184 -135 -105 -139 -155 200 32 -266 -71 -101 42 68 37 -54 238 150 -56
6154 -56 -232 -8 -123 158 -41 11 167 18 -82 -248 316 -66 -63 -87 50 -56 -149 55 54 82 183 73 246
6177 246 74 -107 -179 37 -85 130 -165 -213 -115 -118 66 48 52 -2 -187 92 54 -206 184 172 -105 52 95 -16
6201 -16 197 -95 -29 -178 -70 73 -108 -237 -75 -28 43 230 70 -163 -25 13 163 -92 -139 82 105 -20
6223 -20 -248 -165 -183 27 24 59 -454 -152 9 -36 89 -109 73 -84 241 -241 185 -69 134 90 153 105 20 -40
6247 -40 6 123 111 128 -18 216 39 2 -100 32 119 -52 172 167 -314 -79 -35 -42 25 76 145 54 62 158 -171 -15
6273 -15 123 -170 -166 -60 139 98 146 105 195 -52 -122 -163 -48 -95 -52 22 29 39 -64 236 -44 242 72 51 87 181
6299 181 -261 -35 201 32 174 19 88 416 -22 -85 -22 114 125 -90 46 16 -282 -25 73 22 -60 58 172
$$ packed form
6129H1N1j54k9M7j8P1O3k24K96l19L0l4j6L55j68k98J95l0J43K6l1r1K92q8k06
6154e6j76K24j15K81j99N2J56j49j00j66N64l82Lk4J37j06r3K04jK8J01j10J73
6177B46j72j81p2K16j22K15k95m8R8lJ84j8Mn4j85K79l8k60L90j2k77J57M3j11
6201a6K13k92O6j49J08J43j81j29J62M7P1J87j60k33J38L8J50k55m7K21K3j25
6223b0k28Q3j8K10lL5n13L02J61m5J25j98J82j57L25m82M26k54K03m4O3m8q5o0
6247d0M6J17j2J7j46K34j77l7j02J32Q7j71K24nm81K35M4pO7N1O9r1QR6l29J56
6273a5J38k93MJ06J99m1M8m1R0k47p0m1J15m7M3P4PJ0j03L00k80K86j70k1L6R4
6299A81m42K26K36j69J42j55O9L28m38o3O3J36J1k15J36l0k98K57R8n1q2J18J14
$$ plain form
6322 172 115 -188 -314 2 -95 32 216 38 17 128 102 -63 -166 -74 181 10 -65 -129 -428 -158 -50 170
6344 170 150 -216 -64 -115 -11 -100 37 179 142 -281 97 -49 -121 -97 -22 21 27 169 84 127 340 120 -169 88
6368 88 -70 -154 -26 235 108 -170 -116 346 -141 181 -31 54 203 -174 4 -118 57 232 260 -27 -141 107
6390 107 11 70 -126 -2 -34 -71 -83 -92 -72 -68 28 207 170 124 84 117 -79 278 52 140 -184 56 0 217 83 261
6416 261 -169 -139 169 -113 183 -167 -74 -221 -33 16 84 89 -145 186 -158 70 -69 -170 -56 94 74 -137
6438 -137 134 -187 -258 75 -78 -134 -314 197 -9 65 50 -147 -43 91 347 -64 299 -132 68 115 -24 38
6460 38 -179 55 -338 100 -89 91 1 -110 -24 -21 76 -151 167 -235 45 154 185 148 15 50 43 230 -57 -40
6484 -40 -52 -69 180 0 210 213 -179 -17 -196 -184 81 210 202 -121 77 -15 -103 102 89 -190 -11 141 153 -320
$$ packed form
6322A72n7l03j26L16r7J27J84j78k1J11k6j65j03R2K55j71p5o4k99K70J08K20
6344A70k0l66J52n1J04q9J37J42l7m23L78j46p2K4P5M3OJ42q5M3K13k20k89K57
6368H8j58q4J28K61j27k78N4M62m87L22k12Q5J49l77J78j22J75J75K8k87j14K48
6390A07r6N9j96J24l2l7j2rK0MR6J79l7m6m0L3j96L57k26Q8l24K40n6K17j34J78
6416B61m30L0L08k82K96l50R3j47J88M9O8Nk34L31l44K28j39j01J14J50k0k11
6438a37K71l21p1L33j53n6j80N11k06P4j5j97J04J34K56m11L63m31K00M7j39O2
6460C8k17K34l93M38j89J80r0j11Q6LR7k27L18m02K80J09L1l7j33L5pJ87k87J7
6484d0j2j7K49j80K10Ll92J62j79J2K65J29ql23J98r2q8K05j3k79J79J52J2m73
$$ plain form
6508 -320 -101 -189 -199 -133 17 -91 -65 -69 -61 -207 19 -204 30 -85 45 52 71 6 -111 -219 -236 100 -190 70
6532 70 -27 174 3 8 -6 101 241 -79 79 254 -146 82 -118 -51 1 97 -8 35 127 22 62 0 -198 -115
6556 -115 146 44 98 94 99 165 -103 141 -161 188 85 34 -200 -1 43 -209 19 -273 -144 74 144 -146 7
6579 7 215 -28 -57 122 9 -82 -217 -168 -161 -306 11 -338 -37 96 192 -128 -3 134 61 -56 -106 -119 64 153
6603 153 6 -51 241 -121 111 -54 233 -83 -234 -100 193 -123 191 4 -66 -93 -284 219 -3 121 -209
6624 -209 208 -80 48 160 97 -133 50 115 -34 120 -61 37 51 168 17 97 3 -36 69 263 -27 135
6646 135 -88 160 87 -85 62 4 170 42 -97 54 117 -57 164 -113 127 179 134 152 -73 4 -43 -131 94
6669 94 -129 -109 -168 -79 4 -34 -33 -179 -9 84 4 -65 -219 -145 -214 -78 -78 -147 3 -149 118 55 119 -41 -140 -86 -143
$$ packed form
6508c20K19q8j0O6J50j08K6mQj46K26k23K34j15J30PJ9o5j17j08j7L36k90K60
6532G0r7K01j71Nj4J07J40l20J58J75m00K28k00O7N2R6j05M3R2j05M0o2j98Q3
6556a15K61j02N4mNO6k68K44l02L49j03n1k34J99M4k52K28k92J29K18P0k90J53
6579GK08k43k9J79j13r1j35M9Pj45L17l49L01J33R6l20J25J37p3j17n0j3J83Q9
6603A53j47n7K92l62K32j65K87l16j51J34K93l16L14j87p0k7j91N03k22J24l30
6624b09M17k88J28J12o3k30J83O5j49J54j81R8J4J17j51Q0r4l9J05J94k90J62
6646A35k23K48p3j72J47n8J66j28j39J51O3j74K21k77K40N2m5J8k25P7m7q8K25
6669I4k23K0n9Q9Q3l8Jj46J70R3q0o9j54P4o9J36%o9J50j52K67o3O4j60r9N4n7
$$ plain form
6696 -143 -74 -55 103 269 -73 -123 156 157 24 73 -9 -125 83 139 89 154 112 116 92 -153 112 -72 -25 -66 0 248
6722 248 76 -14 11 -33 -45 105 119 -23 -118 115 213 -12 -79 145 98 -75 61 -250 212 138 -31 -231 217
6745 217 8 155 114 55 111 -52 149 -141 139 -185 47 29 16 32 187 -129 -122 -200 -38 94 63 -52 89
6768 89 -17 145 -113 -18 227 280 -10 -97 46 -205 -157 -114 -6 -61 146 101 -51 30 -37 87 17 -37 226 11
6792 11 -6 4 -170 51 306 -86 24 68 -118 -42 -26 105 -124 -106 263 64 38 -95 56 10 18 -59 -9 -67 -79
6817 -79 67 4 85 -89 -32 -56 -23 -102 -27 -73 -234 -76 301 30 -214 3 -69 52 -9 -118 -196 -314 -174 73
6841 73 -128 110 -94 -27 -8 -23 22 55 -42 99 -15 -176 -247 311 -57 88 -25 -58 144 -155 177 -169 220
6864 220 115 -234 112 75 119 187 115 104 70 -133 145 -106 191 -77 140 -100 -32 -92 -234 -9 93 -190 -100
$$ packed form
6696a43O9J9J58J66l42n0K79Jj33M9q2j16K08N6n0O5m2Mk4k45K65j84M7m1O6K48
6722B48j72r0K5m4j2J50J4j42r5K33R8k25o7K24m7j73J36l11M62p4j69k00M48
6745B17k09J47m1n9N6j63K01k90K80l24K32j8j3J6J55l16Pp8J62J32l1j15J41
6768H9j06J62k58R5K45N3k90q7J43k51M8M3J08n5K07m5j52Q1o7J24p0n4K63k15
6792A1j7J0j74K21K55l92J10M4j86P6J6J31k29J8L69j99k6j33J51m6Qp7N0n8j2
6817g9J46o3Q1j74N7k4L3p9P5m6j61J58L77k71k44K17p2J21o1j09p8j18J40K47
6841G3k01K38k04O7J9j5M5L3r7J41j14j61p1N58l68J45j13l3K02k99L32l46L89
6864B20j05l49L46l7M4O8p2j1l4k03K78k51K97k68K17k40O8o0j42K25J02k83R0
$$ plain form
6887 -100 57 137 211 -278 79 -145 184 212 60 216 23 280 -219 -52 6 22 58 102 54 -299 161 8 -77
6910 -77 80 -219 21 -10 63 238 9 145 -127 64 37 -19 119 -98 -8 -76 -360 -321 12 -7 -16 129 96 3
6934 3 -16 96 53 0 118 -51 -92 -59 -48 -65 122 -227 202 104 57 117 63 150 -138 299 -29 112 118 80 -216 -37
6960 -37 172 -55 -23 211 158 279 126 -86 69 17 34 118 -60 89 268 -56 -28 -41 -154 -114 -185 -229 -80 184
6984 184 57 55 17 -85 61 -104 -158 104 20 -3 -116 53 -216 13 49 -22 -126 5 -186 -38 55 158 -326
7007 -326 221 38 171 8 -43 118 -39 -29 16 80 15 127 -56 -171 86 -65 53 71 -116 143 88 -146
7029 -146 -104 -107 -8 -119 -61 -112 -87 -5 131 -266 4 -174 52 136 -168 -41 5 109 -57 -120 -68 -25 -50 -102 45
7054 45 -98 47 -140 103 -230 126 -31 -81 -99 -17 157 53 155 -121 150 -98 43 89 75 224 7 77
$$ packed form
6887a00J57Q0P4m89L57k24L29K8j52J56j93K57m99J67N8J6L6M4m8l53M60j53q5
6910g7J57k99K40l1P3J75k29J36k72J91k7n6J38k17R0o8k84L9L33j9rJ45l3r3
6934Cj9J12m3n3J18j69m1L3J1j7J87l49M29r8m7O0n4Q7k88M37l28J41Ol8k96J79
6960c7K09k27L2K34n3J21j53k12J55n2J7Q4j78J49J79l24K8j3j13M0p1m4J49K64
6984A84j27kl8j02J46j65n4K62q4k3j13J69k69K29L6p1j04J31j91J48R3J03m84
7007c26N47j83J33j63n1J61j57J0M5O4o5J12j83j15K57j51J18J8j87K59n5k34
7029a46M2lR9j11N8n1K5Q2J36l97K70j78K26Q4l04J27M6J04j66o3N2M3k5n2J47
7054D5j43J45j87K43l33L56j57n0j8Q2J74j04J02k76K71k48J41M6j4J49k17P0
$$ plain form
7076 77 -156 -101 61 -7 -6 89 -65 -79 280 -232 -26 84 169 14 -43 -59 206 263 -258 62 -177 232 27 75
7100 75 -110 -50 -59 -23 79 39 65 19 -163 90 150 265 147 -140 -8 181 -1 -135 135 88 70 -16 -9 154 -155
7125 -155 34 33 -291 11 179 -136 -65 133 -76 -38 -96 -25 220 9 -176 92 126 19 192 11 -81 -19 -33
7148 -33 -113 62 -250 -12 41 -188 132 -63 -91 162 67 187 106 -38 -40 -136 -146 -161 -115 -80 -36 148 55 -226 -48
7173 -48 -46 104 -218 73 -140 79 55 -111 183 52 -244 -52 189 -81 -90 51 -51 -103 -263 -54 168 30
7195 30 -134 -78 -51 55 138 318 14 10 -38 -225 140 -46 -165 -89 -200 -123 -48 -15 108 102 -73 98 82 2 17
7220 17 -95 9 -43 147 99 93 -208 -96 212 321 110 -133 251 252 65 -276 -19 165 -108 255 119 18
7242 18 -243 289 -13 198 -171 40 56 -89 -75 -80 93 -141 169 161 16 -45 60 144 -168 148 3 279 -16
$$ packed form
7076G7k33N5J62o8JR5j54j4L59n12K06J10Q5j55n7j6K65N7n21L20k39M09k05M8
7100G5j85O0rL6J02m0K6m6j82K53O0J15j18k87J32J89j82j34K70m7j8q6PJ63l09
7125a55J89jl24L02J68l15P1J98k09L8n8P1K45k11j85K68L4j07J73j81r2O2j4
7148c3q0J75l12K38N3k29L20j95k8K53r5J20q1j44kr6j0j5M6L5M4J84r3k81J78
7173d8KJ50l22K91k13K19k4j66K94j31k96J92K41k70rJ41j02n2j60K09K22j38
7195C0j64N6K7J06Q3J80l04mm8j87L65j86j19P6j11P7P5L3J23oj75J71j6q0J5
7220A7j12J04n2J90m8ol01J12L08J09k11k43L84Jj87l41K57J84k73L63j36j01
7242A8k61N32l02K11l69K11J6j45J4nJ73k34L10qj45o1J05Q4l12L16j45K76k95
$$ plain form
7265 -16 -427 -60 28 -17 189 145 23 163 -147 -55 -58 -69 55 81 68 106 -64 198 20 -128 56 -73 22 11
7289 11 -21 159 55 -65 192 86 20 -208 -69 -163 157 54 -205 307 -26 10 -15 -4 193 -54 -194 88
7311 88 -25 49 -29 -103 255 -291 82 -74 200 -33 -10 42 -136 56 -75 -31 -171 -38 -89 -245 175 -65 100
7334 100 92 -32 157 125 194 -263 155 -18 -22 -96 -301 138 202 57 -48 -11 -47 19 -246 -132 51 -218 271 5
7358 5 81 -144 55 137 -244 243 -198 -112 -31 -43 6 -47 161 -181 -64 83 96 121 -27 -188 -14 -30 -1 -119
7382 -119 110 5 163 -7 42 -25 115 3 215 -284 186 -41 -43 -314 -109 -129 -137 152 38 168 179 -133 -46
7405 -46 -136 19 168 88 -123 -97 167 188 37 -11 -98 80 -24 -233 -242 187 169 25 -201 -140 -8 80 -300 24
7429 24 62 45 71 41 -11 -70 111 51 17 -4 -88 -154 -40 171 -12 90 189 -110 159 31 121 -174 51 103 -8
$$ packed form
7265a6m11L67Q8m5K06m4j22J40l10R2lj1J24K6j3L8j70K62j78j48J84j29R5j1
7289A1l2J80j04j20K57j06o6k28J39r4L20j03k59N12l33L6k5J1J97k47j40K82
7311H8j13P4p8p4L58n46L73j56K74k33K3N2j78J92j31M4j40J33n1j56M20k40J65
7334A00qj24J89l2O9m57M18j73mp4k05M39O4j45j05L7l6O6k65J14J83k69M89k66
7358EP6k25J99Q2l81M87m41Q6Q1j2M9n3K08l42J17J47J3K5j48j61J74j6K9j18
7382a19K29j05J58j70M9o7J40j12K12m99M70k27kk71K05k0qK89j14J30J1l12Q7
7405d6r0J55J49q0k11K6K64K1j51m8q7J78j04k09rM29j8j44k26O1J32Q8l80L24
7429B4L8j7K6l0n2n9J81o0l4k1q4o6J14K11j83J02R9k99K69j28R0k95K25N2j11
$$ plain form
7454 -8 -323 -123 64 -141 124 -82 39 -234 235 -131 -4 134 -94 199 292 179 165 8 84 -79 -2 13
7476 13 -86 80 94 44 -206 237 -26 60 91 -22 21 141 90 89 117 89 164 -124 -129 -214 159 188 294 -67 -106 38
7502 38 -63 -59 -74 -154 -42 -25 -4 81 -139 51 -56 80 -12 -185 30 -27 32 21 -14 -29 -120 -1 256 33 -174
7527 -174 -317 176 33 53 -72 -7 -87 107 217 209 11 -45 51 86 57 257 76 154 308 -50 -84 100 -185 97
7551 97 -80 -162 -93 -200 -75 -51 90 -80 212 69 -6 71 166 134 37 154 -197 84 318 -69 -65 88 231 -300
7575 -300 -38 301 161 61 -2 -98 255 -206 33 -99 126 11 102 -41 387 69 -172 -71 -36 -169 14
7596 14 -89 -158 -123 -43 7 -91 222 181 111 103 167 -73 121 123 139 -59 -76 -223 33 -34 -45 29 -359 -70 149 107
7622 107 -79 -88 163 -21 213 -148 -41 165 -58 -191 -216 -45 29 98 76 -72 -37 157 -11 -133 27 -121
$$ packed form
7454hl15K00J87k05K65k06J21k73M69l66J27J38k28K93R3j13j4j57P6j63P7J5
7476A3r9J66J4n0k50M43k63Q6L1j13M3J20n1jK8k8P5k88nq5L73K9J06l61l9J44
7502C8j01Mj5q0J12J7K1Q5k20J90j07J36r2j73K15n7N9j1l5j5r1J19K57k23k07
7527a74j43M93j43K0j25O5q0J94J10qj98n6R6L5k9K00j81P8J54l58l4J84k85K82
7551I7j77q2O9j07J25K4J41j70K92j43p5P7R5l2r7J17l51K81K34l87MJ53J43n31
7575c00K62L39j40j00o3r6L53m61K39j32K25j15R1j43M28l18k41J01L5j33J83
7596A4j03o9L5Q0N0r8L13m1p0qO4k40J94KJ6j98j7j47K56o7j1P4l88K89K19m2
7622A07j86rK51j84K34l61J07K06k23j33k5J71P4O9k2j48L5J94j68j22J60j48
$$ plain form
7644 -121 88 235 171 -111 49 -83 -4 4 225 2 201 71 -224 -21 -69 231 -169 27 134 -214 228 97
7666 97 -32 -25 -46 6 -142 -66 -108 119 -252 74 -213 115 85 -86 195 181 -46 -105 -85 82 45 -159 98 -54
7690 -54 24 24 116 17 206 -112 99 -197 13 194 -62 16 43 54 -236 112 -106 -55 45 -16 63 -72 99 -7
7714 -7 222 -160 -205 -112 -68 -111 -6 -11 -83 -132 -33 119 -108 256 -141 19 -31 -13 -30 138 -47 -108 -76 164 8
7739 8 -90 153 -21 46 152 18 -150 -50 -304 -126 116 -5 -4 -181 -55 26 351 -72 167 85 -7 117 129
7762 129 -174 12 355 88 -101 -83 -29 -131 98 -49 -144 52 -48 78 48 -26 15 -196 -115 12 117 0
7784 0 17 59 24 147 56 157 160 -254 -262 27 -14 98 -149 -64 22 54 106 104 -154 -18 -82 216 -14 -52 -70 243 -106
7811 -106 21 66 -168 55 -131 -4 -52 -47 -165 135 -164 -23 12 53 57 -193 134 -217 -32 -84 124 64 139 2
$$ packed form
7644a21K09J47o4k82J60j32P9QK21k23J99j30k95K03m8L00m00J96J07l48M42j31
7666I7j29Pk1N2j48P6m2K27l71L26k87L28l0j71K81j4k27n9K0J67l7k04K57j52
7690e4P8%R2r9J89l18K11k96K10J81k56P8K7J1k90L48k18N1J00o1P9j35J71j06
7714gK29l82m5R3M4m3J05np2m9R9J52k27L64l97J60n0J8j7J68j85o1L2K40j56
7739Hr8K43j74O7J06j34j68J00k54J78K42j21Jj77J26Q1L25m23K39q2r2J24J2
7762A29l03J86L43k67j89J8N4j02K29j47r5J96j00J26l0p4M1k11Q1J27J05j17
7784@J7M2l5J23r1J01Lm14qK89m1J12k47Q5Q6L2N2kk58J36o4K98k30l8j8L13l49
7811a06J27M5k34K23j86J27m8Nj18L00k99J41L5M1Mk50L27l51J85n2K08o0P5j37
$$ plain form
7835 2 -66 51 112 48 83 -15 59 -111 161 -54 23 -44 -51 -224 156 -13 -18 -151 -8 -112 106 -41 165 -95 112
7860 112 -163 9 -61 -41 95 -183 357 -101 -25 -80 88 -34 139 33 -74 -173 -37 -24 12 -100 144 210 -253
7883 -253 125 60 48 54 79 -2 223 41 -38 108 209 -57 -29 -13 26 87 -94 65 -36 -99 58 111 37 197 24
7908 24 -40 -48 -123 99 -33 -228 32 -52 213 -190 -107 70 22 24 -165 82 104 165 231 -17 157 -79 -30 173 50
7933 50 31 -3 -17 -129 39 -6 258 79 10 16 177 -2 -301 -220 -228 170 38 -141 149 136 -71 -1 92 132 -79
7958 -79 -4 -347 95 68 -19 83 144 90 -65 291 89 83 -13 -60 -79 -58 56 281 -26 23 146 -59 12 19 -178
7983 -178 -5 148 50 -92 -246 42 -249 -3 7 -206 -123 -55 7 139 -56 29 100 60 -69 132 35 25 -135
8006 -135 -253 97 25 67 84 89 258 -40 285 -18 48 -111 197 -82 254 -328 -193 220 24 146 -128 119
$$ packed form
7835Bo8J17O1o4L5r8P4j70K72k15P7o7pj73L80j69nj33J43j04K18j47K06k60K07
7860A12k75J72p0K0J36k78N40m58P6n5J68j22J73j06j07r9J36J3L6j12K44O6m63
7883b53L78o5j2OK5q1K25j82p9J46J01k66K8J6L9O1j81J59j01o3J57N3p4J60j73
7908B4o4qp5K22j32j95K60q4K65m03Q3J77m8Kj89K47K2O1O6k48J74k36M9K03j23
7933E0j9l4j4j12J68m5K64j79o9OJ61j79k99Q1qL98j32j79K90j3k07P0R3M0k11
7958g9P5l43M42k7q7J02O1n4j55L56k02or6m7j9K1J14K25l07M9J23k05P1Pj97
7983a78J73J53r8j42j54K88k91K46J0k13Q3O8O2J32j95Q5P1m0j29K01r7j0j60
8006a35j18L50p2M2J7NJ69k98L25l03O6j59L08k79L36n82J35M13j96J22k74K47
$$ plain form
8028 119 1 -97 -251 84 81 -72 -187 -118 -3 69 2 -68 -42 110 -71 -74 -91 -116 -268 88 0 -82 211 -278 147
8053 147 22 85 4 -216 104 -73 -27 249 36 73 -238 286 -15 -42 -9 65 -95 35 36 134 -264 -40 277
8076 277 45 11 -256 288 70 27 292 -91 -31 -15 -199 23 119 -97 -33 -29 -21 -146 1 -63 -65 -78 178 -37 153
8101 153 67 -9 -88 -157 -234 -57 195 -60 -232 -52 -102 -326 -6 -48 -25 -280 36 -7 15 79 -2 -206 -179 -125 35
8126 35 -58 -17 229 15 -122 -13 138 7 -10 -97 72 -55 -48 -25 99 41 85 -82 -41 301 -193 16 106 2
8150 2 -93 -39 66 -188 98 65 26 139 64 14 -166 -33 -109 63 -216 -71 -28 19 71 4 -18 -118 -3 -56 -194
8175 -194 -114 141 -7 -84 -8 -343 -27 31 -95 39 0 -37 96 -46 -198 -79
$$ packed form
8028A19j18r8j54L35lj53j15O9J15P2o7p0K6J52j81lj7k5j52L56q8q2K93m89M25
8053A47j25O3q1k20L20j77M6K76k13L7l11N24l01k7L3P4j60J30JR8l98K24L17
8076B77k32l4k67N44k18m3K65l83O0J6j84K22R6k16O4MQj25J47o4kj3K56k15J90
8101A53q6p6p9o9p7J77K52k55j72J80n0k24L20m2K3k55L16m3K2O4q1k04K7N4J60
8126C5r3M1K46k14j37J09J51j31j7q7J69j27PK3J24n8M4j67M1L42m94K09R0j04
8150Br5N4J05k54K86l3l9J13p5n0j80J33p6J72k79J45M3M7N2o7k2j00J15n3j38
8175a94Q0K55j48p7P6l35L16N8j26J34l9l7J33j42j52J19
8191g9
$$ Imaginary data points
##PAGE= N=2
##DATA TABLE= (X++(I..I)), XYDATA
$$ plain form
0 0 0 0 0 0 0 0 0 0 0 0 -8 8 -8 8 -16 16 -24 24 -32 40 -48 56 -64 77 -89 104 -121 139 -161 185 -211 240
32 240 -272 308 -348 393 -441 492 -550 613 -683 758 -840 931 -1030 1136 -1254 1382 -1521
49 -1521 1676 -1847 2033 -2241 2474 -2734 3028 -3363 3748 -4196 4727 -5368 6153 -7149 8453
64 8453 -10247 12874 -17097 25001 -44880 201888 290719 -65131 166161 245058 110309 103948
76 103948 149434 22016 158004 183843 -42379 -6783 218380 38786 -125130 109210 93138
87 93138 -78182 10802 35236 -52067 26118 30361 -127919 29530 109529 -99600 -87306 128546
99 128546 29374 -110466 53345 66386 -10094 55698 37550 -28707 122213 115222 -91488
110 -91488 61264 196990 17472 -39023 130383 95844 6641 80959 30721 14434 116485
$$ packed form
0@%%%%%%%%%%qJ6j6J6k4L2m0M8n6P2q8J04j20J41j66J93k25K60l00L46l96M51
32B40n12N80o56P41q34R33j042J163j296J441j598J771j961K166k390K636k903
49a521L197l523L880m274M715n208N762o391P111p944Q923j0095J1521j3302J5602
64H453j8700K3121k9971M2098o9881K46768Q8831l55850K31292P8897j34749o361
76A03948M5486j27418J35988K5839k26222L5596K25163j79594j63916K34340j6072
87I3138j71320Q8984K4434q7303P8185M243j58280J57449P9999k09129J2294K15852
99A28546r9172j39840J63811J3041p6480O5792j8148o6257J50920o991k06710
110i1488J52752J35726j79518n6495J69406l4539q9203P4318n0238j6287J02051
$$ plain form
121 116485 45960 -84440 81177 115739 -102461 -29451 99988 -18930 -83301 17946 -24626
132 -24626 -40416 13717 -97220 -94953 54264 -12484 -183477 -30310 62054 -106246 -101045
143 -101045 -8074 -43802 -46465 -7570 -102861 -43224 73088 -67313 -125881 44593 57331
154 57331 -105718 -32027 46361 -25331 -9537 1161 -55961 10295 74517 -84045 -60208 92069
166 92069 -4043 -100680 10747 36654 -66604 -15138 -6191 -53901 2800 -4502 -102336 -27918
178 -27918 65950 -94453 -100431 46553 -6553 -98300 -24411 -6082 -54423 6294 -36242 -76948
190 -76948 30073 35789 -102266 -39045 92050 -30519 -69883 33906 25933 -18513 23780
201 23780 -12761 -26847 84070 13696 -75925 41862 96351 -46584 -34822 76784 7724
$$ packed form
121A16485p0525j30400J65617L4562k18200P3010J29439j18918o4371J01247m2572
132b4626j5790N4133j10937K267J49217o6748j70993J53167R2364j68300N201
143a01045R2971l5728k663L8895r5291N9637J16312j40401n8568J70474J2738
154E7331j63049P3691P8388p1692J5794J0698n7122O6256O4222j58562K3837J52277
166I2069r6112r6637J11427K5907j03258N1466Q947m7710N6701p302r7834P4418
178b7918R3868j60403n978J46984n3106r1747P3889J8329m8341O0717m2536m0706
190g6948J07021N716j38055O3221J31095j22569l9364J03789p973m4446M2293
201B3780l6541j4086J10917p0374q9621J17787N4489j42935J1762J11606o9060
$$ plain form
212 7724 -17160 26691 -4349 -3430 63412 -25713 -64766 79954 33252 -89920 -3469 78248
224 78248 -31889 -39389 22746 -19613 5762 25279 -54165 -35084 86682 -9117 -94145 42731
236 42731 52025 -53572 -16166 43084 -18591 10992 25895 -43586 15589 67212 -34605 -49779
248 -49779 86189 25803 -64440 28663 48739 -23127 4198 26589 -27792 35849 38010 -60431
260 -60431 -237 82674 -23393 -71026 59032 32317 -45369 3482 14030 -18162 25276 6766
272 6766 -69314 33303 62421 -65432 -40694 70012 1610 -59923 23286 7616 -17709 20766
284 20766 -10104 -41101 43634 27595 -82167 8368 68988 -35689 -46993 42668 6466 -27707
296 -27707 17984 -21522 -13464 45355 -7607 -62956 40001 50087 -66215 -14636 53748 -6564
$$ packed form
212G724k4884M3851l1040R19O6842q9125l9053J44720m6702j23172Q6451Q1717
224G8248j10137p500O2135m2359K5375J9517p9444J9081J21766r5799q5028J36876
236D2731R294j05597L7406N9250o1675K9583J4903o9481N9175N1623j01817j5174
248d9779J35968o0386r0243R3103K0076p1866K7325K2391n4381O3641K161r8441
260f0431O0194Q2911j06067m7633J30058k6715p7686M8851J0548l2192M3438j8510
272F766p6080J02617K9118j27853K4738J10706o8402o1533Q3209j5670k5325L8475
284B0766l0870l0997Q4735j6039j09762R0535O0620j04677j1304Q9661l6202l4173
296b7707M5691l9506Q058N8819n2962n5349J02957J0086j16302N1579O8384o0312
$$ plain form
308 -6564 -26942 23997 -8229 453 41807 -32265 -25053 63745 19753 -63285 26727 61136 -30084
321 -30084 -10973 31923 1630 5024 29026 -31369 2179 64585 -26180 -48623 48507 32144
333 32144 -56900 600 30212 -21200 -5187 -3502 -33860 4207 29109 -62215 -34511 50800
345 50800 -21141 -68906 7721 14869 -46110 -9445 -10051 -29934 13134 -4437 -58515 -1194 49416
358 49416 -47066 -41360 43892 8655 -35982 8936 11556 -11930 30818 -4774 -27550 45233
370 45233 36780 -45859 556 67298 -10758 -22092 32989 15525 -4325 22564 -7476 -15909
382 -15909 50856 -1652 -49946 29279 44998 -44138 -20869 38540 -11945 -14940 7035 -16004
394 -16004 -5239 32487 -26421 -40381 49552 12321 -52583 8646 46195 -18582 -6613 25375
$$ packed form
308f564k0378N0939l2226Q682M1354p4072P212Q8798m3992q3038R0012L4409r1220
321c0084J9111M2896l0293L394K4002o0395L3548O2406r0765k2443R7130j6363
333C2144q9044N7500K9612n1412J6013J685l0358L8067K4902r1324K7704Q5311
345E0800p1941m7765P6627P148o0979L6665o06j9883M3068j7571n4078N7321N0610
358D9416r6482N706Q5252l5237m4637M4918K620k3486M2748l5592k2776P2783
370D5233q453q2639M6415O6742p8056j1334N5081j7464j9850K6889l0040q433
382a5909O6765n2508m8294P9225J5719q9136K3269N9409n0485k995K1975k3039
394a6004J0765L7726n8908j3960Q9933l7231o4904O1229L7549o4777J1969L1988
$$ plain form
406 25375 -6519 20393 29826 -18704 4193 69823 3263 -31628 55451 44401 -16673 15788
418 15788 45175 4356 28997 29076 -16638 32568 53220 -20323 -14185 66749 12896 -33969 28507
431 28507 26610 -13758 7974 10824 -22149 28145 19361 -47338 4233 48863 -25330 -39516 39804
444 39804 8240 -25715 11906 4537 -9266 24981 5596 -36818 35763 42289 -36308 -4823
456 -4823 55840 2742 -21405 32339 9616 2356 28190 -2769 -14132 42129 17842 -48443
468 -48443 17133 41949 -28471 -24544 24801 -10274 -24521 5512 -31951 -22061 14622 -32347
480 -32347 -60036 10660 190 -73248 -27192 4481 -40304 -41411 -11472 -39419 -26780 416
492 416 -53303 -39047 19821 -19747 -62736 6014 14964 -41422 -14325 6044 -14550 -1382 10739
$$ packed form
406B5375l1894K6912R433m8530K2897O5630o6560l4891Q7079j1050o1074L2461
418A5788K9387m0819K4641P9m5714M9206K0652p3543O138Q0934n3853m6865O2476
431B8507j897m0368K1732K850l2973N0294q784o6699N1571M4630p4193j4186P9320
444C9804l1564l3955L7621p369j3803L4247j9385m2414P2581O526p8597L1485
456d823O0663n3098k4147N3744k2723p260K5834l0959j1363N6261k4287o6285
468d8443O5576K4816p0420L927M9345l5075j4247L0033l7463R890L6683m6969
480c2347k7689P0696j0470p3438M6056L1673m4785j107K9939k7947J2639K7196
492D16n3719J4256N8868l9568m2989O8750Q950n6386K7097K0369k0594J3168J2121
$$ plain form
505 10739 -29138 2096 39728 -23703 -26833 37503 16773 -33949 11060 19981 -12090 6606
517 6606 -49 -20319 10188 18648 -41568 -14393 32321 -22353 -43208 6427 539 -37693 -8474
530 -8474 -16142 -28802 3680 -16506 -49972 -5095 18432 -46710 -30390 19765 -10560 -29686
542 -29686 1672 -2804 -13464 19052 -8813 -18540 33016 21570 -26576 12529 47203 -4120
554 -4120 2496 34751 17098 12863 31244 9641 9361 49681 11251 -10437 41408 40149 -14351
567 -14351 9673 39782 1135 6324 16037 -1348 10165 25443 -17590 -16345 37418 697 -35617
580 -35617 7450 22443 -19678 -7761 5636 -16531 8447 7153 -27803 -3685 34730 -15264
592 -15264 -27141 29030 11918 -17690 7575 17622 -4528 18815 14206 -14316 24606 32556
$$ packed form
505A0739l9877L1234L7632o3431l130O4336k0730n0722M5009Q921l2071J8696
517F606o655k0270L0507Q460o0216K7175M6714n4674k0855M9635n888l8232K9219
530h474p668j2660L2482k0186l3466M4877K3527o5142J6320N0155l0325j9126
542b9686L1358m476j0660L2516k7865r727N1556j1446m8146L9105L4674n1323
554d120O616L2255j7653m235J8381k1603k80M0320l8430k1688N1845j259n4500
567a4351K4024L0109l8647N189R713j7385J1513J5278m3033J245N3763l6721l6314
580c5617M3067J4993m2121J1917J3397k2167K4978j294l4956K4118L8415m9994
592a5264j1877N6171j7112k9608K5265J0047k2150K3343m609k8522L8922P950
$$ plain form
604 32556 -14361 181 47490 6298 -11612 29145 17926 -12 16794 11302 -6476 28780
616 28780 15360 -24763 13860 32253 -17845 -17856 28318 -1822 -16247 7408 -7343 -11252 11018
629 11018 -10176 -33549 15797 8945 -38385 -9682 18587 -19665 -24709 10487 -13498 -12606 6819
642 6819 -17700 -17270 20022 -5571 -38282 15059 18318 -26603 -10246 18806 -5806 -7974 10370
655 10370 -15339 1957 24433 -14210 -22465 30150 13510 -31311 6272 18896 -7766 -1486
667 -1486 9291 -10875 6376 19277 -22804 -8195 29024 -1920 -26620 16688 12990 -19920
679 -19920 5405 5867 -11506 4695 9821 -19383 3258 21409 -21174 -12780 23957 737 -25490
692 -25490 11039 9094 -13054 5987 -1656 -14049 11592 12259 -27408 142 26230 -13933 -17436
$$ packed form
604C2556m6917J4542M7309m1192j7910M0757j1219j7938J6806n492j7778L5256
616B8780j3420m0123L8623J8393n0098j1M6174l0140j4425K3655j4751l909K2270
629A1018k1194k3373M9346o852m7330K8703K8269l8252n044L5196k3985Q92J9425
642F819k4519M30L7292k5593l2711N3341L259m4921J6357K9052k4612k168J8344
655A0370k5709J7296K2476l8643q255N2615j6640m4821L7583J2624k6662O280
667a486J0777k0166J7251J2901m2081J4609L7219l0944k4700M3308l698l2910
679a9920K5325M62j7373J6201N126k9204K2641J8151m2583Q394L6737k3220k6227
692b5490L6529j945k2148J9041p643j2393K5641O67l9667K7550K6088m0163l503
$$ plain form
705 -17436 14780 4581 -14707 8238 -1634 -9202 15382 -1052 -21052 10874 19424 -24090 -4747
718 -4747 22301 -5005 -11526 8134 964 -5456 12843 -8811 -11080 21018 4708 -25001 5510
731 5510 22791 -16333 -8107 11030 -1703 -1385 5806 -12880 -5342 22550 -9980 -21745 14218
744 14218 12450 -19569 -2705 11464 -11768 1209 4701 -11994 1213 14540 -14533 -10675 22382
757 22382 -4124 -17574 10911 11650 -11917 3116 8754 -8582 9423 7177 -12614 4731 22938
770 22938 -11362 -10754 23250 2600 -11937 7397 8977 -5422 8801 1935 -12547 13888 9975
783 9975 -19991 -3785 23588 -8620 -15973 10944 -953 -7891 3091 -5348 -12898 13212 -1380
796 -1380 -23689 7035 12579 -19062 -11699 16064 -6854 -9720 6450 -7153 -3808 11801 -6625
$$ packed form
705a7436L2216j0199j9288K2945r872p568K4584j6434k0000L1926Q550m3514J9343
718d747K7048k7306o521J9660p170o420J8299k1654k269L2098j6310k9709L0511
731E510J7281l9124Q226J9137j2733L18P191j8686P538K7892l2530j1765L5963
744A4218j768l2019J6864J4169k3232J2977L492j6695J3207J3327k9073L858L3057
757B2382k6506j3450K8485P39k3567J5033N638j7336J8005k246j9791J7345J8207
770B2938l4300O08L4004k0650j4537J9334J580j4399J4223o866j4482K6435l913
783I975k9966J6206K7373l2208p353K6917j1897o938J0982q439p550K6110j4592
796a380k2309L0724N544l1641P363K7763k2918k866J6170j3603L345J5609j8426
$$ plain form
809 -6625 -17097 19440 7845 -19817 4569 16857 -7726 -5657 12982 -4943 2087 12365 -8739
822 -8739 -4006 20112 -644 -20301 15549 10674 -14679 -380 9536 -7790 -2258 6336 -15967
835 -15967 -1223 11835 -13801 -15709 12863 -2703 -24584 4838 2200 -16594 -4270 1478 -13540
848 -13540 -1335 3913 -22168 -3604 14104 -11894 -19417 12561 3642 -16889 3710 1290 -7022
861 -7022 5786 4022 -14619 8153 16453 -15962 -4201 18729 1235 -11513 11335 4888 -5131
874 -5131 10232 -276 -7582 11279 9171 -17051 4675 17543 -11203 -6974 11321 76 -9043
887 -9043 7476 -3227 -5628 10874 -3872 -14014 8810 10639 -18334 -964 14362 -5201 -4552
900 -4552 6621 -1916 -1908 13165 -5606 -4864 17186 4461 -10707 10152 16518 -7997 4358 13865
$$ packed form
809f625j0472L6537j1595k7662K4386J2288k4583K069J8639j7925P030J0278k1104
822h739M733K4118k0756j9657L5850m875k5353J4299R916j7326N532Q594k2303
835a5967J4744J3058k5636j908K8572j5566k1881K9422k638j8794J2324N748j5018
848a3540J2205N248k6081J8564J7708k5998p523L1978q919k0531K0599k420q312
861g022J2808j764j8641K2772Q300l2415J1761K2930j7494j2748K2848o447j0019
874e131J5363j0508p306J8861k108k6222K1726J2868k8746M229J8295j1245r119
887i043J6519j0703k401J6502j4746j0142K2824J829k8973J7370J5326j9563O49
900d552J1173q537QJ5073j8771P42K2050j2725j5168K0859O366k4515J2355R507
$$ plain form
914 13865 1536 5798 11516 -1113 4078 20973 -2487 -4060 19056 11000 -7156 7153 13749
927 13749 -2851 6461 6616 -2610 6933 11952 -7830 -2586 17906 -3585 -9038 8944 6004 -7808
941 -7808 2549 3030 -7381 6433 739 -11245 2137 11111 -11431 -8217 12380 -3735 -9001
954 -9001 3471 1416 -6385 5539 -2156 -9840 9639 3132 -13377 -370 13673 -7247 -6858 8370
968 8370 -2627 -2928 4290 -3024 -6358 10945 -1546 -12558 8715 6307 -11327 -3456 10391 -5928
982 -5928 -3884 4683 -5913 -1589 5904 -7025 -10770 11800 -487 -15283 2781 5908 -9027
995 -9027 -5098 3782 -8692 -115 3751 -11319 -4338 8840 -6319 -14482 8409 228 -12209 377
1009 377 2269 -8022 -615 2488 -12481 1360 6211 -10849 -6093 9919 -3757 -12866 7316
$$ packed form
914A3865j2329M262N718j2629N191J6895k3460j573K3116q056j8156J4309O596
927A3749j6600R312J55r226R543N019j9782N244K0492k1491n453J7982k940j3812
941g808J0357M81j0411J3814n694j1984J3382Q974k2542L214K0597j6115n266
954i001J2472k055p801J1924p695p684J9479o507j6509J3007J4043k0920L89J5228
968H370j0997l01P218p314l334J7303j2491j1012K1273k408j7634P871J3847j6319
982e928K044Q567j0596M324P493j2929l745K2570j2287j4796J8064L127j4935
995i027L929Q880j2474Q577L866j5070O981J3178j5159q163K2891q181j2437J2586
1009C77J892j0291P407L103j4969J3841M851j7060M756J6012j3676r109K0182
$$ plain form
1022 7316 747 -8279 1799 2145 -6928 3948 4212 -13110 3020 9840 -7586 -7145 10880 917
1036 917 -8353 5940 -82 -2849 5659 1258 -8770 7569 8961 -12288 123 10438 -2818
1049 -2818 -6041 7950 -201 -3577 7182 -3535 -4853 8016 3092 -12097 4903 9368 -9571
1062 -9571 -1960 6864 -2443 -4389 6545 -4165 -2645 8445 -4335 -7775 7452 5498 -12048
1075 -12048 2149 8096 -5367 -922 4163 -3220 -1379 7630 -6470 -2917 10023 -1346 -8321
1088 -8321 5316 6069 -8756 2116 4216 -4137 1142 3460 -5352 -1076 8584 -7047 -4333 8652
1102 8652 -55 -8643 3005 4487 -6681 1677 272 -4609 3099 3781 -8316 -1655 10259 -5514
1116 -5514 -5812 6034 2087 -4938 2785 1157 -4290 6763 58 -6018 4380 8441 -5815 -1806
$$ packed form
1022G316o569r026J0078L46r073J0876K64j7322J6130O820j7426M41J8025r963
1036I17r270J4293o022k767Q508m401j0028J6339J392k1249J2411J0315j3256
1049b818l223J3991q151l376J0759j0717j318J2869m924j5189J7000M465j8939
1062i571P611Q824r307j946J0934j0710J520J1090j2780l440J5227j954j7546
1075a2048J4197N947j3463M445N085p383J841R009j4100L553J2940j1369o975
1088h321J3637P53j4825J0872K100q353N279K318q812M276R660j5631K714J2985
1102H652q707q588J1648J482j1168Q358j405m881P708O82j2097O661J1914j5773
1116e514k98J1846l947p025P723j628n447J1053o705o076J0398M061j4256M009
$$ plain form
1130 -1806 9546 -1820 -1841 4810 1776 -1497 6759 389 -4321 8525 2759 -5447 2963 8444 -4057
1145 -4057 -660 7058 -1984 -189 3544 -1170 -2432 7674 -1959 -6561 7274 2465 -6540 -63
1159 -63 5832 -4288 58 3093 -4081 1006 3736 -4132 -4310 8417 -1195 -6956 5040 2969 -4823
1174 -4823 168 3671 -4624 3390 3062 -5735 1175 6435 -3912 -5532 8068 -190 -5325 3123 1814
1189 1814 -3580 1649 1845 -6884 4120 3594 -7449 -1370 7067 -3060 -6967 4972 -969 -3297
1203 -3297 1705 -1214 -4983 3698 1925 -9407 2428 4926 -5841 -2691 5769 -2188 -4316 4833
1217 4833 -2416 -2346 4395 26 -5056 5335 3856 -7607 3027 5580 -3684 -2133 6440 -1604 -1936
1232 -1936 5248 -2950 -1368 5710 26 -6903 5666 4694 -6875 -9 4114 -2137 -2109 3897 -3744
$$ packed form
1130a806J1352j1366k1O651l034l273Q256o370m710J2846n766q206Q410N481j2501
1145d057L397P718r042J795L733m714j262J0106r633m602J3835m809r005O477
1159f3N895j0120M346L035p174N087K730p868j78J2727r612n761J1996k071p792
1174d823M991L503q295Q014l28q797O910N260j0347j620J3600q258n135Q448j309
1189A814n394N229J96q729J1004n26j1043O079Q437j0127l907J1939n941k328
1203c297N002k919l769Q681j773j1332J1835K498j0767L150Q460p957k128R149
1217D833p249P0O741m369n082J0391j479j1463J0634K553r264J551Q573q044l32
1232a936P184q198J582P078n684o929J2569r72j1569O866M123o251K8O006p641
$$ plain form
1247 -3744 -255 5918 -4795 -4212 5481 1870 -7225 2785 3146 -4335 1126 2402 -2663 -93 5268
1262 5268 -4302 -484 7594 -1471 -3354 5269 3467 -4563 4521 3327 -1862 3438 3585 -2188 1530
1277 1530 6891 -4011 -193 6968 153 -3279 3835 2526 -3554 3577 390 -2853 3080 2223 -4716
1292 -4716 -172 5224 -4897 -2635 3284 -824 -3848 1667 -677 -4421 2883 -1940 -4565 1616 2000
1307 2000 -6066 -1704 4394 -4408 -2627 1007 -724 -2471 1789 -2507 -3770 4330 -1441 -5568 385
1322 385 3445 -4864 -1951 2112 -3166 -833 -453 -3628 -2601 3556 -3448 -5622 2511 -868 -5151
1337 -5151 -1693 379 -5087 -732 -179 -5738 -841 335 -4408 -4036 2644 -3188 -4278 2033 -1078
1352 -1078 -4282 -324 1443 -3821 1435 805 -3251 1688 2875 -2833 -2209 5561 -534 -2324 3113
$$ packed form
1247c744L489O173j0713N83R693l611r095J0010L61p481N461J276n065K570N361
1262E268r570L818Q078r065j883Q623j802q030R084j194n189N300J47n773L718
1277A530N361j0902L818P161o815l432P114j309o080P131l187l243N933q57o939
1292d716M544N396j0121K262N919m108l024N515k344l744P304m823k625O181L84
1307B000q066M362O098q802J781L634j731j747M260m296j263Q100n771m127N953
1322C85L060q309K913M063n278K333L80l175J027O157p004k174Q133l379m283
1337e151L458K072n466M355N53n559M897J176m743L72O680n832j090O311l111
1352a078l204L958J767n264N256o30m056M939J187n708O24P770o095j790N437
$$ plain form
1367 3113 1350 -565 2466 1673 -2771 4339 2477 -3288 1806 4910 -1600 -2031 4483 -1071 -525 2305
1383 2305 -458 -1604 2830 416 -4827 3098 1568 -4075 -225 3438 -2308 -1920 2698 -2785 -399
1398 -399 2700 -1500 -2870 4318 1488 -4855 2586 2914 -1626 115 3796 -945 1256 4756 -2112
1413 -2112 631 5053 1311 -2099 5371 3061 -1920 4111 3348 -641 1348 4681 -1424 1296 4709
1428 4709 -2104 60 4095 602 -3355 3991 1646 -3118 1716 1262 -1902 -153 2253 -3711 153
1443 153 3106 -3072 -2187 3347 468 -4179 2349 378 -1881 1771 290 -2586 1462 3533 -3592
1458 -3592 166 4300 -313 -1317 2852 1160 -1733 3849 582 -1292 3115 1805 -1979 1792 4102
1473 4102 -2616 406 3188 152 -854 2454 -46 -1900 3288 -942 -1965 1907 1531 -3119 270
$$ packed form
1367C113j763j915L031p93m444P110j862n765N094L104o510m31O514n554N46K830
1383B305k763j146M434k414n243P925j530n643L850L663n746L88M618n483K386
1398c99L099m200j370P188k830o343P441L28m540J741L681m741K201L500o868
1413b112K743M422l742l410P470k310m981O031p63l989J989L333o105K720L413
1428D709o813K164M035l493l957P346k345m764M834m54l164J749K406n964L864
1443A53K953o178Q85N534k879m647O528j971k259L652j481k876M048K071p125
1458c592L758M134m613j004M169j692k893N582l267j874M407j310l784L771K310
1473D102o718L022K782l036j006L308k500j854N188m230j023L872l76m650L389
$$ plain form
1488 270 2674 -3016 -203 898 -962 -1094 1946 -1580 -2127 2943 -1059 -2484 1243 1619 -2312 567
1504 567 2349 -2041 1090 1361 -921 -442 3044 -850 -970 3437 -265 -1710 1536 2399 -1761 1169
1520 1169 1266 -1335 1614 1062 -1756 -688 2814 -1362 -1994 1606 -908 -1876 -207 -353 -3026 591
1536 591 -791 -3458 -226 -168 -3485 -2557 1083 -3206 -2726 -218 -2150 -2622 -841 -1802 -4275 509 -1562
1553 -1562 -4063 -741 -137 -3526 -2918 709 -3203 -1589 26 -2315 -1887 724 -1222 -3914 1532 -912
1569 -912 -2712 -269 845 -2224 -644 1746 -2478 -199 1138 -1131 -1060 2005 -299 -2697 2529 402
1585 402 -1642 372 1448 -1374 676 2015 -2605 534 2105 -891 -1745 2721 257 -2160 2200
1600 2200 331 -1289 680 1497 -2180 614 2202 -1984 432 1827 -786 -1558 3093 167 -1516
$$ packed form
1488B70K404n690K813J101j860j32L040l526n47N070m002j425L727L76l931K879
1504E67J782m390L131K71k282M79L486l894j20M407l702j445L246Q63m160K930
1520A169R7k601K949n52k818J068L502m176o32L600k514r68J669j46k673L617
1536E91j382k667L232N8l317R28L640m289M80K508j932m72J781r61k473M784k071
1553a562k501L322O04l389O08L627l912J614J615k341M28K611j946k692N446k444
1569i12j800K443J114l069J580K390m224K279J337k269P1L065k304k398N226k127
1585D02k044K014J076k822K050J339m620L139J571k996q54M466k464k417M360
1600B200j869j620J969Q17l677K794J588m186K416J395k613p72M651k926j683
$$ plain form
1615 -1516 2167 558 -519 1400 1801 -1946 1806 2827 -1270 468 3092 1048 -1012 3321 1091
1630 1091 333 3048 744 -89 2310 3125 -1569 1731 2880 -150 606 2258 512 -806 2706 -262
1646 -262 -549 2312 606 -1600 717 1661 -2665 241 959 -1524 -675 1030 -877 -2030 1710 -1708
1662 -1708 -1604 989 185 -2440 29 1339 -2329 432 690 -925 -509 1595 -798 -508 2714 -756
1678 -756 -345 1381 1048 -1108 1126 1618 -1207 1132 620 -473 -100 1450 -953 -332 2038 -1327 -1177
1695 -1177 370 417 -2003 -235 -426 -2193 -125 -862 -1992 -1397 801 -2518 -2019 249 -1442 -1611 -926
1712 -926 -897 -2031 887 -524 -1857 638 690 -710 -484 1716 -756 800 2154 212 852 1900 1587
1729 1587 77 2967 1366 847 2428 2001 901 1385 2689 347 1604 1735 991 983 2103 659 -257
$$ packed form
1615a516L683j609j077J919M01l747L752J021m097J738K624k044k060M333k230
1630A091p58K715k304q33K399Q15m694L300J149l030P56J652j746j318L512k968
1646b62k87K861j706k206K317R44m326K906P18k483Q49J705j907j153L740l418
1662a708J04K593q04k625K469J310l668K761K58j615M16K104k393K90L222l470
1678g56M11J726l33k156K234M92k825K339n12j093L73J550k403O21K370l365J50
1695a177J547M7k420J768j91j767K068p37j130N95K198l319M99K268j691j69O85
1712i26K9j134K918j411j333K495N2j400K26K200k472J556J354j942O40J048l13
1729A587j510K890j601n19J581m27j100M84J304k342J257J31p44qJ120j444r16
$$ plain form
1746 -257 2503 254 -441 1155 601 -1005 -171 890 -1702 404 135 -1444 -646 852 -1183 -1766 1123
1763 1123 -856 -1004 138 -2 -1124 451 888 -1448 990 776 -390 -253 1717 106 -785 1796
1779 1796 212 148 1170 896 -592 1475 1496 -1282 1012 1202 -250 -862 1318 -569 -691 1166 -1125
1796 -1125 -996 148 8 -2358 -8 -197 -2184 -684 -536 -1722 -1941 529 -2109 -1550 381 -1090
1812 -1090 -1586 -593 -135 -2414 723 -53 -2026 -231 809 -576 -1356 1141 -946 -109 1053 -391
1828 -391 -719 956 896 -1539 1100 582 -424 -3 817 -502 -387 1393 -1315 -547 711 -67 -1168
1845 -1168 -127 135 -1684 615 -413 -1058 -256 550 -1083 -1138 964 -1322 -572 -149 -240 -1370 368
1862 368 212 -1604 349 -397 -714 -141 914 -945 -296 1374 -694 -212 458 262 -795 957 268
$$ packed form
1746b57K760k249o95J596n54j606Q34J061k592K106k69j579P98J498k035n83K889
1763A123j979j48J142j40j122J575M37k336K438k14j166J37J970j611q91K581
1779A796j584o4J022k74j488K067K1k778K294J90j452o12K180j887j22J857k291
1796a125J29J144j40k366K350j89j987J500J48j186k19K470k638N59J931j471
1812a090m96R93M58k279L137p76j973J795J040j385p80K497k087Q37J162j444
1828c91l28J675o0k435K639n18j006M21Q20j319J15J780k708P68J258p78j101
1845a168J041K62j819K299j028o45Q02Q06j633n5K102k286P50M23r1j130J738
1862C68j56j816J953p46l17N73J055j859O49J670k068M82O70j96j057J752o89
$$ plain form
1879 268 -716 620 163 -29 -346 825 -774 9 1268 -657 1 495 426 -682 1047 -44 -408 827
1897 827 67 -155 -187 1086 -676 288 885 -240 65 -70 165 -585 1138 -439 -712 314 80 -560
1915 -560 -785 481 -1056 259 -260 -1037 -389 60 -514 -1473 236 -1115 -569 -350 -718 -875 -470 177
1933 177 -1367 218 -221 -404 -208 460 317 -303 1496 -476 782 1198 1044 212 1360 1604 259 1923
1951 1923 1016 736 1377 2253 696 1010 2283 1017 1336 1570 1093 397 1465 996 -81 1253 767 442
1969 442 68 1043 -277 -115 439 -855 -82 -139 54 -1002 464 -264 -1353 373 -160 -563 -298 493
1987 493 -730 265 787 -370 120 866 554 -593 1486 351 -46 779 871 310 -4 1507 -388 687
2005 687 1336 323 -118 481 330 -665 978 -306 -717 23 -25 -888 -963 235 -1561 -872 -741 -1344 -1408
$$ packed form
1879B68r84J336m57j92l17J171j599P83J259j925O58M94o9j108J729j091l64J235
1897H27p60k22l2J273j762R64N97j125L05j35K35p50J723j577k73J026k34o40
1915e60k25J266j537J315n19p77O48M49n74r59J709j351N46K19l68j57M05O47
1933A77j544J585m39j83J96O68j43o20J799j972J258M16j54q32J148K44j345J664
1951A923r07k80O41Q76j557L14J273j266L19K34m77o96J068m69j077J334m86l25
1969D42l74R75j320J62N54j294P73n7J93j056J466p28j089J726n33m03K65P91
1987D93j223R95N22j157M90P46l12j147K079j135l97Q25R2n61l14J511j895J075
2005F87O49j013m41N99j51r95J643j284m11P40m8q63p5J198j796O89J31o03o4
$$ plain form
2024 -1408 -515 -761 -2117 -664 -1245 -1418 -1003 -818 -1600 -1194 -33 -1718 -615 -366 -449 -970 249 -337
2042 -337 -809 507 -325 -106 -98 923 -404 -25 855 -285 385 431 291 -353 1092 79 -447 664 -96
2061 -96 -364 -154 528 -767 -261 -20 -876 -356 -606 -523 -957 364 -678 -877 -218 -725 -507 -768 -269 -759
2081 -759 88 -180 -521 -97 84 323 -307 893 86 369 824 435 495 650 1243 189 925 733 552 600
2101 600 578 713 325 1272 17 585 585 172 314 260 808 -339 577 -402 130 59 -186 -41 -281 505 -651
2122 -651 158 -246 -153 17 122 174 -610 620 28 342 -61 345 -3 352 720 -178 614 148 630 116
2142 116 465 112 -204 550 -195 269 -119 283 -533 -270 253 -964 -83 -505 -76 -839 -5 -786 -1155 -245
2162 -245 -871 -667 -863 -132 -1427 -644 -65 -984 -242 -740 -374 -936 345 -445 -675 315 -310 -92 -272
$$ packed form
2024a408Q93k46j356J453n81j73M15J85p82M06J161j685J103K49q3n21J219n86
2042c37m72J316q32K19QJ021j327L79Q80j140O70M6j40o44J445j013n26J111p60
2061i6k68K10O82j295N06K41q56N20k50Q3m34J321j042j99O59n07K18k61M99m90
2081g59Q47k68l41M24J81K39o30J200q07K83M55l89O0J55N93j054P36j92j81M8
2101F00k2J35l88R47j255N68%m13J42n4N48j147R16r79N32p1k45J45k40P86j156
2122f51Q09m04R3J70J05N2p84J230n92L14m03M06l48L55L68q98P92m66M82n14
2142A16L49l53l16P54p45M64l88M02q16K63N23j217Q81m22M29p63Q34p81l69R10
2162b45o26K04j96P31j295P83N79r19P42m98L66n62J281p90k30R90o25K18j80
$$ plain form
2181 -272 609 -447 556 357 -142 290 436 295 -369 929 -14 389 603 -55 202 98 805 -612 317
2200 317 61 -256 132 301 299 -600 557 -361 -189 44 111 -198 118 569 -691 437 404 -210 -108 463
2220 463 392 -282 774 -151 181 124 527 15 340 564 -449 366 99 235 -99 444 -60 -368 662 -255
2240 -255 133 36 385 -634 434 234 -439 8 -52 -31 -570 248 -68 379 537 122 229 -21 669 -16
2260 -16 580 461 -19 601 400 583 -71 900 359 623 441 444 77 51 702 -253 148 101 -130 -168 -110 -333
2282 -333 -630 119 -754 -152 -411 -446 -508 -766 -396 -998 -177 -883 -572 -897 -656 -676 -740 -79 -826 -19 -669
2303 -669 -399 -284 -217 -173 -352 288 -80 286 8 162 340 289 643 -102 686 344 466 174 558 270 73
2324 73 363 41 303 -17 21 -252 -122 38 -630 -47 -640 -280 -315 152 -483 -371 31 -672 -393 -724 115
$$ packed form
2181b72Q81j056J003j99m99M32J46j41o64J298r43M03K14o58K57j04P07j417R29
2200C17k56l17L88J69kq99J157r18J72K33O7l09L16M51j260J128l3o14J02N71
2220D63p1o74J056r25L32n7M03n12L25K24j013Q15k67J36l34N43n04l08J030r17
2240b55L88r7L49j019J068k00o73M47o0K1n39Q18l16M47J58m15J07k50O90o85
2260a6N96j19m80O20k01J83o54R71n41K64j82Ll67k6O51r55M01m7k31l8N8k23
2282c33k97P49q73O02k59l5o2k58L70o02Q21p06L11l25K41k0o4O61p47Q07o50
2303f69K70J15O7M4j79O40l68L66k78J54J78n1L54p45P88l42J22k92L84k88j97
2324G3K90l22K62l20L8k73J30J60o68N83n93L60l5M67o35J12M02p03K79l31Q39
$$ plain form
2345 115 -732 -36 -368 -418 -47 -218 25 -385 381 -10 152 166 65 213 38 628 -51 673 418 184 947
2366 947 561 578 151 715 18 344 521 91 91 206 469 -282 244 -48 38 -41 -418 69 -202 233 -628 -270
2388 -270 -123 -287 -525 -257 134 -423 470 -219 -183 -167 316 -5 -36 349 -110 114 -109 253 121 658 399
2409 399 -150 707 224 371 147 377 312 269 539 112 451 39 332 -362 269 128 62 302 116 170 -251
$$ packed form
2345A15q47O96l32n0L71j71K43m10P66l91J62J4j01J48j75N90o79P24k55k34P63
2366I47l86J7m27N64o97L26J77m30%J15K63p51N26k92Q6p9l77M87k71M35q61L58
2388b70J47j64k38K68L91n57Q93o89L6J6M83l21l1L85m59K24k23L62j32N37k59
2409C99n49Q57m83J47k24K30o5m3K70m27L39m12K93o94O31j41o6K40j86N4m21
$$ [...]
8191a7
##END NTUPLES=NMR FID
##END=
