##TITLE=1H_CA-8790-1
 CDCl3, 8 sc, 
 29.10.2020
##JCAMPDX= 6.0         $$ Bruker NMR JCAMP-DX V2.0
##DATA TYPE= NMR FID
##DATA CLASS= NTUPLES
##ORIGIN= UXNMR, Bruker Analytische Messtechnik GmbH
##OWNER= root
$$ XWIN-NMR		Version 3.5
$$ Thu Oct 29 12:18:48 2020 Russian Standard Time (UT+4h)  she@DPX200
##.OBSERVE FREQUENCY= 200.1315066352
##.OBSERVE NUCLEUS= ^1H
##.DELAY= (6, 6)
##.ACQUISITION MODE= SIMULTANEOUS
##.ACQUISITION SCHEME= undefined
##.AVERAGES= 8
##.DIGITISER RES= 18
##SPECTROMETER/DATA SYSTEM= spect
##.PULSE SEQUENCE= zg30
##.SOLVENT NAME= CDCl3
##.SHIFT REFERENCE= (INTERNAL, CDCl3, 0, 15.7039)
##AUDIT TRAIL= $$ (NUMBER, WHEN, WHO, WHERE, WHAT)
$$ ##TITLE= Audit trail, XWIN-NMR		Version 3.5
$$ ##JCAMPDX= 5.01
$$ ##ORIGIN= Bruker BioSpin GmbH
$$ ##OWNER= she
$$ F:/spectra/data/she/nmr/H-F/1/audita.txt
$$ ##AUDIT TRAIL=  $$ (NUMBER, WHEN, WHO, WHERE, WHAT)
(   1,<2020-10-29 12:16:18.26 +0400>,<she>,<DPX200>,
      <created by zg, POWCHK disabled, PULCHK disabled
       configuration hash MD5:
       00 E9 B6 7A A2 85 ED C7 34 08 36 98 17 FE 4E 26
       data hash MD5: 16K
       CC 40 B6 AF A6 21 41 B5 D8 8F 0E 0A 13 12 9C 21>)
$$ ##END=
$$ 
$$ hash MD5
$$ 0C 88 29 D1 0C 06 7B 70 31 66 66 EE 64 59 D2 FF
##$RELAX= 
##$RELAX= 
##$RELAX= 
##$RELAX= 
##$RELAX= 
##$RELAX= 
$$ Bruker specific parameters
$$ --------------------------
##$DU= <F:/spectra>
##$EXPNO= 1
##$NAME= <H-F>
##$PROCNO= 1
##$TYPE= <nmr>
##$USER= <she>
##$AMP= (0..31)
100 100 100 100 100 100 100 100 100 100 100 100 100 100 100 100 100 100 
100 100 100 100 100 100 100 100 100 100 100 100 100 100 
##$AQSEQ= 0
##$AQ_mod= 1
##$AUNM= <au_zg>
##$AUTOPOS= <>
##$BF1= 200.13
##$BF2= 200.13
##$BF3= 200.13
##$BF4= 200.13
##$BF5= 200.13
##$BF6= 200.13
##$BF7= 200.13
##$BF8= 200.13
##$BYTORDA= 1
##$CFDGTYP= 0
##$CFRGTYP= 5
##$CHEMSTR= <none>
##$CNST= (0..31)
1 1 145 1 1 1 1 1 1 1 1 1 1 1 1 1 1 1 1 1 1 1 1 1 1 1 1 1 1 1 1 1 
##$CPDPRG= <>
##$CPDPRG1= <>
##$CPDPRG2= <>
##$CPDPRG3= <>
##$CPDPRG4= <mlev>
##$CPDPRG5= <mlev>
##$CPDPRG6= <mlev>
##$CPDPRG7= <mlev>
##$CPDPRG8= <mlev>
##$CPDPRGB= <>
##$CPDPRGT= <>
##$D= (0..31)
0 1.2 0 0 0 0 0 0 0 0.06 0 0.03 0 0 0 0 0.0002 0 0 0 0 0 0 0 0 0 0 0 0 
0 0 0 
##$DATE= 1603959377
##$DBL= (0..7)
120 120 120 120 120 120 120 120 
##$DBP= (0..7)
150 150 150 150 150 150 150 150 
##$DBP07= 0
##$DBPNAM0= <>
##$DBPNAM1= <>
##$DBPNAM2= <>
##$DBPNAM3= <>
##$DBPNAM4= <>
##$DBPNAM5= <>
##$DBPNAM6= <>
##$DBPNAM7= <>
##$DBPOAL= (0..7)
0.5 0.5 0.5 0.5 0.5 0.5 0.5 0.5 
##$DBPOFFS= (0..7)
0 0 0 0 0 0 0 0 
##$DE= 6
##$DECBNUC= <off>
##$DECIM= 32
##$DECNUC= <off>
##$DECSTAT= 4
##$DIGMOD= 1
##$DIGTYP= 9
##$DL= (0..7)
0 120 120 120 120 120 120 120 
##$DP= (0..7)
150 150 150 150 150 150 150 150 
##$DP07= 0
##$DPNAME0= <>
##$DPNAME1= <>
##$DPNAME2= <>
##$DPNAME3= <>
##$DPNAME4= <>
##$DPNAME5= <>
##$DPNAME6= <>
##$DPNAME7= <>
##$DPOAL= (0..7)
0.5 0.5 0.5 0.5 0.5 0.5 0.5 0.5 
##$DPOFFS= (0..7)
0 0 0 0 0 0 0 0 
##$DQDMODE= 0
##$DR= 18
##$DS= 0
##$DSLIST= <SSSSSSSSSSSSSSS>
$$ [...]
##$SUBNAM2= <"">
##$SUBNAM3= <"">
##$SUBNAM4= <"">
##$SUBNAM5= <"">
##$SUBNAM6= <"">
##$SUBNAM7= <"">
##$SUBNAM8= <"">
##$SUBNAM9= <"">
##$SW= 16.880792210976
##$SWIBOX= (0..15)
0 0 2 0 0 0 0 0 0 0 0 0 0 0 0 0 
##$SW_h= 3378.37837837838
##$TD= 16384
##$TD0= 1
##$TE= 0
##$TE2= 300
##$TE3= 300
##$TEG= 300
##$TL= (0..7)
0 120 120 120 120 120 120 120 
##$TP= (0..7)
150 150 150 150 150 150 150 150 
##$TP07= 0
##$TPNAME0= <>
##$TPNAME1= <>
##$TPNAME2= <>
##$TPNAME3= <>
##$TPNAME4= <>
##$TPNAME5= <>
##$TPNAME6= <>
##$TPNAME7= <>
##$TPOAL= (0..7)
0.5 0.5 0.5 0.5 0.5 0.5 0.5 0.5 
##$TPOFFS= (0..7)
0 0 0 0 0 0 0 0 
##$TUNHIN= 0
##$TUNHOUT= 0
##$TUNXOUT= 0
##$USERA1= <user>
##$USERA2= <user>
##$USERA3= <user>
##$USERA4= <user>
##$USERA5= <user>
##$V9= 5
##$VALIST= <valist>
##$VCLIST= <CCCCCCCCCCCCCCC>
##$VD= 0
##$VDLIST= <DDDDDDDDDDDDDDD>
##$VPLIST= <PPPPPPPPPPPPPPP>
##$VTLIST= <TTTTTTTTTTTTTTT>
##$WBST= 1024
##$WBSW= 4
##$XGAIN= (0..3)
0 0 0 0 
##$XL= 0
##$YL= 0
##$YMAX_a= 191556
##$YMIN_a= -183393
##$ZGOPTNS= <>
##$ZL1= 120
##$ZL2= 120
##$ZL3= 120
##$ZL4= 120
##$ABSF1= 10
##$ABSF2= 0
##$ABSG= 5
##$ABSL= 3
##$ALPHA= 0
##$AQORDER= 0
##$ASSFAC= 0
##$ASSFACI= 0
##$ASSFACX= 0
##$ASSWID= 0
##$AUNMP= <proc_1d>
##$AZFE= 0.1
##$AZFW= 0.1
##$BCFW= 1
##$BC_mod= 2
##$BYTORDP= 1
##$COROFFS= 0
##$CY= 11.3945322036743
##$DATMOD= 1
##$DC= 2
##$DFILT= <>
##$DTYPP= 0
##$F1P= 15.9154993809931
##$F2P= -4.1035820241983
##$FCOR= 0.5
##$FTSIZE= 0
##$FT_mod= 4
##$GAMMA= 1
##$GB= 0.15
##$INTBC= 1
##$INTSCL= 1
##$ISEN= 128
##$LB= 0.24
##$LEV0= 0
##$LPBIN= 0
##$MAXI= 10000
##$MC2= 0
##$MEAN= 0
##$ME_mod= 0
##$MI= 1.114404
##$NCOEF= 0
##$NC_proc= 0
##$NLEV= 6
##$NOISF1= 3.799351
##$NOISF2= 2.8
##$NSP= 1
##$NTH_PI= 0
##$NZP= 0
##$OFFSET= 15.70392
##$PC= 1
##$PHC0= -10687.04
##$PHC1= 11.00088
##$PH_mod= 1
##$PKNL= yes
##$PPARMOD= 0
##$PSCAL= 0
##$PSIGN= 0
##$REVERSE= no
##$SF= 200.130013532006
##$SI= 16384
##$SIGF1= 3
##$SIGF2= 2
##$SINO= 400
##$SIOLD= 16384
##$SREGLST= <1H.CDCl3>
##$SSB= 0
##$STSI= 0
##$STSR= 0
##$SW_p= 3612.71676300578
##$SYMM= 0
##$S_DEV= 0
##$TDeff= 0
##$TDoff= 0
##$TI= <>
##$TILT= no
##$TM1= 0
##$TM2= 0
##$TOPLEV= 0
##$USERP1= <user>
##$USERP2= <user>
##$USERP3= <user>
##$USERP4= <user>
##$USERP5= <user>
##$WDW= 1
##$XDIM= 8192
##$YMAX_p= 0
##$YMIN_p= 0
$$ End of Bruker specific parameters
$$ ---------------------------------
##NTUPLES= NMR FID
##VAR_NAME=  TIME,          FID/REAL,        FID/IMAG
##SYMBOL=    X,             R,               I
##VAR_TYPE=  INDEPENDENT,   DEPENDENT,       DEPENDENT
##VAR_FORM=  AFFN,          ASDF,            ASDF
##VAR_DIM=   8192,          8192,            8192
##UNITS=     SECONDS,       ARBITRARY UNITS, ARBITRARY UNITS
##FACTOR=    0.000296,      1,               1
##FIRST=     0,             0,               0
##LAST=      2.424536,      0,               0
##MIN=       0,             -183393,         0
##MAX=       2.424536,      191556,          0
$$ Real data points
##PAGE= N=1
##DATA TABLE= (X++(R..R)), XYDATA
0@%%%%%%%%%%%%%%Qj6J6j6J9k7L2l8M6n5O4p3Q8j04J19j36J58j81K07k37K69l04
36a61L42l85M32m83N38n98O67p42Q21r08J004j109J223j348J487j639J806j989
54a042K193k421K678k971L304l689M141m682N340o160P221q660J0744j4095K0770
69A2671o4239J04590j02400j34015J50268O831p2421O2576j9978n6546J49771
80C7108l6092j28528J00371J42279j67771k0230J60268m2317n1587N6382k583
91D7300j9591R4904p2391o8081J53136M088j50051M8151J37098j21141l3254P7143
103I7311l6776n940L7315q1567j7950J41862j04442j08021J33563L2288j37462
114d9819J3650Q4726p1259J5314Q260o0123M8353O9936j20062k5190J63790o4419
$$ plain form
0 0 0 0 0 0 0 0 0 0 0 0 0 0 0 0 8 -8 8 -8 11 -16 16 -22 24 -31 33 -40 48 -56 63 -73 85 -96 111 -126 143 -161
36 -161 181 -204 228 -255 283 -315 352 -390 431 -477 527 -582 641 -707 780 -859 947 -1042
54 -1042 1151 -1270 1408 -1563 1741 -1948 2193 -2489 2851 -3309 3912 -4748 5996 -8099 12671
69 12671 -51568 53022 -49378 -183393 -33125 -26294 -98715 -36139 -56117 -112663 37108
80 37108 1016 -127512 -27141 115138 -52633 -72863 87405 45088 -6499 49883 47300
91 47300 27709 122613 50222 -17859 135277 139365 -10686 37465 174563 53422 20168 97311
103 97311 60535 54595 91910 10343 -7607 134255 29813 -78208 55355 87643 -49819
114 -49819 -36169 48557 -22702 -7388 872 -59251 -10898 59038 -61024 -86214 77576 13157
126A3157r4736Q6452M9974p2700K5942K1075m2862Q2061m277r4727N9322J13171
138A41852j18861m4202J37234k8597o6293M1630J2912l6244O1119m2772p1712
149a3934J08193J4144j28598J7832J19480r2680n3452P1043k2789k3281K9255
160B5213m4457l3236J06250n5842r8520R5948M7622j08617m828R0114n3941o370
172d0664K7176l7506K0181O0676p3891m0180J33628l1499r5596O6079O0660o9909
184b0845L408M0968m2559M4845J1468p3332K5849R5317q2574o2095J12954q215
196D5189p2229K4905L0279l8830L1311j1418o1468P1706K3821r6038Q85J05720
208E3833o1749n9333O7388k461k8299K0020j3415l0454P8999k5239q5352P5731
$$ plain form
126 13157 -81579 4873 54847 -17853 8089 29164 -13698 68363 64086 -30641 28681 141852
138 141852 22991 -21211 116023 87426 21133 62763 75675 39431 100550 57778 -13934
149 -13934 94259 108403 -20195 -2363 117117 24437 -29015 42028 19239 -4042 25213
160 25213 -19244 -52480 53770 -2072 -100592 -4644 42978 -65639 -70467 19647 -34294 -40664
172 -40664 -13488 -50994 -30813 29863 -44028 -84208 49420 17921 -77675 -11596 49064 -20845
184 -20845 -17437 23531 -19028 25817 37285 -36047 -10198 85119 2545 -59550 53404 45189
196 45189 -27040 -2135 28144 -10686 20625 9207 -52261 19445 43266 -52772 -51887 53833
208 53833 -7916 -67249 139 -2322 -30621 -10601 -24016 -54470 24529 -710 -86062 -10331
220a0331N4278q9018j6540R2237l7377k4364L3670k1974N283M9129m5998m8229
232e9234J06436q701r2353M5889O3388o0406j5976M9097l3937J8502J8376n4034
244b2953O458P8121n2857o7129R3525O941p1189J6965M1616l7352J2641R950n2127
257c7390M9811L0840p6371j0141R7542m1842o7249O4775J2075l8070J2598Q192
269D770l4515N3447j390p8368N1293N8675p4034l2230Q7926k2854m2358L3635
281C997o401j0748L4149k1533n0667P8938Q437q5401K8678O6250m9527l1577N4501
294A9096k1404j217K1849l4836n739O4352k8704o8740P6854K3648o9609M946N2159
307C2655l0172p482K4007l9569K6506L3320n4393k2256Q1081j8811p1940N1105
$$ plain form
220 -10331 43947 -45071 -61611 30626 -6751 -31115 2555 -19419 -14136 34993 -11005 -59234
232 -59234 47202 38501 -53852 -7963 55425 -4981 -20957 28140 -5797 12705 31081 -22953
244 -22953 -16495 61626 8769 -58360 35165 42106 -29083 -12118 29498 -7854 4787 14737 -37390
257 -37390 12421 43261 -33110 -43251 54291 12449 -54800 9975 22050 -16020 -3422 4770
269 4770 -29745 23702 22312 -56056 -4763 53912 -20122 -52352 35574 12720 -29638 3997
281 3997 -2404 -13152 20997 -536 -51203 27735 36172 -49229 -20551 45699 -3828 -35405 19096
294 19096 -2308 -3525 18324 -16512 -22251 42101 13397 -55343 21511 45159 -24450 -19504 32655
307 32655 2483 -4999 19008 -20561 5945 39265 -15128 -37384 43697 24886 -47054 4051
319D051K5541l9543j558K0984k7840K8653R793o2658L2389N2644n4051l8180P5204
332B5429p237m7712K7642O964j3408J9778m876m4002N7999J8633p3577J7903O3568
345D7104l7987l8795N3093r927j3388J9584k0587j0314M7523j3180o5249N7736
357A5613L0404o4007n593N2157k3665k1745K7189k8769J0648K9206m1085k6398
369d6045O6490o434p1632M1545L2226l9738p973K9548k3323J2480K0070n1143
381d3929J9017N1565l9189m3083O8728O745n3558K4326J9992j7411Q646R798l7415
394b5768L7239K7518o1619M865N9827k4793m7205M7001L344k4013J3329q040j2652
407a0967L0557j940n7712M0727L3657n6174j2044M8899j3964l0372K6504j6052
$$ plain form
319 4051 29592 -9951 -11509 9475 -18365 10288 20081 -42577 -10188 42456 -11595 -49775 25429
332 25429 18192 -29520 -1878 5086 -8322 11456 6580 -37422 20577 39210 -34367 -16464 47104
345 47104 9117 -29678 23415 13488 100 19684 -903 -11217 36306 23126 -42123 15613
357 15613 46017 -17990 -23583 28574 4909 -16836 10353 -18416 -7768 21438 -19647 -46045
369 -46045 20445 14011 -57621 -16076 16150 -23588 -31561 -2013 -25336 -12856 7214 -43929
381 -43929 -24912 26653 -12536 -55619 13109 19854 -33704 -9378 10614 -6797 1849 11647 -25768
394 -25768 11471 38989 -22630 -17765 42062 17269 -29936 17065 20409 -3604 9725 1685 -10967
407 -10967 19590 17650 -40062 665 34322 -21852 -33896 15003 1039 -29333 -2829 -18881
419a8881P24K4765k6904k5535N3237M742o5696L3318L8096l5847j3236L3688j3211
432a0740q1K3541l6934R784M5919k7064m0922N6939J5124n2742J8136K5175j6583
445I552r05J5219k9633K2634K8362n2093j980N3798j7575m9073M1712J1417l1205
458B30J0935J935j5159K0501Q365n1308K8191L9340m8721j7996M9708m995l8036
471a7010K8211k728r011K0294j2089k5192L8812J6505n9770K0927M2597l0660
483A0886k1757L4328m963j3239K1933k5093o30L5795j6713m2338M2575K1528n3468
496a1156Q459K8744j6693j1176J6936k2239P440K7623m0974r750M5662p871n0331
509c5326L3415K0810l3367M428J0363j1524Q547J4219l9376J5965L9165l7386
$$ plain form
419 -18881 -18157 6608 -20296 -45831 7406 12148 -53548 -20230 17866 -17981 -31217 2471 -10740
432 -10740 -10821 12720 -24214 -14430 31489 4425 -36497 20442 35566 -17176 960 26135 9552
445 9552 8647 23866 -5767 16867 45229 -6864 -8844 44954 27379 -21694 20018 31435 230
458 230 11165 13100 -2059 18442 26807 -24501 3690 43030 -5691 -23687 26021 21026 -17010
471 -17010 11201 8473 -538 19756 7667 -17525 21287 37792 -21978 -1051 41546 10886
483 10886 -10871 23457 18494 5255 27188 2095 1465 37260 20547 -21791 20784 42312 -11156
496 -11156 -2697 26047 9354 -1822 15114 -7125 315 27938 -13036 -22786 22876 15005 -35326
509 -35326 -1911 18899 -14468 -10040 323 -11201 -2654 11565 -27811 -11846 27319 -10067
521a0067k1229M4458L926m0313K2971P709j3159J3693m695k1194K6362J9803n2160
534b3895J1335M1870k6385k6697L1232J892k1785J8261j4819p527K7623p959m0212
547c7066L0153K7243m8792J187L1801j2308j8504J8712j0547k525K5471k7598
559b2773j1437L7530J121m5256K5185K8105l0335p75J6707o422Q67J5626k7777
572a9634Q201L6597k9353k2066L8743J0069m0992J7392J4899j6049P747J953j9018
585a1511J5464K2968m4410K359M0565k0018k9355K7444Q687k6612J5100m234j0806
598a4359J9882j63l3353J9959L0182m1305m152L2879o794k1829J8105q88q765
611a0601K2234j7178j3152L1089O588m1057J8083L1330k8959n455J9257l048p097
$$ plain form
521 -10067 -31296 13162 17088 -23225 -254 7455 -5704 7989 3294 -17900 8462 28265 -23895
534 -23895 -12560 29310 2925 -23772 7460 9352 -12433 5828 -8991 -16518 11105 3146 -37066
547 -37066 -6913 20330 -28462 -27275 4526 -7782 -26286 -7574 -18121 -20646 4825 -22773
559 -22773 -34210 3320 4441 -40815 -15630 12475 -17860 -18635 -1928 -8350 -7483 8143 -19634
572 -19634 -11433 25164 -4189 -26255 12488 22557 -18435 -1043 13856 -2193 5554 7507 -11511
585 -11511 3953 26921 -17489 -15130 25435 5417 -23938 3506 12193 -14419 681 -3553 -14359
598 -14359 5523 5360 -27993 -8034 22148 -19157 -23309 9570 2776 -19053 -948 -1836 -10601
611 -10601 11633 -5545 -18697 12392 18980 -22077 -3994 27336 -1623 -7078 12179 9131 2034
624B034J5717j9494o67L2252k0718k3855L0166J4883l9863J0092K0117j6866R21
637D719N101j2675N995K0976l4176k863L5443j4388k8585K1981J4401k7491J0223
650a339K007j0576J4712J898k7697J3631L0299l6224q033L2291m390k3394J5572
663a243M882j3833J8690j0375j4991K3841J0698l7485R754L3752k6870j0320K0709
676G209n42j2844J4626j0400p309K7430j2995k3627K3925J8544l7243M801K5676
689A7251j6594m240R879p871j241K0879k4216q271L3145q167k9196J7910K0887
702B0155k8327M475J0254j0699O433O753k0217L503K9798k7576j3450K9009J518
715A1629k6044J0543J2150j5846J0968l133j2924J5359J1011k9173K573L2685
$$ plain form
624 2034 17751 -1743 -2410 29842 9124 -14731 15435 30318 -9545 547 20664 3798 4719
637 4719 9820 -2855 3140 24116 -10060 -12923 22520 8132 -20453 1528 15929 -11562 -1339
650 -1339 668 -9908 4804 6702 -20995 -7364 22935 -13289 -21322 10969 6579 -16815 -1243
663 -1243 3639 -10194 8496 -1879 -16870 6971 17669 -19816 -10062 23690 -3180 -13500 7209
676 7209 6667 -6177 8449 -1951 -9260 18170 5175 -18452 5473 24017 -13226 -8425 17251
689 17251 657 -3583 6296 -1575 -2816 18063 -6153 -14424 18721 10554 -18642 -732 20155
702 20155 -8172 -3697 6557 -4142 2291 9044 -11173 -7670 22128 -5448 -18898 10111 11629
715 11629 -14415 -3872 8278 -7568 3400 267 -12657 2702 13713 -15460 -12887 19798
727A9798k1377j4096J8931M117j5180J0221k565r867K2214p387k1624J7319K0701
740B1205l1815n89K6912j3851p901J0479l019o189J8118j5175j2599K8392l079
753A0889k6946J1969K3062k5828o99J4226r285R37P228j3145j926K6326k0243
766c435j5799K6166M363k4412O118J7029j6053N925K492j1218R936J2389k3024
779i523l186L2256j6289j6973J7824Q192j7150O497M416j2046J6450k646j8734
792a0912J1103K0380k5763p204K7468r959j1964Q426K710r432J2921q273j3839
805a4338K2537L53k3578O637K3770k1759n771J6516o392k442P041p950n205K3343
819A2762j2851j7030K2631P466k2618L050J9786j4891J677O642q501M864J1981
$$ plain form
727 19798 -1579 -15675 3256 7373 -7807 2414 -151 -10018 12196 4809 -16815 504 21205
740 21205 -10610 -11199 15713 1862 -6039 4440 1421 -4768 13350 -1825 -14424 13968 10889
753 10889 -16057 -4088 18974 -6854 -7553 6673 -2612 -1675 5553 -7592 -9518 16808 -3435
766 -3435 -19234 6932 11295 -13117 -6999 10030 -6023 -98 2394 -8824 1112 13501 -9523
779 -9523 -12709 19547 3258 -13715 4109 12301 -4849 1648 6064 -5982 10468 7822 -10912
792 -10912 191 20571 -5192 -12396 15072 5113 -6851 1575 4285 -5147 7774 -499 -14338
805 -14338 8199 8552 -15026 -8389 15381 -6378 -12149 4367 -2025 -4467 2574 -5376 -10581 12762
819 12762 -89 -17119 5512 12978 -9640 -6590 13196 -1695 -18 6624 -1877 2987 14968
832A4968j5772p314K8342j0823j8005J5166J0237j6955K034R125j1922J0596L86
845A0063j5851O201J8767k0735j0192K5462p450j3971P872N003j0619Q872k679
858G43j4361J8308K749k1023K967K4024j8505r180J7787m523n601O317k228q215
872a0741J8874p266j7112J8636Q762k0267r16K1379j2968l410Q983o609P81J0189
886H315j0726j0150K4910p026j9022J3029J1240j6365j480J3045j2371N722M045
899C166j2857J511J7905j4792j4191K4583k616j6643O562J0120j1658M333L995
912e82j3190J1969O077j5948j447K2685j2007j3273J7532J14q210L890L290q710
926g810J3071k065j5607J3965R358j6150m240K0422r267p184R000k885k034P228
$$ plain form
832 14968 -804 -8118 20224 9401 -8604 6562 16799 -156 1878 11003 -919 9677 10063
845 10063 -5788 413 19180 -1555 -11747 13715 6265 -7706 166 5169 -5450 3422 743
858 743 -13618 4690 7439 -13584 -10617 13407 -5098 -14278 3509 -1014 -6615 -298 -2526 -10741
872 -10741 8133 867 -16245 2391 11153 -9114 -10030 11349 -1619 -5029 3954 -2655 -1874 8315
886 8315 -2411 -12561 12349 5323 -13699 -670 10570 -5795 -7275 5770 -6601 -879 3166
899 3166 -9691 -8180 9725 -5067 -19258 5325 2709 -13934 -7372 2748 -8910 -4577 -582
912 -582 -13772 -1803 4274 -11674 -13121 9564 -2443 -15716 1816 1930 -6280 -2390 900 -7810
926 -7810 5261 3196 -12411 1554 10912 -5238 -9478 10944 1677 -5507 3493 608 -1426 5802
940E802m994j1233K0176k831j7912R743J2157j3635m862J4271r040J469M791q760
954d858k54J4355r008j4059K0803p1j5438M923J0864r905Q16O459j1307R078N586
969G984j3050k342J9953q877j4614J6651J550r691K880N791r466Q956J985j5247
983g537J0356J0257j3716p302K0502o374j1052R860j77m329M393K88j1619J4572
997H122J413j6480O335J2841j0625q181J4921o033k767N203m662k342J0394m240
1011C899j4313J6732K574j4769K485J1387p819l749Q475r059M501N606r308m275
1025g633J5922m482j5594J4018L142r363K35O869p043L988L764j2769P777Q371
1039G202j0181p488J6990l338j1359R203Q89m305K771K219j0453J1630K840j5171
$$ plain form
940 5802 808 -10425 9751 6920 -10992 -1249 10908 -2727 -7589 6682 -2358 -889 3902 -4858
954 -4858 -5112 9243 235 -13824 6979 6908 -8530 -3607 7257 -2648 -1832 4627 -6680 2398 7984
969 7984 -5066 -7408 12545 3668 -10946 5705 7255 -2436 444 6235 -3231 5725 7710 -7537
983 -7537 2819 13076 -640 -7942 12560 6186 -4866 4994 4817 488 4881 5169 -6450 8122
997 8122 9535 -6945 -610 12231 1606 -6575 8346 2313 -454 4749 87 -2255 8139 3899
1011 3899 -10414 6318 8892 -5877 -3392 7995 176 -3573 4902 -4157 344 5950 -3358 -7633
1025 -7633 8289 3807 -11787 2231 5373 -3990 -3755 3114 -3929 59 3823 -8946 -1169 7202
1039 7202 -2979 -10467 6523 3185 -8174 1029 1918 -2387 384 2603 -7850 3780 6620 -8551
1053h551N632J2167q827r019J4954m118n328O371l134l451Q771o77j4434J3923
1067D279M736j4055R36J2103o585o174J0086o683P74N689o046n519J2703m74j6124
1082a0354J2107N692r743j709Q663n907l9O303j0467M131Q194p254r088J5261
1096E790k36j3452P679L795n433L39M769r218O730N549j3217K385J0965n276j0961
1111i792J2919n90p224M415J35l343M397K578j2977R924O140j1714q23J0967l490
1126A522q354R527l651r19M692l524n350R818J919j4683R096O660q671l223R541
1141D400l843l105O839p472J424O990m289r192J1806K513j2933N831M796m419
1155f54k572N761o229K663N913j0201Q16R017k771j1000J1012J379q171L962J375
$$ plain form
1053 -8551 -2919 9248 421 -8598 6356 2238 -3090 3281 147 -3304 5467 4790 -9644 4279
1067 4279 9015 -5040 -4104 7999 1414 -4760 5326 -1357 -583 5106 -940 -6459 6244 5770 -10354
1082 -10354 1753 7445 -2298 -4007 4656 -1251 -1290 5013 -5454 -1323 6871 -383 -9471 5790
1096 5790 5554 -7898 -219 3576 -1857 -1518 3251 -5967 763 6312 -6905 -4520 6445 1169 -9792
1111 -9792 3127 2537 -4687 -272 -137 -3480 917 3495 -9482 442 6582 -5132 -5955 5012 1522
1126 1522 -6832 2695 -956 -1875 2817 -707 -6057 3761 5680 -9003 93 6753 -1918 -5141 4400
1141 4400 557 -2548 4291 -3181 -1757 5233 944 -8248 3558 6071 -6862 -1031 3765 -654
1155 -654 -3226 2535 -3694 -1031 4882 -5319 -4503 4514 1743 -9257 1755 3134 -5037 -1075 300
1170C00k959K157L909j0759O652P284j0469j718J0129j292r637Q718j023l312
1184b020M142q28n211O362M140j3348O303P233p087m362Q233j153n524O771m993
1199a342l97N383j824p961Q024M628j2411M322N532m015l342O189m404J97O500
1214E079q100m27P653n36j0847R007M137q996K894K765k178r03N336p828K800
1229a44P482q149k774P983Q65j0076P186Q63m093K405l88l659L253M544j1146
1244e848L737O856o325m074O806k23o514O209l546j438M462j027p255O198N726
1259C744j1953L482O201l691l764O034k576j965O660n647j336O834Q35r911O753
1274c00N670q798K351L590j609k195N722n877N01P401o716l083O793K412j0072
$$ plain form
1170 300 -2659 -502 3407 -7352 -700 6584 -3885 -5603 4526 3234 -6403 2315 1292 -2020
1184 -2020 2122 1294 -3917 2445 6585 -6763 -460 6773 -314 -4676 3557 2404 -3120 3651 -1342
1199 -1342 -1739 3644 1820 -6141 1883 6511 -5900 -1578 3954 -61 -3403 2786 -1618 -1421 5079
1214 5079 -3021 -3448 4205 3669 -7178 1829 5966 -3030 -136 2629 451 -452 4884 -2944 -144
1229 -144 7338 -811 -3585 4398 5263 -4813 2373 3236 -857 1548 1160 -2499 754 5298 -5848
1244 -5848 -2111 4745 -1580 -5654 1152 929 -5585 624 -2922 -4360 102 -925 -8180 -1982 3744
1259 3744 -8209 -4727 1474 -2217 -5981 53 -2523 -4488 2172 -3475 -4811 2023 2858 -7053 -300
1274 -300 5370 -3428 -1077 2513 904 -1291 4431 -1446 -945 6456 -260 -3343 3450 5862 -4210
1289d210N570L061n383J405J398k769M75N605r006J104P673m673n284N838K664
1304C468q075N070l83k164K596R87n383K939O857r338J089O098j739m703M918
1319B237K93l637N571l559j446M588J683p886L921N901p624Q64L320n85l359M519
1335D801l658j359O517n132k997M882K540r187M018M211n719P04J980j929j210
1350a538N613p021p1O625l077m965M428L539p572L880J263k688K268J394m184
1365b106J321O902p640m27O206j228n087M132J928n040M848j753k471L188K281
1380E054o761J233P170p151r44L893L08m747L630q46l677N431l140l181K937L684
1396B893p660J268N160m615n47K153l13k632M681m039j429N576k109l716L177
$$ plain form
1289 -4210 1360 4421 -962 443 1841 -928 -453 5152 -3854 -2750 4923 250 -5034 804 3468
1304 3468 -4607 463 80 -2084 512 1499 -3884 -945 5912 -3426 -2337 3761 2022 -2681 2237
1319 2237 2530 -1107 4464 905 -541 4047 5730 -2156 1765 7666 42 906 4226 3641 282 4801
1335 4801 1143 -216 6301 1169 -1828 3054 5594 -3593 425 4636 -1083 -379 1601 -328 -1538
1350 -1538 4075 -2946 -3017 3608 531 -4434 -6 3533 -4039 -159 1104 -1584 684 2078 -2106
1365 -2106 -785 6117 -1523 -1950 4256 3028 -2059 2073 4001 -1039 3809 2056 -415 2773 5054
1380 5054 -1707 -474 6696 -455 -1399 2494 2802 -1945 1685 839 -2838 2593 -547 -3728 -791 2893
1396 2893 -4767 -3499 1661 -2954 -3501 -1348 -1661 -4293 388 -3651 -5080 496 -1613 -5329 -2152
1411b152M153o643K387K445k646J157J452j992q68O555n733j155N670m10m626
1426b406K638L342n602L922o62j976J442K704n136L7O798n695j494L669L81m243
1442b281K789L62l494M610j906k890K242L665o176M33N266m247n68J815O10l400
1458c170M399k428k380N339j493l639J674M707o002J156L103k737M91R95q17j967
1474b769N253l849j908M587k94l699J106L997n537K567P71k140Q22K615l557j311
1490c346O447m809j407L043J237l907J886J886m490L989p06k440J111L971m943
1505b478p89N412l166j329J855J328l628L132p4l527M170k59k800N16M575m626
1521a688o31M082k119j81J067K03k674M960k293k523M019L69l369K60M455m345
$$ plain form
1411 -2152 2001 -4642 -2255 190 -2456 -1299 153 -1839 -2707 3848 -1885 -3040 2630 2220 -2406
1426 -2406 232 3574 -2028 1894 1232 -744 698 3402 -1734 -1697 5101 -594 -2088 1581 1962 -2281
1442 -2281 508 870 -2624 1986 80 -2810 -568 3097 -3079 -2646 2620 -1627 -2195 -380 230 -3170
1458 -3170 1229 -1199 -3579 1760 267 -3372 -1698 3009 -2993 -1837 1266 -1471 -980 15 -802 -2769
1474 -2769 2484 -1365 -3273 1314 1020 -2679 -1573 2424 -3113 -546 225 -1915 -1093 1522 -2035 -3346
1490 -3346 3101 -1708 -3115 -72 1165 -2742 -856 1030 -3460 529 -177 -2617 -1506 2465 -2478
1505 -2478 -3267 2145 -1021 -2350 -495 833 -2795 337 263 -3264 906 647 -2153 -1637 2938 -1688
1521 -1688 -2319 1763 -356 -537 530 733 -1941 3019 726 -1797 2222 2591 -778 -518 3937 -408
1537d08J114J476j399q3K151j514k658N686k666k365K516J608l711M87L155l843
1553d54K195p4j614L0L179l237j854N121k845j537J519J530l047J969L79l176
1569a916L481n24k035J38M545m204q26M149j845r17J206R28k792L768r25k908
1585f77L374R49k983m02M624l596k59K185j376l19J228k87l128M584k026k544
1601f53K130J367k588j080L346l480J089M34j196p18K275j687k745M546j531k205
1617b696Q70J745k542N40J599k955K098N77j243q16L694k355j640L317r56p98
1633a561N50J739k791K468l7k243K302N91j560j275M062k974l81K173j409l55
1649g01R48N74l278L791j177k213J546J539k246r46L519l063N14J443j237o47
$$ plain form
1537 -408 706 2182 783 700 2851 1337 -1321 4365 1699 -666 1850 3458 -253 234 3389 -454
1553 -454 1741 1667 53 83 3262 25 -1829 3292 447 -1090 429 1959 -1088 881 1260 -1916
1569 -1916 1565 1041 -994 -856 3689 -515 -1341 2808 963 46 1252 2180 -612 3156 2231 -677
1585 -677 2697 3646 663 261 4885 1289 1030 3215 1839 1520 2748 2461 -667 3917 1891 -653
1601 -653 1477 2844 256 -824 2522 -958 131 565 -631 -1349 926 -761 -3506 1040 -491 -2696
1617 -2696 -1826 -81 -2623 -2083 -484 -3439 -1341 -764 -2007 -2823 871 -1484 -3124 193 -763 -1561
1633 -1561 -1011 728 -2063 405 368 -1875 427 1018 -542 -1817 2245 -729 -1110 1063 -346 -701
1649 -701 247 821 -2457 1334 157 -2056 -510 1029 -1217 -2163 1356 -1707 -1193 250 -987 -1634
1665a634K081k46k960M026j204j572Q50K197k325K62K384k779K058Q2q41j052
1681f73L333j253k133L160r74p74N0J651k422J311R86k873J829O40j326j539L372
1698B365k257j260K456j255m43J17J089k915K380J28k090J113J029j000j680L422
1714A199j952k46R26n20j64P43Q48l173L659q68j742Q15J704j246p95K486k439
1731g65R11M68l72j450K269k94k950L160l16j069m23J718k056M79J489k727J496
1748d32K42k24k060K983r24j755K124o60j72n55J646k157J867K71j811J146N71
1765A00k65j796L085j849k72J277o82m50O35Q21k658K631l24j631K50J512r81
1782e97j746K879k083M28M57k50j085J325Q46l291K924n11o02j12J624j072o46
$$ plain form
1665 -1634 447 201 -2759 1267 63 -1509 -659 1538 -787 -525 1859 -920 1138 1220 379 -673
1681 -673 2660 1407 -726 2434 1460 686 736 2387 -35 1276 2262 -611 1218 1858 532 -1007 2365
1698 2365 108 -1152 1304 49 -394 -277 812 -2103 277 405 -1685 -572 457 -543 -2223 1199
1714 1199 -753 -999 -73 -593 -757 -14 834 -2339 1320 452 -1290 -475 1229 -17 -812 1674 -765
1731 -765 146 614 242 -1208 1061 767 -2183 977 661 -408 -831 887 -1169 -690 799 -1928 -432
1748 -432 -190 -414 -2474 509 -415 -2170 -46 -706 -878 -1433 213 -1944 -77 194 -1617 -471 100
1765 100 -165 -1961 1124 -725 -997 280 -402 -852 -217 604 -2054 577 253 -1378 -1128 384 -597
1782 -597 -2343 536 -1547 -1119 -662 -912 -1997 -672 174 -3117 -193 -704 -1306 -1418 206 -866 -1512
1799a512K318k425J537M17l1j479K495n7k005K102n45K73m62K023k108Q89J116
1816B546j851M68N93O38k759K833q93j119R66k92l92q16J709k318J008K32j024
1833d71R7K14L18j864K301j682L65j3J73q14M91J238k433K354m25l85k10J284
1851E38p23l68J753j833J411j07N27j439J650L32j942J968o73l68n66J621j700
1868H1J91J478j819P52M1J31k197K241o84j372J565p96J0n67J225j996R98O48
1886g0j201M94J57O33k046K907j219k29R65m6k13k39K178k793K082K36n30l16
1904G50Q69M71j822K216j376M37l83Q37j053J58J326k276J507o69J65j232J349
1921A274r04r80J634j570O89l08N89j747J302J45j342R29k06L99j120J825j650
$$ plain form
1799 -1512 806 -1619 -82 335 304 -1175 1320 1263 -742 1360 815 1088 626 2649 541 1430 2546
1816 2546 695 1163 1756 2394 -365 2468 1575 456 1422 1130 738 -78 1631 -687 321 553 -471
1833 -471 -374 -160 158 -1706 595 -1087 -722 -735 -562 -1376 -885 353 -2080 274 -151 -536 -746 538
1851 538 -185 -553 1200 -633 778 671 1198 -241 1409 1741 -201 1767 1094 726 160 1781 81
1868 81 272 1750 -69 683 724 855 -1342 899 215 -1157 408 -388 -378 -945 280 -1716 -718 -70
1886 -70 -1271 -777 -620 13 -2033 874 -345 -574 391 345 132 -107 2071 -722 1360 1596 1066 750
1904 750 1619 2090 268 2484 1108 1545 1162 1999 946 1104 2430 154 1661 992 1157 -75 1274
1921 1274 370 -610 1024 -546 143 -165 424 -1323 -21 124 -1218 -289 -495 -96 -1216 609 -1041
1938a041N11R26j174O53r2R85j945J871l07o06Q62k62j3n13J606j752J101O2m34
1957D38m75L38N31j566J750j280Q1J42J09n34l42J395k066J214j40k90n72J129
1975a38m62r24J652j388O72k67R14j311Q30R08j795J233m57N46j215J708q75l06
1993f75Q73j128N73k47J042j951J311q7r37O96n12K86j319J915j755N25M01p33
2011a722J8K00O74j804J508n02K18kM27k78m14J671j306J037q4K69k49O11N30
2030H02j002J619q84P94n97Q90p15L43Q54j344J127n02L56j021J000o51n28R10
2048A451q66N92j055J155j698J004l6r90O67m70N59j251J413r40q5N42l66R6m20
2067f98J284j442J304m28j05L17j79M37o81J531j568J215j15N5j22L31J95j489
$$ plain form
1938 -1041 -530 396 -778 -125 -217 768 -1177 694 387 -219 643 381 368 -145 1461 -291 810 872 438
1957 438 -37 301 832 -734 1016 -264 -183 -41 68 -466 -808 587 -1479 -265 -405 -695 -1267 -138
1975 -138 -600 -1524 128 -1260 -588 -855 59 -1252 -422 486 -1309 -76 -533 13 -1202 506 -369 -675
1993 -675 198 -930 -357 -604 438 -1513 -202 -289 -1226 -530 -1042 -756 -2075 -160 -1915 -1390 -989 -1722
2011 -1722 -1704 -1504 -830 -2634 -1126 -1628 -1410 -1412 -985 -1263 -1677 -6 -1312 -275 -359 -90 -339 272 802
2030 802 -200 1419 535 1329 732 1622 907 1250 2104 760 1887 1385 1741 720 1720 1069 541 1451
2048 1451 585 1177 122 1277 -421 583 547 -443 224 -246 313 -938 475 -465 -550 -8 -374 -278 -698
2067 -698 586 -856 448 20 -85 232 53 490 -191 1340 -228 987 872 927 805 1136 1331 -158
2085a58J842j218L10j52K45n51j40R23j540P80m65P31j466R68k02j036J242j004
2103h91N21n98J024j268M89M19r51R27l69P27j376J491m34m49P36l18Q71r96J409
2122I64j530J124J48n44J10K21L11j083J615j368L37j73J08k80l10R69j548J219
2140B90r31O4j31J22rp61J287j423R79q40P36l98N6Q02j318J270q55Q12p29Q73
2160a04k21j84J182j320J125o20Q28j065J077j43m10J154j080Q42j076J282j058
2177B09P89l5p41M22j64L98j175J265j123J95J84q5ll43R44j310R42j92k82k5
2197a30K39L61r50J451j018O22k55M06m57k1R66j502J430p08M53q81J028l97p91
2216a54J121r47P17o62M78o33J81K10p16O32o60O68q59P30q83M47K59n09L39o46
$$ plain form
2085 -158 1684 466 776 624 869 318 178 1101 -439 341 -124 607 -859 109 -93 -1129 113 -891
2103 -891 -370 -968 56 -1212 -723 -304 -1255 -328 -697 30 -1346 145 -289 -738 -2 -320 551 -445 964
2122 964 -566 558 706 162 272 493 804 -279 1336 -32 305 132 240 -40 -350 619 -929 290
2140 290 -641 -577 -708 -586 -595 -1356 -69 -1492 -513 -1353 -617 -1015 -959 -157 -1475 -205 -1060 -248 -977 -104
2160 -104 -325 -509 673 -647 478 -142 686 -379 698 555 145 1299 219 1061 -15 1267 209
2177 209 998 963 222 644 480 878 -297 968 -155 40 224 139 136 -207 737 -573 369 177 -105 -130
2197 -130 109 470 -480 971 -47 575 320 726 269 248 1214 -288 1142 434 887 6 1034 637 -154
2216 -154 967 20 737 75 553 -80 101 311 -405 227 -433 235 -624 106 -777 -330 -71 -580 -241 -887
2236h87P34j044J117m77J05K16l43P30n66P27j147J076m5l27K75j23P11j269J327
2255G90j195P04j5q5k19l4N45j459J061o16L62l08K05K97j141R36o90Q00r17Q74
2275a05n89m0P80j354J479o51O95j045J057m12l77J062p66N66j96P87j154J069
2293H06j90l24O34n13N09o99R02r62N02m8l43O5o31R37j242P05q00J64k99J68
2313f59q3l14Q16j104O60o80K90l0j0K73p27J009p44Q51l80N65j41J2P53q17J220
2334G60n62P34l60M69P2m57J039q40P77j91N20j126Q66J15r62N38n79N70j069
2353C14Q37p12J91n6p70L93o44Q43j324O81o38P7K53m58J95m60R67j065Q14m34
2373i96J58J39k25R78j111J196o77O10j85M11j64J88P32r87O47k45O62p10L28
$$ plain form
2236 -887 -153 -1197 -80 -557 -452 -236 -579 151 -415 312 -835 241 196 -131 144 21 732 -537 790
2255 790 -405 299 284 199 -20 -54 491 -968 93 -523 -161 -469 -264 33 -1108 -172 -862 -62 -979 -105
2275 -105 -694 -734 46 -1308 171 -480 215 -830 227 -185 -562 500 -266 300 104 891 -263 806
2293 806 616 292 926 413 922 223 1125 163 665 617 274 339 -292 645 -597 108 -692 -528 -827 -659
2313 -659 -742 -1056 -240 -1344 -684 -1364 -1074 -1104 -1114 -841 -1568 -559 -1303 -452 -832 -267 -408 -396 357 -460 760
2334 760 198 932 572 1041 1113 656 1695 855 1632 1441 1961 835 1701 1816 854 1392 813 1383 314
2353 314 1151 439 630 574 -196 197 -447 396 -928 -247 -885 -808 -555 -1013 -818 -1278 -311 -1376 -562 -996
2373 -996 -838 -699 -924 54 -1057 139 -538 72 -113 298 134 322 1054 67 714 469 1131 421 749
2392G49K20q35P70p74Q47p41O93p59O7K35q46O81q64Q75r32P05o86L37L89o86
2412e55M63o82J035j125Q60j57p3M76o11R04r69J248q40L90K40l38L30l86J064
2431A274j581R42l28M05l90j53J16l82P74j100R21p00K12m16j32J91p90P23q94
2450a308Q14p16L29k07L0M44p19O45o18N12l73M27l9l15J240j179Q62l16P13l93
2470a67J42K21r6L31k88O44o76Q68p58J80J84n76M20n98J045j269R25j84m55L78
2490B71k56j07n69J044j217M33k07L11l64l98J008j042R03o46N63k24J57k66j99
2509h05R33o28M63j40M83n82M44J12m58J009j014O94n75P30m71oO93o32L88m59
2529A79R91j080P58l92k90L18l71L36o08J080j260P45j70l12M03l39K07m56Q55
$$ plain form
2392 749 969 134 904 130 977 236 929 170 237 472 -374 307 -557 318 -614 91 -595 -258 131 -555
2412 -555 -92 -774 261 -864 -4 -161 -234 242 -369 535 -434 814 -26 364 604 266 596 210 1274
2431 1274 -307 635 307 712 322 169 285 -97 677 -423 498 -202 10 -406 -538 -347 -1137 -414 -1308
2450 -1308 -494 -1210 -881 -1088 -1058 -614 -1333 -688 -1306 -794 -1167 -740 -779 -1094 146 -1033 -171 -487 226 -167
2470 -167 -25 196 100 431 143 787 111 979 221 401 585 9 429 -169 876 -393 532 348 -107 271
2490 271 15 -92 -661 383 -834 -401 -608 -297 -661 -1059 -51 -1093 -190 -836 -273 -497 -340 -606 -805
2509 -805 128 -500 -37 -177 306 -276 168 280 -178 831 -183 511 -64 666 195 189 882 250 638 179
2529 179 1170 90 848 456 166 484 113 449 -159 921 -339 406 236 -76 327 -12 195 -261 594
2548E94q92M58n8K52m11k05O94r41R84n39L27n61L57j1n02J382j308O13j38M23
2568E18o43K45K58n17N86p41P97l54O24n10m53J005q71Q12o09R26j144P90k38
2587D81j86L75m11M56p42J013q78M44m5j91J89m18N95r25Q66r40L01M20q98J16
2607c78k58P96j215R05r35L14N7j46L0o10R55n93J77q4K48Q9l90P33o30Q61n31
2628f05L47m6M96j62m93J309p95M38n73Q61m97O58j04m62N42m05L65n42Q75q95
2648C12o0P66o36L9n84Q42j174R97m11n26M44j55m4n32Q23q87K19J67k30J97k33
2669f66L76m90J007q85L51j3J08L70m68Q16o99Q01n89J60k4L84o1m11P79p97O42
2690F91m83L97k96q6K66n95O32o89J95m06P97o33j89N38m42K49p58P33m78N18
$$ plain form
2548 594 -298 160 102 354 -57 -262 432 -509 475 -64 263 -298 59 48 -454 928 -380 233 95 518
2568 518 -125 120 378 -139 447 -294 503 149 773 263 -190 815 -56 756 147 1073 -71 719 481
2587 481 295 670 259 715 -27 986 108 552 507 316 505 87 682 -243 623 -317 -16 404 -494 -378
2607 -378 -636 160 -1055 -150 -1085 -771 -714 -860 -830 -1440 -485 -1078 -901 -985 -737 -648 -1038 -305 -935 -74 -605
2628 -605 -258 -304 192 30 -463 846 51 489 -84 777 280 938 834 372 914 509 874 332 1207 312
2648 312 252 1018 382 421 -163 679 -495 502 91 -435 9 -146 -190 -722 101 -786 -567 -400 -630 -433 -666
2669 -666 -290 -780 227 -658 -307 -320 -212 158 -310 506 -193 608 19 179 155 539 478 67 846 49 691
2690 691 208 605 309 223 489 -106 526 -163 32 -374 423 -210 -399 139 -303 -54 -812 -79 -557 -39
2710c9m1n94P05m78L42n86J405p15KJ44PM0K54L04o06J034m43j58J30K81k66k73
2732D49R04q94J21L2o8m06M93j10j157J015q85N24n38M55n22m16P28q46M05l08
2752a024l5l89O29n25j28M70k60K98k89P65o43L44L63l19O60l15M92l79J018l22
2772D11p2O54m07J34j62P48j045R54j40o19L28J65k24o60Q46r55J88M9l52J33
2792b6l55L25j055J154o92p9j71M75m32m34R64p64K51n8L39o45O65Q5q92J381
2812C6m12L32k23O40n94L04O49q66J035n76N17q72J171m74l95N53k77K44m62P24
2832A054j021O78k33n82L76j57K84j144J112l86m69J98j05j5j28N13j096J331
2850B10l36l07RK86Nq16J374p04N58l45J05k40N26K56r05J149m09M8j55P52n49
$$ plain form
2710 -39 -80 -674 31 -447 -105 -691 714 -1 1 145 152 192 446 750 144 1178 735 577 707 988 722 449
2732 449 1353 459 580 612 544 138 631 521 -636 379 -506 18 -520 -65 -587 -1003 -275 -1121 -716 -1024
2752 -1024 -1059 -1448 -819 -1344 -1472 -1002 -1262 -964 -1253 -488 -1131 -787 -424 -743 -83 -398 94 -285 733 411
2772 411 339 993 586 720 558 1306 261 1215 1075 456 784 949 725 65 911 -44 144 193 -159 -26
2792 -26 -381 -56 -1111 43 -649 -728 -899 -424 -856 -1290 -326 -1090 -839 -897 -558 -1203 -538 -453 -1345 36
2812 36 -376 -44 -267 373 -221 83 732 -134 901 325 842 -30 1141 667 272 825 548 792 330 1054
2832 1054 33 711 478 -104 272 115 399 -745 367 -19 -488 -290 -395 -410 -538 -25 -1121 210
2850 210 -126 -433 -424 -138 -133 -949 425 -279 279 -66 39 -201 325 581 -324 825 416 464 309 1061 512
2871E12r9O71p06N19p2j89l97O49p8q38P93l41M0o65R01j029O07K81j243Q39j00
2892E5J71r88R63k07l80L51o4j23k08N63q74P97j25j17k59N76n0j082J702j062
2912c61K84MJ4k71K99N37j487J280l47j43n27J099k70n09Q49q23N45k21O2m39
2932d25P35k5q67P51j13J09p17Q97r62M85O03q97N00KJ31j232J278J97r22N35
2952F3j33j12j31P55r03O26J51m96k8L01K56j038J081m49J55J14J10n65N0R11
2972G18j427O77M16j90n12O78m0q14J168r33K09o8L91p32L50N92j288P40K8j45
2992a82n94J067n42k33O67q72K48J61L51j169J395j47q13Q45j73r0n96J185q75
3011c67K91N80n26R3L94N84j454J479m19n4M31l14k52J05R09r48O11K69q11q2
$$ plain form
2871 512 413 1084 378 897 825 636 239 888 810 -28 765 424 464 -201 700 -329 278 559 -684 155 55
2892 55 226 -762 201 -6 -386 -35 -99 -222 -430 133 -741 56 -69 -186 -445 131 81 -1001 701 -361
2912 -361 -77 -73 -59 -330 -31 506 -981 299 -48 -191 -718 381 111 -398 451 -372 173 -48 14 -425
2932 -425 310 285 -582 169 56 165 -552 345 -617 -132 471 -426 74 76 207 -1025 253 450 -472 63
2952 63 -70 -182 -313 442 -461 165 316 -180 -208 93 349 -689 392 -57 98 212 322 -243 -193 718
2972 718 -709 -32 384 194 -318 360 320 -494 674 -259 -50 -118 273 -459 -109 483 -805 -65 -37 -182
2992 -182 -776 291 -251 -484 183 -689 -441 -280 71 -1098 297 150 -663 182 9 -81 -677 508 -367
3011 -367 -76 504 -22 71 465 1049 -405 1074 655 601 1032 718 466 571 1480 532 1143 1412 601 519
3031E19M86J46j285J027p86ML76k58o86L48N56j515Q53j46k18n24O32l06m42Q78
3051c41r63K77j12O64j229J014J8p10L71O49k14m07J209r06L32J001p06j14N44
3070C77O72j236P17K09n63N92J13k96m2Q34j360J01Q24l00o63P49l34j039J145
3089E00o36l24J96P3o88P4J339j725K69N56r8q84M63M12p16R46r21L58J21N47
3109a38r69Q40Q01j168K24N07J39n27R05l85j55J085p78j3K07N77j284Q02M07
3128A077n83J37j25J10n63J013j130k7P53o82n64M40P62j696J136m29j42L44o4
3147b33m67J00J172j433K86O09J37p06N65M57j160J232n87J87J99N20o94L29P98
3166A311j468P48L5N03j148Q55l32r6Q78j003l9K55O50j727M74Q47o20k24K37
$$ plain form
3031 519 1005 1151 -134 893 107 111 487 229 -457 -109 447 -1068 -215 -361 -579 -1103 -471 -777 -1219 -341
3051 -341 -1304 -1027 -1139 -475 -1704 -690 -672 -1382 -1011 -362 -576 -983 226 -680 -348 653 -53 -167 377
3070 377 1049 -187 530 739 176 768 881 585 543 1377 17 118 942 642 -21 728 394 -645 500
3089 500 -136 -460 -264 -191 -879 -805 534 -1191 -922 -366 -464 -1348 -885 -473 -1189 -243 -1164 -806 -685 -138
3109 -138 -1107 -267 534 -634 -410 97 236 -291 614 229 74 1159 381 368 575 1152 -132 670 1077
3128 1077 494 631 506 616 53 1066 -64 -91 662 -20 -584 -144 618 -1078 58 -371 -513 -169 -233
3147 -233 -700 -600 572 -861 -575 34 171 -535 30 487 -673 559 -28 159 358 878 184 513 1311
3166 1311 -157 591 626 1129 -19 836 504 408 1286 283 244 499 1149 -578 -104 743 123 -101 136
3185A36O9r97J133q69j84P11m30k73J45R59j558O88K87q24Q08L5j13m82J468j370
3205f61J45J106l14n95O68O38j634Q84J45j67M9M71q17J25J172j515J32M17K68
3224E17o00K18L05q98O91m16m09J65J011j648Q5J455q78k99L62J24m68P98m51
3243c36o53J280m91m42J50J329j537N11O21o28N40K09k29m76J495j334j0R46k83
3262F62o44J33J106j299N69L44n83J66J66m47m79J204r63k65M72K36r81K43O19
3281B59j136R60n03j68JN44q55l71J710r65l24M52L70p74P18j80q60J250j13p51
3301g36N31J309j630L94R18p36O6J81J52o29J014n51k84Q40O3q85K12J068j192
3320A05O2N21k82m08P34n10n78J333j113l30O83O54j472K30J068j184N27J7j91
$$ plain form
3185 136 205 -792 341 -528 -712 -1 -431 -704 -559 400 -1158 -470 -183 -1007 -199 -164 -277 -759 709 -661
3205 -661 -516 590 276 -319 349 987 -647 237 382 215 264 735 -82 43 1215 -300 -168 249 517
3224 517 -83 135 440 -458 233 -183 -592 -427 584 -1064 -979 476 -402 -701 -339 -215 -683 115 -336
3243 -336 -989 291 -200 -642 -492 837 -700 -189 432 -196 344 553 324 -152 1343 9 -1 945 662
3262 662 18 151 1257 -42 527 871 288 454 620 173 -306 898 -65 -330 142 378 -603 -360 259
3281 259 -877 83 -420 -588 -587 -43 -898 -1269 441 -524 -848 -396 -26 -800 -82 -262 -1122 128 15 -736
3301 -736 -205 1104 -526 -132 786 50 116 297 449 -180 834 283 -1 839 902 17 229 1297 105
3320 105 167 688 406 -2 732 222 -356 977 -136 -466 217 871 -601 -371 697 -487 40 57 -134
3339a34j98Q17r14n88J580p29n74L07P68r96N44k22l53R33k59n14J6J236j320
3358f00J63Q90o58j19L98M30p35J062n79o95J026oo67l72J586r14n48Q88l74J54
3378C30j23j64o59J669j206m32R29K57r44M2J263j493L82R8k51k44J065q23n36
3397h40J457n79q13L57R24j112M16N41j064P63m0m55j69J627j366o53J662o59
3415ck95O9N18q63O91j7r78J256o7r47j01J505j052n05Q69n01k1RO6p70J333n37
3437c41q51P98K72o52k04J374j188J23M03k2k04N43k22j209J918o02n20M82O70
3456E68r31j34J189r14O79k95q2p6J237n76j143J476n16k58j58J081j196N49K46
3475G46r69O68J71q90l54J527q43p81J002O4n76l4N66r60R37k8j161J019K56k51
$$ plain form
3339 -134 -332 485 -429 -1017 563 -166 -740 -433 335 -661 -117 -339 -692 241 -18 -532 -516 720 -600
3358 -600 -437 453 -205 -324 74 504 -231 831 252 -443 583 577 -90 -462 1124 210 -338 550 176 330
3378 330 207 43 -616 1053 -153 -585 344 601 -343 -301 962 -531 -149 -51 -302 -546 519 -304 -840
3397 -840 617 38 -775 -418 506 -606 -190 351 -713 50 10 -445 -614 1013 -353 -1006 656 -3
3415 -3 -298 -229 289 -574 117 100 -878 378 311 -636 -737 768 -284 -789 80 -421 -442 -433 -367 -1137 196 -341
3437 -341 -1192 -394 -122 -774 -978 396 -792 -669 -266 -288 -492 51 -171 -1380 538 -64 -584 -102 568
3456 568 -363 -497 692 -222 457 162 80 4 1241 665 -478 998 482 224 66 1147 -49 500 746
3475 746 -223 445 616 -274 -628 899 56 -725 277 341 -235 -269 297 -663 274 246 -915 104 360 109
3495A09r60J605q34k16L72K24m83O88n0r57J711n10q53L81J031r76m09J335q32
3514C76R0N54m90n94R70m80j091J559j83j095M58P16r01J50M49j346R85N39q94
3533b28o61J420p20r73J380j00j38m39P22r38Q43K06j148P61N20n27q86J881o90
3552B85m91M88Jj47L98K53j325J312J5j489Q35R66r44p89J252m43o06N76m59j30
3572d42O08j16j306J438j3p84k04Q12n30k01O41q43M59K90n97l39J202n1j325
3591a301J187K56p29P6Q34o82L12N54j239P83M85m57j032J662k45j184J100j04
3609B76k58K22K49j205J327J53j438N63R85m69j344J640o48k98L77m5m89R03j72
3628C29j318J280N88j554m1J185m95q10J337p67K65L48m67p99J579J8j553R20
$$ plain form
3495 109 -851 754 -80 -296 76 300 -183 505 455 -502 1209 699 -154 227 1258 282 -127 1208 376
3514 376 466 1020 530 -64 906 426 -665 894 711 -384 74 790 -111 39 488 -858 127 666 -228
3533 -228 -889 531 -189 -1162 218 118 -20 -459 263 -675 168 374 -774 -13 507 -20 -906 975 285
3552 285 -206 282 283 136 534 787 -538 774 789 -700 135 1101 157 -632 620 177 -429 147 -312 -442
3572 -442 166 50 -1256 182 169 -615 -819 -7 -537 -738 -97 -940 -481 -191 -788 -1127 75 24 -1301
3591 -1301 -114 142 -587 -511 323 -359 -47 507 -732 51 536 79 -953 709 464 -720 380 276
3609 276 18 240 489 -716 611 764 -674 -111 874 405 -939 701 53 -245 132 87 -402 501 329
3628 329 -989 291 879 -675 -716 469 -26 -836 501 -266 -1 347 -120 -919 660 678 -875 45
3646D5O30q42m84J163p00j9M70p13M76L05k56j162J831j80j352P89J70l63j7N08
3666B99j034P71L80j089K63R27k53j298J389k81l23O1j5j34M17M36j540J107P08
3685G91j237j3J283n03r58J069l70J01L26j22r71J202M66k167J330O38p43p44
3703f22J310o12l17J000j235J72Q65l63j326J542K70j642O53Q30j028L4P45q92
3721f16M76O11j400L96J138p06j287J607Q4r02L86K73l50R2P51j511Q96Q70j133
3740c25n26J343k08j247J369k08m84N66p0o61O51O98j799R67Q98r36n12Q61Q3
3759D60n16Q79r40q2N66L06j526J178N28j396N20N52l28q72J160o07L2Q01j178
3778d63n3J168j75j580J245K59q09K93L42k47j08O19j286M96R52q59p02J403J73
$$ plain form
3646 45 675 -167 -651 512 -188 -207 263 -450 26 331 75 -1087 744 564 -788 1 171 -192 -209 299
3666 299 -735 36 416 -673 -410 517 264 -1034 355 74 -249 -188 -203 -337 80 516 -1024 83 791
3685 791 -446 -459 824 321 -637 432 62 163 489 367 -604 598 1064 -1103 227 865 122 -622
3703 -622 688 76 -241 759 -476 -304 561 198 -1128 414 684 -958 -305 525 -503 -469 276 -616
3721 -616 -140 471 -929 -533 605 -101 -1388 219 303 -599 -213 60 -290 -198 553 -958 -62 808 -325
3740 -325 -851 492 284 -963 406 198 -286 280 210 -451 200 898 -901 66 964 28 -484 377 460
3759 460 -56 823 -117 -199 367 673 -853 325 853 -543 -23 529 201 -671 489 -118 -86 715 -463
3778 -463 -516 652 477 -1103 142 401 -408 -115 227 -20 -128 491 -795 -299 653 -206 -908 495 668
3797F68j375R90J47k26o5M2n18O17O43j602K32J470r52r99J360Or82J083n99r1
3817a51K80L3j025Q76J054j948K73R85j02r92J080m15k83R20p56l76R98K03j811
3836a157J209Q77j509M32L41J33n47J052j021P8J086r91l78P41O27j701R87N83
3854H42p60R8J88k94J2R10j578K97J335r54q25J153K94j430Q27j16k79M49K40
3873D09j234P53P80j584J87R75o5j327J240r1o43Q77q12j03R39K42j775O82J421
3892H71j488K80N86q8l74O04r08M19R17o00j133J356M61j827P92O64n69m44R30
3911D49m53j42J131j617L5J369o51j266R85P42j231M59K89o52O45J33q66L5J519
3930I13j511j08R74J14j240P63L86p21O56k67l63L56O03j471N92J178j113k87
$$ plain form
3797 668 -707 283 430 204 139 181 -337 280 923 -679 -447 1023 71 -928 432 438 -544 539 -60 -151
3817 -151 129 162 -863 13 1067 -881 -608 377 275 -717 363 -52 -335 585 -171 -547 451 654 -1157
3836 -1157 52 929 -580 -148 193 326 -221 831 -190 -112 974 -17 -395 346 973 -728 259 842
3854 842 82 180 368 74 86 996 -582 -285 1050 96 -729 424 718 -712 115 -1 -280 169 409
3873 409 -825 -72 708 -876 -689 286 221 -1106 134 43 -600 277 -535 -638 301 543 -1232 -550 871
3892 871 -617 -337 249 161 -213 391 -517 -98 819 219 -914 442 903 -924 -132 532 -37 -481 449
3911 449 -4 -146 985 -632 -597 772 121 -1145 -160 582 -649 -190 99 -553 92 225 -641 -606 913
3930 913 -598 -706 268 382 -858 -95 291 -430 226 -41 -404 -48 555 -916 -324 854 -259 -546
3948e46P19K48r22O10n6o04J187n06j076Q51J101j786K17J094p98k90N16r9n39
3967f79J287j100m19J585r38p54O09J266j530O66K56j59j43O08q59lJ497j407
3985b17l50J225J64j226N16P96j155P00M5m82O10J83j095J00J501j160m86Q57
4003E26M4r40P70k49k73P87q13p34Q34J019j830J95J477r29l29M15M57q83R28
4022D72o22m73J433j96j251L58J463j352k90Q01k94j35M25m09k96J433j260p73
4040i66J516K97j494N63Q70j038K50L1k76K02P92j376n9J696j036o01Q36O13j386
4059e66L65N39p93P82n00n19L28J617j806k99J728q00n22N28M28p26O71p04j39
4078c88J122m41j005M53J605j735o0Q96m36j44j3K70n11J359j051r44J107P19
$$ plain form
3948 -546 173 421 -501 109 53 -551 636 130 -946 -95 1006 -780 -563 531 -267 -557 -41 -140 -679
3967 -679 608 -492 -911 674 -264 -1018 -409 857 -673 -7 249 90 -53 555 -304 -307 1190 -217
3985 -217 -567 658 822 -404 112 908 -247 453 498 16 626 809 -286 -186 1315 155 -331 526
4003 526 570 -370 400 151 -122 665 -148 -882 -48 971 -859 -664 813 -116 -445 -30 427 -456 472
4022 472 -150 -623 810 614 -637 -279 1184 -168 -458 343 49 -86 339 -70 -366 1067 -193 -966
4040 -966 550 847 -647 -84 786 -252 -2 29 -247 -45 747 -629 -688 1008 -28 -629 207 820 -566
4059 -566 -201 338 -455 327 -173 -692 -364 1253 -553 -852 876 76 -446 82 510 -216 455 -249 -388
4078 -388 734 293 -712 -259 1346 -389 -449 447 11 -133 -146 124 -387 972 -79 -1023 84 803
4096H03j670K62J309j180P0K02m05J54R14j000n22J739n35j221J074O77j378K14
4114d93Q43o70O09j33n87J38J341j155p79J886m25j147N50N95q36O19k33n78R06
4133D51J09j015K30J368j124n44J138j50o76K22K76p35J043m07j230J393N73j394
4151d72QJ419j049r0L07k00p6M45k34q26J744r29j111J152R25j349j58R20n31
4170a05Q4J56n48J37J064j042q86J866n02j026O01J035j139K19L75q48Q86l0j081
4189g84R9J416r54q70J176P6n79K24M45q44J121m11j075R58P66j363j56J812j265
4208b08l69O83Ok84L05o9r71J732o00j212R52Q19r24m38J187m73k7L4k55MQ81
4229G73n71j206J712n23r47K13J279r40j27M10o52P81L11o85p70J596p21j217
$$ plain form
4096 803 -867 -605 704 -476 -406 -204 -609 -455 459 -541 -1063 676 141 -1080 -6 671 -707 -493
4114 -493 350 -320 289 156 -431 -293 1048 -107 -886 1000 575 -572 -22 573 -263 356 123 -455 451
4133 451 560 -455 -225 1143 19 -525 613 463 -213 9 285 -450 593 186 -1044 349 922 -472
4151 -472 -464 955 -94 -184 123 -77 -153 292 58 -768 976 47 -1064 88 1013 -336 -494 426 -105
4170 -105 -21 135 -413 -276 788 -254 -1140 726 224 -802 -201 834 -305 -86 289 -559 327 297 -784
4189 -784 -685 731 -223 -1093 83 159 -420 -196 249 -595 526 115 -960 -2 764 -599 -755 1057 -208
4208 -208 -577 106 112 -172 133 64 -907 825 225 -987 -35 784 -140 -578 609 136 109 143 -112 -108 773
4229 773 202 -1004 708 185 -762 -549 730 -210 -337 73 -579 202 513 -172 -942 654 -67 -1284
4247a284J853k11q15J36L79o55P94M7j353J071Q08j020p90K002p91p55P68J67
4265C51n31K88J28j093J541k2j471N32J271q83o23J323q62o2m0M05n67P94L7j561
4285a045J833K97j468K2J239q32l53O59o42K99J49k99m20J559p20j234J251M68
4303G63j029j01R82l61k55N81j027M51R68j092o46J698l47j103O36K4j51J8J71
4322A80p56R77j35r46O54R52p85j090J576m40o46N66k45k14O23j20j171J140O35
4341G55j413O8J009n81o34J131n02J1M65m40m95J358l93j384J218L84q28j43R35
4360E21o75j28P83q64N25N78n99q65J607j42j623R50N97p29k77O88n75N44N18
4379H34j359l0J594p70j272J500n7p51N31k00j04K40n3q71J115M27j314k57J641
$$ plain form
4247 -1284 569 358 -457 -321 58 -597 197 244 -1109 -38 770 -250 -1040 962 171 -584 184 351
4265 351 -180 108 236 -857 684 662 -809 -277 994 111 -512 811 -51 -113 -153 252 -315 479 516 -1045
4285 -1045 788 1085 -383 -361 878 46 -307 352 -290 9 158 -141 -561 998 278 -956 295 763
4303 763 -266 -367 615 254 -1 580 -447 4 972 -120 -766 932 585 -518 118 142 -9 9 180
4322 180 -576 401 266 -680 -26 926 141 -949 627 187 -459 107 -138 -352 271 151 -1020 120 755
4341 755 -658 -590 419 -162 -796 335 -167 -156 309 -131 -626 732 339 -1045 173 557 -271 -414 521
4360 521 -154 -282 501 -363 162 740 141 -724 883 741 -882 68 665 -64 -341 347 -228 316 834
4379 834 -525 -555 1039 269 -1003 497 440 -311 220 20 -84 156 103 -768 347 774 -540 -797 844
4398H44q80j075J343l11j71K52j64n32R20M4j339R66P39r81l61R53k50k72L78
4417A03m00L27N70l88j384J729J79j658Q11O47m27k71M46m67K03N57j088K57J061
4436H07k68j706J344M78j294O21N18o91J88L60j213P52N29r06k53J446l06j329
4454i23R92M15n32K15k05k15K72M38j218P58P48j019k19J047j07j093J078m84
4472e2j96P00l81q19J236L9j276O65M54n38m49J133l72n96J259j235J40P09k53
4491A68j366J287M42q61N3M75k10j74K94m49J75Q64j124l10J440j98j627J242
4509A21L85o32K77J6k53R4Q57j274M87Q75p76n84R64r6o28M25K68l43L51l26o67
4530d59Q13N13j299J25J061p75p19J182n00m28Q09o59L2O17q9j378J224M71q82
$$ plain form
4398 844 -36 -1111 232 -79 -250 2 -162 -694 226 270 -1069 -103 636 -345 -706 247 -3 -275 103
4417 103 -297 30 600 212 -1172 557 736 -922 -111 536 109 -162 284 -183 20 577 -511 -254 807
4436 807 539 -1167 177 655 -639 -18 500 -191 -3 357 -856 -104 425 -481 -734 712 406 -923
4454 -923 69 484 -48 167 -38 -253 19 457 -761 -3 745 -274 -493 554 447 -646 432 -52
4472 -52 -248 452 71 -748 488 527 -749 -84 370 -168 -617 516 144 -452 807 -428 -288 421 168
4491 168 -1198 89 531 -330 -277 198 -12 -186 108 -341 -166 698 -426 -736 704 506 -1121 121
4509 121 506 -126 151 167 -86 8 865 -409 78 953 177 -407 557 461 -167 258 526 183 534 208 -459
4530 -459 354 867 -432 -307 754 -21 -740 442 -58 -486 323 -336 -304 313 224 -1154 70 541 -341
4549c41j3O14k95n57O65m52o9J090r01m16J055l2j309P87M74o60Q8K65m93O33
4569A33L11j159N72O53o65o02J035M27j404M97L24k24L43j97n32N87M61j288K22
4588e06R33k34q02N83L09p93O03p02q6J149R5j302J076O81j624L05L80N00p80
4607b15M81m18l36J124q40j73P60L49j556O59R26q84j3K01k3j18O83j265L79Q30
4627E51k37j039R32M26j198N85L05l71n7K56m54L99N81j347J70Q96j93j005O57
4646a43M52k55J69j98l24O12P7r82N06J227j480L0Q72j95p62R75k86m68P56l20
4666B63l77M04O49j141K35Q79o11n99O52j41l29P56o22r3O48n51l48L36P83j385
4686e92O1P81j79l57N61o14J99Q16j133k83J135k09j045Q17M31r19N79J15o15
$$ plain form
4549 -341 -354 260 -35 -592 73 -379 -448 642 -259 -675 380 348 -961 -174 300 -360 -272 -7 -500 133
4569 133 444 -715 -143 510 -155 -757 278 705 -699 -202 122 -102 241 44 -488 99 560 -728 -506
4588 -506 427 193 -609 -26 283 -510 93 -609 -695 454 549 -753 323 1004 -620 -315 65 565 -215
4607 -215 266 -152 -488 636 -204 -377 383 732 -824 -165 761 -123 -136 65 42 -76 607 -658 -279 551
4627 551 314 -725 207 633 -565 20 325 -46 -103 153 -301 98 679 -668 -498 398 205 -800 -143
4646 -143 309 54 223 25 -299 313 390 -592 -86 1141 -339 -309 563 368 -394 581 295 -173 583 263
4666 263 -114 290 939 -202 33 912 301 -298 354 213 -116 640 18 -75 573 22 -326 10 793 -592
4686 -592 -531 250 71 -286 275 -339 -140 676 -457 -740 395 186 -859 -42 389 -530 49 164 -451
4705d51N42M20j243K86J158r32m27R88J41j162Q56O9l47J65j01k38K45O69j237
4724e99K24J127r92k07M76K35q00Q39l52l48P75m46p54N90R86j198N3R31p56l2
4744b48L50N1l55Q54r45l27J133r9j097P65M90j124N20M09m58n4N26o32O4J006
4764H29r45l84O53L31j029O48K18p75M59J1m67M24N38r43j83J119n71m59O09R4
4784A77o77L82K42n79R15j75o82J91Q51j110k12J254o44l58O75j04l58P96p98
4803b14m5O05N27j272J76R30q79N6J93J04l38M40m29j42Q05o49n10Q39L92r97
4823d08J78J142j124L06j29j28J67N46p40j54J006n72p96M35R29r75M24R8m73
4842b68O30k14n18M9J059r05m69J098l73l46R3M13n85O53j69p98P42M23j044K14
$$ plain form
4705 -451 91 511 -732 -446 712 -220 -647 341 482 -680 176 245 -102 63 -38 -276 -31 638 -599
4724 -599 -375 752 -240 -447 29 264 -536 303 -49 -397 378 -68 -822 -232 754 -444 -391 540 -216 -248
4744 -248 102 153 -202 652 -293 -620 513 414 -683 82 572 -552 -32 377 -81 -135 391 -241 -177 829
4764 829 -116 -500 153 484 -545 103 321 -454 5 16 -451 -27 511 -432 -615 504 -67 -526 83 177
4784 177 -500 -118 124 -455 460 285 -397 -206 645 -465 -677 577 -67 -425 250 146 -212 584 -214
4803 -214 -259 346 873 -399 -223 707 -172 -116 77 181 -157 283 -146 -288 517 -132 -642 197 589 -408
4823 -408 -230 912 -212 94 -35 -163 4 550 -190 -344 662 90 -706 -271 658 -317 107 205 -268
4842 -268 362 148 -370 -321 738 -167 -636 462 89 -257 -164 249 -336 317 148 -650 92 515 -529 -315
4862c15R48j012o8L80j00J11K69l81n20Q85k54q82R91L77p46k13J203q91M0J27
4882e1p2J23M39m35n61J368n82n96L66L90p25J74J22o7N40m50l75M6J125q11m20
4903d52R69j78n91O9N98p03P22k83o04O27K41n36m01J354j030k52P54q8n39M13
4923I0R4m50N41j84q64R58M65r61l42J316q85j02M92l06j98O90l09o86J030mq54
4944d69J40R72j160O07K96n53K34J27l91j48R14m60n79Q25J98q11L1Q33o94L74
4964B86m4m71M54M83q53k56J255l80p43O50L5m47M20J58m67K90p3p48P45K25o44
4985a25m58Q35k58k74M87l30j56M92j32o50O94M2p06J89O59p84j79Q50o42M65
5005A9J44m89N7P27l72j009J278k07k08q2O04l77j02K59m55L89M97q40j40J105
$$ plain form
4862 -315 633 -379 -447 -67 -167 -56 213 -168 -688 197 -57 -939 52 429 -317 -530 673 -218 -178 -51
4882 -51 -123 0 439 4 -557 811 229 -367 -1 389 -336 -162 -40 -107 433 -17 -392 -346 779 -32 -452
4903 -452 517 339 -252 -183 415 -288 434 151 -453 174 415 -121 -522 832 -198 -450 304 216 -323 90
4923 90 184 -266 275 91 -773 185 650 -311 -653 663 -222 -324 168 -138 -336 354 45 -641 389 385 -469
4944 -469 -329 643 -517 90 386 -167 67 194 -197 -345 569 109 -470 355 553 -258 -227 606 -88 286
4964 286 242 -229 225 708 -145 -401 854 474 -269 381 416 -31 389 547 80 370 297 -451 294 519 -125
4985 -125 -583 252 -6 -280 207 -123 -279 213 81 -569 125 167 -539 -350 309 -475 -654 196 -446 19
5005 19 163 -326 -269 458 86 -923 355 148 -60 -142 462 85 -17 242 -213 176 673 -167 -307 798
5025G98n47p74P49P8n18K44L57p31P15j14p84N58L17m96m19J069o00n05O14Q0
5045I1l55J62j20j06N49K52j029N52M18o33l39O51j6j47N0j41q9Q70m63p06Q79
5066C30K08n90k70O83l97k14O04n40j29M71k72n40Q23k87q87R20K91n27j32M48
5086gm60N81j15p71N61N62m93p58J463m66o04M06J12k6n9K66n22M68P9l86j5O34
5108D50k0o52O85J2p81N44j21j81K71o1m61M85L74q63L9P60n37j94N29m76J46
5129e2J32o9n40O84L9o54N06K4l68j42M43j48J06M16l60j24M14l81l74Q56L1n87
5151a48MM41j04j23K81q62O97J94m49k21N56m8o51P24l0m54J66Lk13L07R9p98
5173f29P44J75n57k54O98l80j12O23n58K86K7j26m04P10J74n88O8M85m78l10N86
$$ plain form
5025 798 251 -523 226 304 -214 30 387 -344 371 257 -527 31 348 -148 -567 502 -98 -603 11 91
5045 91 -264 -102 -222 -328 221 473 -556 -4 414 -219 -558 93 77 -70 -20 -161 -250 620 157 -549 330
5066 330 538 -52 -322 361 -36 -250 354 -186 -315 156 -116 -656 167 -120 -1007 -87 204 -323 -455 -7
5086 -7 -467 114 -1 -772 -211 351 -142 -900 563 97 -507 -101 11 -15 -74 192 -330 138 217 -169 -184 450
5108 450 430 -222 463 475 -306 238 117 -64 207 146 -315 170 544 -319 -280 480 -57 -251 278 -198 -52
5129 -52 80 11 -529 155 194 -460 46 70 -298 -440 3 -145 -39 377 17 -107 307 -74 -448 408 439 -148
5151 -148 -144 297 193 70 351 -511 186 380 -69 -290 266 218 -433 291 261 -193 -27 -24 -237 70 169 -629
5173 -629 115 290 -267 -521 177 -203 -315 308 -250 36 63 -63 -467 243 417 -171 -103 382 -96 -406 180
5194A80J39k43J30l19j3O81k02q59O43N15p68m0M56j49l77L04k87K73M59o09l7
5215a23N65l23o87Q50M18q02O2M66n46lL80l66k6O75o68k42N01K6o23M79j8J09
5237A04k09J44j94J76L57r36M07J70K97q77O24k53k08N29k24J24k9J34m43L85
5257G8L55r39O24R5r0l90N31l10J18L29k44n27Q06k03k93M66J29o57J99J32k15
5278fL38K2m04L74J94m27n85O88O9p71L94K98k83k4qk01K26L64q01M92N09n36
5300g8p57P87J72m33M06k33K3J06m9m60M22M19o46J4O37j97n73P39l85NL40l56
5322i7m0L56lo44P26J54o91J45K20k85L9J14j86K7M13l04k31L71J13n64M15q4
5344c6m5l15M43k49P4M00n12j5O12l22m11M81K04l68K40k32j11K28L19p52N70
$$ plain form
5194 180 319 76 206 -113 -126 555 353 -506 137 652 -116 -156 300 151 -226 78 -209 64 523 -86 -123
5215 -123 442 119 -568 282 700 -102 -40 426 -120 -123 257 -109 -135 540 -128 -370 131 157 -466 13 -5 104
5237 104 -105 39 -155 21 378 -558 -151 19 316 -561 63 -190 -398 131 -93 31 2 136 -307 78
5257 78 433 -506 118 213 123 -267 264 -46 72 401 157 -370 436 233 -60 406 535 -122 77 209 -6
5278 -6 332 354 -50 324 518 91 -494 194 263 -508 -114 184 -99 -123 -131 -332 -106 258 -543 -51 458 -78
5300 -78 -835 -48 124 -309 97 -136 -113 -7 -56 -516 -94 325 -321 -307 330 133 -440 299 -86 -81 259 -97
5322 -97 -137 219 216 -428 298 452 -239 -94 126 -159 -120 -6 -192 -165 248 -56 -287 84 197 -367 48 -36
5344 -36 -81 -396 47 -202 -128 272 -240 -255 357 35 -376 105 309 -59 181 -51 -162 66 385 -367 203
5365B03N25r35RM74j26o08M13j03k1K77M7m94M31K96p36J05M44m87NK15k81k84
5387f31L52j58Q8M74j31m89M44K86p90K90M89j92k10L82j01l87P76n95M3J82r1
5408C1j25M52J07n08K08P0o8j03N66q21L31M40o64p0K34j06l31M49j25k77L64
5429E4l51J19j45M41q95N11M32o48N5J35M50n06L24J50n35N52j95j80j85O95o43
5450c65K25M28m16J60M1k53L00K56l36k1M56k17n92K43M94m18J82r3j0j38M10
5471C36p9l14N30q78p7M38R4l82J87J99l87K26k40K79J68Q9n81j29Q81m44k41
5492c25L06K47l29R4J23j99N35n4o86M11M67q45M40M17k15k50Q3J23k08J91p8
5513B48l33N83k94l86J64L59m69J3M98k85k84J49m2k38M62l51k21O73jl80J24
$$ plain form
5365 203 728 -207 -198 276 150 -458 -45 -148 -169 108 155 -339 92 388 -348 -243 201 -286 -281 -66 -347 -631
5387 -631 -279 -437 -349 125 -6 -495 -51 235 -555 -265 224 32 -178 204 103 -284 492 -103 -60 122 31
5408 31 -94 358 465 -43 165 235 167 64 630 -191 140 580 -84 -154 80 -26 -357 92 -33 -310 54
5429 54 -297 -178 -323 118 -777 -266 166 -482 -427 -292 158 -348 -24 126 -409 143 -52 -232 -417 278 -365
5450 -365 -140 288 -128 32 73 -180 120 376 40 19 475 258 -334 -91 403 -15 167 74 64 -74 336
5471 336 257 -57 473 -405 -482 -44 50 -332 -145 54 -333 -107 -347 -68 100 189 -392 -521 360 -84 -325
5492 -325 -19 228 -101 -7 116 -83 452 398 -288 123 590 -255 185 602 387 137 220 343 135 326 248
5513 248 -85 498 204 -182 -18 341 -128 -115 383 98 -186 -37 -79 -317 145 -206 -427 246 245 -135 -11
5534a1K08n64L24n6n5K1L58l32k83N33j53m20O02M84j052M42R2l84K70N02n45
5555a9k70O85m39p8K40l2l70O57k51m22M25pj93J75n5j49j82P45n68n9K44n3K61
5578B85l38M9k22O17k86k97O28j85l35j00M75k68p3Nk6J34j65O6j27M91o16J3
5600b75L5M57n38j2L23j62L00l74J67j58N72n19k12M33l7M4M2lk72J08K79l85
5622a87L33K4m11m0N39l98M9K74k73K02p9k7j64N12j82m59L20J82l16p5M50n00
5644b26L7K27Q2m57M65j15m85P75m27l7P8K95m01n8K43k43J59J38k09O9M87m60
5666f3j98O19l36n75L22N24n74M02j98j57P9J08j41j8M45m64j82N21k53r8n6L77
5688H4n50L40J43l72K30K10j20m42O25l17O7J04J93k94K65J76n15N80m52j7M9
$$ plain form
5534 -11 197 -367 -43 -99 -154 -133 225 -107 -390 143 -10 -430 172 656 -396 46 138 -246 24 526 -19
5555 -19 -289 396 -43 -121 119 87 -283 374 123 -299 126 119 -74 101 46 -103 -285 460 -108 -167 77 24 285
5578 285 -53 -4 -226 391 105 -192 436 251 -84 -184 291 23 -50 -45 -71 63 -102 -36 -163 328 -288 -275
5600 -275 -240 217 -321 -333 -10 -172 128 -246 -79 -237 335 -184 -396 37 0 44 86 83 -189 -81 198 -187
5622 -187 146 170 -241 -281 258 -140 -91 183 -90 112 33 6 -158 354 172 -287 33 215 -101 -176 274 -226
5644 -226 -189 38 120 -337 128 13 -472 303 -124 -161 -83 212 -189 -247 -4 -247 -88 50 -159 -90 397 -63
5666 -63 -261 358 22 -553 -231 293 -281 121 -77 -234 -155 -47 -188 -206 239 -225 -407 114 -139 -237 -293 84
5688 84 -466 -126 17 -355 -125 85 -35 -477 148 -169 -102 2 195 -99 166 342 -173 407 -45 -62 -13
5709a3N57n87J62J06j13M01l42j2k89N63m21j78N06k45p8j85L37K9k30j80K89
5730G7r7Q0j64K00J30j88m80O57j65j78o5M48n03K79L25n37M45j71M6n11N65j23
5752G0n1J50LOj80K05k41K60L0k85o5K84R9l32L37r9j25Q3k9l30M03K4n99O13
5776B31o5k35k79M81k20q8J54k97K02l58K28K6N28l73j61l2L86m14K39P8j15J52
5798F8J44l19R6J24l0M1K68k69p9R8m7j37JL44l51J97N8m49L12n9j38j73M31k28
5822i7L9k41K75j59j18K77m98L10K23j99j86M63k31k39L58M3k46qL7M5M20Rm26
5845a49K37K95k65J41M1m22L17Q1m03K56J79j18k43M05j18j65J66N1J59n33K62
5866A74K0j41O0l81J70J80N8m20K36q9J3J73M4rj20J83k92K06O6j69J59K49j27
$$ plain form
5709 -13 544 -43 119 225 112 513 171 159 -130 433 12 -166 340 95 17 -168 169 198 -32 -212 77
5730 77 -20 60 -104 96 226 38 -442 215 50 -128 -193 255 -248 31 356 -181 264 93 139 -372 193 70
5752 70 19 169 172 178 -2 203 -38 222 252 -33 -98 186 285 -47 290 191 66 149 120 -210 193 217 -382 231
5776 231 166 -69 -348 133 -87 -175 -21 -318 -116 -474 -246 -220 308 -65 -226 -258 128 -286 -47 31 -84 68
5798 68 212 -107 -11 113 83 124 392 123 44 142 95 -42 -41 303 -48 149 207 -242 70 11 -127 -300 131 -97
5822 -97 -58 -299 -24 -183 -301 -24 -522 -212 11 -188 -374 89 -142 -381 -23 20 -226 -234 -197 -152 268 277 -149
5845 -149 88 383 118 259 300 -122 195 276 -127 129 308 190 -53 352 234 69 235 286 445 -88 174
5866 174 194 53 113 -268 -98 82 140 -280 -44 -133 -120 53 97 88 -32 151 -141 65 131 -38 121 370 243
5889B43m25M58n19K73K8L2q3K46R7m98L43J43m86J71J57l79K92r6J44k68j07J23
5911a11k9J55K7r0p5j34O4LO9l39K70K75l46J88j7J14n70O70j68j41K17j24J18
5934B6q6p8J7K34j19j18K67k9K81m55L19j51J5j34K63O1j24j24k33L27p5K6j93
5957h3J85o6l39J61M7n1K32j56k15j46L17l67J98J23n1k56O59n06K01R3k69J14
5979a75J90J12n65O02r8k06N3J69j7k35N93p18L16O1j61K15n5j17k33L67l1j16
6001d9nJ21j60J50J60j87J66k38l8o2J86jo5K37m89M37J9K65o39M29J1o22M12
6024C8J28k04m9K33k59j69M17k56O0q8J13k25K47Q2m04rL51N9j99J79R9o6Q1j02
6048E7ql24M51n01k2M13J57l89J23j96K11J47r4J44r0J95m37J22K63l44J72k20
$$ plain form
5889 243 -182 276 -243 30 58 90 7 253 350 -148 195 338 -148 23 180 -199 93 -3 141 -127 -234 -111
5911 -111 -140 15 42 -48 -123 -257 -193 -190 -121 -460 -190 85 -261 -73 -90 24 -546 124 -44 -185 32 -92 26
5934 26 -60 -138 -121 113 -6 -124 143 114 395 -60 259 108 123 -11 252 313 189 65 -168 159 84 110 -83
5957 -83 102 36 -303 -142 -95 -146 86 -70 -285 -431 -114 -481 -283 -160 -211 -467 192 -314 -113 -20 -289 -175
5979 -175 15 127 -438 164 66 -140 -87 82 65 -170 423 -295 21 82 -79 136 81 -36 -269 98 67 -49
6001 -49 -54 67 -93 57 217 30 196 -42 -80 -142 44 43 -22 215 -274 163 182 447 -192 237 248 -374 38
6024 38 166 -38 -87 146 -113 -282 135 -121 -61 -149 -36 -261 -14 68 -336 -345 6 65 -134 45 144 78 159 57
6048 57 49 -275 176 -325 -347 66 223 -166 -43 -239 -28 119 25 169 79 274 -163 -41 222 -122 50 -170
6070a70K23J6P6j81J3P2N8q8j52J85k56J68K86l22j8J83j88J6K09k81M6K55j20
6093C0L23k98J23k35K73k57J95n6Q1k99L23o5k17K8J28J7k45L65j26j0J06l15
6115a31K02R2j65n8q2L58q8J61l52p9n2J07j51n3K47j34M2j61M39m39K62o6j61
6138b62L58k49j70L96J09m44J85K40k75J74PJ60m06M18m01L7P1N3J38j98J26l2
6160C5j12J40k56K45j24m2k13N09m38K11m7J59k51J72r2j53k5J50K53kp1j74R5
6183c1J43k90q8K45K37j17j73L33m01L73k52K73l32L36j94j4J06j18M3j11J22
6204I0nr5m6N4L3J29j41L8m2j43J21k9j01J04L6J6k87J79l01L43m2Jj50K71k9
6229Dj35J7J83P3p1K06j51M2L26n2k24P6l0j90K7J72j64L59j91J08L1j03k07l6
$$ plain form
6070 -170 53 69 145 -36 -23 49 107 19 -133 52 -204 -36 250 -72 -90 93 -95 -79 130 -151 -105 150 30
6093 30 353 55 178 -57 216 -41 154 98 179 -120 203 138 -79 -51 77 94 -151 214 88 78 184 -131
6115 -131 71 163 -2 -60 -142 216 128 289 -63 -142 -194 -87 -238 -291 -44 -178 -136 -297 142 -297 -35 -101 -262
6138 -262 96 -153 -323 73 182 -262 -77 163 -112 62 69 229 -177 241 -160 -123 -52 1 139 -59 67 35
6160 35 -77 63 -193 52 -72 -114 -327 182 -256 -45 -92 67 -184 -12 -104 -257 -282 -132 121 119 48 -126 -31
6183 -31 112 -178 -266 -21 216 99 -74 259 -142 231 -21 252 -80 256 62 48 154 36 79 -32 90
6204 90 85 -10 -56 -2 31 160 19 57 15 -128 -7 -36 -137 -33 3 19 -268 -89 -390 -47 -89 -88 -238 33 4
6229 4 -131 -114 69 142 71 277 126 168 494 442 218 294 264 74 101 273 109 468 277 385 416 313 106 70
6253G0L09l82J9j60J88J59J3l10OkN0J44N5n3m52M7K89k24K1J0K26k70J97k94
6277c44M79l6m71K73l6K96l00N4J18k66K29j4J92l23L71j85k51L20R4k25j04J13
6299a6J69j27l2k20M3J47O3j45L25l81k7J24j18R9k4Q0j41K67k06L3M2j5j18K13
6323C5O5k67K43j9j95k13L74J31j42J76j99J7Q6J55j73J09L7p2K9k63N2j45M13
6346B34m33J27M54l27j89J17J33j70k44K31MjQ8K47k18J25j15j54Q0j87M07l62
6368a53M97l25Q9q6o0J50K8O1l73M83k24q4QK95j58j03K25k54Q2n1J34k12J87
6391A56j77m6K98j78N1l36L42j52k21L21l0j73K35j19r0K22j3J45m14K45j57K44
6413A53L9k96L82l44R6q0K5N8j2J31l33R3J90j80J44Kj34J82J33k47k7j10K78
$$ plain form
6253 70 379 -3 16 -144 44 203 216 -94 -88 -90 -40 104 159 106 -346 -299 -10 -234 -213 -203 23 -247 -50 -344
6277 -344 135 99 -372 -99 -135 161 -139 -85 33 -233 -4 -18 174 -149 222 37 -214 106 200 -25 -129 -16
6299 -16 153 26 -6 -226 -183 -36 27 -118 207 -174 -201 -77 -195 -96 -120 -40 -181 86 -120 -87 -45 -60 -178 35
6323 35 100 -167 76 57 -138 -351 23 154 12 188 -11 6 92 247 74 183 220 148 177 -86 -34 -179 234
6346 234 -199 -72 382 55 -134 -17 116 -54 -298 -67 -63 -64 24 271 53 178 63 -91 -11 -198 209 -153
6368 -153 344 19 108 22 -38 112 140 201 -172 311 87 3 11 306 148 45 270 16 98 47 181 -31 156
6391 156 -21 -67 231 53 104 -232 110 -42 -263 58 28 -145 90 -29 -119 103 90 235 -179 66 -91 153
6413 153 192 -104 278 -66 30 -50 -25 33 21 152 -181 -88 102 -78 66 68 -66 116 249 2 -25 -135 143
6436A43m19K06M8J03K3l01K36j35K08k82J18k36O18k28l0J67n0Kl49p9K14O7J48
6459A92m37L04j44J86m8q4J97k05p9L1L0J80K4k44L22j24m14N19q9J15m2l29L9
6482a00K05N2k32N10n23J95l77J50J44qK26k00q2o0J27l01J86K80k57K59j12p9
6504Cm1Mk9mJ79j91M08n00J48k65M56j14j26o3j3M1M2R9k62M7j19K24K64l72K9
6529a55p7L17l51O0J79lJ28l33L62l82M68l57J7k36L42j30J49P5nj34q7L54l30
6552a29P9J40L5Ok23PJ88k69J50k07J47J08l22K13J95k69J30K7l44K33J29m0j5
6575c1j71J37O7m1J59n5k86L39m9j00J20j08n1Q9m9RM8j06J44m5j5J43k01R5p5
6600c3K59j57L04m33K24k23K11j0K1k02M2J9j39N5m1J38J72l97R2J69J15n2M9
$$ plain form
6436 143 -276 -70 -22 81 104 -197 39 -96 112 -170 -52 -288 330 102 72 239 189 191 -158 -237 -23 44 192
6459 192 -245 59 -85 101 53 -31 166 -39 -118 -87 -57 123 147 -97 225 101 -313 206 117 232 190 -139 -100
6482 -100 105 157 -75 435 -88 107 -270 -120 24 16 242 42 -40 -100 27 -274 -88 192 -65 194 82 3
6504 3 -38 -34 -63 -67 112 -79 329 -171 -23 -288 168 54 -72 -135 -148 -107 -65 34 -228 -181 -300 -76 188 -184 -155
6529 -155 -232 85 -266 -206 -27 -30 98 -235 127 -255 213 -144 -127 -363 -21 -151 -2 73 68 -66 -153 201 -129
6552 -129 -50 90 125 131 -92 -85 103 -166 -16 -223 -76 32 -290 -77 118 -151 -21 6 -338 -105 24 -16 -31
6575 -31 -202 -65 2 -39 120 65 -221 118 69 -31 89 -19 -70 19 -30 -21 27 -79 65 20 5 148 -53 42 -33
6600 -33 226 69 373 -60 164 -59 152 142 163 -39 3 22 -117 -62 -103 35 207 -190 -98 71 186 134 183
6623A83k3l67M42k99j9J18K03m20K62N8r6J0n7K95l80J25K0P7N0l62L1k5J37j03
6647a40m1K78p4MM7r9j76R9j04Q2l2P6k78J49J19p2K79j75k18J22R1k6j84L53
6671H0k91K17j44J30r5l9J25p5M0R1K83m52L26R1J2k71j18R4q8K51J17l42P2m2
6695b8J02J76k01K4J12r2j82K04N1j63J9M8k36K65L7j27J0k72L38m42M20l81K0
6718b98j4M03Kj99Q8Rj12j9L74l04K05o4k4J75m03K32nm5j12K62k99JL76N8m61
6743a74J16K0J22j2j50K24k07N3J3j24L33j97Q5k21p9L45q9m7j18K77j78N8m7
6766CJ58L1k68M45m37N0J43l01J91R6n0j40J29j21P7J02K5N6r8k59J53o1q3P7
6790h2k26N03l11j18K35o5O2n2R5k94O8J50J30jj71j24n2K90Qo7j3O7j74P5K47
$$ plain form
6623 183 160 -207 235 -64 -83 35 238 -182 80 138 42 52 -5 290 -90 35 55 132 182 -180 -149 -174 -37 -140
6647 -140 -181 97 23 27 74 -25 -201 -102 -206 -124 -156 -80 -358 -209 -90 -162 117 -58 -276 -154 -63 -89 -273 80
6671 80 -211 6 -138 -8 -103 -142 -17 -92 -52 39 322 -130 196 287 299 28 -90 4 -84 167 284 -58 14 -28
6695 -28 74 250 49 73 185 93 -89 115 166 3 22 70 -166 99 136 9 19 -253 85 -357 63 -318 -298
6718 -298 -312 91 93 -106 -18 -9 -121 -140 234 -70 135 71 47 222 -181 51 46 1 -111 151 -148 -147 229 287 -174
6743 -174 -58 -38 84 72 -78 146 -61 -8 5 -119 214 17 102 -119 -198 147 58 11 -107 170 -8 50 3
6766 3 161 192 -76 369 -68 -18 125 -176 15 111 61 -79 50 -71 6 108 133 189 91 -168 -15 -76 -159 -82
6790 -82 -308 195 -116 -234 1 -64 -2 -54 41 -253 -185 -35 95 94 -77 -201 -253 37 45 -22 -35 32 -142 -67 180
6815A80n55M94l34j7L01Rj20j14J99p1J45l5j26M2p5L00k02k9n9J89l47L89ql67
6839b11K66L1q6k44K84m3M9jk13K66k31J39k74K91k27K03R6k88L18k62J12Q1J40
6862A96k18n0K35N5N8l03nK3k57K28R9J07j40m8N4l6k6j13k3k38M29k56J32o4
6886a61L98m48l4K36k6L6j48K77k00k54M05M1P0j71kM1K03r6n2k42J95j03K86
6909B51k01n2K97k40M13m38N0Ko5o0Jk44L06K17l24K68r1k43K69j04p0R9K11n40
6933b88J12L56l15J75j17K25j11J05j63L6k50K60J7j40Q9k4J36j73L5K48j06k5
6955H2l37J84L5n1P3K4J07l25K13K6O0j98L01j82K15ml23Q2j41L00j33J52o4j05
6979iPJ52j0p7J62j22k24J36j07J14J23j15r4p9K15J00l96K26K17N3l17j65N9
$$ plain form
6815 180 -375 119 -215 -232 69 78 -42 -156 43 -28 117 82 -44 -2 -77 223 21 -8 -67 122 -225 164 156 -211
6839 -211 55 86 0 -244 40 -3 46 45 -168 98 -133 6 -268 23 -204 -1 95 -193 125 -137 -25 56 196
6862 196 -22 -72 163 218 276 -27 -32 -9 -266 -38 61 168 28 -20 34 -2 -28 -141 -164 -402 27 -229 -97 -161
6886 -161 237 -211 -245 -9 -35 1 -147 130 -70 -324 81 122 192 21 19 60 263 167 115 -127 68 -35 251
6909 251 50 -2 295 55 468 30 80 82 17 -43 -42 -286 20 237 -87 181 90 -153 116 12 -58 41 252 -288
6933 -288 -176 180 -135 40 -77 148 37 142 -21 15 -235 25 42 -98 -9 -33 103 -70 -35 213 107 82
6955 82 -255 -71 -36 -87 -14 10 117 -208 5 31 91 -107 194 12 227 223 -100 -18 -159 141 8 160 96 -9
6979 -9 -2 150 140 63 225 103 -121 15 -92 22 145 30 -64 -143 72 172 -224 2 219 272 -45 -210 -151
7002a51K64J17m26P2K05j55K12l17K77O4l7k86O6J90j99j01P1K8J57j53N5mj20
7025a71J27K06l18j23J56j24J47K2R0p9J90l04L38l30M09j27p1Q8l25k5lM50m40
7048b17K60R3p9p9L0q9j49M84j83P4J4k4Pk49K73l28K91o3k91J67J37J25k85J91
7072A10j31J72p9j03o2J4J73r3K20qj93KJ08k38N1L07j55M0jj20j33o9J66k80
7096c02K42o7n3P5N3L85n26L24l35J84j68M19k93K68k23l6j0m3R6k36K89j45J46
7119D4l46M55l60J1qJ2K01P7q3j33K84j53qQ1k41L0K16k6J15q4j27J4p9o1L24
7144A55j48J91j50L6O3M0o9j73mp0L33j80j70L33k57R0p3J13j27L4K53k29k34
7167b43J32L13l97J61J1K6J38n0O9n4j09j32Q4K01j79p4K23j03n3J12l31M33l2
$$ plain form
7002 -151 113 230 -196 -124 81 -74 138 -179 98 162 125 -161 -95 95 -104 -205 -134 -106 51 -102 -47 -51 -171
7025 -171 -44 162 -156 -279 -123 -247 -100 -78 12 -67 123 -181 157 -173 236 109 38 126 -199 -224 -227 223 -217
7048 -217 43 136 57 -22 8 -81 -230 254 71 145 159 135 142 -107 166 -162 129 66 -225 -58 79 204 -81 110
7072 110 -21 151 72 -31 -93 -79 94 1 221 213 20 22 130 -108 -57 250 95 135 134 14 -119 -188 -22 -302
7096 -302 -60 -127 -180 -105 -52 333 -193 131 -204 -20 -188 231 -62 206 -17 -53 -63 -106 -10 -246 43 -102 44
7119 44 -302 153 -207 -196 -204 -192 9 86 3 -130 154 1 -7 74 -167 -137 79 53 168 84 -43 -29 -108 -169 155
7144 155 7 198 48 84 147 187 118 -55 -59 -129 204 24 -146 187 -70 20 -53 60 -67 -33 220 -9 -243
7167 -243 -111 202 -195 -34 -23 3 141 91 160 106 -3 -135 -51 150 -29 -103 120 17 -36 76 -255 178 146
7190A46j15L4J28J3m98L12m3R1Q2j22n6J59R4k95K58j87J53l25J73K70l89J88
7212G1L2O6k10m6K70k16m9K85j11j34Q3k13L36m25J57J95J41l11K66k12K1RJ40
7235A45k46k53L38K4k70M96j89j28J88l6j78L25p5k66K50k15r5K51M3l58N51k19
7257H3rJ5j11Q8J24j56lk38J81j5J12K50l74p0P2J40m47M29k99K39j73J77M9r1
7281b7P3j09j48J52J39Mk96L9J75m4p7M16m07J42N6k0j20K2o5k2J84rj45j36K55
7306C2L5R6J66k99J67l47J30pq0j53K57J31j71j05j16J76j03L00L46m54l9J7r6
7329a17J93j64l5O5L32l12K97m02Q1J53L5o6j05J09O3o4J59k9p7k61M08k86k5
7352d8L18k37p6M0J42k1l6oo3q9J3j64K71j80J24j1j09q1K11R1j14K49p5r9O7
$$ plain form
7190 146 31 65 193 206 -292 20 -23 68 150 28 -28 131 225 -70 188 1 154 -171 2 272 -117 71
7212 71 103 169 -41 -87 183 -33 -82 203 92 -42 41 -172 164 -261 -104 91 232 -79 187 -25 -4 5 145
7235 145 -101 -354 -16 8 -262 234 45 -83 105 69 -109 216 141 -125 125 -90 -185 66 109 -249 302 83
7257 83 74 89 -22 66 190 34 31 -207 -26 -41 71 321 -53 -123 -51 89 -358 71 -228 11 -162 15 64 -27
7281 -27 46 -63 -211 -59 80 84 -212 -173 2 -42 -119 297 -110 32 88 68 -52 -30 -95 -117 67 58 -87 -223 32
7306 32 67 163 329 30 197 -150 -20 -27 -107 -260 -3 128 -43 -148 -264 -88 -191 109 455 1 -38 -21 -117
7329 -117 76 -88 -123 -58 274 -38 259 -143 -62 91 126 60 -45 64 127 63 222 193 116 -145 263 -23 -48
7352 -48 270 33 -43 -3 139 118 82 76 13 -76 -63 -227 44 -136 -12 -23 -132 -213 -2 89 -25 224 149 50 117
7377A17J2k00L9j35L6M13l98K39j63j16K71q6o3q2M0q8M32m30N8j1J80J20l94
7400b09N33n00J40J2j49L3K33K02n12M20k01j89o2K37J6O4j37j19K85p2K9j79
7422a25J45M0j58K22l75L27k8N3j85P7K46k46J17j97O0q6J11j31J52K13j60j85
7444a13Q6O1OJ59k70p5K30k23K83o8L4k47o2O3o8K19j15L41j92O8P8k9k29J94
7468A31k19j8K42m81J82Q2j81N7K19M8l10K82n0K03k98n1L72k68K33j98P7k3J65
7491A96j51L9p1k32J41R1K42j61K1rj12P4j04o0J58j06J7J18k44J57J00q5j31
7514a12K13J2k02K38k53J79J0p5k18K25J21j31J4pl7j36Q3K14l36K14j16P0p6
7537a06J29k83L46nr3l0N4Q3N6k04k70J21J94k6L5N6j91j81J91J76l69K72L04
$$ plain form
7377 117 129 -71 -32 -167 -131 282 -116 123 -40 -156 115 29 -34 -116 -76 -164 268 -162 -104 -115 65 185 -209
7400 -209 324 -176 -36 -24 -173 -140 93 295 -217 203 2 -187 -249 -12 4 68 -69 -188 97 25 54 -125
7422 -125 20 60 -98 124 -251 76 48 101 -84 -7 239 -7 110 -87 -27 -113 -2 -133 19 232 72 -113
7444 -113 -27 34 40 199 -71 -146 84 -139 144 76 110 -137 -199 -136 -204 15 -100 241 49 117 195 166 -63 131
7468 131 -88 -106 136 -345 -163 -81 -262 -205 14 62 -248 34 -16 187 -111 -162 210 -58 175 -23 54 31 196
7491 196 45 84 13 -219 -78 13 255 94 115 106 -6 68 -36 -96 62 -44 -27 91 -153 4 104 19 -112
7514 -112 101 113 -89 149 -104 75 85 10 -208 17 138 7 21 14 -23 -159 -76 138 -198 16 -100 -30 -106
7537 -106 23 -260 86 81 -12 -42 12 95 151 -53 -323 -202 -8 -34 1 57 -134 -315 -124 52 -317 -45 259
7560B59l62J09Pm26K45K77k00K66j13m7l5q7J21pK04l7k41k3K22m6K08l55l0J54
7584F3n2O4r2K10l05K32j21j81K53n6j15o9K88J18k67k11K95p8NN4k8j60K43L2
7608A22j03j42P3N8k0M5qj78L93k56j93K49L6j45P8j93M0L09k97J48o2j7J23m9
7632A1N0m7j1o7k14J33N3j0j93M05m3k77J10K04R9l82N52l74M4J21k60j55K90
7655C9M0j76J81Po4J10m5j26K41l34J82Q1M3k70j32K35J31l14P2J31k38L06l6
7678F4j54j01K06j92L40l18K53k24K65j54L2J19k90L36j34Q9o5L15k82k25N5J93
7700A28R1J04k06L0r5R1q2j81P5J29j48m2K4K0L3Nl1j08K41k98K90q2J10k94J55
7725d1K5l23M67m2R6p0j51M2n8J5j09K12K5K1M7j52J20Ro4m5J05l4J4p2p8J60
$$ plain form
7560 259 -103 6 13 -413 -168 109 -91 175 62 15 -20 -107 14 7 211 174 -67 -90 132 86 294 -61 -91 63
7584 63 11 75 -17 193 -112 120 -1 -182 71 15 -100 -169 119 237 -30 -241 54 -24 -19 35 7 -153 90 122
7608 122 19 -123 -50 8 -12 33 25 -153 240 -16 -209 40 76 -69 9 -184 -144 165 -132 16 -46 -63 60 11
7632 11 61 14 3 -64 -278 -145 -92 -102 -295 110 67 -210 -100 104 203 -179 373 -1 43 164 -96 -251 39
7655 39 79 -97 84 91 27 137 92 -34 207 -127 55 136 179 -91 -223 12 143 -171 -99 32 -206 100 64
7678 64 -90 -191 15 -177 163 -155 98 -126 139 -15 17 136 -154 182 48 137 72 387 105 -120 -65 128
7700 128 219 323 117 147 52 143 61 -120 -45 84 -64 -106 -82 -62 -29 -24 -55 -163 78 -220 70 -12 98 -196 -41
7725 -41 -16 -339 128 86 182 112 -39 3 -55 -40 -149 63 88 109 156 4 124 133 69 24 129 95 109 37 -41 119
7751A19k38J47r7j64oM0Q6J9J44l14J93K8J67l65J53J85q4j22N0r2J11J19l61
7774b82J12J39j12J31L31k88q2J01l2J72k92J95l6k6j06j65N32m63L4m7K02P4
7796I2k96L24j85j18L58j72j04J04J77m18K14J20l07J87O9J49l67J3L75k06j57
7817a48J96j07L07k2k69K91m9k85R9J22k83J19q2J99L0j6Q6j55K66o5l46P3K95
7840B56j76m0qj26K00J03m5k14J37j21k52O61o49J21j18K84K02m51M24l76J49
7861c9Q4l03Q7j87M00j99J09n0OP1o4rj84M71j84o6N3K13m94K75R5l9Q2k29J87
7886H6M1J05l48K10j54K50j84j30L48l10L00j94o7Q1Q4j96J8J11n2J76k72Q0r7
7909a14K9Qn8k3j68L31J89k4k70J08J36m04L67q9o8K56l98M1j81K62k7j58J98
$$ plain form
7751 119 -119 28 -69 -233 -239 -199 -113 -94 50 -264 -71 -43 124 -241 -88 97 13 -109 -59 -151 -40 79 -282
7774 -282 -170 -31 -143 -12 319 31 -51 50 18 190 -102 93 57 31 -75 -240 292 -171 -137 -184 18 92
7796 92 -204 120 -65 -183 175 3 -101 3 180 -238 -24 96 -211 -24 45 194 -173 -160 215 9 -148
7817 -148 48 -59 248 226 -43 248 199 -86 13 135 -148 -29 -111 88 118 102 188 33 299 234 -112 -39 256
7840 256 80 40 32 -94 106 209 164 -50 87 -34 -286 375 -274 -153 -271 13 215 -236 188 -188 -39
7861 -39 45 -258 -171 -358 42 -157 -48 -98 -92 -21 -85 -94 -278 193 9 -57 -4 209 -285 -10 85 46 128 -101 86
7886 86 127 232 -116 94 -60 190 6 -124 224 -86 214 20 -47 34 118 -78 -60 51 -1 175 -97 -17 -114
7909 -114 -85 -77 -135 -158 -326 5 194 170 -100 8 144 -260 107 18 -50 206 -192 -151 -332 -70 -97 -255 -57
7932e7k7k04N54m22L81j87rkM6O1k46K13j42j80J87jJ20j16J19j42KJ36j17n4
7956h7k1L24l33K82l54K32k9L12m4n25N44j64k57K60k70o4Q1K67l10K30O1J0j15
7979C0j10j45J88L5l91K89K60J6o8q5j16O4J73j5k81R4l9J66j66L1O6K16l17J02
8003cl0k4l4j22K00J01m5n4J06N4k27K47L6n05L98n5k2J48k11OJ78J2j90k56L11
8028A9M9J36j51M7k56J96k97K17N1m1j37M12n7l08K04N6l5K1k26K27j10j08J97
8051A06l24L23j28k27M48n0m09K43K38k63J74j52j82K56P7l34J58Nj23r8L15p6
8073b3n8m2R0L9k24L92n20K27J06k2J66k27J7K49k09O2j51L87l18J2J47P4k29
8096e5J61p4Po6o1K0j84lk71N08L5j74K68k25L1k5J08Kj15QR0m0j04J29m5J31
$$ plain form
7932 -57 -84 -288 266 -156 225 38 29 27 73 134 -112 101 -41 -221 -34 -35 85 -31 88 -54 -52 84 -33 -87
7956 -87 -108 216 -117 165 -189 43 14 326 282 -243 301 137 -120 140 -130 -194 -113 154 -156 74 135 145 30
7979 30 -80 -225 -37 -2 -393 -104 156 172 104 19 -97 -33 140 125 -156 -62 -101 65 -101 -70 -4 212 -105 -3
8003 -3 -33 -57 -91 -213 -13 88 43 -11 95 149 -78 169 205 -300 98 43 21 169 -42 -36 142 154 -36 -292 19
8028 19 68 204 53 100 -156 40 -257 -40 11 -30 -167 245 188 -120 84 140 105 126 -100 127 17 -91 106
8051 106 -218 105 -23 -250 198 148 -261 -18 220 -43 131 -21 -203 53 130 -204 -46 -41 -164 -262 53 -23
8073 -23 -81 -123 -33 6 -218 174 -346 -119 -13 -35 131 -96 -79 170 -39 23 -128 259 -59 -47 100 174 -55
8096 -55 106 32 39 -27 -88 -68 -252 -255 -526 -18 17 -157 111 -114 -83 -108 0 2 -113 -105 -15 -55 -159 -30 -75 56
8122E6l1j39K78k01N0j83L18r1J7M20m90L2r2K25j78o9J32j24O3QQ4j6J20k98
8146a09l9K96m15J25K87j27j41jm8N1k5J71q1k10L99k39R1m5K20k68K10N6l02
8169a44J55J49J19l96L97m26J53K57q3r6j68K43j63K95j13q0r9l5K17j68J70k04
$$ plain form
8122 56 25 -114 164 -37 13 -170 148 57 74 494 4 36 -56 169 -9 -78 54 -70 -7 1 85 69 189 -109
8146 -109 -148 148 -267 -142 145 18 -123 -124 -172 -121 -146 25 -56 -266 133 -106 -15 -60 160 -108 102 158 -144
8169 -144 11 160 279 -117 280 -146 7 264 181 85 -83 160 -3 292 179 99 0 -35 182 14 184 -20
8191b0
$$ Imaginary data points
##PAGE= N=2
##DATA TABLE= (X++(I..I)), XYDATA
0@%%%%%%%%%%%Qj6J6j6J6k4L2m0M8n6P2q8J04j20J36j60J85k10K42k78L18l62
33a93M11m65N23n86O58p36Q22r17J017j127J250j382J527j685J857k047K256k484
51a301K736l016L325l671M061m506N012n597O287p108Q108r358J0971j3137J6219
66I025k0988K9399m8561J70640N2041k26875J70198L3523j03440P708M0968r6965
78A6673R8960p717j46594N5271J37267j46336r6038J74459k8098j10065N1704
89e14K0430m3525M9156j5409r9365J30540L2663j46881K0494J58266q6231q6260
101f6636J19181r303l3582M2716k8988l6135J25142l8538j36381J34467O4154
112A36097j34715j5279J21090n5564l6892M5431n2320J9172O0126q4465o6301
$$ plain form
0 0 0 0 0 0 0 0 0 0 0 0 0 8 -8 8 -8 8 -16 16 -24 24 -32 40 -48 56 -64 72 -88 97 -113 129 -149 169 -193
33 -193 218 -247 276 -310 348 -388 434 -483 534 -593 657 -725 802 -883 974 -1073 1183 -1301
51 -1301 1435 -1581 1744 -1927 2134 -2372 2640 -2957 3330 -3778 4330 -5028 5943 -7194 9025
66 9025 -11963 17436 -31125 139515 191556 -35319 134879 168402 64962 72670 113638 16673
78 16673 115633 107916 -38678 16593 153860 7524 -88514 85945 57847 -52218 -514
89 -514 19916 -23609 25547 10138 -89227 41313 73976 -72905 -52411 105855 19624 -66636
101 -66636 52545 43242 9660 52376 23388 -12747 112395 73857 -62524 71943 136097
112 136097 1382 -13897 107193 51629 14737 60168 7848 27020 87146 2681 -63620
123f3620J50558k9946j40541P9188O3847q4440k0144N5571n2072L4692J9798r5787
135h2896L1874J05463q6293r0139J44210L03j00754M1214M2292m0514K6509R104
147C73p8093Q8155M4063j17794J329J31713n5069r3566R6197O492m5236K5766
159D330p660m0611P8903p760j16304Q3448O7340j03686l3646J05834l3012n3405
171e6229M8198k5802k752M6949m3066o1986J12245M292j22577N7044P6755o6486
183c3415l2236O8101l1291O552L4496o2185J0589Q7624m6791q7145J11637K5142
195E1078r3433K2583N3040l1551j518K4654n7018M8340M3728q6044j3260J03438
207F4037l0225r2698P5268K0815m8591J0635Q876l1503M5426Q542r4111N6637
$$ plain form
123 -63620 86938 56992 -83549 -4361 59486 -24954 -45098 10473 -41599 -6907 12891 -82896
135 -82896 -51022 54441 -31852 -121991 22219 22522 -78232 -37018 5274 -35240 -8731 373
147 373 -77720 10435 54498 -63296 -61967 69746 14677 -78889 17308 23800 -21436 4330
159 4330 -3330 -43941 34962 27202 -89102 -5654 61686 -42000 -75646 30188 -2824 -56229
171 -56229 -8031 -33833 -36585 10364 -32702 -94688 17557 21849 -100728 -43684 33071 -33415
183 -33415 -65651 2450 -28841 -22289 12207 -49978 -39389 48235 1444 -85701 25936 51078
195 51078 -42355 -19772 33268 1717 199 24853 -32165 16175 59903 -26141 -39401 64037
207 64037 33812 -58886 16382 37197 -11394 -759 8117 -23386 22040 30582 -63529 -6892
219f892O7411q3126m0139R6781j3265o3859M5228n600j2272L5387j9585n6456
231e6387Q1834K4402j06998L4810P7406n1120m4044O4942j4159j5625L2819m0542
243a2662m477O6245k3866q2255Q0667L6398q7228Q414N6510k8272j9250L2453
255B2677m2038K1865M3626o6585k2143Q7767j2995r2184O2043L5103n3156J047
267a4973K5117k7225K0792K4908p6060L1078O9358o3053m9565Q6275M850p1938
279d0436L7343J2926k1150J9481r91m8186N1926L5132r0513J5163P5196l7620
291H271n4199N9422K101l1571K8628k1016j2559M8378n264p4385N7889M8527p8405
304b4183n107O0943j5972l4718L6391k1751J807M0274m2287k7953O7838O631q5100
$$ plain form
219 -6892 60519 -22607 -62746 34035 20770 -43089 2139 -3461 -15733 19654 69 -56387
231 -56387 25447 49849 -57149 -22339 55067 3947 -40097 24845 10686 -4939 27880 -12662
243 -12662 -17139 49106 25240 -57015 23652 60050 -27178 -18764 37746 9474 -9776 22677
255 22677 -19361 2504 46130 -20455 -42598 45169 32174 -60010 2033 37136 -16020 -14973
267 -14973 10144 -17081 3711 28619 -47441 -16363 52995 -10058 -59623 26652 31502 -40436
279 -40436 -3093 9833 -11317 8164 7173 -41013 10913 46045 -44468 -29305 45891 8271
291 8271 -45928 13494 15595 -15976 12652 -8364 -20923 27455 22191 -52194 5695 54222 -24183
304 -24183 -29290 31653 15681 -19037 17354 -4397 -2590 37684 -4603 -32556 35282 41913 -43187
317d3187M1793M7123m7645j2854L1241j4770n33K6186n4326J2747N8069m4495
329f51m9447O5723J6945o9567K3697K3000k1565M944P047l5900L0025L7342p3735
342d2142L677O8538k6837n4814N1079J4410l7378K2062n897j3233L3525M881o0831
355d2960L8731N2369o5279j4005N8873p188m1662L2885o935r871L3153k8258k8427
368b8574N1984J4518p7080K7448N1517m4476k0233L4311q236j4532K8460l8637
380b3530j013N2741k9966n0047N4149K8418o8329J5106L5491k0687n502J6966
392C797k3438J1985M0892n4328p113O2384j1993n5458M0707K8105l9362J1989
404H167O727j1548J8166J0643m7752K1302M9995n3482k0643N1516m13m5247K4439
$$ plain form
317 -43187 -1394 45729 -1916 -14770 16471 1701 1168 27354 -26972 -14225 43844 -651
329 -651 -50098 15625 32570 -36997 -13300 9700 -11865 -6921 126 -35774 -5749 31593 -42142
342 -42142 -38465 30073 3236 -51578 -499 13911 -23467 -1405 -7302 -20535 12990 17871 -42960
355 -42960 -4229 48140 -17139 -31144 27729 20541 -21121 11764 4829 -5042 28111 -147 -28574
368 -28574 23410 37928 -39152 -11704 39813 -4663 -24896 9415 1179 -13353 15107 -23530
380 -23530 -24543 28198 -1768 -51815 2334 30752 -37577 -22471 13020 -7667 -13169 3797
392 3797 -19641 -7656 33236 -21092 -28205 34179 22186 -33272 7435 35540 -3822 8167
404 8167 14894 3346 21512 32155 -15597 5705 55700 2218 -18425 33091 32678 -12569 11870
417A1870L960j7221K3507j7459k6426L6725J9192o6986J5489N2986l9051k5120
429b8534L4592J055k2460K5351k2267p012M5091j8338m3272M2791L4165n9563
441a8401P485M0901j6824j1695J9684j2969J646L7442m0694j2884N4637n891n3968
454a1531L1127L2983m2671L996J3842j3877N709J3947m0231O039M8520m5926k9625
467b7698M6735N902n0863J7916J5421k4786J3615n066k4138K1479K4593n4872
479d1762K362N3974k9200l1158L3037J1028k8055K0479o564j1778L4597p058l7604
492c7702K9692L8807n1627k392M3456j2663j8924J8868l699q778L1232k7556j8947
505b0233M3905J090n0629J9420L8354m0409o190J9699r446m391J3858k6520l935
$$ plain form
417 11870 15830 -1391 22116 4657 -21769 14956 34148 -32838 -17349 35637 -3414 -28534
429 -28534 6058 7113 -15347 10004 -12263 -19275 25816 7478 -35794 6997 41162 -18401
441 -18401 -10916 29985 13161 1466 21150 8181 9827 47269 6575 -6309 48328 42437 -11531
454 -11531 19596 52579 9908 13904 27746 13869 19578 33525 -6706 -667 47853 1927 -27698
467 -27698 19037 24939 -25924 -8008 7413 -17373 -3758 -8824 -32962 -11483 13110 -41762
479 -41762 -39400 14574 -14626 -45784 -12747 -1719 -29774 -9295 -15859 -27637 6960 -98 -37702
492 -37702 -8010 30797 -20830 -23222 20234 7571 -11353 7515 3816 -4962 26270 -1286 -20233
505 -20233 23672 24762 -25867 -6447 31907 -8502 -14692 5007 -4439 -8830 5028 -21492 -25427
518b5427M2927l2658l0183L9385J3615m6697J0391K5785k3003O666L058j6577
530c2718J3616K6007m0972l922N1841k0669l1321L0052J8669k9969J4158M885
542c43j4265K5322Q96l2016J7320L9832m2895j1387M2320q023k4798J5518O039
555A3520j5485K2163j4864j9998L2967O310m3481J0125M0236l3859j2497K2651
567G788m002r819J2286j4135q366L7341k1660k9077L4102J7931m1885M629L1247
580A6380k0622L81R184j2164N373K4847l0461j1260M6984j3328l3322K3670K2291
593B7953l0789O227J2244j5876J4813M882k5823O966L6179l4458j7649L9050l702
606B0017k7465J1716J2203j8378J5143n905j9711K4738R375l6138K727M0465k7987
$$ plain form
518 -25427 17500 -15158 -45341 -5956 7659 -39038 -28647 -2862 -25865 -19199 -16141 -32718
530 -32718 -19102 6905 -34067 -37989 13852 -6817 -38138 -8086 10583 -19386 -5228 -343
542 -343 -14608 10714 11610 -20406 -3086 36746 -6149 -17536 24784 16761 -8037 7481 13520
555 13520 -1965 20198 5334 -14664 18303 24613 -18868 -8743 31493 -2366 -14863 7788
567 7788 3786 -6033 6253 -7882 -16248 21093 -567 -29644 4458 22389 -19496 -14867 16380
580 16380 -4242 -3861 5323 -6841 -1468 23379 -7082 -18342 28642 15314 -18008 5662 27953
593 27953 -2836 3391 15635 -241 14572 19454 -6369 597 36776 2318 -15331 23719 20017
606 20017 -7448 4268 16471 -1907 13236 7331 -12380 12358 21733 -14405 -11678 28787 800
619H00j7143K4257M37j4055R757m518j2224K9967j2205k8057K5330K1156l6622
632a3120l067L3740j7808p247J0451n987j465J8987k0270j4722L8815q559l1174
645b1426J7247K3717k7889j158J6677j3875Q578N424k0327K755L2649k6775k0436
658b4839L6829J9k7292R307J7022j8710R612K158j8801J8643J2516k9785k599
671a5920M0174k1792k1447K5487L937j7188Q052L504j5074K2618m223k6012J8869
684I85K2047l1317q664L5246j4404j3578J3425j406p296J5877j0949j8471L2847
697A4342j887l1023J2257K7447k5819q195K2576j1451r2Q084j2155m222K7774
710A7636j6448k3446L0995N829k7273L389K2189j6812Q73P154j4222J0464J1501
$$ plain form
619 800 -16343 7914 8351 -5704 4053 -465 -12689 17278 5073 -22984 2346 23502 -13120
632 -13120 -16187 17553 -255 -7502 2949 -3038 -4503 14484 -5786 -20508 18307 9748 -21426
645 -21426 -4179 19538 -8351 -9509 7168 -6707 1871 7295 -13032 -10277 22372 -4403 -24839
658 -24839 11990 12009 -15283 -5976 11046 -7664 1948 4106 -14695 3948 16464 -13321 -15920
671 -15920 24254 2462 -18985 6502 10439 -6749 1303 4807 -10267 12351 8128 -17884 985
684 985 23032 -8285 -16949 18297 3893 -9685 3740 2334 -4962 10915 -34 -18505 14342
697 14342 12455 -18568 -6311 21136 -4683 -12878 9698 -1753 -1845 6239 -5916 -10138 17636
710 17636 1188 -22258 8737 14566 -12707 -9318 12871 -3941 -3068 4086 -10136 328 11829
723A1829k1274p538L4685j4213k3489K1676P945j6905K262R182j3903J5340R51
736F548k2607J2670K2268k4411j3002L3752r593j6256J2904K913r118J1117k292
749D893j8752K5316L450k7348O870K6918k0146j3117K3691p907n061P341o038
762A10p168K1438r094k3636K5324Q089k4864p99K3251j4189n409J0838j1213M605
776b717J0979j4771j1029L0439p866k5351J9012J1369j6542j650J3865j2606Q054
789A186N892j8504P277K0336j7058j6384L0457l351j8987J0178P629r508N142
802D305L206j6840J7854O324k3163K336K4819j4755j6971K1992l535q389O077
815C260k128q408J6104k979k3159K0245J0573k2248l836K3880j0634j0422J3335
$$ plain form
723 11829 -9445 -16983 17702 3489 -20000 1676 9621 -7284 -5022 4160 -9743 5597 6548
736 6548 -16059 -3389 18879 -5532 -18534 15218 5625 -10631 2273 5186 -3932 7185 4893
749 4893 -13859 11457 14907 -12441 -5571 21347 1201 -11916 11775 3868 -1193 6148 110
762 110 -7058 14380 5286 -18350 6974 15063 -9801 -10600 12651 -1538 -6947 3891 -7322 -2717
776 -2717 8262 -6509 -17538 12901 5035 -20316 -1304 10065 -6477 -8127 5738 -6868 1186
789 1186 7078 -11426 -4149 16187 -871 -17255 13202 9851 -9136 1042 8671 -837 4305
802 4305 7511 -9329 8525 14849 -8314 -5978 18841 4086 -12885 9107 5572 -2817 3260
815 3260 1132 -7276 8828 5849 -17310 2935 13508 -8740 -12576 11304 670 -9752 3583
828C583p384L27R438q277j2311K4180j613k4517J5213J3137j4969n762J6104r334
842b185J582P256j4074L360J6855j2321j7388K6283m60k0116Q205Q725r251M19
856c110O409j5230J2105P734k0453k21K2544j0369j9496K1274n78j0961N100K358
870b894q232J0600K347k0966J5652J1900j8550n962K2932o116j3171J3962l359
883a857k385P744l754j1714J9480K549k3787J2223J4846j3889p948J7533p584
896A457l244R493j0634p46J5104o789j9128K2233M181k1427N824J2301r221m520
910e116J0408j1727M988R966j5167l171J9068m357k0549J8076M960j2224J977
923b868O446o491M848N533j6655J0275J1979j3985p471J9633j869j5658J2226
$$ plain form
828 3583 -3801 -3474 5964 -2313 -14624 9556 7943 -16574 -1361 11776 -3193 -8955 7149 -2185
842 -2185 -603 6653 -7421 -4061 12794 473 -16915 9368 8908 -11208 -3003 5722 -3529 -3110
856 -3110 3299 -11931 174 7908 -12545 -12766 9778 -591 -20087 1187 609 -10352 -5252 -2894
870 -2894 -11126 -526 1821 -19145 -3493 8407 -10143 -16105 6827 711 -12460 1502 -1857
883 -1857 -4242 3502 -252 -11966 7514 10063 -13724 -1501 13345 -544 -8492 9041 1457
896 1457 -1787 7706 -2928 -3674 11430 4641 -14487 7746 11927 -9500 -3676 8625 -596 -5116
910 -5116 5292 -6435 -1447 8519 -6648 -9819 9249 4892 -15657 2419 7379 -4845 -2868
923 -2868 3578 -2913 1935 7468 -9187 1088 13067 -918 -8389 11244 9375 -6283 5943
936E943M30m296M564J52j0916J3197N612k1593Q222J4297j1346j0525J6130l493
950F378p611Q526o821j922J0201l015j7052J6377O758j9896L563J2257p187o584
964f028J0932q848K119R078j1592l883J6432j369k0111J5710O745j3116J330Q238
978E637n689K18Q837j4828N964J2667j1730r608J7916J188j7806J0794L479o499
992E40J553L542r960P206Q342j8725M035J3481q121j2308J4145M0j0171P251k801
1007a951l150O305P07j4713J0945R096j7599J358J2196m075r611J0478l844j868
1021e726P993p424m084J1526K174j7910J1413R270j1983j141Q609k970l064Q398
1035E081j0555L306J0788q608q255J3737L601j6781Q654M843o024L60M116o908
$$ plain form
936 5943 6373 2077 6641 6793 -4123 9074 14686 -6907 1315 15612 4266 -6259 9871 6378
950 6378 -1233 7293 472 -1450 8751 5736 -11316 5061 11819 -8077 -4514 7743 556 -6028
964 -6028 4904 -3944 -1825 7253 -4339 -8222 8210 6841 -13270 2440 9185 -3931 -2601 5637
978 5637 -52 166 9003 -5825 139 12806 1076 -8532 9384 10572 -7234 3560 7039 540
992 540 2093 5635 -4325 2881 11223 -7502 -3467 10014 1893 -10415 3730 3770 -6401 850 -1951
1007 -1951 -5101 1204 1911 -12802 -1857 7239 -10360 -9002 3194 -881 -10492 -14 -3858 -5726
1021 -5726 2267 -5157 -9241 2285 4459 -13451 -2038 7232 -4751 -5892 2717 -253 -3317 5081
1035 5081 -5474 -2168 8620 12 -8243 5494 9095 -7686 968 5811 -213 147 4263 -2645
1049b645L719Q848j6103K854J2841o467j1917J2865K239j1701P353p69m319M891
1063A689K918j3562P601J0842j6023o33J2325l008j1153J0077o60n651P695m170
1077a713n296Q483M225j6504P793J0835j1437k886Q657j066o180Q450o748n16
1091c903R839n865q484J0684O382j6940N862Q381o422k103N169m338k19R482j2090
1106d565k58J1302l329j1854R553O180j2361M404K112l117J511M077r864L291
1120b918J1028j2675k182J0567j38j1760P852K413o357N430j930m114N222N800
1134F238j3791M157J1691r975m054Q440J115q098P599l161k823P976k846p653
1148e185O956P750j4482L082Q551n361l534N373j846l114Q258q454j883R559j811
$$ plain form
1049 -2645 1074 9922 -6181 -3327 9514 3047 -8870 3995 6234 -5467 1886 1117 -3202 1689
1063 1689 4607 -8955 -1354 9488 -6535 -7168 5157 2149 -9004 1073 413 -5238 2457 -1713
1077 -1713 -7009 1474 5699 -10805 -3012 7823 -3614 -6500 2157 1091 -5089 3361 -3387 -3903
1091 -3903 5936 71 -8413 2271 8653 -8287 -2425 5956 -466 -2569 2600 -1738 -1957 7525 -4565
1106 -4565 -4823 6479 3150 -8704 849 7029 -5332 -928 1184 -1933 -422 3655 -6209 -2918
1120 -2918 8110 -4565 -6747 3820 3682 -8078 -226 2187 -4170 1260 -670 -4784 438 6238
1134 6238 -7553 -3396 8295 -1680 -5734 2706 3821 -4277 3322 161 -2662 5314 2468 -5185
1148 -5185 1771 9521 -4961 -1879 6672 1311 -2223 3150 1304 -1810 6448 -2006 -3889 5670 3859
1163C859j0617O655P418j2148L037L738l093n20M127o665K22J0716j0213l435
1177f919R565J489j1297O053M900p697M571K34l868K627O664j0780J162J1725
1191H429p634m749O883L244q500N540j2m216O048j149o399L940Q296j2307P53
1206a833Q851m492m731M623L82n455P136n547l112P479j13r916M064Q731j0943
1221d876M16N149k251k297L628l281k422R528p043l933P436K626r643L333O644
1236C014o772K351J077k115Q57N943p983m45J0284o149m465N902L527q090M112
1251A048J850m626M947o49n356K409Q005j0298o83R083m252m663M350J918o206
1266c123O094k714m169O525Q41q275K171R694r752n77O090j699l535M320j342
$$ plain form
1163 3859 -6758 -103 7315 -4833 -1796 1942 -1151 -1671 2456 -4209 -3987 6729 -3484 -6919
1177 -6919 2646 4135 -7162 -1109 3791 -3906 665 899 -2969 -342 6322 -4458 -3296 8429
1191 8429 795 -3954 2929 6173 -2327 3213 3201 -1015 5033 3884 -2515 1425 9721 -2586 -1833
1206 -1833 7018 2526 -2205 2418 2800 -2655 4481 -1066 -4178 3301 3188 -6728 -2664 6067 -4876
1221 -4876 -4460 689 -1562 -3859 -231 -3512 -5934 3594 -3449 -7382 54 2680 -6963 -3630 3014
1236 3014 -3758 -1407 -330 -2445 -1588 4355 -3628 -4073 6211 62 -4403 1499 5026 -3064 1048
1251 1048 2898 -1728 3219 2570 -2786 -377 7628 -2670 -3353 5730 1478 -3185 1165 3083 -3123
1266 -3123 2971 257 -3912 2613 3454 -4821 -2650 7044 -2708 -3285 2805 1106 -2429 1891 549
1281E49l385Q208m567m442O442L438r005J958Q039o921P11K528j388j594N558
1296F129m919l107R554m236n536M386M856q208J587M143m963K227Q59l514n91
1311a333P264p150k941P880k032n098K300M102o194L707l22l779M355J148n299
1326c392J07Q281p204j449N503j021l089K226J256m557O868k753m742N209L401
1341D644p195j04Q225o238r49L436p66k196M040k959l834P924k623n412L141M935
1357D069o897l6M916m758J562J098k214j420O725n363l934P841j543m485J530
1372b909M842o190K505J714l990L032J972m247j498Q045m997l395N625L9l581
1387c033J411K705m853M489m85m015K683L610m896k031P694m366j687K470P6k362
$$ plain form
1281 549 -2836 5372 805 -3637 2805 6243 -2762 -804 7235 314 1025 3553 2165 571 6129
1296 6129 1210 -1897 7657 3421 -2115 2271 7127 -1081 506 4649 -314 1913 2772 -742 -1333
1311 -1333 5931 -1219 -4160 3720 1688 -3410 -1110 2992 -3202 505 183 -3596 759 1907 -3392
1326 -3392 -3285 4996 -2208 -3657 1846 825 -2264 -38 1218 -3339 3529 776 -3966 1243 4644
1341 4644 -2551 -2655 5570 -668 -1617 1819 1053 -1143 2897 -62 -3896 4028 1405 -4007 -866 4069
1357 4069 -2828 -2864 2052 -2706 -1144 -46 -2260 -3680 3045 -2318 -6252 1589 46 -4439 -2909
1372 -2909 1933 -4257 -1752 -38 -4028 -996 976 -3271 -4769 3276 -1721 -5116 509 548 -3033
1387 -3033 -1622 1083 -3770 719 234 -3781 -1098 2512 -2384 -4415 3279 -1087 -2774 -304 -228 -2590
1403b590K779m83l918O154j570m147K076M660n029j140N687l868O65J275q78j808
1419b135N026k309m426O878n28m124N47N482n350P80K720l718K345J580k447k918
1435b597P272l331m366M849L73l328J48L583m616K815M86m181K232K898l565k922
1451d250O866l347k295K666N23k614J422J829n039M961J39m297J299M621l737
1466a253k369O041l103n26J303K93j974L366m83m586N170L66l581j95N435m034
1482a30p88L498l479J580J089j341k498N429k079m149M290P31k804k66M015m345
1498a247J829J552l345J194K951j980l757O631k090l243K550J271k224M65K476
1513C033m082L367M27k861L14M118k346l281N255k111j009J076N34k479K482P87
$$ plain form
1403 -2590 189 -294 -4212 1942 372 -3775 -1699 2961 -2068 -3208 2479 -1389 -724 551 -327 -2135
1419 -2135 2891 582 -3844 3034 2506 -1618 -1071 4411 -939 -159 2561 -1157 1188 2768 321 -2597
1435 -2597 4675 1344 -3022 1827 2200 -1128 -980 2603 -2013 802 1288 -2893 -661 2237 -1328 -4250
1451 -4250 2616 -731 -3026 -360 163 -2451 -1029 800 -4239 722 861 -3436 -2137 2484 -1253
1466 -1253 -3622 2419 -684 -1210 93 386 -1588 1778 1295 -3291 1879 2245 -1336 -1531 3904 -130
1482 -130 -918 2580 -899 681 1770 429 -2069 3360 1281 -2868 1422 2153 -651 -917 3098 -1247
1498 -1247 582 2134 -1211 -17 2934 954 -2803 3828 1738 -1505 1045 2316 92 557 3033
1513 3033 -1049 2318 2745 -116 198 4316 1970 -1311 3944 1833 824 1900 2434 -45 2437 3224
1529C224m599L979O30l016j046M631k992k054L917k411L06O97l0k999M318m58
1545B097m431L399J170k369j393M092l018K42J835k346L77J881p60l620N275j003
1561A428l100K252R09j688m62L150m121K341J165l113J99L343j523l570M812j212
1577H10k238J462R44k168R33K074m901L329J148k431j456M118j289l371M001j629
1593f64o80O15P09k569K528Q81m419K848Q83j626j627L694k097q52K074j868o3
1610b233J224L66l386L565K28l270J413J473j189j385L402k614M54J617j819j28
1626b282K017L58m156M408m02j631P39J181p57j78K212l223K424J276j776o99
1642d89K952n93k694L369j406m71N65J085k400J745J493m296K529Q97j303k015
$$ plain form
1529 3224 -1375 2604 3234 218 -828 3803 811 -1243 2674 263 569 1266 1236 -1763 2555 2097
1545 2097 -2334 1065 2235 -134 -1527 2565 -453 -211 1624 -722 -345 1536 776 -2844 2431 1428
1561 1428 -1672 580 1489 -199 -661 2489 -1632 709 1874 -1239 -1040 2303 780 -2790 2022 810
1577 810 -1428 34 978 -1190 -257 1817 -3084 245 1393 -1038 -2494 1624 335 -3036 965 -664
1593 -664 -1344 -729 -20 -2589 -61 820 -3599 -751 132 -1494 -3121 573 -1524 -2376 -302 -2170 -2233
1610 -2233 -1009 -643 -4029 -464 -236 -3506 -2093 -620 -1809 -3194 208 -2406 -1952 -335 -2154 -2282
1626 -2282 -265 93 -4063 345 -57 -1688 -949 232 -525 -703 1509 -1714 710 1986 210 -489
1642 -489 2463 1870 -824 2545 1139 668 1233 2318 -82 1663 3156 -1140 1389 2286 983 -1032
1658a032L243j511j460K578j792m10M05J142l448K739P74l341J505R31l46k331
1674b354L176k029Q0J702j332j41J294R32l781L459K60j769Q94P43r53k11K645
1691B615l177J097J419j193j400K194O04l787K886p21r76K62J031j939K54K263
1707A432l659J252R39o95k011K240l59k039K678j524j79O9J367k600J829J368
1723A08k689J113J131p1j857K878j027q19K262j351j38R78J393l236K352P94j727
1740I4K65J311l58j900L164k719K89J196p65j336J257R47l445K438m95q27k05
1757a089Q76q86r08K448k757Q89Q87k15j785J814O68k383K264p91l1j27J382j591
1775a335Q39K203k649J462P43J80k061K812o83o67J345q27L67l73J861k947J547
$$ plain form
1658 -1032 2211 700 -760 1818 26 -384 21 1163 -2285 454 1228 -2113 -608 323 -23 -2354
1674 -2354 822 -1207 -1127 575 -757 -898 396 1328 -2453 1006 1266 -503 391 1134 181 -30 2615
1691 2615 -562 535 1954 761 -639 1555 2159 -1628 1258 537 -439 -177 854 -1085 -831 1432
1707 1432 -2227 -975 -36 -731 -2742 -502 -861 -2900 -222 -1746 -1925 -1856 -489 -3089 -1260 108
1723 108 -2581 -1468 -337 -408 -2265 613 -414 -1233 1029 -322 -460 518 1911 -1325 1027 1821 94
1740 94 359 1670 1312 -588 2576 -143 146 1342 577 -759 498 1445 -2000 438 -57 -884 -1089
1757 -1089 -213 -1099 -2007 441 -2316 -1427 -540 -755 -2540 -726 -58 -2441 -177 -968 -999 -1126 256 -1335
1775 -1335 -496 1707 -942 520 1263 1443 -618 2194 1511 844 2189 1362 1729 1356 3217 270 1817
1792A817J245k445J070N50J42k196K506j518n71J414j000p43M60J396l431K091
1808G87K06j274K2P08j88j468K542j909O3O77K91j492Q63J614k628J608j09k00
1826A13n59J428j099m24K081k136N47K98P79j868J466m9j398J381q29M46p44J414
1844H47j968O46J135j734P99J10N33j659J827p86j44P34o68j03j70J940k564J723
1862D98K91q51R4L35K68j207K436k070P17M17j29j066P09J267k400J734n06l41
1880A96l04R88q87p22K457k536P85J28L30j622R94Q42j904J696q37M16j060J841
1898H01j524K38J270j038K73O4J196k036J628j80j039J311o19J04o15J910k015
1915b71N63O67p77j44J41N83j731J557j357m7M75k70m60m04J555k211Q86l4Q1
$$ plain form
1792 1817 3062 617 1687 2237 2379 183 2689 1171 600 2014 1014 271 731 2127 -1304 787
1808 787 993 -281 -259 449 261 -1207 1335 -574 -511 166 457 -1035 -172 1442 -1186 422 313 113
1826 113 -446 982 -117 -541 1540 -596 -49 249 1028 -840 626 577 -821 560 -269 177 -567 847
1844 847 -1121 -475 660 -1074 -275 -165 368 -1291 536 -250 -394 340 -328 -431 -601 1339 -1225 498
1862 498 789 -62 32 367 635 -572 1864 -206 511 928 799 -267 442 1709 -691 1043 537 196
1880 196 -108 880 -7 -729 1728 -808 -23 105 435 -1187 -193 649 -1255 441 -396 20 -1040 801
1898 801 -723 -485 785 -253 20 84 1280 -756 872 692 -347 964 345 449 -166 1744 -271
1915 -271 292 959 182 38 179 762 -969 588 -769 -816 -341 -611 -1071 -1475 80 -2131 -1245 -1279 -1198
1934a198n91K91m7j030K176j516M34j27P00r10L89J395j364J373n98O90r32J274
1952D09m40m31J846j364O08j01P39j473J241J40r90J139r27K44j123J447j605
1969f41L65O61j265J94k75Q20k131J636j009k50M77j46l04o39J627j775Q60M24
1987a371m18j06K72R64j384J821r24N19K62M73q1n31J856j747J764n48M76m70
2005H27J026k00j057J930j558N85o1Q10j445O01K43j267J053m07J13j252J487
2022A428r76n05J025j059M26r06J398j417J194o12k56P12m57N03j115J850j182
2039E1N09N48n69L13n1O30j403J665o00o2P1j6j57m18J266j664J010m79K66q34
2059G6M14J90j205J218j199N50n26N43q92p5P48j364Q78o54N56q68J001q59p1
$$ plain form
1934 -1198 -1789 -1498 -1545 -2575 -399 -1915 -1481 -1608 -908 -1818 -1429 -34 -1398 -25 -623 67 -865 409
1952 409 -31 -462 1384 20 628 527 1266 -207 1034 1174 184 1323 396 640 -483 964 -641
1969 -641 -276 385 -880 -686 -961 -141 -2272 -636 -1645 -1895 -1418 -1564 -1868 -2507 -880 -2655 -1795 -1371
1987 -1371 -1789 -1895 -1623 -659 -2043 -222 -1146 -627 -365 108 27 -504 1352 -395 1369 821 1297 827
2005 827 1853 1653 596 2526 968 1553 1492 2302 857 1458 1701 434 1487 1080 1193 -59 1428
2022 1428 452 -53 972 -87 339 -567 831 -586 608 -4 -260 452 -5 498 -617 1233 51
2039 51 560 1108 539 852 801 1431 28 1693 1093 1031 1102 1086 929 511 1777 113 1123 644 910 76
2059 76 490 680 -525 693 -506 44 -482 61 -831 -906 -158 -1522 -644 -1298 -742 -1610 -609 -1468 -1539
2078a539J268j023Q83o93J189j298J167J49o33Q37n64O99p65J658q84j81M89k05
2096E54o2m07J142j869J620l22n21K48j50j14q85J181j212L73k79L39m16k02R10
$$ plain form
2078 -1539 -271 -1294 -411 -1104 85 -1213 -46 103 -530 307 -257 442 -323 1335 451 270 759 554
2096 554 492 85 1227 -642 978 656 135 383 233 119 -766 415 -797 -424 -703 -364 -780 -982 -72
$$ [...]
8191F3
##END NTUPLES=NMR FID
##END=
