##TITLE=1H_CA-8787-1
 DMSO, 8 sc, 
 27.10.2020
##JCAMPDX= 6.0         $$ Bruker NMR JCAMP-DX V2.0
##DATA TYPE= NMR FID
##DATA CLASS= NTUPLES
##ORIGIN= UXNMR, Bruker Analytische Messtechnik GmbH
##OWNER= root
$$ XWIN-NMR		Version 3.5
$$ Tue Oct 27 10:01:33 2020 Russian Standard Time (UT+4h)  she@DPX200
##.OBSERVE FREQUENCY= 200.1315066352
##.OBSERVE NUCLEUS= ^1H
##.DELAY= (6, 6)
##.ACQUISITION MODE= SIMULTANEOUS
##.ACQUISITION SCHEME= undefined
##.AVERAGES= 8
##.DIGITISER RES= 18
##SPECTROMETER/DATA SYSTEM= spect
##.PULSE SEQUENCE= zg30
##.SOLVENT NAME= CDCl3
##.SHIFT REFERENCE= (INTERNAL, CDCl3, 0, 15.7039)
##AUDIT TRAIL= $$ (NUMBER, WHEN, WHO, WHERE, WHAT)
$$ ##TITLE= Audit trail, XWIN-NMR		Version 3.5
$$ ##JCAMPDX= 5.01
$$ ##ORIGIN= Bruker BioSpin GmbH
$$ ##OWNER= she
$$ F:/spectra/data/she/nmr/H-F/1/audita.txt
$$ ##AUDIT TRAIL=  $$ (NUMBER, WHEN, WHO, WHERE, WHAT)
(   1,<2020-10-27 10:00:11.04 +0400>,<she>,<DPX200>,
      <created by zg, POWCHK disabled, PULCHK disabled
       configuration hash MD5:
       00 E9 B6 7A A2 85 ED C7 34 08 36 98 17 FE 4E 26
       data hash MD5: 16K
       CF 14 F2 55 27 91 9C F0 2D EC 08 75 60 5A 4D B2>)
$$ ##END=
$$ 
$$ hash MD5
$$ 95 03 C2 5B EC 24 90 B0 69 0C 92 D6 05 0B B7 D4
##$RELAX= 
##$RELAX= 
##$RELAX= 
##$RELAX= 
##$RELAX= 
##$RELAX= 
$$ Bruker specific parameters
$$ --------------------------
##$DU= <F:/spectra>
##$EXPNO= 1
##$NAME= <H-F>
##$PROCNO= 1
##$TYPE= <nmr>
##$USER= <she>
##$AMP= (0..31)
100 100 100 100 100 100 100 100 100 100 100 100 100 100 100 100 100 100 
100 100 100 100 100 100 100 100 100 100 100 100 100 100 
##$AQSEQ= 0
##$AQ_mod= 1
##$AUNM= <au_zg>
##$AUTOPOS= <>
##$BF1= 200.13
##$BF2= 200.13
##$BF3= 200.13
##$BF4= 200.13
##$BF5= 200.13
##$BF6= 200.13
##$BF7= 200.13
##$BF8= 200.13
##$BYTORDA= 1
##$CFDGTYP= 0
##$CFRGTYP= 5
##$CHEMSTR= <none>
##$CNST= (0..31)
1 1 145 1 1 1 1 1 1 1 1 1 1 1 1 1 1 1 1 1 1 1 1 1 1 1 1 1 1 1 1 1 
##$CPDPRG= <>
##$CPDPRG1= <>
##$CPDPRG2= <>
##$CPDPRG3= <>
##$CPDPRG4= <mlev>
##$CPDPRG5= <mlev>
##$CPDPRG6= <mlev>
##$CPDPRG7= <mlev>
##$CPDPRG8= <mlev>
##$CPDPRGB= <>
##$CPDPRGT= <>
##$D= (0..31)
0 1.2 0 0 0 0 0 0 0 0.06 0 0.03 0 0 0 0 0.0002 0 0 0 0 0 0 0 0 0 0 0 0 
0 0 0 
##$DATE= 1603778410
##$DBL= (0..7)
120 120 120 120 120 120 120 120 
##$DBP= (0..7)
150 150 150 150 150 150 150 150 
##$DBP07= 0
##$DBPNAM0= <>
##$DBPNAM1= <>
##$DBPNAM2= <>
##$DBPNAM3= <>
##$DBPNAM4= <>
##$DBPNAM5= <>
##$DBPNAM6= <>
##$DBPNAM7= <>
##$DBPOAL= (0..7)
0.5 0.5 0.5 0.5 0.5 0.5 0.5 0.5 
##$DBPOFFS= (0..7)
0 0 0 0 0 0 0 0 
##$DE= 6
##$DECBNUC= <off>
##$DECIM= 32
##$DECNUC= <off>
##$DECSTAT= 4
##$DIGMOD= 1
##$DIGTYP= 9
##$DL= (0..7)
0 120 120 120 120 120 120 120 
##$DP= (0..7)
150 150 150 150 150 150 150 150 
##$DP07= 0
##$DPNAME0= <>
##$DPNAME1= <>
##$DPNAME2= <>
##$DPNAME3= <>
##$DPNAME4= <>
##$DPNAME5= <>
##$DPNAME6= <>
##$DPNAME7= <>
##$DPOAL= (0..7)
0.5 0.5 0.5 0.5 0.5 0.5 0.5 0.5 
##$DPOFFS= (0..7)
0 0 0 0 0 0 0 0 
##$DQDMODE= 0
##$DR= 18
##$DS= 0
##$DSLIST= <SSSSSSSSSSSSSSS>
$$ [...]
##$SUBNAM2= <"">
##$SUBNAM3= <"">
##$SUBNAM4= <"">
##$SUBNAM5= <"">
##$SUBNAM6= <"">
##$SUBNAM7= <"">
##$SUBNAM8= <"">
##$SUBNAM9= <"">
##$SW= 16.880792210976
##$SWIBOX= (0..15)
0 0 2 0 0 0 0 0 0 0 0 0 0 0 0 0 
##$SW_h= 3378.37837837838
##$TD= 16384
##$TD0= 1
##$TE= 0
##$TE2= 300
##$TE3= 300
##$TEG= 300
##$TL= (0..7)
0 120 120 120 120 120 120 120 
##$TP= (0..7)
150 150 150 150 150 150 150 150 
##$TP07= 0
##$TPNAME0= <>
##$TPNAME1= <>
##$TPNAME2= <>
##$TPNAME3= <>
##$TPNAME4= <>
##$TPNAME5= <>
##$TPNAME6= <>
##$TPNAME7= <>
##$TPOAL= (0..7)
0.5 0.5 0.5 0.5 0.5 0.5 0.5 0.5 
##$TPOFFS= (0..7)
0 0 0 0 0 0 0 0 
##$TUNHIN= 0
##$TUNHOUT= 0
##$TUNXOUT= 0
##$USERA1= <user>
##$USERA2= <user>
##$USERA3= <user>
##$USERA4= <user>
##$USERA5= <user>
##$V9= 5
##$VALIST= <valist>
##$VCLIST= <CCCCCCCCCCCCCCC>
##$VD= 0
##$VDLIST= <DDDDDDDDDDDDDDD>
##$VPLIST= <PPPPPPPPPPPPPPP>
##$VTLIST= <TTTTTTTTTTTTTTT>
##$WBST= 1024
##$WBSW= 4
##$XGAIN= (0..3)
0 0 0 0 
##$XL= 0
##$YL= 0
##$YMAX_a= 230993
##$YMIN_a= -207812
##$ZGOPTNS= <>
##$ZL1= 120
##$ZL2= 120
##$ZL3= 120
##$ZL4= 120
##$ABSF1= 10
##$ABSF2= 0
##$ABSG= 5
##$ABSL= 3
##$ALPHA= 0
##$AQORDER= 0
##$ASSFAC= 0
##$ASSFACI= 0
##$ASSFACX= 0
##$ASSWID= 0
##$AUNMP= <proc_1d>
##$AZFE= 0.1
##$AZFW= 0.1
##$BCFW= 1
##$BC_mod= 2
##$BYTORDP= 1
##$COROFFS= 0
##$CY= 11.3945322036743
##$DATMOD= 1
##$DC= 2
##$DFILT= <>
##$DTYPP= 0
##$F1P= 16.9975609425685
##$F2P= -3.02152046262296
##$FCOR= 0.5
##$FTSIZE= 0
##$FT_mod= 4
##$GAMMA= 1
##$GB= 0.15
##$INTBC= 1
##$INTSCL= 1
##$ISEN= 128
##$LB= 0.24
##$LEV0= 0
##$LPBIN= 0
##$MAXI= 10000
##$MC2= 0
##$MEAN= 0
##$ME_mod= 0
##$MI= 1.114404
##$NCOEF= 0
##$NC_proc= 0
##$NLEV= 6
##$NOISF1= 3.799351
##$NOISF2= 2.8
##$NSP= 1
##$NTH_PI= 0
##$NZP= 0
##$OFFSET= 15.70392
##$PC= 1
##$PHC0= -10688.94
##$PHC1= 9.800879
##$PH_mod= 1
##$PKNL= yes
##$PPARMOD= 0
##$PSCAL= 0
##$PSIGN= 0
##$REVERSE= no
##$SF= 200.130013532006
##$SI= 16384
##$SIGF1= 3
##$SIGF2= 2
##$SINO= 400
##$SIOLD= 16384
##$SREGLST= <1H.CDCl3>
##$SSB= 0
##$STSI= 0
##$STSR= 0
##$SW_p= 3612.71676300578
##$SYMM= 0
##$S_DEV= 0
##$TDeff= 0
##$TDoff= 0
##$TI= <>
##$TILT= no
##$TM1= 0
##$TM2= 0
##$TOPLEV= 0
##$USERP1= <user>
##$USERP2= <user>
##$USERP3= <user>
##$USERP4= <user>
##$USERP5= <user>
##$WDW= 1
##$XDIM= 8192
##$YMAX_p= 0
##$YMIN_p= 0
$$ End of Bruker specific parameters
$$ ---------------------------------
##NTUPLES= NMR FID
##VAR_NAME=  TIME,          FID/REAL,        FID/IMAG
##SYMBOL=    X,             R,               I
##VAR_TYPE=  INDEPENDENT,   DEPENDENT,       DEPENDENT
##VAR_FORM=  AFFN,          ASDF,            ASDF
##VAR_DIM=   8192,          8192,            8192
##UNITS=     SECONDS,       ARBITRARY UNITS, ARBITRARY UNITS
##FACTOR=    0.000296,      1,               1
##FIRST=     0,             0,               0
##LAST=      2.424536,      0,               0
##MIN=       0,             -207812,         0
##MAX=       2.424536,      230993,          0
$$ Real data points
##PAGE= N=1
##DATA TABLE= (X++(R..R)), XYDATA
$$ [...]
2000a586J833J815j760j099J698R0j767J440O87j966k69K758j017k688J660J847
2016A676j766k113K550J217k577q25K766J96k878L45K229p05k210J803R91j826
2032a127m53J524n8j946J467J122j810k89K358o83k768J954K285k505j562L368
2048H77O64l771P00L264j152k935J936J944k083o97K140k58j564J218M23j075
2064c69j58J999r39j665J541J737k324j184K873M38k609j78K990p20k427R01K002
2081A908j129j929J766R90j544m15J675m40j325J305K60j294O1J810j147j744
2097a192J791J035k004j086L379n49l164Q81L222j841k601K671J140k363q06K395
2113I08j99k036J069J263j384o44J843r08j234J216J282k178p14K810m95k270
$$ y = [-1586, 247, 2062, 302, -797, 901, 991, -776, 664, 1351, -615, -884, 1874, 857, -1831, -171, 1676, -90, -2203, 347, 1564, -1013, -1838, 928, 1124, -1754, -1409, 820, 115, -2095, -292, 699, -1127, -1580, -56, -114, -2060, -593, 529, -1281, -1570, 788, 105, -2663, -709, 1576, -929, -2491, 877, 1541, -2230, -1530, 1734, 582, -2353, -417, 1527, -556, -1253, 887, 629, -935, 283, 706, -369, -527, 1472, 533, -1132, 409, 2146, -178, -1362, 1511, 1949, -660, -838, 2152, 1432, -995, -94, 1908, 779, -1150, 616, 1606, 62, -353, 1322, 882, -443, 862, 1122, -172, -111, 1699, 552, -1192, 599, 1634, -370, -1456, 1923, 1374, -1790, -909, 2313, 472, -2129, 542, 1682, -681, -1487, 908, 709, -1327, -258, 1005, -379, -1023, 820, -88, -1322, -106, 1176, -1002, -1716, 1094, 599, -1671]
2129a671M63K486j141k216J600J752j652j440K019P38j742k62J886p21j288R14
2145b75R12j484J88J413q28j289J852P53k316j90K983r58k633J469K803k388j766
2162a754K742O03k385m35K751r25j768R46J281j389l50J718p68r79J215O77j784
2179f04k54K402j140j689R07K126j666j718K081J079k142p12K305q2j838L45J792
2196A192r47j289J132P11j125l08J365r55p41J128O55j973M61K273j558j911J905
2213A5J874k601r99K875Q9k404J32K503j121j551J380Q33j370l83J552o84o47
2230e07O85P66j386Q1J527p34j588J085J919j989j045J962Q24k696K22K348o44
2247H30j902P67J969j487j108J112N09r81o9J399j061o65J080J74j591N25J734
$$ y = [-1671, -1208, 1278, 137, -2079, -479, 1273, -379, -1819, 200, 938, -804, -1066, 820, 99, -1189, -275, 637, -847, -659, 754, -74, -1363, 489, 1242, -1074, -1264, 1719, 761, -1872, -403, 2400, 12, -1754, 988, 1591, -794, -1229, 1522, 597, -1171, -225, 1056, -333, -683, 1035, 267, -712, 503, 1180, -604, -858, 1544, 404, -1285, -378, 1748, 82, -1636, 445, 1524, -618, -1330, 975, 893, -945, -600, 1192, 245, -1044, 88, 799, -326, -634, 731, -224, -965, 163, 818, -1155, -694, 1579, 21, -1890, 15, 1889, -712, -1711, 1164, 1253, -1151, -1019, 1484, 363, -1188, 192, 1025, -345, -728, 824, 140, -507, 178, 944, -442, -361, 1166, 432, -1156, -71, 1848, -141, -1186, 776, 1600, -1096, -874, 1474, 830, -1072, -305, 1664, 177, -931, 181, 690, -291, -360, 1039, -22, -687, 393, 567, -1024, -499, 1235]
2264A235j195j539J609J260k420l43K160L9k440O44K309j338j373J434R82j857
2280h33k70J535k71j184J229O7j095K37J123p86j332J296J475k129m01K125J15
2297I01k264O78K114j085j805J363J396j455p45J405M8j033J10J055n73o58R59
2314D11K43j314N91J404j096j287J730P32j855J51J698n32k158J060J966j690
2330E4r69J429Q94j784J1J625m57j216M67Q64j059j70J177l17j246J057Q47j676
2348d69j79J679j29j894M50J829j150j766J653R17j616m30J556J91j756O44J193
2365G23j096q02J254kj223O28J200j027q03J430K95k060O50J626o51j825J465
2382b18J263j750o93J772J81j611L8J379k03j366R93Q97j291J22Q41k28j002J000
$$ y = [1235, 40, -1499, 110, 1370, -1050, -1393, 767, 806, -1634, -990, 1319, -19, -1392, 42, 1024, -833, -1103, 432, 161, -1023, 206, 273, -822, -585, 538, -248, -1580, -284, 1191, -938, -1339, 786, 901, -1363, -685, 1429, 344, -1461, -98, 1298, -157, -902, 503, 551, -482, -372, 683, 110, -548, 411, 654, -660, -69, 1335, 239, -1048, 682, 1414, -441, -290, 1408, 876, -1282, -222, 1744, 54, -915, 514, 1408, -376, -365, 1260, 803, -413, 54, 918, -141, -311, 866, 549, -697, 360, 1207, -469, -648, 1031, 902, -992, -542, 1287, 137, -1629, 24, 941, -675, -1105, 451, 642, -1114, -470, 723, -373, -1175, 79, 77, -1146, -518, 682, -345, -1148, 282, 577, -1483, -833, 793, 142, -1683, -218, 1045, -705, -1398, 374, 555, -1056, -1018, 361, 158, -1208, -215, 682, -609, -487, 354, 126, -876, 124]
2400A24O93j350j69J458k06j287P97J320j331j092J800P60k006p8J580J64j593
2417d16M90J235q87n02O56L76j378O49Q72r79k48J087K40j938P14J166q53j312
2435a028J345J138k032j86J707k67j595M62J559j084q70J133L79j232K19Q91m94
2452D5p53O32O96j046k56J175j17j498J216M48j038r13J745K72j832K49J634n27
2470A32j438J094P69r75o85J122N2j016N61M23k11p44J060J02j330R41O08q40
2488c75j073J688L92j500K41J502k40j869Q56J311q31r16J188N63j156k96J060
2505E45r0q42Q68L92j105p3J244m70j019J086L91j193l89J398J2j660O81J388
2523A164p92j489J398Q55j561l89J459J60j222M25N77m82n14J049q3j313N46J048
$$ y = [124, 817, -533, -702, 756, 550, -737, 60, 1380, 49, -1043, 757, 1517, -489, -567, 1013, 1177, -416, 74, 1309, 422, -80, 576, 952, -426, 223, 1095, 116, -132, 955, 1195, -743, -29, 1137, 284, -1028, 317, 1455, -577, -763, 944, 677, -918, -456, 1103, 19, -851, 282, 661, -571, -352, 539, 45, -708, -76, 620, -426, -682, 493, 376, -1122, 94, 542, -496, -1409, 336, 608, -1224, -975, 659, 132, -1306, -212, 557, -418, -1103, 19, 71, -945, -384, 39, -172, -916, 144, 246, -1084, -143, 465, -375, -1448, 240, 632, -868, -627, 875, 635, -1234, -378, 933, 102, -814, 374, 937, -219, -515, 545, 455, -387, 481, 873, -232, -305, 939, 469, -550, 536, 927, -266, -655, 743, 755, -905, -224, 1164, 372, -1117, 281, 1136, -425, -814, 645, 805, -417, 8, 585, 103, -411, 638, 555, -758, -212, 836]
2541H36j285k57J311K5j427J76J585p14j286P91J075j088o86J394J77j301J03
2558e71J202o26q43J026K10q23K7J014o21n50Q67J88j096n2J410l29j369P29J134
2577I27o87j317J537N12j824R5J250K33j321P08O77l91o99Q07j27q97N94M21m39
2596E9n71J020J09j323M53J085r32r28J681K22j013q59J899n29j016L40R20l70
2614B47j149J039J96q40K94N74m57n07J039N5p82n1J066n27j156O74J051r06p43
2633h83J308M4j096n3J309n59r76O20J032q23n51J031M7q76J45P62q41l3Q50k91
2653A66q42L22J115p35o58J021J05j055l03J451Pj365N73J253q60p04P81N13j073
2672b88k6Q74n08l21Q63k48n07j36J067p94n02R29N31j095k36J029q1r85J10J024
$$ y = [836, -449, -706, 605, 630, -797, -621, 964, 250, -1036, -245, 830, -258, -944, 450, 627, -674, -571, 631, 5, -838, 188, 398, -425, -398, 616, -5, -555, 312, 500, -596, -648, 762, 433, -936, -207, 927, 240, -1077, 460, 972, -852, -757, 493, 726, -595, 113, 790, 399, -300, 507, 380, -517, 77, 498, 59, -512, 508, 617, -706, -253, 832, -100, -1028, 653, 875, -138, -997, 902, 373, -643, -303, 617, 247, -902, 137, 333, -507, -213, 361, -96, -603, 436, 491, -291, -342, 724, 197, -959, -285, 766, -140, -883, 425, 469, -627, -680, 629, 70, -906, -286, 746, -77, -628, 403, 450, -426, -281, 481, -360, -393, 457, 166, -676, -354, 761, 26, -632, 389, 494, -561, -864, 587, 594, -771, -198, 1055, 195, -509, 272, 785, -288, -314, 560, 52, -269, 594, 346, -161, -297, 770, -24, -526, 403, 934, -161, -397, 632, 551, -434, -324, 700]
2692G00o18r93J061J61l82o20Q31j01n55N98K64o89j80P81k63n37L59P84j115
2711e14l64J188L22j433K30J275n11q48L54J056j058m89J187L2q93L55P43p28
2729i6n60O83L78o90Q6Q44p43o97J087K68j103l18J444k78r75M51J082q20n66
2748e23P62M84q13l50J195l62m27K04P67j074K44N47l87l58M12P16j086r6P43
2767E98J52j178K85J046o77r04R36O01j128n31J600m60r26K26R79r28m93Q65O2
2786A25l98K13O31q23j98N69J35p84J01R68p24l22P35Q72j362l01P47L03j097
2805f10K22Q90q23l13L07L12p48K82N31j20n64J78N91p79j38Q02k06m45M1J160
2825E70q07n63R71L36j052l43J150l13l67J63J071r34j68N51R3m53J52L44j34
$$ y = [700, 82, -911, 150, 311, -71, -691, 140, 39, -516, 82, 346, -343, -523, 258, -5, -542, -183, 601, -514, -878, 310, 632, -801, -571, 704, 193, -655, -301, 755, -303, -792, 395, 427, -466, -111, 632, -96, -656, 27, 405, -285, -199, 645, -98, -795, 292, 560, -543, -861, 583, 305, -670, -219, 863, 43, -523, 239, 723, -90, -440, 755, 393, -34, 170, 937, -137, 107, 654, 267, -91, 321, 1037, -49, -145, 598, 750, -428, -143, 903, 226, -678, 258, 859, -269, -800, 800, 340, -586, -360, 619, -309, -802, 63, 125, -273, -60, 571, -252, -450, 119, 254, -530, -429, 539, -185, -507, 228, 1100, -262, -563, 184, 487, -610, -388, 502, -321, -634, -327, -15, -763, -481, 50, -70, -634, -456, 135, -644, -782, 20, -186, -631, -590, 570, -237, -800, 171, 507, -545, -888, 262, -51, -418, -255, 816, -118, -286, 265, 358, -95, 57, 401, 267]
2844B67m46K26M04j057M35O85k27o71M72P42j299J0R78jq80O5Q07m00o46P93K52
2865E09p39j61Q08j92l47J72K78l73O2N97j91q62P43L46p00j44N36L98j164J45
2885b79Q05m76o15N17O22j161j74R48j85k85PQ18p27l31M39L67n34o6Q58q63k73
2906e88O10M35q90%J043l45r75O54M08k23o59P53M53j010J63M72K4m10M7M57m31
2927a2m6L82j15p41O13N92q49k20Q72J55j304N48O98m48p37P86M43j008J39N31
2947B79L0o13M27K44n77j96M90K78p40K39O33m48l91L60K75p96N92M91l80p50
2967e53N04M60m76l23M38L30q25K5O96l6n71K55P18r50J09M35l65m40P60K28p94
2988c75J75N19l0r87N85O36l26o02N30K95o81K27J78K05o98J43O29p13oL92m8
$$ y = [267, -179, 47, 451, -606, -171, 514, 287, -384, 88, 830, -469, -459, 519, 518, -362, -297, 510, 110, -536, 257, 509, -230, -391, 417, 225, -122, 50, 328, -45, 17, 614, 423, -439, 304, 650, -50, -194, 342, 740, -424, -279, 526, 50, -565, -48, 574, -587, -761, 187, 2, -283, -276, 542, -185, -516, -77, 290, -244, -310, 548, -315, -588, 22, 457, -433, -433, 610, 265, -710, -56, 352, 129, -530, 223, 676, -334, -171, 301, 325, -85, -38, 419, -12, -58, 324, 209, -532, 81, 673, -176, -396, 476, 631, -673, -125, 573, 125, -612, 174, 617, -391, -252, 279, 309, -304, 123, 367, -210, -406, 84, 362, -378, -139, 494, 46, -345, 15, 290, -506, 86, 577, 197, -553, -49, 411, -65, -388, 50, 380, -445, -420, 276, 240, -331, -76, 642, -308, -199, 236, -129, -569, 191, 419, -375, -200, 319, 289, -698, -113, 523, 197, -405, 125, 420, -261, -34, 144, 349, -349, -206, 423, -290, -296, 96, 48]
3009D8j71K30J56k94O8K87K34p21L22J79m37k79L21O95o99l74Q66J58j044L58
3029i7J43k60j48J20O23o35K14l1j10k16O83Q6r13J96R39o05o34P22L93n22l65
3050d17P44K88j271M28P10m47n36O73J25l79k39O34ro33L51J90l54l19Q94o2j041
3071f70M21M24k10o98R32L25r56k47J146j45r02P66L33o68k01O39J71n79K74J72
3091C27j53o27R70K3o21K45K90j30n23O89J7o84j42R27m18o81L88M46k99m82P87
3112C49O3m58l80N09K82p37M59j0j23l37O51L1n82J72L92m52l99N36K76n05J58
3133a05N50j59n86M04J99m08l33P57j10m99J1M26m16l19P84k8m76LK87p8m48K12
3155c32M02m56j33P45m02n06N76L78n17k76N19L44p03r9R09m64n30N52L22k92
$$ y = [48, -123, 107, 263, -31, 37, 324, 558, -163, 159, 338, -99, -378, -57, 638, -61, -435, 431, 589, -455, -97, 46, -214, -362, -242, 381, -254, -40, -71, -181, -397, 286, 372, -541, -345, 594, -11, -645, 77, 470, -52, -417, 327, 615, -656, -228, 482, 35, -501, 172, 297, -82, -321, 313, 304, -329, 22, 212, -142, -461, 433, 371, -670, -249, 175, -35, -733, 199, 524, -432, -679, 467, 322, -580, 186, 519, -149, -350, 289, 460, -119, 155, 327, 174, -453, 517, 540, -81, 164, 454, 324, -199, 490, 507, -177, -319, 608, 190, -491, -103, 343, 44, -438, 349, 412, -46, -426, 83, 365, -372, 87, 77, -46, -383, 268, 299, -283, -111, 281, -171, -570, -34, 242, -263, -105, 445, 286, -300, 104, 303, -105, -438, 319, 209, -290, -279, 147, -269, -588, 196, 168, -308, -305, -18, -96, -544, -332, 70, -386, -519, 226, -176, -682, -106, 272, -245, -521, -2, 342, -361, -460, 449, -15, -545, 7, 329, 37]
3175C7k92N61j87l58K17N96o80j23P99k21n08K4Q18m40n89K80M81n91j02R44n40
3196A26m71K96M00m13k76R01k92n57K3O08l34l15N76nm27j0N15j54n20L49K24
3217B44k40l75P85m0m78k58N48k62j88L26J74l89j13O04l64n22O10M8r8l60O90
3238C42l79k37O3M57l02k38M04n7k02l24O74k86m97N73J77r6m79O90j59m11J72
3259a15K79j91n83R19l57j04O5O31n68l62O45J91m30j60M31Pn74J8P26k67k80
3280g9L11n1l01k4L32l72J60Q4k0l3j35O52k98m68L4O97n98j76L95L70n42l72
3302d34R67l38l72M17L14n44j89K67M6j82R7L89m65n09P42l0l01k96P18r1n56
3323c50M73K15o16p3O92k39j83J13K19m79N2K7M28n32j5N51k87k40K16J87n34
$$ y = [37, -255, 306, 119, -239, -22, 574, -106, -229, 570, 349, -159, -135, 683, 243, -346, -66, 415, -176, -278, 666, 126, -345, -49, 351, -62, -338, 563, 271, -286, -263, 345, 11, -304, 272, 267, -160, -170, 345, 191, -329, 20, 244, 4, -371, 414, 374, -104, -362, 186, -76, -264, 62, 236, -153, -266, 338, -26, -548, 62, 110, 12, -348, 342, -37, -274, -211, 246, -56, -294, 110, 53, -149, -473, 201, -85, -582, -9, 168, 72, -407, 283, 124, -287, -115, 164, -27, -610, 309, -48, -152, -87, 544, -24, -386, 259, 450, 20, -140, 291, 298, -276, -258, 468, 201, -79, 232, 181, -120, -144, 188, -184, -24, 60, 40, 7, -128, 524, 226, -242, -208, 489, -109, -285, 110, 480, -62, -434, 533, 195, -177, 240, 554, 10, -179, 88, 134, -48, 49, 438, -27, -536, 206, 176, -125, -421, 297, 206, -350, 123, 338, -278, -351, 341, 102, -81, 32, 251, -228, -176, -149, 279, -253, -268, 283, -4, -244, -28, 159, -375]
3344c75Q4M99j62k71K66K74l33k93O61q7m42r3P77n30k32K66J79n58K93L07k2
3365B08n82K61L82j97k39N90k46n39M08K44l26k97L36L84p10j05O33j39o65M49
3385a50O32n81k36M36K15p51L20k0K61l57J14L34m21J17K05j48j10J04K37j89
3405A2j75N68k99m18L43O51n58m02N82n6n69n7Q16l15k38m4M59m06l30N17mm53
3427c76L82K15j04o58P34N5l51k0L78j59l96M49L37n50K5K91k82k31J09M71l44
3448b5j54M87j33k60O7L37l98p8J88J72m25N6M59j20n22L49L39n90J93L06J6m81
3470b17k3N11l97m4q8M92l96k23N08n9n71N10J78j76j27M2K19n71M07N6m75J29
3492c15L44L37m37l47M92J52m23M32K04m75k52K52J95j82pK28k06j47K8K26k13
$$ y = [-375, -291, 208, 46, -225, 41, 315, -18, -311, 350, 263, -179, -272, 505, -25, -257, 9, 188, -370, -77, 230, 208, -374, -113, 269, 72, -167, 423, 177, -362, 46, 290, -36, -333, 3, 387, -323, -428, 205, 66, -599, -150, 482, -99, -335, 101, 316, -435, -115, -135, 126, -231, -117, 217, -204, -87, 118, -30, -140, -36, 201, 12, -163, 405, 106, -312, 31, 682, 124, -278, 304, 248, -321, -378, 438, 123, -115, -159, 300, -106, -436, 81, 77, -376, 6, 221, 117, -541, 193, 248, -103, -123, 255, 96, -300, 149, 486, -64, -39, 252, -30, -261, -152, 319, -25, -179, 308, 175, -85, -18, 319, -79, -157, 31, 203, -222, -166, 293, 173, -349, 0, 339, -251, -58, 248, 264, -217, -240, 271, -126, -170, -258, 234, -162, -385, 123, 64, -507, 3, 181, 5, -122, -80, 139, -432, -25, 31, -444, -315, 29, 366, -71, -418, 74, 226, -197, 235, 439, -36, -288, -36, 159, -23, -30, 198, -8, -155, -127, 99, -114]
3513a14r2N98l49l85J54L48rl57N78j3o71r1P02k73m59O53J84l65l5L97j50l58
3535a07J01N21n02k64M81J9k54J72K09k62l10N51J2p76O24J37j71m29K95j20O
3556f7m48P51K6o15J50M27j17m48M91o7q9n0K6N4k17L90k24J27m29O86j87n66
3578c96K48N5k60J69L80k15j84J47M13m03l12K27L06o30N1M07j31j80M12j48l00
3599c44k25M45J07l23L30L61m30k28K81K40l61k58N95j4k89J68J05J21l88K17
3619A10J13l03K2L19l27q8L76M4l42j76N76k58l40K59K54l53k06K10L47o47K18
3640a92M99j98n44M63M41m79k96N60k96r8m0N25k99k02M14j6m68j03N93M0k59
3661D5L47k60k40P2L33M0n06J12K16k62j36L70k49jO4J96k8l20K08l5k41J33J39
$$ y = [-114, -206, 392, 43, -342, -188, 160, 151, -206, 372, 359, -312, -403, 299, 26, -433, 220, 404, 39, 4, 401, 251, -107, -6, 515, 13, -251, 230, 249, -5, 167, 376, 114, -196, 355, 367, -409, 215, 352, 181, -248, 47, -73, -67, -515, 236, 262, -353, -203, 224, 107, -341, 150, 83, -6, -56, -30, 24, -193, 197, -27, 100, -329, 357, 170, -396, -148, -93, -353, -184, 196, -19, -203, -56, 357, -46, -358, -131, 175, -455, -404, 3, -128, -308, 104, -44, -344, -569, -124, -17, -340, -10, 351, -79, -307, -26, 214, -147, -405, 190, 176, -113, 55, 160, 281, -107, 110, 223, -80, -58, 261, -66, -154, 222, 266, -76, -252, 324, 66, -274, -15, 239, -114, -320, -110, 237, -410, -192, 307, 109, -435, 28, 469, -10, -306, 254, -42, -140, -180, 345, 46, -156, 258, 242, -226, -329, 264, 304, 45, 392, 132, -108, -36, 297, 337, -169, -57, 159, -103, -239, 131, -118, -119, -55, 141, 113, -207, 1, -34, -275, -142, -3]
3684cK21o01K11K22m9j16K76N6l68J5N25k26o82P37P5l44P9M28l67k77K19J91
3706B22k46j26L04l78J5K21J50p9l69M36l6n13M91J06n0k23n6K24l69K24J94j55
3728a3l9K7L85j35l07L12J3p7r1lj97J2Q7L04l52K41J25j49l81K31J15j20l79
3751c91O55k4j62j48J70j68k55O73m48J22k36L97k91j44K88L5k76j11L21N6m10
3772c47J88K92j91j89L66J31j73l57M37p2k46K75j36j2J14J46J11l39j04R6J07
3793I7J9j05L30n66J7L03k28J8j7K93o8k70M49p2n10J58O16n09j38J08p1J45q9
3816i0M91o13j03K14M04k49k62M38j23l02JM17m44J85J70J60m66J0M53k40j38
3837h7K19j8O4k53O3J72n14K37N16m20k77M25L1l27o8L67K04q10O35J12j41j14
$$ y = [-3, 218, -383, -172, 50, 1, -115, 161, 217, -151, -136, 389, 163, -519, 218, 293, -51, 28, 456, 89, -188, 31, 222, -24, -150, 154, -224, -209, 12, 162, 83, -286, 150, 114, -399, 92, 198, 148, -75, -131, 93, -276, -52, 142, -13, -52, -25, 360, 225, -82, 230, 243, 166, 75, 72, -125, -113, -26, 278, -74, 167, 292, 143, -238, -7, 108, -12, -391, 264, 240, 78, -70, 100, -68, -323, 350, -98, 24, -212, 185, -106, -250, 38, 73, -203, -314, 7, 63, -347, -159, 133, -58, -247, 119, 250, 77, -280, 157, 85, -161, 114, -22, -34, 80, 226, 337, -2, -106, -10, 97, 116, 11, 341, -225, -208, 95, -133, -115, -132, 161, 93, -177, 272, 200, -310, -152, 464, -45, -183, -75, -146, -1, -90, 401, -212, -315, -101, 303, 54, -208, 230, 107, -195, -194, 223, -221, -36, 134, 294, -172, -162, 291, 51, -87, 132, 114, 178, -75, -12, 160, -354, -117, 399, -21, -298, 127, 158, -169, -237, 130, 334, -476, 159, 271, 130, 16]
3859A6M5j82J84l22N62k24l71M74J0k15k73M88k49M0K71K23n45J4L15j59n5N6
3881A03K62k98k39M82r7n12M44K14l59j83L20o8Ol36J52p9J01j97L48O5m14L37
3903E2N0j37k74P06n66K3L51j6l38r7M03k65q8J73L30l11q6K76o7m60K56L58l17
3926d4j00j6M46n10K29J91k39r3O1J35l54K7L97p9j67q5J66J06j56q5J07J28k83
3949b18M67k37k13J28L69k30n1J34K4j05J61p4j22k54K16K42n45K96M01m15j97
3970b23K17K57n52j40M09J95l73M9K26k14j18Q3N15m19J2J61r1M3Rj18R6J22P1
3993B17J82n44rL83J11m90K76K54n33J92oK29l59NR0n9j65K82K93n94J42J19k08
4016a92J69J28k14l33M06J58J15m73L32k2o4oN9K72n09J25L11n26K21O5k24Q6
$$ y = [16, 61, -121, 63, -259, 303, 79, -292, 182, 192, -23, -296, 192, -57, -17, 254, 477, -68, -54, 261, 102, 47, 103, 365, 67, -172, 310, 213, -299, 145, 359, 0, -183, 137, 69, 75, -261, -109, -188, -87, -284, 64, 129, -285, 52, 102, -35, -309, 397, -169, -146, 205, 189, -149, -246, 157, -108, -196, -23, 307, -4, -90, 186, 119, -341, -85, 273, -44, -144, -160, 286, -224, 5, 196, -43, -136, -75, 60, -294, -267, 130, 51, -116, -201, -35, 71, -85, -170, -63, 65, -218, 249, 12, -201, -73, 296, 66, 15, 149, 173, 68, 229, 155, 33, -221, -5, 237, -308, -12, 389, -26, -223, -6, 251, -301, -441, -32, 163, -210, -161, 65, -149, -267, -184, 331, -88, -76, 85, -6, 37, 46, -72, 24, 146, 217, 399, -145, -154, 229, 340, -150, 126, 380, -153, 39, 33, 262, -97, -92, -2, -61, -226, 56, 349, -245, -103, 16, -192, -23, 105, -109, -442, -36, 122, 237, -236, 96, 74, 10, 4, 63, 335, -174, -49, 262, -264, -43, 22, -202, -116]
4038a16J30O2j12N1J41J42k22R9n4j41l31M85J16l54K07Pm6l10K49J53l5l20r
4061b08L57l58N05K0j45k54L5L41k01l41L88k06J95o0L1J18l50K61R5m18m5O07
4083C67l52k42K76M58o67j58M53K14o51K48K85k91k30L55J23k16j91L74N9m67
4103b53L16k2M7r6J22L9j18j40N04o13J28m1K77j90j22K43j48j11Q6M12k93k1
4125FL5j2m91N43J9j81j52M62k64o4J41q4J09k97K36J30m43j19M43J82k13o5J75
4148I6l43O5K40m2j87P1J00J07l40K04K9j75Q7K45j22j14J03K29k44l34K94j4
4170d5r7L4K28k56j05L64k6j87M4K51p4n31L10m4j14j65O09j43j53l0M41m14j33
4193b36J58PR3k04M88j48k42L05k44J87m19J98L4l00L65P0M3n25N29P4k18j98
$$ y = [-116, 14, 76, -36, 15, 156, 298, 76, 175, 121, -20, -351, 134, 250, -104, 103, 110, 64, -246, 3, 156, 121, -199, -208, 149, -209, 296, 316, 171, -83, -48, 293, 92, -249, 139, -67, 128, 68, 99, 217, -133, 128, 223, -195, -240, 367, 15, -227, 49, 507, -160, -318, 135, 349, -302, -54, 231, -60, -290, 65, 188, -28, -219, 155, 214, -253, 63, 41, 88, -8, 114, 153, 35, -105, 399, -214, -86, -127, 150, -40, -162, 81, -67, -178, -92, 320, 27, 6, 41, 29, -462, 81, 100, -81, -233, 229, -35, -99, 42, -42, 67, -230, 6, 136, -307, -426, 17, 199, -14, -79, 96, -247, -182, 58, 16, -171, -100, 0, 107, -233, -29, 0, -175, -88, 157, 35, -79, 24, 253, 9, -325, -31, -45, -142, -108, 120, -136, -241, 123, 97, -90, -46, 205, 131, -400, -90, -134, -248, -413, 196, 53, -100, -130, 311, -103, -236, -78, -71, 22, -182, 306, 158, -84, 221, -23, 164, -255, -57, -23, -323, 42, 112, 155, -370, 159, 233, 15, -183]
4215a83K90k08j6J08K16l55l2L33n3l22P9K92L5l24K58Q2j14k87P8K26l54K38
4237a3J9n2nJ32j01l78N41p9o2j80K55n0j51m0L26j22l88L62pK1jK10J7l48J4
4262h0K64m4j65J91k1k65Q7K65j48l07L38k27k41j14K96K7KO5Q1k1k04P56m23
4285A12k3q2L19l49M3j46J05l41K48L06n4k31J47Q6j45km1K31j88j00M09k64k98
4308b58M7L73j93k88L66j11r0L3M27l45k62M86o8l46K07Q4M8j67K67k17N7j31
4330h1K68j78l23K22L72k87q2R2Q6k19J79J0j30j76J11J44m5k62L76Mj50J26k2
4353C5k22jL34j61j30K48L3Qm53N36j07n8l37J58J65r3r0K25Jk33K64M9j54k34
4377b17M46k53J76j05o3J8N6J18l40J06j09K05j16l39N62l30j85J95L03J5j03
$$ y = [-183, 107, -101, -117, -9, 207, -148, -180, 153, 100, -222, -143, 149, 184, -140, 118, 200, 86, -201, -123, 103, -251, -13, 6, -46, -51, 81, -20, -398, 143, 64, 2, -178, 77, 27, -124, -164, 162, 40, -348, 14, 7, 28, 27, 237, 254, -94, -80, 184, 140, -25, 166, 145, -120, -33, 232, 84, -223, 115, -112, -353, -467, -171, -144, -142, -77, 4, -17, -221, 535, 112, 89, 7, 326, -23, 20, -126, -21, -362, -114, 192, 138, -93, 54, 140, -5, -7, -48, 183, -5, -105, 304, 40, -258, -211, 162, -31, -319, 47, -64, -154, -121, 306, -39, -301, 185, 117, -229, -22, 62, 110, -57, 210, -7, 50, -81, 187, 9, -314, -92, 280, -7, -89, 3, 89, -130, 49, 59, -71, -247, -136, 8, -37, -299, 77, 81, -69, 57, 35, -187, -188, 146, -15, -145, 103, 136, 144, -309, 227, 120, 62, -275, -117, 48, -45, -135, 90, 91, -142, 122, 171, 17, -217, 229, -24, 152, 47, -16, 2, 58, 176, -164, -58, -167, 38, -78, -417, 145, -185, -370, -175, 128, 143, 40]
4398D0N7j16r5P2J83k4j31MK34m80N8J93J8j18Q7O8L9l63M29M0j08j23J88o6j47
4423f1J81Mj33n3J02P9l99K94J50k18j56J72K32k75j64K66L1j07P3N6k40L04j5
4446A23p1k43P3K20O4l32j8K98j92K32j9j57j34K89l6j73k0J8M1j93K15j56R2
4469g9q2J79R0k25J44O2j13rN7K34l40k2K77k28J2K27k74l26L60r8K78k61K67
4492A30j87o5Q0n4K9m4Q0K3K58k26n9K2m1r7J05o2R3K81j75o4K8l76K34L7q0O4
4518f6k9K1jJ67k06J20J26P3n03K49K92k69j71K03k79N37j2j25N2l61J99M6l6
4541B7j18N7k3J6J20N7k30J40p2J08j38K19l50M50m72J42J74j07J11l61J28NJ06
4564a1M9K5j99J62K39n70K55J79j24p3J15j00N3m9K32k78o3J43K05j28k62L44
$$ y = [40, 97, -19, -114, -42, 141, 117, -14, -10, 224, -256, -198, -5, 13, -105, -18, 50, 89, -274, 155, 195, 87, -36, 152, 86, -61, 120, 124, -9, -62, 40, 119, -280, 14, 164, -54, -210, -38, 194, -81, -245, 21, 52, -55, 18, 74, -166, 138, 123, 52, -191, -118, 102, 166, -166, -184, 114, -78, 154, 135, -22, -156, 133, 97, -76, -96, -78, -37, -230, -15, -171, -79, -161, 18, 108, -117, 27, 89, -24, -33, 24, 258, -82, -104, 173, -55, -43, 184, -90, -416, -56, -154, 124, -137, 130, -57, -122, -42, -96, -67, -111, -31, -8, 250, 24, -35, -13, -54, -151, -46, -108, -15, 266, 91, 27, 55, -321, -87, -50, -130, -66, -95, -74, -75, 92, -114, 6, 132, 205, -298, -49, 243, -26, -197, 6, -273, 264, 252, 127, 179, -182, 17, 63, 27, -91, -34, -57, -41, 79, 136, -94, 46, -26, 82, -56, 163, -187, 263, -209, -67, 107, 0, 111, -250, -122, -117, -11, 38, 63, -136, 26, 265, -305, -50, 129, 5, -68, 47, -53, 0, -49, 183, -95, -158, -15, 190, 62, -200, 144]
4586A44k2l07M6K43o3p7q8J17r6J40K21n1j22j78n5K66l33K31Q9l93L03K43k74
4609a6j06K19Q0l49J0K42P5l46J41L11l44J3K83l37R6k3Q5l6j47J89o0k57J62
4632a15J86M2k81M2K26j16R9J30j26R4oj61j54R7R8J43k53k08M43o0j02k07m2
4655b31K15n2L47l79l5m7K43J71k62J36K93m63j68L77j53k4p1Q5L69l49P6r7k8
4678d7o9K88j96j88J20L84l99J75J36k28N0p8J28l67R7L68N4j61o7j60o5J59P0
4701DJ27o5k89L04N1k99L30k43O9m65M93r8j00J02P0q4l4K46j26O7j46o9O5j0
4725a00K34O0m3Q5o7j87l38L07o5L3K0J66j01k36J33K40l8j85P1O3J16l25J20
4748c7K63l09m5J33k04k69M55M9n6j78L24J25l92q3K79l1k46L51J5j03k7K20l49
$$ y = [144, 122, -185, -139, 104, 41, -36, -124, -7, -103, 37, 258, 207, 85, -93, -148, 118, -215, 16, 105, -288, 15, 258, -16, -122, 97, 177, -172, -162, 80, 155, -191, -50, 261, -83, -70, 213, -124, -28, -51, 34, -2, -149, 40, -20, -277, -115, 71, 113, -168, -126, 100, -16, 83, 213, 87, 181, 175, 14, -140, -43, 55, 198, -55, -263, 180, 120, 18, -189, -231, -16, -68, 279, -100, -135, -182, 61, 232, -30, 106, 399, -64, -232, 145, -8, -32, -103, -18, 351, 2, 78, -19, -47, -116, 172, -24, -212, -92, 292, -107, 68, 204, -24, 26, -52, 76, -291, -194, 174, 228, 67, 0, -160, -225, -66, 4, 131, 66, -223, 81, 132, -167, 163, -80, -11, -476, 17, -81, -181, -79, -9, -93, -127, 119, -7, 60, -86, -155, -90, -100, 134, 194, 151, 236, 169, -18, -356, -49, -114, -81, -61, 105, 4, -232, -99, 141, 103, -82, -11, 52, 168, -157, -37, 226, -83, -128, 5, -199, -468, -13, 36, -20, -198, 126, 251, -141, -224, 55, 24, -222, 129, 144, 41, 14, 234, -115]
4771a15J31J74j95k29L39p4J78k90R2j82L11l62J70K58m05K46k0j28J96J6k52
4792a41K73j61K02j49J28j02j65J28J6r2n3J0J25J87l73L30k8L1l91K65M6O0j14
4815C2j7L73n38r0M16k03J77l6l8j90q2L72j32N1J02k03j24J34Q7j16j29J36K00
4838A82n8J6l44K48M4j28J39L0l24n7N2J58k0K05J05k85k0p2J56j13L52j40j75
4861d9O0j19K9q6K84m0j77m9K55j12J67j05Q8j31r7q9L64k91Q7J62k2p7M6j43
4885d5p8K7J71n2N2J1L7m7k82J74o1J29k98M78l17J7J47M6k69J57Q2j26l23L83
4909A3J90j2k06K30j94k9l59L33k1J89k5k30P6j28M41k50M9j00K06q0k1M2j03
4932A1Q5j59O3k21p5L42J24j66o7J04n6R7n9J15l49J43K23N7j32j49K70j83J58
$$ y = [-115, 16, 190, -5, -234, 105, 31, 209, -81, 11, -171, 140, -222, -52, 206, -199, 47, 27, -101, 95, 111, -141, 132, -29, 173, 24, 152, 50, -115, 13, 29, -63, -116, -106, 19, 206, -167, 163, 135, 166, -225, 40, 86, 146, 32, 15, 388, -150, -240, 176, -27, 150, 114, 76, -114, -196, 176, 44, 95, 197, -6, -130, 4, 91, -25, -154, -18, 182, 124, 140, -204, 44, 88, -40, 99, 129, -195, -252, -200, -42, -62, 143, 248, -37, -57, -129, 27, -86, 266, 126, -49, 11, -108, -79, -165, 119, 79, -98, -147, 108, -4, 163, 58, 146, 15, -82, -171, 193, -98, -11, 151, 129, 52, 98, -45, -123, -96, 75, 23, 75, 86, 123, 76, -206, -32, -93, 36, -262, 216, -101, -84, 63, 109, -160, -3, 79, -47, -370, 13, 203, 191, -15, 215, 21, -8, -367, -34, -55, 134, 109, -121, -45, -173, 268, 18, 67, -33, 173, 93, 72, 114, 11, 96, -63, 0, -221, -296, 46, 170, 4, -63, 41, -15, 82, 23, 138, -211, -68, 155, 212, 80, -69, 201, 18, 176]
4955A76k45K18k76j6L42l72J63j24J27O5l05L00j97n4K39J01k7k33J70J78l70
4976a40J77j9j08j61K99P1m41L14J79J04j10l61L60k04j36j08K57q8O4J83L9m34
4998b63K95R6Jp0j42K21Jk04J41j42J02j83K26k1j84M9p9k3J25J37k54o3L36j09
5022gJ72k43J36j31l3J74j16n9J35J1o6P4J75k94k00K25M70m90M2k23K48k09J10
5045i9R8K21Oj68j23l4J55l06L38j16N7K9J28m44k2K12K62k89N7R5M3m01N65l31
5069f7q7L81j17l21J23r1K01r1R0Q4j28J40j52J10m7j83q5K71p6l6j54L6j13K82
5093c0j96L30k40R8J21p6j67J20J21l21K74j32j7K85n4k61L13k11n4nJ59Q7J3
5116A57q9k74K43nq8Q9N0k96K07K63o7k19J1K09k45j4K03j83J29j26j65R3K45
$$ y = [176, -69, 149, -127, -143, 199, -173, -10, -134, -7, 58, -247, 53, -144, -198, 41, 142, 115, -118, 52, 230, -140, 37, 18, -90, -251, 48, 119, -322, -8, 171, 275, 165, -196, 164, -40, -176, -284, -27, -115, -51, 132, 171, -263, 32, 128, 129, 59, -83, 138, 139, -65, 76, -66, 36, -147, 79, 58, -126, -77, -156, -179, -54, 83, -171, -234, 102, -7, 165, -78, 58, -73, -106, 68, -48, -107, 28, 39, -27, 47, 222, -72, -272, -47, 423, -67, -25, -248, 0, -209, -99, -1, 220, 226, 58, -65, -99, 56, -250, 88, -28, 29, 58, 186, -258, -280, -68, 194, -95, -38, 57, 100, -301, 264, -67, -154, 227, 110, -211, -88, -179, 22, -69, 21, 105, -23, 117, -35, 75, 28, -155, -240, 31, -45, -81, -235, -199, -312, -30, -226, 104, -136, -38, 83, 7, -160, -40, 81, -240, 34, -98, -115, 170, 116, -145, 168, -43, -97, -102, 57, 144, 157, 68, -206, 37, 32, -56, 33, 83, -213, -6, 257, 190, -29, -18, 191, -54, -68, 135, -48, 81, -45, -210, -117, 128]
5139A28k55M0l9K35j6j87o8J60j27J50Q5m9J2k07K17m0k99K61j17K98k15J05q3
5162a1N9j36l0M6nn4J91M2j82L93j13k80K64p3l18J0J04R2l4Q2Joj67O1J19j51
5188i6q6J27P1l6n3j20K47j91J15J65j09O3j44O6P3l28J95J33l38L2K09J02l60
5211b63L56J5j05M31l36l0OJ7J88k10j08j80K64k06J45J93n8j27J46q1J47l99
5233a95M42l39J48q3L24j84%p8R7k06K2K06l52L02j71J70j43K34k43l8J7K86m26
5256b10k9L11J29j99J61k58L54l29l45M59J77j02k57M6r0J47K0J31q6o4K0j06
5278a20n9M20Q9m34q5M87j78k7J3k26J68k38m0J01K90j7J60l68m8J35r5J34k40
5301a78L60k53p2L27M6j31k14J83k2j72L22j47j38O0O9n7j1k23K28K66k74l4j1
$$ y = [128, -127, -87, -126, 109, 93, -94, -162, -2, -129, 21, 106, 57, 69, -138, 79, 39, -260, 1, -116, 182, -33, 72, -11, 48, -88, -118, -72, -77, -131, 60, 102, -80, 313, 200, -80, 184, 111, -207, -197, -93, -1, -35, 47, 48, 42, -125, -64, 55, -96, -182, -55, 16, -20, -73, -193, 54, -137, -22, 143, 34, 97, -47, 19, 92, -236, -41, 92, -246, -214, -5, 97, -263, 93, 108, 3, 434, 98, 68, 74, 91, 279, 69, -39, -219, 45, -161, -16, 177, 119, -8, 138, 57, 204, -195, 247, -92, 56, -27, 297, 113, 113, 35, 132, -74, -52, 154, -198, 104, -67, 103, -40, 194, -49, -87, -70, 216, -210, -239, 72, 201, 2, 163, -95, 259, -70, -415, 44, 221, 119, -138, -92, -182, -35, -15, 116, 30, -34, -14, -120, -179, 241, 330, -104, -189, 298, 120, 93, 106, -120, 48, -190, -230, -129, 161, 144, 304, -64, -112, 23, -72, 62, -178, 182, -71, -143, 184, 230, 99, -115, 68, 46, -126, 196, 49, -89, -29, 40, -17, -28, -251, -23, 243, -31, -65, -76]
5324g6r7%K91j8j35K89j63j73k5J53J26m7K0j27R2k85J57J68k84J89J42n6l76
5347b35Q0R2j54J51m8J26J81l23L70n8J64k71N0j82r3J68K6k22l7J99j01j42L11
5370E2m0j49N5J97k90J9L41k12M1j22R2kj29N5K9J42j21%j25N1K01j15l98K40
5394a88K04p9j8K63m7l95M3K95J00k01k43N71j27j41j41Q6N0L6j57L63n09L87
5416A52j89J15j75n0J27J53j12q0N9j31K94J47k55m0K34k25q3L27j67Q3j3l22
5438a51M6j06M6J10N4k4R0l62M28l06K85qj82n8P5pJ26k16Q9pJ88j00j94J25K6
5463c3M31n05lJ88N7j01J06j67J75j81n4P7n2o8L30l3k91J04k3k86M74k40J11
5486A6N7M8q3J05j11k03K72k69K45o3L9k87K73J15j38K7J1q1K54k91P5r7K34k07
$$ y = [-76, -173, -173, 118, 100, -35, 254, 91, -82, -107, 46, 172, 125, 145, 18, 110, -175, -18, 150, -134, 55, 197, 141, -235, -155, -63, -217, -66, -114, 12, 193, -130, 240, 182, 346, 75, 125, -57, -150, 18, 44, -178, -215, -16, -117, -259, 52, 12, -137, -82, 115, -175, -156, 185, -27, 14, -108, -16, -18, -147, -92, -63, 79, -42, -42, -167, -116, 85, -30, -428, -188, 16, -63, -81, 182, 135, -260, -217, 78, 178, -23, -266, 305, 178, 37, -104, -18, 32, 68, -89, 274, -235, 152, -37, 78, -97, -147, -20, 133, 21, -59, 0, -131, 163, 310, 55, 15, 249, 24, -59, 268, 101, 184, 171, -151, -105, -211, -165, -55, -1, -25, 65, -297, 131, -175, 110, 102, -80, -138, -63, -70, 56, -160, -71, -78, 110, 10, -184, -59, -33, 398, -107, -110, 78, 135, 34, 140, -27, 148, -33, -87, -10, -62, -130, 200, 167, -124, -20, -43, -329, 145, -95, 16, 73, 121, 38, 143, 32, -171, 101, -168, 77, 14, 53, -234, 39, 154, 16, 43, 54, -27, 227, -64, 11, -86, 148, -59]
5510e9J6l9K59j35k50K98j44m7J20l21M55pj07J26k52M95m93j13L17j11LJ75j6
5533A70o0j69K35k02J65m5J93l90m7P4j97L60j54M1K4p7J86J96m39n0O5Q6m4J33
5557E4r9j06K28n3j13J12J35r4l33M40k30k04K59j11K90l39O3j16R9K64n9l5o0
5580hJ80l21J40k3m5J26k55J81K1l0n7K1j34J65Q6j27m6J16j48R8K0j20M53k30
5604F3j02N3N8j9L4j23L1k4j71K74k21J52m1J41j85o9J49J0n8q9K19j89o2K92
5628A23M2j90P9k82K66P3k35L3K36qj42O6qr2M1P3j60l66M27J91k33O0K2J05J5
5653A36k77L31k28j3K42j94o4L18j48j17J93k45j09K20M2k98L22oj26J10m5j86
5675a42P5L6N7m2L60n83K08J48l6m27L65Q7p0J83j06K8j50J64j70O5k07K76k00
$$ y = [-59, -43, -82, 177, 42, -208, 90, -54, -101, 19, -302, 153, 146, 39, 165, -87, 408, -85, -198, 119, 8, 11, 186, 170, 110, -59, 176, -26, 139, 94, 287, -103, -150, -76, -273, 87, -67, -26, -2, -79, 107, 303, -136, -186, -121, -35, -79, 54, -45, -151, 77, 24, -89, 23, 158, 64, -269, 171, -59, -263, -4, -115, 175, -164, -101, -217, -118, 146, 87, 52, -8, 172, -149, -9, -32, -77, 49, -206, -25, -4, -34, -91, -70, -204, -39, 47, -80, -126, -10, -158, -60, -40, -160, 293, 63, -39, 14, 72, 53, 87, -36, -5, -29, -200, 74, -147, 5, -36, 105, -80, -149, 0, 10, -48, -137, 82, -107, -169, 123, 165, -25, 54, -228, 38, 111, -124, -91, 145, 137, -5, 61, 53, -39, 2, 75, -85, -451, -24, 167, -66, -6, 16, 121, 136, -141, 190, -38, -51, 191, -3, -67, 251, 103, -14, 179, -66, -175, 45, 87, -211, 111, 105, -21, 89, 44, -142, -67, -31, 26, -16, 344, -239, -31, 117, 81, -346, 19, 106, 36, 219, 113, 141, -9, 155, -15, 50, -157, 119, -81]
5698h1Q2l2J46j06J10r6J03n5N0q6J06P6j76k23J78m3K17j99K60k93J55j47J57
5721A03p7j9j44O5j04K82j08P3j83O5K4l00O41k35l2p2J32k96J36J04j32N0k05
5744b32K87l6j59K69l62K42o1P9j22K70q6j99k8K95j46j0O5j62K09QK9n0J44k54
5768a0j03J8K5K59m15K54Lj41N4j1o9J3J44p3R6j46o8K72k00K56k09n5J87j19
5792c8k50M10j4j80JKj8n0P5J6L9r7K13j63M2k57K60j00J80P7l20J26N1K3k06
5817a78K35k8Mo1k6J6K75k75R5k4N5j09P1q9pK61r2J68j28k39R4m9P5k74K89p1
5843a2o6m9RM89k90j7m7Rj36K26k31K27o8j36J27o0j18J55mP1j99o7M1K26j57
5868g7J79R6j23k08J06J22l30K96j76J41jj13Q8J91k49j37J53N0j05j00L02q5
$$ y = [-81, 1, -31, 115, 9, 119, 23, 126, 71, 121, 35, 141, 217, 41, -182, -4, -47, 170, -29, 231, -62, 93, -54, 103, 26, 7, -137, -72, -176, 106, -2, 71, -112, -47, -23, -323, 318, 83, 51, -21, 111, -185, -49, 55, -77, -27, -232, 55, 19, -140, 129, -233, 9, -52, 27, -95, 175, 89, -110, -138, 157, 11, 1, 66, -96, 113, 121, 150, 100, 244, -10, -113, -95, -70, 189, -226, 28, 31, -110, -56, -67, -136, -123, 21, -52, 44, -102, -170, 102, -98, 158, -51, -106, 81, -38, -288, 122, 108, -72, -71, -69, -87, -137, -62, -46, -7, -104, 109, -54, -12, -269, -9, -109, 71, 148, -172, -46, 5, 28, -178, 57, 29, 33, -28, -54, -38, 237, -38, 57, 33, 88, -21, 50, -39, -46, 215, 123, 291, 163, -76, 18, -31, 44, -230, 59, -12, -78, -127, -118, 371, 81, 64, 17, 26, -110, 116, -115, 112, 44, -92, 35, -25, -143, 12, 8, 79, -120, -187, -146, 80, -77, 102, 198, 75, -133, -27, 95, -235, 61, -115, 26, 25, -88, 0, 191, -58, -195, -42, 8, -97, -197, 105, 20]
5890B0L7%K89n12M48m10K79l07J88J21k18J72j30Q8j08j8M8K20q5n0J27m2m9O2
5914A70j46MP2k78L20lj16o3PON5J47o5O2k97O0j48K67k36K25Kk08P7K85l47l6
5940a84N4K24O3k85N6M7L97n94L64k78M5O1J91k14k5Q2J2k19J01J59n4k8J40k43
5964a28J92L3j41k16K93R7j32m9Q8n7o1J01l0M6l7J79j52J64k46J00J83m14J40
5987d7n8N4L6L8j11l0J81J51l10M6J09L83o39K43l24N5L79L5j71n8r2J1R7p2K04
6012A10k71j52L81k37J0J03j4j14K00J32j70j48K74j19k17K24lJ08J42p7l38L4
6034a42K0L3J1K37n3Qj03K33j79q7N8J13l6j25n4j99N07m7j65j10L7m6J28k75
6058b36J18J32L2j87J16L07l12J2J44no9L3K7j67k14L44j76P5J6j71J95J03j38
$$ y = [20, 57, 57, 346, -166, 282, -128, 151, -156, 32, 153, -65, 107, -23, 65, -43, -61, -13, 207, 122, 72, 199, 157, 108, 170, 24, 28, 100, -178, 142, 139, 23, -40, -33, -27, 28, 175, 110, 172, -125, -65, -213, 54, -182, 43, 45, -163, -86, 199, -148, -184, -130, 94, 157, -128, -72, -25, 372, -222, 142, -136, -91, -30, 161, -53, -78, 4, 16, -203, -102, 57, 3, -25, 115, -128, 64, 97, -44, -260, 33, 130, -2, -51, 37, -20, -81, 20, -10, 36, -1, 178, 26, 190, -56, 44, 227, -187, -47, -105, -51, -15, 23, -88, -118, 63, 214, -96, -50, 59, 442, -197, 46, -278, -223, 156, 191, 20, -38, -130, -119, -22, -94, 110, -161, -313, 68, -169, -159, -56, -70, -184, 16, 148, -22, -170, 104, -15, -232, -8, -11, 97, 239, 162, -176, -142, -122, -89, -78, 159, 106, 114, 11, 244, 65, -22, 36, 149, 113, -12, -66, -265, 242, 195, 30, -80, -43, -89, 39, -236, -118, 14, 46, -141, -25, 282, -30, -18, 126, 121, 52, 85, 112, -55, -269, 75, -101, -26, -10, -181, 14, 117, -21]
6081b1j98L20qj10K42o6l32J54R1Ok2k80K99J89k17j9m4Q4j7Q2p5m8l6m6r4J02
6107f4J79k74oR8J79k61m6J85J20j64j39L22k51K41m5j40J2J04q6J08k47J80J91
6130A96j09m14L65J57j47j07J89J32q1n5j04Jj22l6P3n3J19J37j02j25J53K0K8
6153A15k09P7l1k21M6L50l00k9J39J10p5K81k00r4J30J24k05J22J06k35M9l12
6175b62R7J14K71p6p9KQ7k98K43r8j5K2K33j45o0j71jJ8J56M4j21m5O4J06j5j45
6201g4J43j59L0l4J4M4r3L6L00k19Mn4o4K43l1J80k97Q6J94j35kj69rJ32Q5j09
6227D2q5O0k91L10k88J86J20O6M1k49J96j76J76m98L04J0K5l4K66l0k67K41l22
6250a97K59j77p9N5N6K97j79J76n5M9k56J13J08l51K50K0j95q6Q4K70k84O7K69
$$ y = [-21, -219, 101, 93, -17, 225, 159, -173, -19, 72, 78, 56, -224, 75, 264, 47, 28, -16, 68, 51, 133, 58, 10, -26, -72, -166, -64, 115, -159, -165, -67, 112, -149, -195, -10, 110, -54, -193, 129, -122, 119, 74, -66, -54, 50, -36, 72, -175, 5, 196, 87, -327, 38, 195, 48, -59, 130, 262, 181, 126, 22, 23, -99, -135, -62, -115, 4, 141, 39, -86, 67, 87, 115, -94, -17, -48, -269, -223, 127, -173, -202, -63, 47, -28, 253, 53, -41, 89, 213, 8, 130, 236, 1, 50, -262, -165, -51, 220, 144, 65, 67, 154, -144, 99, 1, -14, 8, 241, 96, 36, -135, -136, -118, 38, 82, -39, -84, -20, 86, 71, -74, 69, -90, -60, -94, -80, -36, -129, -93, 207, -12, -8, -62, -126, 117, 86, 266, -31, 55, 249, 114, 112, -57, -66, 66, 151, 42, -43, 17, -274, 36, -252, -66, 54, 120, 161, -88, 108, -68, 108, -390, -86, -76, -51, -85, 181, 151, -116, 125, -197, 62, -115, -194, -139, -83, 214, 35, 211, 156, 205, -51, 62, 170, -181, 69, 89, -106, -192, -108, 162, -122, -55, 214]
6273B14j20j52l1L16j89M4N1j53L50m02K89j85r5K74j32J56k56l1r5L09l3j62
6295c3K6J70n4j38j89P3N9R5J12j39P9j08n3qo4L41k48K17n2k02J97m7QqJ0O4
6321A08o7q1q5Q0m1k0L52m7j04j59M2O5J8J98k66o9RJ9L9K8r1J69j67j08J38k
6347d2nJ49m60L67J56l18L25l45J77P6Q9l86M08k80L61o2m05j0K71M9N2j1j17
6370C9j90J53%j56M61m25J89r4j60j4M07j79j10J78k8r1L65k80o7r6R7m0M6k05
6394b00Q7J51J63k46R1l3k72J9K64J9q8M5k6K55l35Pq7K23j86r3L49k12L65k04
6418E6Q8K2j3p5l40K38JR3j60K62K37k80q9M2K7q3l2J68k46K8J61k21J77p8q8
6443a05K81l9p0o1j81K03j51J12J53l0j28J39K54j43k41O4j5j3J00lm9pj03N1
$$ y = [214, 94, -58, -89, 227, 38, 82, 133, -20, 330, -72, 217, 32, -63, 211, 79, 235, -21, -52, -147, 162, 129, -33, -7, 163, 109, -29, -218, -145, -86, 9, 121, -18, 61, -47, -100, -108, -172, 169, -79, 138, 86, -116, 81, 34, 42, 34, 44, 108, 41, -40, -125, -45, -86, -106, 246, 199, 95, -64, -22, 43, 61, 259, -7, -76, -67, -48, -9, 19, -72, 97, -70, -178, -40, -42, -47, 102, -358, 9, 165, -153, 172, -173, 4, 80, 169, -217, 191, -89, 272, 210, -195, -205, 66, 115, 167, 156, 39, -151, 2, 2, -154, 307, -118, 71, -23, -183, -197, 210, 31, -79, 99, 71, -20, 345, 65, -2, -98, -1, -41, 5, -200, -113, 38, 201, -45, 46, 13, -259, -240, 24, 43, -45, 0, -26, 229, -106, -99, -186, 37, -149, -242, 107, -105, 260, 56, 144, 166, 153, 78, -262, -24, -23, 70, -90, 172, 409, 129, 40, 82, 109, 26, -6, 162, -84, -56, 105, -116, 61, -17, -105, 176, 137, 67, 6, -175, 28, -123, -11, 142, 112, -16, 123, 377, 234, -7, 57, 42, 29, 129, 126, 77, 70, -33, 18]
6467A8Q3j46j06p1J11Q3J08j96J35K34k42J6K08j47l18K04K61m71J84l8l6j3J42
6490Cj65J64R7j13j17K3M1k2K31r1j92K45p5m1o4J27R4l38K11m6P9j41K7J4O0
6515A1l38M04O1j06r5M5P3jl7J6j49m2L80p1l69L55k21j21J88o3J14l0J5o8J43
6540I4p5P3J1j3n8J52j60j60M6J30M5j1M4j50K38j26l1R1K8k95L36o8j52J64k01
6565d8l0J28m6J41k06J9J29j54J44j77N02l16m51K32J97l1j33Q9K39l7j61J82
6587B12j66K3j4n2l7n0K44j69J22J39l70J61p3lq3J25r6k4k7o8nM7r1L31K7j31
6613b8K32k25K51l78J86J23l00K09j17p5P5j21J32q8J44JK0P8j17J82j50N2l3
6636E3k12K34k52L11l18K25n9l3J47Q6j88K8J05p0p3J9P0j42P0R3k82J03J67M3
$$ y = [18, 101, -45, -151, -222, -111, -28, 80, -116, 19, 253, 11, 27, 235, 88, -230, -26, 235, -236, -52, -90, -126, -139, 3, -162, 2, 99, -14, -131, -108, -67, -89, 142, 51, -141, 104, 29, -12, -76, 51, 145, -193, 18, -28, 51, -90, -63, -49, 11, -327, 77, 138, 32, -63, -18, 55, 54, 17, 33, -116, -158, 222, 151, -218, 137, -84, -205, -17, -80, 34, 4, 19, -49, 94, 19, 92, 103, 90, 32, 184, 24, -136, -90, 40, 85, 74, 118, -32, 206, 80, 49, 140, 168, -127, 209, 141, -11, 153, -48, -78, 50, 4, 145, -61, -42, 87, -67, 77, -100, 402, 86, -365, -133, 64, 33, -100, -11, 228, 191, 30, 212, 46, 69, 55, 3, -34, -84, 160, -9, 113, 252, -118, 43, -30, -33, -116, 9, -87, -111, -138, -206, -211, -164, -255, 76, 103, -28, 204, -21, 230, -148, 38, 161, -139, 70, -47, -122, -47, -168, -36, -124, 20, 21, 41, 119, 2, 184, 34, 86, 53, -159, 75, -177, 134, -184, 41, -18, -51, 96, 182, -6, 22, 127, 57, -16, 3, 73, -69, 1, 94, -188, -85, 82, 125]
6660A25q8l4L9j1Q4j79J50j38l8Q8l5J85j34R3k25K02J55k47K0ok27LK44J12l47
6685b09R6qM46k97J01k14j20K79j08P2J10q4k8L1n11M58M6O1k19q4J03O6o1j8
6709i2O2n0PJ70j53l87O06j11l15J57K6j67N82l69J54q6j33L49l52K69l67L61
6731A61l30J35k3j74K30l85M62q5J65k45J28r6J17P3j50P2j03M1pJ20P3k87J22
6754A4Q2J13j38r5N5r4R3l3o3jJ46j81N1L30k93J63j34j78J75j43P6o0M05o12
6778c22J43J11P2rj1P9p0M4n5K83j13k86j36K76kR8j29ko6J0J47q0r7J73J3j55
6804h4J29n0l17J62J74J9j11K52j36JJ06o8J76m02K27Q1k29m3J67K33k42J10k76
6827a21O2O7J6O4n2L32m07P9q2j74J05OJ96l9N9p9k00oJ15k23J69J8n1PMJ28k5
$$ y = [125, 37, 3, 42, 31, 115, -64, 86, -52, -90, -2, -37, 148, 14, 107, -118, 84, 239, -8, 12, 6, -221, -218, 26, 138, -209, -113, -121, 325, 28, 129, -85, -205, 74, -34, 38, 148, 64, 36, 67, -444, 14, 60, 121, -98, -182, -79, -13, -74, -92, -30, -80, -73, 97, -56, -443, 163, 52, -263, -106, -80, -247, 335, -34, 120, 34, -99, 250, -102, 167, -200, 161, -169, -34, -57, -231, -1, -386, 76, -9, 156, -89, 39, -57, 60, 133, -17, 55, -48, -7, -14, 106, 179, -108, 14, 96, 209, 71, -24, 31, -63, 30, -3, -66, -67, 79, -102, -51, 279, -14, 149, 15, -163, 12, -131, -55, -115, 290, -322, -179, -68, 4, -5, -16, 63, -7, 37, -18, 265, 152, -134, -270, 6, 4, 102, -27, -29, -95, -85, 62, -18, -115, 58, 71, -84, 45, -5, -322, -160, 14, 33, -78, 174, 38, 39, 145, 77, 253, -149, 78, 159, -70, -113, 54, 287, 45, 155, -121, -59, 8, 24, 88, 36, 368, -39, 40, -42, -216, -111, -105, 91, 52, 111, 32, -168, -174, -59, -282, -113, -95, -146, -139, -135, -7, -32]
6854c2K31m23j52M55j37K41k11J32k43k0K92j16K0j54n0J02R2K8j49j03J62n0
6876h5J27p6j13K94l69L07l5J4M3q3Q5q0o7j81J34J4J37m7l2J90l46J37J32j86
6900h6J85O7N1j49j09J29J2K9oJ2j60j55r1L30j22R3L7j48p1K00J06r0m4K35k38
6925A7p4j4L1j10K28j70L13k62r3K81j90J10k34K17MKkL3j66j60L01j61p4J8L1
6950a24Q3n0J63j79K8k2Q8J76%m9J60n32L07J0j66P8M8J71m56J46L2J63l0j4l7
6975fk30J91j03J76O3r2m9l2K56k81N0j90L75J18l14J37k43K45k66qJ60n2Q8Q7
6999H0J16j54l42M40k08J99j6M9j25k41K70j12j45M17j79j52J56R0m3k8m1o6J90
7022A55J24m28J71J91l52K38k00L44k49Q6o5o8K1P5J39N7Nk15L0k14K37q9R9j13
$$ y = [-32, 199, -224, -376, 79, -58, 183, -28, 104, -139, -159, 133, 17, 37, -117, -167, -65, 27, 55, -94, -197, -35, -85, 42, -34, -147, 147, -222, 85, 50, 64, 107, 24, 109, 29, -38, -219, -85, -71, 66, 19, -13, 177, -169, -32, 100, -86, 99, 166, 217, 68, -41, 88, 100, 129, 123, 135, -25, -180, -271, 59, -63, 30, 67, -81, -152, 48, 154, 64, 20, 255, 17, -57, -71, -40, -150, 78, -92, 221, -41, -134, 147, -43, 67, -167, 50, 54, 56, 54, 87, -79, -239, 62, -99, -173, -155, -124, -41, -91, 72, -107, -79, -101, -13, 163, 163, 114, 274, -258, 49, 59, -107, -29, 19, 190, -266, -120, -88, 75, 45, 31, -6, -236, -45, -148, 28, 91, -1, -50, -82, 174, -107, -57, -247, 128, 246, -68, 69, -174, 71, -195, -203, -43, -95, -7, 80, 196, 42, -300, 140, -68, 131, 115, 164, 39, -202, 68, -44, -189, 228, 49, -103, 53, 143, 100, 72, 31, -35, 155, 279, -149, 22, 213, -139, 99, -101, 243, -6, 80, 15, -53, -32, 43, 182, 239, 244, 29, 59, -155, 82, -7, 92, -21]
7046b1j0J69l96M11j62k59K44j90J7J53N9M7k2q0J28q4J59k19R2J73j75N5j10
7069b1m5N17n10l9Rp9J78k1k90M09q5n7K2Q0j07J39j13j47J54J01j05l28L77K6
7093F5J73l18J08l02L51m24L43q4o5L42n6l8r2J1k1N7K69o44N7L48J83k27k02
7116a66J58l6L5K10l24J96j54R9k28J26L45l68J74K6Q4o4m5l01OK97ok6j5o2k45
7141b84K84j54L62k09k44J90j53J76j11J65l14K27M1M1J27j72j70Q9L40j37K07
7162C01m96J42J19j54J08J3p3J85p6o0K2J70k75KR2J2J47L3l65j0J13M0K86m12
7186a36K11J0m3m8j2p3Q3p6K42k16R5K8o6O9j03N5p6J83j8j92j11L09k55l9O1
7211a18oQ8j54J10P5Q6k31J12J72R1k22k15j9K89Rq0J45k41P5j23m2j1K65K7l8
$$ y = [-21, -31, 138, -258, 153, -9, -268, -24, -214, -197, -44, 15, 62, 40, -40, 88, 4, 163, -56, 36, 209, 34, 89, -21, -66, 451, -59, -98, -89, -168, 10, -11, -301, 108, 23, -34, -12, 68, -39, 100, -13, -160, -6, 95, -10, -338, 39, 65, 238, -80, 28, -274, 77, -347, -4, -88, -153, 189, 133, 95, 3, 14, -7, 50, 319, -325, -268, 80, 263, 36, -166, -8, -44, -9, 201, -123, 73, -81, 18, -210, -84, 261, -107, 67, 93, 177, 113, 68, -233, -227, 70, 64, 38, 23, -39, -284, 0, -154, 208, -1, -245, -55, -208, -32, -143, 22, -292, -65, -24, 17, 144, -28, -198, -109, 231, 94, 301, -195, -53, 66, -88, 20, 33, -40, 145, 69, 9, 31, 201, -74, -72, 20, 32, 179, 212, -153, -163, -50, -10, 276, -136, 75, 85, 42, -6, -18, -91, -8, -84, 158, -58, 37, 65, -1, 68, -35, 20, -56, 127, 109, -83, -194, 115, -140, -179, -118, -124, -36, -190, -80, -5, 81, -150, -38, 134, 225, 3, -212, -231, 58, 67, -13, 132, -109, -34, -157, -199, -210, 55, 82, 44]
7236D4j5M8J17N9n82L65j08J25M8k21M7J88j30K17m68O4L00O0k3k37M9J64k31
7259a20jL44j65L2j60P4N1n5J60k40K46O5n2o6P4k6N4k00j23J58J47k14L4J31
7283A48j08r6Q7L3j17K07k94K78J3o7Kn1J6l8K05K1r7k26L35m6l25K92j4k06p5
7308a23R5j8N1K39r0Kk10J14j6q0j7%J35m7M1j02L01m32ML65k64K8k3j79L12k
7334H4l02J60L77m94L52k92J20%K16j93m6m8j41K11J20%M4M0q0Jj29M3j33m7L26
7359A89j32j93J45L9j67J71j78Q8m1J29n6pQ8l0k9M7Lp8P9J3q2J87J44k88k91
7384b50K45J53l68L02j89K92k51N1j93K75M3m8j54N7Q8K2j59qJ04P3k29K59j48
7407c3J39J60k94j62J37J96J77l52k3K31L0l19K19O0j68J78l66J19J06j30J43
$$ y = [44, 29, 77, 194, 253, -329, 36, -72, 53, 101, -120, -73, 115, -15, 202, -266, -202, 98, 158, 135, -102, -53, 111, -120, -121, 223, 58, 90, -70, 4, 55, 0, 160, -80, 166, 231, 179, 113, 187, 161, 215, 15, -108, 50, 197, -17, 17, 148, 40, -56, 31, 64, -53, 154, -140, 138, 151, 84, 86, 35, 51, 13, 218, 239, 142, -84, 251, 205, -120, 172, 158, -48, -123, -28, -46, 5, 244, 154, 156, -54, 60, 44, -36, -53, -53, 82, 35, 76, -26, 275, -157, -153, 212, -52, -24, -47, -226, 86, 84, -218, -58, 319, -175, 177, -115, 5, 5, 221, 28, -18, -66, -207, 4, 124, 124, 168, 208, 128, 129, 0, 43, -90, -137, 189, 57, -136, 9, 48, -119, 52, -126, -38, -79, 50, -6, -13, 75, 45, 16, 63, 66, -12, 67, 80, -2, 185, 329, 41, -250, -5, 148, -220, 82, -107, 185, -66, -15, -208, 67, 110, 62, -92, -35, 53, 75, -84, -92, 12, 85, -144, 115, -33, 106, 266, -28, -190, -53, 143, 320, -32, -55, 176, 206, -113, 106, 166, -2, 176, -190, -71, 35, -95, 48]
7428D8%j15l4J6J88m02K15J61r0j3k76R7J07J34m2p4M2j40L81k03J06m0j88J08
7452a4o6Lj7L4J89j32rK22m47K31j66M03l17J50q6m7M5J3L8l7P8J48p5j34J32
7477A39p8m5J0m1q5J21k76L61J68j85l6n9p4k82M03k7Q1Po6J9l9P9l48K36k7o9
7503a13K32k77J15M6R6q4L19l40R0m8n6K62k88N0j5Pj47J72j04Pl7K34k60ok9
7528a74O8J04J16J08k68Q2j44N9J03Mj41j09M54k65j68O7j35L40j40l8O4q1M4
7551e0J06J07k07O7k09K65n8j59K42j50K14r5m5J54r3l76J65L1k68N62j91q2r0
7574a60K34j10P4m5J60j01j55J23J92j75j07K05%k55J78o9J64p8k25J52jK51l17
7597f5M2j70J5J75jJ27j46J74L9M3l20l9R5r2L68k50j00N0p2L6J8J82j15o9j1
$$ y = [48, 48, -67, -101, -85, 103, -299, -84, 77, -13, -26, -302, -205, -98, 36, -6, -80, -38, -178, 203, 0, 106, 66, -122, -14, -80, -77, -94, -60, 129, -3, -12, 210, -237, -6, -172, 231, -86, 64, -22, -69, -24, -11, 27, -10, 68, 216, 141, 7, 139, 61, 16, 26, -15, -100, 21, -255, 106, 274, 89, 53, -6, -80, -362, 41, 14, 95, 102, 36, 55, 16, 95, -253, -17, -44, -113, 119, -158, -43, 3, 99, 15, 334, -6, 84, 36, -20, 242, -46, 4, -11, -4, -151, 21, -83, -76, -113, 121, -139, -145, -174, -106, -2, 114, 222, -46, 36, -108, -49, 54, 58, -83, -192, 262, -3, -171, -104, -239, 101, -39, -77, -13, -94, -50, 56, 163, -44, 23, -186, 79, 21, -138, 104, -46, 168, 73, 28, 182, 89, -287, -122, -91, -359, 203, 12, -70, -160, 74, -36, 38, -7, 153, 52, -103, 20, 212, 37, -70, 135, 135, -120, 58, -11, 153, 75, -150, 2, 1, 252, -65, -23, -193, -178, -3, -4, 123, -23, 151, 190, 233, -87, -126, -31, -123, 245, -5, -105, -55, -127, -91, -73, 109, -6, -75, -86]
7622h6K08p9j95R5J66k1PL2k9k8k5J41l7K55Jl91J79r3M8n2k47K40J1k5O7J2k61
7649a07J48J31k40l3Q2Q0J10j55J0l30K98j77J00lQ5j0K9j97K48J49j12j93J71
7672H4K7J9p5J57r2q%o8l4J01L4l23J78o3K5N5p3K4K10k25m5M7J27p0J0l1K35
7699B26k00K52k54q3O1P2j4j76Q4K16j17j28O3o9K29P4j91j19lJ0J41N5k61R6
7723c6o8Q2n8J75j63J64j29N9j26L28k54j17J48L0m4j03J16J79j53j76J73j96
7745a69L17l42L66l13J33N1N8q7J40j74Qj24K7K80n3l95M13M9j75L7l5n3K3J36
7769A18j58J2k50Q9J82K84k71Q5r0o0K03kj80m1l08K25R6L9L8K0q2O3J14M2J12
7794B80J33n89J29J78r5J55p5j40k36K27n6J99k12J28n0j13NK2L66j95R7p0p1
$$ y = [-86, 122, 43, -152, -57, 109, 88, 95, 127, 98, 70, 45, 186, 149, 404, 405, 14, 193, 100, 148, 96, -151, 89, 100, 75, 142, 154, -107, 41, 172, -68, -101, -19, 61, 171, 16, 26, -304, -6, -183, -83, -86, -1, -11, 18, -179, 69, 218, 106, -87, 84, 111, 130, 55, 212, 120, 112, 112, 44, 10, 111, 145, -178, 0, -63, -38, 17, -56, -32, 178, -47, -92, -45, 82, 12, 22, -9, 226, 26, 278, 24, -59, 2, 74, 60, -116, -32, 184, 67, -61, 2, -67, 162, 236, 45, -74, -77, -67, 74, 129, -132, -36, -104, -22, -80, 95, -68, 96, -33, 26, -100, 228, -26, -143, 5, 35, -9, -112, 4, 183, 30, -146, 27, -169, 148, -194, 172, -141, -8, 43, 101, 14, 154, -20, -12, -136, -109, 171, 118, -277, 136, 185, 10, 47, 12, -41, -18, 118, -40, -28, -278, -189, -7, 277, 6, 91, 1, -59, 144, 142, -38, -79, -387, -162, -66, -27, 11, 31, -51, 12, 126, 168, 280, 413, -176, -47, 131, 36, 191, 116, -24, -260, -33, -89, 110, -102, 26, -24, -137, -132, -110, 256, 61, 158, 88, 17]
7817A7k46JK07K8K41k92p4J9j22L31J48j07J8k33L18k93k85M39j07pJ06k15K00
7840I2m0pj68J57k1O5L5j77L4J0Q7n5q2J24J33j28k5j33J10Q2j6k65M89k9j83
7865H9j71J33k36M89j72j05K1M8j8k25L23j71K17m34K34j25J67m3m2K2j16K25
7887A10k99J83q1N0J75l1l2l33J0P1p9K57Q7l5k04j4L75l55K01j22P5N2R9r3j38
7912g1P7M7k81L14n9L4l4P3J0J35j99m3M4q4m3K15k32Q4M9Q4o2N4k60J26o3j14
7938a99J85n8j32K96MK3l28j03L21K26j73j13K46kj69j2m4J06k91K85q2q2j57
7961b53M0K07j72K72l73N5j19K73J22J2K6j44K76j10J71l13K4O5J6P1j73N6j33
7984a04K6Q1j16M03l98OJ15Q3j38j02L3n9K40k3k48J72P9O3k29J93m28M83j50
$$ y = [17, -229, -228, -21, 7, 248, -44, -118, -99, -221, 110, 258, 151, 169, -64, 254, -39, -324, 115, 8, 1, 107, -108, 92, 52, 45, -123, 34, 13, 78, 113, -64, -30, -20, 67, 12, -70, 54, 187, 59, 34, -99, 11, 93, 77, -188, 301, 272, 89, -82, 51, -185, 304, 132, 27, 48, 96, 78, -147, 176, 5, 222, -212, 22, -103, 64, 21, -21, 1, -115, 110, -189, -6, -87, -37, 138, 107, 75, -258, -248, -177, -256, 1, 88, 53, -151, -165, 210, -145, 56, -66, 9, 61, 160, 67, -71, 6, 53, -228, 86, 27, 61, 27, 100, 110, 245, 46, 3, 47, -37, -80, 135, -97, -13, 36, 120, 58, 112, -148, -22, -85, -199, -14, -72, -204, 92, 96, 119, -209, -312, 9, 235, 62, -51, 195, 193, 24, 12, -32, 74, -217, 68, -14, -96, -253, -213, -6, -178, 94, -279, -224, -343, -70, 52, 64, 90, -54, 222, 112, 283, -30, -6, 59, 75, 146, -27, 29, -104, -78, 3, -113, 290, -108, -102, 13, 96, -42, -144, -111, -170, 70, 47, -201, -29, 50, 113, -116, 77, -351, 132, -18]
8007a8K40j79J36j76Q7j03K29l57J22J80j15m1r3lj30M47M6k29j49K35r2J77k99
8030h5K8N2nK7k4k44J14QJ61j70O0n9m1K04j04k12r1L95m0J73k17N3R8l4K32k50
8056B9p2r2J62J4l27K14O8J46j97L17l27l4P6j78P3J40n5j03J79j34J68k2J77
8079B22J37m61N0J6J67q4j07Q4P7M3j39M3r3Q0j7J7RK6k17K48r5K44l29M8K07
8104A76m72M13M4k15J02m5j51K46k53K29k34K9R0k1P3O7l5j22K00l43L19r7l7
8127c7J02J22k31K09j58m0q8rJ8L86l38J74j54n4p6j69N01j93j2K12qm66K72K28
8151A91k49K92k05j91J69q4j1O2q9K02j19p4O2L9j01L49j50M6j40J19j58k39L16
8174C7j03%P3J59j11O4r0j11K75l13oP9R5M8J65l16j87
$$ y = [-18, 222, 43, 179, 3, 90, -13, 216, -141, -19, 161, 46, 5, -88, -91, -221, 226, 272, 43, -106, 129, 37, 214, -85, -57, -5, -10, 17, -7, -251, -137, -129, 32, -138, -78, -137, -178, 26, -78, -290, -381, 14, -26, 147, -70, -17, 81, 47, 279, 29, -43, -135, 27, 41, -286, -72, -4, 142, -55, 262, -65, -99, -23, -201, -128, 12, -43, -146, 33, -101, 67, 45, 222, 359, -102, -52, -36, 131, 47, -60, 24, 101, 144, 5, 48, -45, 35, 18, 35, 44, 70, -147, 101, 6, 250, -79, -31, 176, -296, 117, 161, -54, 48, 3, -148, 98, -155, 74, -160, -131, -41, -62, 11, 78, 43, -79, 121, -222, 97, 0, -37, 65, 187, -44, 165, 7, -33, -121, -130, -112, 274, -64, 110, -44, -98, -174, -343, 158, -35, -47, 165, 157, -309, -37, 191, -58, 234, 29, -162, 7, -77, -88, -26, -115, 87, -32, -106, -44, -5, -106, 243, 93, 139, -1, 118, -40, -279, 37, -66, -66, 7, 166, 55, 119, 29, -82, 193, -120, -126, -47, 48, 96, 261, -55, -242]
8191b42
$$ Imaginary data points
##PAGE= N=2
##DATA TABLE= (X++(I..I)), XYDATA
0@%%%%%%%%%%%Qj6J6j6J7k5L2m0M8n6P2q7R8j15J36j55J80k09K41k75L12l54M00
34B12m54N11n72O43p21Q04q93R92j102J223j352J493j649J818k002K207k433K678
52A403k951L257l600L983m415M914n491O168o977P962r196J0790j2940J6014k0793
67a1872K9291m8873J74968N4586l17662J56484J94071j25055j77299J48801Q5972
78A63412j16884m9079P9506k6372q808J7088n3450k5054Q0507J3290j31665o143
90f3652J54033l1617j63729L8520J63741n7686j57708N4443J67257p5198j51740
101a23336Q7175J32415q2840j15904R3048Q8232q6386n2980P4465J2206m2227
112a6132J9274j0949k8878M6000L5616j07451k5038J49428j9869j78421N1889
$$ y = [0, 0, 0, 0, 0, 0, 0, 0, 0, 0, 0, 0, 8, -8, 8, -8, 9, -16, 16, -24, 24, -32, 40, -47, 51, -64, 72, -83, 97, -112, 129, -146, 166, -188, 212, -242, 269, -303, 340, -381, 423, -470, 522, -580, 643, -709, 784, -865, 953, -1049, 1158, -1275, 1403, -1548, 1709, -1891, 2092, -2323, 2591, -2900, 3268, -3709, 4253, -4943, 5847, -7093, 8921, -11872, 17419, -31454, 143514, 198100, -119562, 36922, 230993, 105938, -71361, 77440, 163412, 46528, -2551, 76955, 50583, 41775, 58863, 5413, -19641, 60866, 74156, -57509, -63652, 90381, 58764, -104965, -66445, 97296, 39610, -118098, -63655, 103602, 28404, -123336, -36161, 96254, 13414, -102490, -9442, 78790, -7596, -60576, 13889, 26095, -16132, 3142, -7807, -36685, 9315, 44931, -62520, -87558, 61870, 42001, -136420, -84531]
123h4531J80957j02041j68780J24071J38302j49667r9768J48306M6752j18309
133h4708j9482Q9236m531m3573J8603J963p278L9725J960o6887L0889Q5887l8319
146C485r1139O0808J05543p5267r2123Q4255R6301q9825q6653R5513Q0179r8870
158g793o9146J03019M3021r0122l0131P7722O582n8430J3217J9377j9786J4549
170B079J8219n8014K610Q5925k7567j05890N8828J19233r8910j00037J23807Q0784
182A01067j34775m8779J37898J9223j17230N755R6256k4484n4651K4985K2035
193B7300j4173L754L224l2685K0289M2472m0035n3060N7734N1618p4957m8686
205e7205P8201M9525r3194m1858R5045L3825r7177k7676R8861J2491r0212k120
$$ y = [-84531, 96426, -5615, -174395, -50324, 87978, -61689, -161457, -13151, 33601, -84708, -104190, -14954, -19485, -63058, -44455, -42492, -49770, -10045, -8085, -74972, -44083, 41804, 3485, -87654, -26846, 78697, 3430, -88693, -4438, 91863, 2038, -84615, 10898, 91077, -7793, -76939, 26080, 69101, -21021, -51152, 26570, 33152, -25278, -12061, 7316, -12470, 2079, 20298, -37716, -35106, 50819, 23252, -82638, -23810, 95423, -3487, -103524, 20283, 101067, -33708, -82487, 55411, 74634, -42596, -36841, 59415, 34931, -19720, 5265, 27300, 13127, 16881, 20105, -12580, 7709, 50181, 10146, -42914, 14820, 66438, -8519, -57205, 20996, 70521, -22673, -64531, 30514, 64339, -32838, -60514, 38347, 50838, -39374, -41494]
217d1494Q2804j4655n9057K4117L2240j9956n801J9054k5790M303M9672k7561
229A7876o1800N8631O6912q9431n1453J07538L7585j22518j0901J21322j4847
240E8914j05185K8521Q6887m2546n6906L7656L1615k9728r673J5157j2500Q635
252A0847J6933k6025k4978M5102K3002o2173j9140P0100J5739q3771o233Q4394
264D3797M66q8570O706Q8194k0000p9829K4380P1679l6002n3345L6788L2371l2632
277e997j3229K3727j1262k690K3529j9759l2800M5359L2611p1978j9416Q6710
289C4805N970j00385J6357R8533l5973q7814M7649P2795n8437m8734N2245K9615
301B6626m5265j1290K9189m109p477P971r350j2356L0350P405m4262o29N5696
$$ y = [-41494, 41310, 26655, -32402, -8285, 23955, 3999, -1802, 17252, -8538, -4235, 45437, 17876, -43924, 14707, 81619, -7812, -59265, 48273, 85858, -36660, -47561, 73761, 58914, -46271, -17750, 69137, 26591, -30315, 7341, 38956, 9228, -445, 14712, 2212, 10847, 27780, 1755, -23223, 21879, 44881, -17292, -36432, 33668, 49407, -34364, -40597, 43797, 44263, -44307, -37601, 50593, 30593, -49236, -24856, 46823, 10821, -42524, -5736, 26635, -5997, -19226, 4501, -6761, -9451, 14078, -5681, -38481, 6878, 39489, -32489, -51905, 34805, 40775, -59610, -43253, 55280, 19307, -68507, -20858, 51937, -6500, -55234, -2989, 26626, -18639, -29929, -740, -4849, -12326, -4355, -13705, -26061, 4289, 11694, -32568, -33197, 22499]
314B2499m051o5526J6771O8302k1349p0074L1946O9873l9422o0403M4337N6057
326D8960n0077l8336M8459K5475m1413j0717L2953o585j2415J2600o796j8477
338a6369K9762J2454n2088j457O2953j2881p6306L1959P2502m8626o6232N8980
350e349N2960o7562l3601O1555J9618n4614l855L9861n637j9675P490O004q395
363a1200J4660K641k5995N736L8408j3164m6460K6847M8039l2828n0341M2939
375g18M7843n1392m1003N4314L4187n9281k1827N4092J1103m8821n36L7526j0371
388E116j8609J0990M125j2020J6765N575l1738Q626M3603j9811m9686M0624M7954
401E1514n0036m0443O2450L2853o6820j4589O4307N918n6940P938M4172j2596
$$ y = [22499, 18448, -47078, -30307, 37995, 16646, -53428, -21482, 48391, 8969, -51434, -7097, 48960, -1117, -39453, 9006, 34481, -6932, -17649, 15304, 8719, -3696, 8904, 2108, -16369, 13393, 25847, -26241, -27698, 35255, 22374, -53932, -21973, 50529, 1903, -64329, -5349, 47611, -19951, -53552, 8003, 27621, -26993, -30848, 9013, 3376, -16299, -8809, -2805, -11200, 3460, 6101, -19894, -14158, 24250, 11086, -35374, -8527, 39512, 6684, -43657, -718, 47125, -4267, -45270, 9044, 43231, -16050, -37877, 16215, 27318, -21503, -22039, 15487, 5116, -13493, -2503, 1622, -10398, 6367, 11942, -19796, -11170, 32433, 12622, -37064, 3560, 51514, 1478, -38965, 23485, 56338, -10482, -25071, 39236, 45154, -11786, -3848, 40324, 27728]
413B7728k8709J3484J5038j3541J823L424j3283K841K1760j4990l0762K6239K8584
426C9636l6626l2271M6460K4696n3947k0022N5276J3056o0026j905N3163n138
438B2352m7834J2406L6994j7780k2343J5916R846j4434O825L641j7820Q330K3903
451B0002k0631l0609L6886K5481m8618k1413N7144R165o1936M11N7005r817n5515
464d2445J9183M1455k3823k9778K1619J7305j9658l851J0224m117j812J3512j0020
477a2206j5988K3905J5322k9800j4630M2822J0106m7117j514N2046m196n0647
489c1897J4665M6821j7343m1921K5283L2655k6680j8858K3181J0101j9096K684
501d05P893r337K933J3766j6129j5816L0719R523l8911m752M7240m297n0760J5052
$$ y = [27728, -981, 12503, 27541, 14000, 15823, 19247, 5964, 8805, 30565, 15575, -15187, 11052, 39636, 3010, -29261, 17199, 41895, -12052, -32074, 23202, 36258, -23768, -25673, 27490, 22352, -25482, -13076, 23918, 6138, -16205, -289, 9557, -4877, 1948, 5589, -12231, -3901, 20002, -629, -31238, 5648, 31129, -17489, -38902, 18242, 27407, -34529, -34118, 22887, 13070, -42445, -23262, 18193, -5630, -35408, -13789, 3516, -16142, -19993, -9769, -13886, -15698, -2186, -12206, -28194, -4289, 11033, -18767, -33397, 9425, 19531, -27586, -29100, 22946, 18750, -31897, -17232, 29589, 12246, -29675, -4392, 28263, 1583, -17275, 5906, 16007, -3089, -405, 7488, -1849, 1084, 14850, -1279, -17095, 13624, 23147, -15764, -20516, 26724, 22427, -28333, -13281]
515a3281M8231k1776m4507L0407L3920l0189k5430L0552J5678k7142l863J7090
527I690j438q526O971l136q803J3921P224k3725n693L4191l952l8354Q652M0785
541B7807j6804m2478K4566L6018k9824l1845L3516K1186l2902j3496K8775N551
553A0070k4328M053J2746p274k242R200q861p286K0760J596k7657M134L6551j4728
567F734l6468K3381L5002k8363l2245L6421K4083l6427j6843L6877P931l1430
579a1347L50K2765l111j5735Q503L446p192P109L460j5162P16K4032q770k7339
593a8275J5636L0441k4071k8694L1639K3364l3674j9716L7551J1699l6204m358
605a4662L2271k101k6502Q164J5545q570p699R129l158o307J3156j679j8759P856
$$ y = [-13281, 34950, 13174, -31333, -926, 32994, 2805, -22625, 7927, 23605, -3537, -7400, 9690, 8252, -274, 6697, 3561, -5242, 8679, 15903, -7822, -13515, 20676, 16724, -21630, -12978, 27807, 11003, -31475, -6909, 29109, -715, -32560, 956, 22142, -10760, -24256, 4519, 10070, -14258, -10205, 2541, -4733, -6975, 2225, -6636, -13922, 6838, 8434, -19223, -15089, 21462, 6734, -29734, -6353, 28649, 286, -31959, 4462, 28545, -7882, -24725, 12152, 20083, -11347, -10997, 11768, 8657, -7078, 1425, 4871, -2321, 4788, 8248, -6914, -6198, 17834, 9064, -18275, -2639, 27802, 3731, -24963, 6676, 30040, -3634, -23350, 14201, 25900, -10304, -14662, 17609, 15508, -10994, -2830, 12715, 4145, -3554, 5575, 2417, -3890, 9266, 7587, -11172, -3316]
619c316K3586j7683k3970K4720K2584l2478j9032L7823J0176l7264n838L6606
631A5914j492l2831P450K4800r839j7861J1771P419q335j44N358q137N83J5180
645I836j0282j6254J6527J8385k4821j6370L1316J2511l4920p497L8148o98l4784
658a8903N639L1784r874k5969J4529J6423j2888r604J2539j7o432O590n34j0681
672g398P050J5129j7139j3119K3321J0881k9032p212L4004L85l3925L937L3899
685B0781j0984k9348J4269K2912j5473j7681J6927P945j3198j605Q248m682j938
698c827Q894o762r137J2844J0093k1780o747K7068J598l0279K950L2557j0253
711G219k9833J3385K7439j8336k1167J9824J3816j7633q262J6365P15r945L990
$$ y = [-3316, 20270, 2587, -21383, 3337, 25921, -6557, -25589, 12234, 22410, -14854, -20692, 15914, 14422, -18409, -10959, 13841, 4002, -13859, -2088, 5331, -3004, -3148, 2210, -5927, -5344, 9836, -446, -16700, -173, 18212, -6609, -22979, 8337, 20848, -14072, -21569, 16579, 15881, -18903, -13264, 18520, 8646, -17323, -2794, 13629, 741, -8863, 3676, 3659, -2773, 3817, 3283, -7398, -348, 14781, -2358, -15477, 7844, 18725, -10307, -17519, 16485, 16870, -17055, -13118, 20781, 9797, -19551, -5282, 17630, 2157, -15524, 1403, 9348, -3850, -5455, 2793, -1889, -3827, 5067, -1695, -10832, 2012, 12105, -9675, -16422, 10646, 12244, -18035, -15085, 17472, 7219, -22614, -9229, 18210, -126, -21293, -1469, 12347, -5286, -13548, 2817, 3532, -6413, -2423]
724b423L234o190L845Q443j2648n524J8308L743k4167J625K7711p300k7489J2174
738f658K7967j7662k2956K0807J8232k1315j2378K1555M889j6165q03J2538l847
751D204n020O405k982n113Q897M957j6526J26K0437m245k3757R766K5300j6439
765F010k2172J9131J9864k3092j4810K3800Q192k1861m147J9202k301j3153M149
778a188O827o292l88N930q292k401J2114r67j8045O264J9789j2554j9775J6009
792b969J9398k2808j4647K3532J0477k4507n811K3365j56j8488K614J4750o336
805a586p458O634J019m937M452L476j1382K731J4120o998j6310J2678J7439j8607
819d729j3837K1479J2220k4933o042K4824K022k2625J971K0705o424j3622P070
$$ y = [-2423, 811, -5379, -1534, 6909, -5739, -11263, 7045, 10788, -13379, -11754, 15957, 8657, -18832, -6658, 21309, 3647, -19309, 1498, 19730, -1585, -13963, 7592, 12481, -3684, -4487, 8051, 4204, -816, 5589, 2607, -2506, 6391, 11348, -5178, -5052, 15385, 11140, -12617, -2851, 22449, 6010, -16162, 2969, 22833, -259, -15069, 8731, 16923, -4938, -9085, 10117, 7816, -5337, -1188, 5639, -653, -1041, 4889, -3403, -5804, 6310, 5343, -12702, -6438, 13351, 797, -18978, -2969, 16429, -6379, -21026, 2506, 12983, -11524, -17335, 6030, 5874, -12614, -10000, 4750, -1586, -9044, -2410, -1391, -6328, -1876, 1600, -9782, -7051, 7069, 71, -16239, -3561, 13878, -4729, -18566, 2913, 15133, -9800, -15842, 8982, 11004, -11621, -9650, 11055, 4631, -8991, -1921]
832a921R453p588k394O768l584k039Q123q82j2062Q169J3147j3039j1792J7571
846G930J1617k2411o337K3243L503k4533J750K2425n782j8632P326J5337j0590
859D846q289Q839K252o677J687L363p497K316Q180o645j0886J2312R213j7788
873d774o691J9892L954k3371L06K2515m424k1672P832J8390j1108j3251J0631
886a771R000j1005l440Q388j951m010M288K0q091O394P262j1316o908J5726M607
901G193k0525M50K0770k986k1933P777J9691j0958j5885J2445J2836j4040o376
914a1541J1556L374r139J234N558m471P05N303m023o047J0664M370j4084j313
928g854J7219o47j9829O518J8878r123j7103J2086J4812j4648j0126J4319O672
$$ y = [-1921, 7532, -56, -2450, 4318, 734, -1305, 6818, 5936, -6126, 2043, 15190, 2151, -9641, 7930, 19547, -2864, -9201, 14042, 17545, -6988, -5238, 17187, 11405, -7227, 99, 15436, 4846, -3443, 5396, 7648, 971, 2658, 6021, -1476, 840, 9020, 2375, -8511, 3801, 13014, -4774, -11465, 8427, 12381, -10990, -10684, 11831, 7407, -14265, -6433, 11957, 849, -12402, -1771, 7229, -3776, -7216, 1172, -779, -4789, -501, -481, -8572, -2178, 5084, -6232, -13140, 2586, 7193, -13332, -12882, 7888, 4902, -17031, -9254, 10437, -521, -16406, -3961, 8875, -5165, -11541, 15, 3389, -5750, -4516, 1042, -3429, -2724, 2579, -1444, -7491, 3173, 7543, -6541, -7854, 9365, 8718, -11111, -4593, 14285, 5162, -11941, 145, 14957, 309, -9817, 4502, 11174]
941A1174j3734j562J0007j267o517L551K479o189M167M465q622l024J2993n45
955G376j5568M016J6636p619j7473J2208J4600j4429j1483J5107Q885j6530l582
968g856J3480O70j1661K783P044m395k156L760j749m672P433J339j0557J201J2919
983G583m772j4790R276J3304j1622j2678J5000R506j6201n773J5410L416j4983
996g324J000J1636l207q156N052L973n973K636L088m756j802R025j144j1753O644
1011a061J1676r586j1770J3949R033j5336o465J6745L417j6975R15J3711k111
1024F142j2133M982Q135o033l464N005j36m425M837M41o779K543Q408n764j0258
1039h499J0246Q251j2569p354J5492M210j6506j556J6084j149j5655N312J1189
$$ y = [11174, -2560, -4122, 5885, 4618, -1899, 1652, 4131, -2058, 2109, 6574, -2048, -5072, 7921, 7376, -8192, -4176, 12460, 4841, -12632, -424, 14176, -253, -11736, 3371, 12256, -4274, -7856, 5624, 6294, -5367, -2584, 4460, 65, -2091, 1669, -80, -4752, 2681, 4020, -6537, -5336, 7583, 2811, -11979, -2703, 10601, -1021, -13699, 1301, 10807, -5394, -11167, 4243, 7659, -7324, -6324, 5312, 2105, -6051, -999, 2974, -2999, -363, 2725, -2031, -3833, 5192, 4048, -7705, -1061, 10615, 1029, -10741, 3208, 12241, -3095, -9560, 7185, 10602, -6373, -5458, 8253, 6142, -5991, -1009, 7126, 1093, -2371, 2634, 2498, -1927, 2910, 3351, -3428, -885, 7523, 1759, -8499, 1747, 9998, -2571, -9925, 5567, 9777, -6729, -8285, 7799, 6650, -9005, -3693, 7496]
1052G496n890q271O916M045o790M04M139l378k086O850k668p278N933P556r515
1067b537o890J3508L976j4731j705J5849j567j5190M514J3271n824j1672Q170
1080h28P230p610l940O738R32n319L356J398m595J763N911m990o211R468L939
1095G242j1139l365J4859n70j4542L196J3932n381j3041Q427R625q635p333R405
1109B680L277q075K71M951k187k695M685j713n290N073M419q434l168J1028J88
1124E010j2516J488J3696n243j3220P459J1068q848r286J0404N304r690k526Q258
1138A358j35o403L100K313l024k08M380l553l738P403J349r347O37J1574l742
1153A964j1312O069J1468q303j0296J0771P047j0765m726J1044J476r326J558
$$ y = [7496, 1606, -6665, 251, 4296, -2494, -2090, 2049, -1329, -3415, 3435, 767, -6511, -578, 6978, -2537, -9427, 4081, 8057, -6674, -8379, 7470, 5903, -9287, -4773, 8498, 2674, -8998, -828, 6402, -1208, -5148, 1590, 2522, -2797, 559, 1957, -2638, -875, 5036, 46, -6165, 3303, 7242, -3897, -7262, 7597, 7027, -7515, -4319, 9613, 4232, -8809, -382, 9243, 608, -6725, 2680, 5957, -2118, -1847, 3104, 917, -1778, 2907, 1194, -4096, 977, 5396, -3038, -6206, 4822, 5010, -7506, -6018, 7678, 2435, -10785, -3326, 7742, -1106, -10392, 12, 5316, -4374, -6900, 1358, 1223, -5180, -2080, 233, -2791, -2999, 1381, -2172, -5910, 1493, 2842, -6505, -5868, 5706, 1964, -9348, -3279, 8189, -114, -10410, 361, 7408, -3357, -8083, 2961, 4437, -4889, -3331]
1166c331O177k251l649M329k59l237L246L453o764o50R368k320r314M214J1043
1181A0055p511r201R692P558j0402n783J1864K619j0600k71R156j360p145L568
1195B239L134l409j235L879k785k377N043K72p194J645Q835n682q472P472P790
1210I155j0051o885J1840L305j1592j488J1193j604r208K658O891m146m440M742
1224C70N83l523J202K663m544j80O475l389o533M649P493q438n842R839M320j1279
1240f134k515J2021q36j0115J698R466l781p130N101M002m562j658M630j337k566
1255c716M027J19n081K523O701n887m925P804M824r699k993J1593K49j0635J554
1270c542J1015l858q755M962O713n185m399N871J005l964P43K894l380l41M316
$$ y = [-3331, 2846, 595, -3054, 1275, 1016, -2221, 1025, 4478, -2286, -2936, 6432, 4112, -5202, -988, 10055, 2544, -6657, 3035, 10593, 191, -5592, 6272, 8891, -1709, -1980, 7176, 5816, -1329, 2239, 5373, 1964, 729, 4608, 1823, -554, 4489, 4761, -2433, -788, 8047, 2365, -6107, 1365, 9155, -896, -7781, 4059, 7364, -4228, -5716, 5477, 3873, -5335, -2677, 4214, 68, -4372, 370, 953, -2570, -1368, 1295, -3249, -3429, 3046, -343, -6876, -2227, 5266, -3172, -9014, 825, 5145, -6134, -8649, 3372, 2536, -7579, -5881, 3585, -196, -7326, -2225, 1777, -2785, -4443, 187, -1150, -3716, 311, 430, -4651, -2128, 4573, -1314, -6239, 1565, 6389, -3310, -6303, 5290, 5539, -5096, -3542, 7473, 3615, -5140, -178, 6535, 1350, -3049, 2822, 3827, -137, 606, 3500, 120, -221, 4095]
1285D095k223m413M276M711p797k696Q971J281j0198M51J1110l591r697M624Q643
1300G547o538o013O892L337o312j793N696j592l005K462Q07l854J703M148m906
1315a421l061O465K046r058L51R317k212r580L869Q930o234o976O467N617p188
1330b668l388P137N73n404R51L995l182q23L611j392l244L800L008o596p02P782
1346C458o51q884L429Q622n063p341O181O672p808l774P706J874o763k45O112
1361C525j791l491K486J810l461J005L030l580j630N229Q49p582K269P217l698
1376B187p389N661O880p622m660P483M008q524j474P582m58o453J894M382l340
1391A57j593K794l83k727K609K245n513M86N865k121o748M158O661o272n323O987
$$ y = [4095, 1872, -2541, 1735, 6446, -1351, -4047, 4924, 6205, -3993, -3542, 7568, 3977, -5720, -1096, 7547, 1009, -5004, 1888, 5225, -1087, -2880, 2816, 1224, -1781, 681, 1488, -2366, -663, 3485, -1421, -4482, 1983, 4029, -5029, -4678, 4639, 2427, -7153, -3284, 5646, -588, -7564, -1097, 4520, -2668, -6056, 1081, 1654, -3750, -2799, 1196, -1986, -2809, 802, -590, -3834, -34, 2974, -3622, -4324, 3458, 2807, -6077, -2648, 5974, 911, -6430, -249, 6423, -1385, -5159, 2547, 4421, -2342, -2587, 3525, 1734, -1757, 729, 2539, -922, 83, 3113, -467, -2097, 3132, 3981, -3601, -1332, 5885, 2187, -5202, 459, 7339, -283, -4943, 2540, 6548, -1976, -3450, 4132, 3674, -2779, -885, 3497, 157, -1436, 1358, 975, -1752, 857, 3102, -2411, -1925, 3940, 1819, -4929, -771, 5890, -382, -5705, 1282]
1407A282M281q809j769Q002M38p410R49O604l324l757L226K241l431M74K405k013
1423f11j353L590o1n322K667N095l918n546O157M675p738k714Q106J513q441N97
1439c304P738k185o038K772N063m430k007M130m54k783J951J487l545O90M235
1454C320k536m777M513M283o508k633P103J691q233M28P648j771p213L126N669
1469D110m084l896L559K816m223m07L357j698j481K616l2l924K537L389l797l470
1485d628N848K283p166o83P453k33q165K434O935l463n778M591L956m936j740
1500c292M393J70l446K076J767l124N31L138k064l755M814K438n631j201O508
1515C322J99p345K181O709k937o484M695M891n102k909M887J918n010M79L354
$$ y = [1282, 5563, -3246, -5015, 2987, 3425, -3985, -3036, 3568, 244, -3513, -287, 1954, -1477, -1003, 1402, -611, -1964, 1626, 1565, -3757, -1090, 4005, 87, -5459, 698, 5373, -2365, -5079, 3027, 4540, -3901, -3304, 4434, 2249, -3789, -1017, 4046, -384, -2391, 1739, 1285, -1498, 453, 1940, -1605, -915, 3320, 784, -3993, 520, 4803, -1705, -4338, 2765, 4456, -3777, -3349, 4299, 2528, -4685, -1559, 4110, 26, -3870, -311, 2505, -1718, -2125, 1232, -466, -1947, 669, 637, -3287, -750, 2639, -1158, -4628, 1220, 3503, -3663, -4346, 3107, 2874, -5291, -2857, 4078, 615, -5163, -572, 3384, -1552, -3292, 1101, 1271, -2175, -99, 1668, -1456, -925, 2213, 149, -3606, 1208, 3646, -1985, -3186, 3322, 3521, -3824, -1643, 5066, 2129, -4355, 340, 5231, 129, -2780, 2107, 4025, -985, -506, 2848]
1530B848j336j849K042M09l134K238K069l131k139N059P02n880P56O211j802p021
1546c958L918N709m831m937N353L131o232q83N313o85m195J810K407l214L1K688
1562A425j732k769L959Q98m930K91N786k200n965L503N190m467m824N684L106
1577B955n650j537N103N89n036J232L402j656k179K168O57k064Q10J939k130j311
1593b708L922r9m657J462N165k569n235M896M379n708l167O848J336o537O79N362
1609C369j096m683K956K475l159m19K769j182k040L205L54l466P37M612k766m352
1625b686M318L047m222l208O002J039n530j96N044q48m688J977L381j897l310
1640a777K764J134k453L44J533j336j552K964k83l515J623L774l497l532M921
$$ y = [2848, 1512, -337, 1705, 2114, -1020, 1218, 3287, 156, -1983, 3076, 3778, -2102, -1346, 4865, 3063, -3958, -40, 5669, 838, -4099, 1254, 4385, -1847, -2730, 2583, 1898, -2297, -487, 1920, -1294, -1263, 1425, -307, -3076, 883, 1781, -3149, -2858, 2928, 728, -5237, -1734, 3456, -1011, -5835, -151, 2955, -2695, -4232, 871, 1460, -3576, -2344, 1058, -598, -2777, -609, 48, -2016, -1206, 733, -1397, -2708, 1214, 1115, -3542, -2080, 3085, 516, -4719, 177, 4556, -1152, -4319, 2529, 3865, -2672, -1993, 3369, 2273, -2410, 546, 3021, -138, -557, 2212, 1030, -1010, 2195, 2549, -917, -180, 4432, 1666, -2686, 1632, 4679, 457, -2751, 3251, 4290, -1240, -1436, 3608, 2760, -1928, 49, 3430, 1533, -1777, 987, 2121, -332, 12, 1545, 209, -1343, 1621, 1338, -2177, -554, 3220, -277, -3809, 1112]
1655A112J995n454j790O303Po270J643N300k776m549L878K297l743n65L234j036
1671d14k186K567K14k851P34L511k621k771L798K178m566j378N717m72m919J108
1687b351M888j762m502K959L091k513k323L093Q50k485J1K207j021j192K188l4
1703A104k291J254K687k844k276M415J394m954o42N979j196n718K908M787l844
1718G63l713M574J894m138l00L497j495k281K455M83k458P00K607k431j740L185
1734A602J056m405K36M672j505m379K075M108l225l330L328K332k979k086L446
1749I46M63k860J70K236q89j627J813m1j651O53K186k618j317L637J52m001N30
1766b218N032k331m258L261L572m292k541N132Q09m391P9M535k043k585K790M85
$$ y = [1112, 3107, -2347, -4137, 2166, 2173, -4097, -2454, 2846, 70, -4479, -601, 1696, -2047, -2612, 622, -414, -2600, -33, 181, -2670, -1936, 1575, -1046, -3817, -19, 2159, -2407, -3785, 1932, 1460, -3459, -2351, 2537, 775, -3727, -768, 2323, -190, -2513, 580, 1430, -1055, -1044, 1163, 142, -1050, 1138, 1104, -1187, 67, 2754, -90, -2366, 2049, 3443, -1511, -2153, 3826, 2630, -3088, -180, 4607, 763, -2950, 1624, 3518, -620, -920, 2577, 1082, -1199, 1256, 1739, -719, -19, 2588, 157, -1583, 1602, 2658, -1747, -1511, 3161, 1656, -2723, -648, 3460, 235, -3095, 233, 2565, -414, -2500, 946, 1409, -1451, -1281, 955, 66, -1561, 252, 211, -1440, -787, 1399, -1219, -2536, 1101, 1253, -2748, -2218, 2814, 483, -3775, -514, 3058, -1234, -3775, 1357, 2166, -2225, -2146, 2389, 346, -2239, 551, 1036]
1782A036k366K98K638k230j061K831K94l266R55L882k907k774K815K953l618j868
1798b388L855J022l852o37M153n85k979M88K609j252j719K130K01j833N74J763
1814A550j873j316L084n5l507Q78M132k956l176L699K616m725j651N548m29m266
1830b447O87M397k559k592K885R16k357L11K074j978p53K497l64k703J188L248
1846B450k641k207K838J934l581j120L985L51l804K04L830j009k927J278K148
1861A729j705j524K440M61j770J58J537j387m26J592M8k205R36L037k903k000
1877a982L378J597m623l88M957j153m341J951L840l146k131L037J017k868j28
1892i83K394j483q96J990j13k500J537J898k614j229K759Q20l506j2L636o64l612
$$ y = [1036, -1330, -1032, 1606, -624, -1685, 1146, 1440, -1826, -871, 3011, 104, -2670, 145, 3098, -520, -2388, 1467, 2489, -1363, -2000, 2153, 1568, -1411, -923, 1686, 434, -1285, 845, 1046, -787, -213, 1550, -323, -1639, 1445, 1390, -2117, -1239, 2893, -63, -3239, 460, 3076, -1649, -3300, 2248, 1819, -2447, -1760, 2637, 78, -2514, 371, 1287, -1070, -759, 1315, -663, -1416, 1081, 717, -1986, -798, 2450, -191, -2398, 440, 2374, -1207, -2327, 1658, 2009, -1795, -1591, 2239, 1230, -1697, -419, 1729, 24, -1500, 940, 1401, -369, -211, 1326, -61, -487, 1105, 1153, -1052, -116, 2921, 18, -1982, 1396, 2993, -1630, -2018, 2939, 1786, -2555, -604, 3236, 90, -2041, 996, 2013, -855, -983, 1411, -72, -968, 1022, 909, -1591, -54, 1844, -770, -1999, 760, 1580, -1926, -1938, 1698, 1034, -2578]
1909b578R83L448j960k286J763J977k219j200K270O0j683P6J978j639n09J804
1925B85l15j984J490J760k323j142L283Q25m290N03M340j925l475K624L045l610
1941i09j720L827N97l455P98K754j793j110J994J71k111J622J285k049o55K557
1957A803J64l359J062L086j500k695K002K471k607j926K906J372l010p06K597
1972A660jk274O27J784j102r30J282j58j314P91J117j926q15K854%l628J504L306
1990B777k565k771K705K425l951j036L462K39l625J206K369j767j163J855L28
2005D88k239J052J104j487p71K404k28k524J113K248j852j995K509J752l130j104
2021b660L117L83k754OK696m11k226J215J654j667n51J364L04j304O76J246j556
$$ y = [-2578, -1595, 1853, -107, -2393, -630, 1347, -872, -2072, 198, 258, -1425, -1349, 629, -1010, -1519, 285, -30, -2014, -524, 1236, -1087, -2229, 1054, 1879, -2411, -1908, 2432, 507, -2968, -344, 2701, -909, -2629, 1198, 1795, -1660, -862, 1892, 99, -1011, 983, 1154, -957, 665, 1950, -99, -754, 1803, 1967, -1392, -330, 2756, 1256, -1439, 563, 3034, 427, -1499, 1407, 2779, -231, -937, 1660, 1659, -615, 12, 1796, 694, -236, 1046, 888, -426, 365, 1482, -444, -1259, 1595, 1595, -2033, -529, 2777, 212, -2559, 146, 2571, -1380, -2416, 1046, 1285, -2340, -1134, 1235, -532, -1695, 160, 488, -1751, -699, 405, -1082, -1853, 551, 323, -2201, -1088, 1160, -692, -2687, -178, 1574, -1556, -2660, 457, 840, -1914, -1908, 788, 377, -1849, -634, 1020, -647, -1198, 166, 470, -834, -158, 1088, -468]
2038d68l63K087j30k846J902K149k376j863L037J498m106O6L718p07l095J903
2054D06K064j939j672K351N07k362R41J072q69o48J513k39j975J236J777j897
2070B66j716K859O30k722l84K615J3k918Q73K584j420k402J768J475j732j014
2086a225J780J74j738N48J187j465j52J517k46k397J862J566k092j492K955L45
2102A127l178N49K888j069k879K218J797j899j331K178L99k375J068J006p40q71
2118a112J537j57j449Q98J303j569j028K402K57k559K69K703p87k591J511J903
2134A531j443j806K192J148k108l56J773j37j621J119R22j252k83J472o03j513
2150i65J399J138j782r85K910p35k230J049K179j851k216K828J109k728o59K713
$$ y = [-468, -831, 1256, 1126, -1720, 182, 2331, -45, -1908, 1129, 2627, -1479, -1413, 2305, 1598, -1497, 406, 2470, 531, -1141, 1210, 1717, -645, 296, 1368, 499, -149, 1364, 1125, -850, 386, 2163, 266, -1450, 1409, 2039, -683, -1067, 1548, 1561, -1357, -484, 2100, 680, -1722, 46, 1521, -211, -1225, 555, 729, -1009, -461, 726, -739, -891, 626, 380, -2017, -155, 1411, -681, -2173, 782, 1127, -2051, -1502, 1386, 317, -2562, -344, 1453, -446, -1777, 401, 800, -1575, -507, 499, -241, -1112, 425, 268, -1181, -283, 1020, -549, -1577, 825, 1082, -1477, -1208, 1495, 708, -1883, -372, 1531, 88, -1718, 474, 1622, -486, -842, 931, 794, -827, 292, 1214, -38, -321, 1151, 548, -965, 434, 1572, -210, -1195, 1715, 980, -1250, -201, 1978, 127, -2089, 739, 1848, -880, -1539, 1174]
2166A174l46j980P91J543j164q05J457l32j352J174O08j018r32K196k54j842M49
2183f33K204j192k100J981J224j902j385K479N92k385J11J881l02j601R97Q40
2199H09j128k57J251n58j249J712L81j882Q5K199o87k458J817J798k032j489K481
2216G93O68k510j39K687n74k155J478R71j309n55J302j0j127N66O16q21n24J729
2234A086l48k081Q68J920j761j111K018P63k178n95K549l69k039N84J898j069
2250A35j443J471M45j538q1J535l41j150J227K43j422r2J746r16j136J281J084
2267A048j826q62K544K6k225R0K584p90k014J262J327j436p89J664K13j500N57
2284a27J114j086m41J504n71j095Q61J359j554j089J994L51j869j35K538j071
$$ y = [1174, 828, -1152, -361, 1182, 18, -787, 670, 338, -1014, 160, 768, -250, -1182, 1014, 760, -1082, -633, 1571, 379, -1721, 260, 1484, -418, -1803, 676, 1268, -1117, -1006, 875, 573, -1028, -31, 809, -319, -576, 675, 117, -1132, 580, 961, -921, -836, 1363, 676, -1782, 35, 1833, -199, -1688, 793, 1461, -1049, -1188, 1499, 925, -1230, 248, 1219, -90, -645, 657, 647, -480, 86, 702, -119, -643, 1086, 738, -1343, -475, 1445, -316, -1427, 591, 1354, -824, -1419, 1130, 761, -1278, -694, 1204, 135, -1308, 163, 608, -930, -1011, 524, 183, -967, 260, 503, -919, -1011, 735, -181, -1317, -36, 1048, -778, -1640, 904, 930, -1295, -1205, 1379, 589, -1425, -163, 1164, -272, -1061, 603, 816, -684, -127, 987, -99, -540, 964, 393, -702, 159, 1518, -36, -1125, 869, 1220, -649, -784, 1754, 683]
2300F83j807J077J578j087j731K085K04j090k08J248o00p51Q63K28r23q9J748
2317A428j296r02J414M98j675l85K096k58j890L39K221j407j567J510J112j838
2333f00m76J874m30j251M27J276j255n08J319k39j202N65J074j723k32J788M1
2350D48j852L74J969j242j404R51J685j393j315J918M06j432m1J673r67p76R15
2367h3O09j128K72R46q33n96J213L23j698L59J669m91j964J232J775j790j174
2384a359J681P02j172n57K012o17j140N61J022j312O6J127o22p97Q98O48j380
2401b39%J316Nj774R39J321j164j015J286R33j770n47K038l19j577L03J387r64
2419A59j021J252N38j371J65R48n84p78J084o5j104L94J149j100r73J105J138
$$ y = [683, -1124, -47, 1531, 444, -1287, 798, 1002, -88, -296, 952, 352, -399, 464, 692, -231, -320, 1428, 132, -770, 644, 1142, -533, -918, 1178, 920, -970, -631, 1590, 183, -1384, 126, 1238, -600, -1076, 798, 368, -883, -456, 820, -435, -943, 376, 137, -1065, -500, 574, -1149, -1381, 407, 448, -1404, -1030, 939, -303, -1707, -756, 929, -464, -1779, 139, 545, -887, -928, 745, -222, -998, -83, 526, -602, -330, 616, -217, -813, 400, 723, -975, -616, 1053, 562, -1402, -170, 1605, -185, -1359, 322, 1024, -148, -705, 1307, 690, -450, 111, 1133, -179, -113, 1014, 392, -405, 493, 1141, -239, -239, 1077, 1082, -692, 247, 1568, 404, -611, 675, 1608, -162, -709, 1329, 1010, -567, -264, 1123, 159, -862, 390, 928, -443, -278, 670, 86, -692, 392, 327, -777, -383, 766, -334, -1307, -202, 936]
2436I36j701o28J834J65j956M49J571q68j142J170P70j017n87J361l31q34M34
2453c74P90j123QJ279l25j750J337J042j568m27J598J69j568J12J625m75j664
2470a314J093J223r92o50Q01M93j072K10P02m13o23J042J13j241R61N63o78q85
2488f67J246O37j591k7J395j28j705Q15J316j170q33R08R55j587qJ043l03m76
2506a80L42M53q43l70J340l93j293J208O07j345l33J230L89j510L60J140n06j348
2524a052Q69Q82j158n31J561n9j381N16Q92q66l53P08L29j104L16R09p27n86J136
2543C01R7j015j52J389k65j587J033J178j160p67J186N37j641K35J276l61j312
2560a028J076N25j094M73R84n31j025Q88L87j269kJ505l84j553J154R06r84j051
$$ y = [936, -765, -1393, 441, 606, -1350, -901, 670, -198, -1340, -170, 600, -417, -1004, 357, 26, -808, -374, 416, -707, -699, 580, 255, -1495, -158, 884, -684, -1111, 487, 656, -912, -800, 825, 350, -1314, -221, 1002, 10, -640, 161, 654, -418, -208, 494, 81, -542, 500, 613, -628, 333, 896, 218, -667, 579, 1216, -375, -402, 993, 865, -840, -25, 1291, 121, -712, 196, 1151, -436, -444, 599, 296, -180, 162, 615, -228, -598, 742, 349, -944, 264, 871, -474, -807, 423, 812, -698, -338, 802, 296, -1052, -183, 699, -459, -990, 571, 512, -869, -353, 539, -327, -680, 28, 357, -747, -431, 478, -249, -835, 301, 398, -617, -769, 620, 355, -1232, -199, 979, -181, -948, 238, 775, -866, -631, 645, 284, -1028, 48, 573, -521, -48, 936, 405, -620, 268, 655, -614, -616, 889, 505, -1048, 106, 1012, 28, -1023]
2578a023J175P23j154m04J451j20j243O69N14n11m01P65K9r92K17R23m94n13R29
2597E40L9j413L72J206n15j267J066O32q54p94J478J95j396K30J030k20j152Q96
2615G3N75j053j12R62l52n57N82M28j093L10J032m03j067O89Q99r64p15J170M51
2634H55j412K35J044l32j040N83R13q32m21P79J64j015M59O83p85l63J127j14
2652E28j115L34J113p68q90R84O89j214l63J552m9j548N73R49m84j181J304O6
2670D80o76l34R18l84p34Q52K29p73n0Q71l53p78N98N70q87p64J602j52j097J02
2690g60J161n40j124R53Q41j057m00J039j22o30K80M49k82r6L74n3n58K35Q84
2709E94r25n48J202L3r49Q2J179k76j152P53Q20r60o93J161O4q88L12O70j55j022
$$ y = [-1023, 152, 875, -279, -683, 768, 648, -595, 74, 588, 77, -324, 441, 470, -522, -305, 618, 124, -389, 540, 579, -834, -462, 744, 229, -1038, 28, 660, -194, -988, 490, 685, -711, -481, 549, 329, -823, 73, 648, -405, -517, 445, 93, -464, 118, 546, -547, -237, 795, 392, -675, 14, 913, -51, -766, 404, 855, -557, -322, 722, 390, -650, -67, 846, 14, -407, 372, 536, -479, -20, 663, -122, -485, 642, 528, -587, -253, 860, 92, -798, 186, 875, -339, -702, 850, 801, -747, -174, 775, 291, -890, 414, 480, -196, -530, 388, 4, -730, 122, 351, -422, -472, 399, 46, -732, -134, 436, -451, -1215, 387, 235, -862, -760, 401, -139, -1263, -310, 531, -526, -926, 113, -9, -639, -359, 90, -192, -288, 86, 33, -525, -290, 594, -331, -879, 323, 356, -593, -511, 668, 392, -760, -7, 813, -147, -840, 321, 385, -503, -191, 479, 324, -698]
2729f98R25J89p70P1O99j50o21R01K27q06m37J432k37j111K30J299p16j061J411
2748G77K65j068m84J269j28r54J80R13m18o17O70L1q22K84N93m78o58J117J50
2767F22j082K64P95o93p59Q09N52r43n90J468j82q52K24P11m42n89N78L57n50
2786c02m4P33m25k71L22L60p92n0J205n37r41N65P51j041m74J309J38j262j18
2805h74J185k45p73L62Q14q09j53N26R1p25M15Q79r86k52J120j68o75K44J084
2824A060p62q85J088N75j093l16J263l53r37L04P00m95k77M78J78n68j91P43m60
2843E2m40P70Qo31r5P01l48p86P33N35o62m80Q09J04r38P4Q79k27o70N12N47o10
2865a63l46N93n6n05L88N23o01o1M24qp07M41L92o43m25P34M16j247o8J382m16
$$ y = [-698, 227, 416, -354, -283, 416, 266, -355, 546, 773, -33, -470, 962, 725, -386, -156, 1143, 427, -634, 777, 1042, -26, -510, 759, 631, -323, -143, 770, 352, -265, 405, 436, -386, -102, 491, 13, -645, 472, 622, -460, -196, 599, -94, -853, -44, 508, -435, -1025, 443, 261, -591, -367, 344, -98, -687, -109, 248, -302, -346, 387, -38, -309, 13, 373, -419, -469, 736, 199, -742, -177, 574, -467, -941, 368, 506, -756, -874, 311, 66, -707, -345, 469, -340, -493, 33, 124, -601, -186, 693, -293, -545, 575, 407, -268, -24, 1060, 298, -587, 501, 1076, -17, -333, 930, 577, -360, -56, 644, 149, -128, 350, 528, -40, -231, 512, 52, -388, 382, 390, -241, -336, 365, 17, -769, -36, 499, -163, -643, 166, 270, -668, -594, 285, 58, -612, -100, 447, -163, -509, 84, 28, -477, -89, 434, -167, -228, 196, 188, -519, -78, 314, -329, -754, -20, 396, -851, -919, 463, 47]
2886D7j053P19N03o79l99P71K41m74m1N67n61j43O93Km70L76M67o15m33P98J91
2907E07j105M17P45k57q43L28J009p52n99P44N27q99j79R62j25o92L36K71o83
2926b88J29O36q0l88k12R93j165k02Q14R8q42J44J014l95o28J72J035j045k76
2945d86R29pr36K57Q27n68k06L75q1n24L45P27p32j06J95M18q92K09N65j42r65
2966g98M72J067p55m73P00M97r88l7Q26m97o53P27N72q60j6M08K11p62L62L69
2986C72n17k22O95J61j025N59N14o18n18O92M15p73l83J164p8p97K24O75o89k79
3006d28N34K14n99J94L91m16k99M80J08n31K4P41n45m15N27M44r30N9P92j53p70
3027e78L9P44o8n42K72O1j98j25L60K18n74K59N53r24Q6O70k18l86O3Q11p82k65
$$ y = [47, -1006, -287, 216, -463, -862, -91, 150, -324, -365, 202, -359, -502, 191, 193, -277, 99, 566, -49, -482, 316, 507, -598, -181, 564, 307, -536, -208, 801, 49, -550, 194, 721, -178, -357, 605, 480, -212, 124, 395, -288, -159, 477, 397, 9, -203, 790, -375, -577, 237, 335, -507, -363, 651, 256, -372, -200, 835, -210, -486, 443, 436, -500, -243, 584, 16, -190, 185, 104, -420, -75, 652, -80, -186, 9, 427, -465, -256, 309, 167, -798, -326, 741, -14, -487, 213, 710, -278, -315, 511, 14, -639, 88, 660, -200, -216, 192, 403, -359, 3, 372, -145, -367, 328, 489, -536, 23, 537, -81, -599, 93, 508, -265, -648, 516, 438, -359, -135, 540, -149, -428, 106, 320, -279, -85, 306, -110, -409, 71, 179, -352, -328, 413, -132, -547, -20, 424, -506, -447, 345, 192, -578, -539, 205, 137, -405, -133, -72, -270, -395, -35, 183, -391, -132, 421, -503, -417, 253, 35, -351, -288, 523, -259, -524]
3049e24N83N22p73j52R22m82m32J25M88m75o6N19n9n70R2P26p08j39M99J76m35
3070a63l8O16k83n78P59L15r74K0R35k46p22N88M17n38l31N86j31l26K53L43k75
3091B27n85N70L42p76J2O22j07o51L85N22p06k96O50K75r97J13P62p4q95M86L83
3112B62p48J56L20J60l90K74P0j90p8L89j44k40J01N15m86m84P00K97q57O7O70
3133C64l74m33L88M59n47j86L77K42p13J97O55l41o85O20J49j91k54M43L4m97
3153b93N72Q5l72k90N75L00q67L09O26m59l29O71J53o55m17Q01K94p09K40J38
3173C73k13o70P19Ko67P11o4J03l53L64j39m02J49L42k02o50O50J20l24j64O02
3194B87L5m53j33M47Ln00K08K55p26K29L89J13l63L46q1l93J74K11P8q07M51N69
$$ y = [-524, 59, 581, -192, -344, 578, 96, -336, -211, 277, -198, -264, 255, 196, -374, -282, 444, -264, -403, 96, 272, -163, -201, 415, 132, -446, 313, 628, -346, -326, 609, 363, -359, 229, 646, 108, -223, 363, 232, -94, 159, 502, 227, -358, 212, 554, -222, -210, 412, 305, -346, 39, 561, -145, -441, 209, 484, -513, -400, 362, 288, -607, -121, 262, -486, -330, -10, 150, -240, 34, 104, -86, -164, 225, 81, -159, -58, 457, -29, -513, 187, 484, -373, -306, 364, -10, -443, -55, 404, -143, -329, 48, 290, -423, -226, 429, 88, -597, 23, 172, -19, -273, 170, 204, -293, 279, 364, -8, -298, 277, 577, -290, 19, 645, 186, -143, 528, 681, 26, -391, 410, 704, -5, 235, 373, 160, -510, 209, 211, -456, 255, 191, 294, -59, 305, 166, -236, -87, 255, 53, -597, 53, 173, -151, -315, 287, 322, -131, -264, 183, 186, -314, -106, 149, -577, -348, 41, 154, -209, 137, 56, -337, -163, 48, 126, -681, -230, 339]
3216C39l64o17Q43n1q68L14P45l59m82L56N07o02l14M42J06m57L8M19l0m34N82
3237A13l7o57M10N62l60o58P87q3j34l35L42K16m09J64O72m32m09M40R3l73m1
3258a29L75k39p6J38L29n84n1N41q8m14J5K69j13q7N11j71k72J71K72m22l24N42
3280A93L18n51l00O61j97l11M71J32m21k65L22K95m60K59R9n3n55O62j11o34K38
3301b08M12l9n54K24M77k39n66P36p2j99l49P64m34k93M98q0l9k60O43n49m51
3322e78M55J26j38j17M16P7p31N05L38j55m60N07L2m80O1L94j95o51M83N24m77
3343f4L0M31m54l70M08J32l57j48N81K51o65pP30j41n10J67K73n04K5L76k1n89
3365d26L15K96o8n21P18j95k29Q0L50m60j32K88K56l75r7N88j60o81L07N25p04
$$ y = [339, -25, -642, 201, 150, -718, -404, 341, -18, -500, -144, 363, -239, -553, -111, -5, -462, -424, -5, -35, -469, 113, 76, -581, -171, 391, 31, -627, 160, 77, -57, -392, -50, 166, -243, -79, 593, 161, -248, 192, 285, -88, -129, 246, 7, -69, 69, 398, -186, -237, 304, 216, -198, -183, 86, -27, -114, 397, 226, -46, 125, 397, -25, -349, 193, 511, -40, -340, 321, 124, -187, 284, 416, -5, -270, 52, 347, -113, 146, 245, 192, -363, 299, 188, -446, -208, 204, 165, -389, -165, 312, 73, -493, 243, 171, -28, -377, 387, -47, -340, 158, 78, 39, -221, 422, -127, -578, -123, 3, -135, -252, 164, 241, -490, 15, 353, 198, -262, 245, 277, -203, -142, 252, 57, -594, -111, 413, -64, -34, 397, -57, -427, -19, 113, -244, -392, 189, 440, -225, -232, 498, 357, -153, 14, 287, -217, -192, 184, 163, -426, -111, 185, 117, -404, 314, 119, -110, -30, 320, -140, -272, 16, 272, -103, -200, 388, 228, -453, -146, 379, -325]
3386c25P0M48n4m86J69M49k68o2j28M32k27m35M92Q6k86P9M15n73j23M86L1m67
3408b77K51M50k03n60M89K00m89l30O39R6o55J2O91m54k08N42n3j02k32N75m69
3429h7j39L67K77l46k06N69k11m59J73O83p00m17R33j88l52k19L94k22j81M15
3449H4K02m66K4L18q5m04K85K83k79l83M39N1m06J27M26n08j64M91n5k58l4M04
3471I2k30m85N03L73l96k77N65ok72P6L25j57m36M21J32n79K17J61l63o2L58Q3
3493D3m00K86N93k52k67j98M98l12o55P60J60l75j02N14l36j72L79K11o73J66
3513a32M05k31j36j8O10l33k24M46j72j82J90N1l44j21K30M43n37kJ40Q6l06J46
3535IL84p04J69J75J40l95J61K31M1o06J20N30p04M23L79k00n11L38J63k99J60
$$ y = [-325, -255, 193, 139, -347, -178, 271, 3, -59, -187, 245, 18, -417, 75, 161, -125, -46, 369, -204, -327, 159, 190, -277, -26, 424, 221, -339, 150, 350, -139, -469, 170, 266, -389, -377, 314, -140, -348, 194, 141, 39, -193, 382, -87, -226, 141, 418, 72, -134, 435, 224, -235, -62, 621, -79, -496, 437, 249, -103, -322, 72, -150, -331, 84, 286, -180, -156, 162, 77, -327, -42, 241, -38, -421, 18, 69, -337, -210, 216, -292, -456, 35, -20, -278, -312, 92, -138, -623, -120, 253, -143, -420, 145, 139, -133, -57, 268, 111, -325, 96, 228, -351, -134, 27, -336, -398, -40, 43, -357, -71, 522, 270, 3, -195, 303, -9, -664, 96, 256, -119, -221, 293, -43, -215, 164, 375, -298, -132, 273, 42, -94, -112, 498, 165, -59, 387, 215, 33, 223, 274, -70, -191, 39, 482, -55, -57, 83, 169, -137, 9, 393, -311, -142, 33, 173, -222, -61, 170, 211, -395, -275, 255, -449, -26, 353, 153, -358, -20, 143, -156, 4]
3556DL2J97n50L17K31k48l33K77J39k96L9J98J87l04K32J24m66K33K41r3n17M54
3578I8K27l67l65N09L98q47O4N68k68m11K99M13l85j83K18M00o33K45N25k84m31
3599b10L65J60n39K66K24J81n09M22j6k18l4K6M28p79J26L06l3l38K91M7m01J50
3621h5J88Q0n73M74J20k04l61M56l9n45M72J68q0n71O64J5o33J94M13J70o03L07
3643B7K56k28n0R3j33K5K31n8j81o7K86q8m24L33M04n20j52K35L0k43R8J78q3
3666c1j63J38L42l77k14N68j94j55k04M05R6o56O84K1k39j98J71J43l46N48q0
3687B59m29o0J33L56p42N03J22r8k03J07M41l01k41K88K52o31K62K05m3l34J61
3708GJ47k88J62J68l35rM78r8m59j7M51r4k37K90j00j86J87L53j98l77k1M45k55
$$ y = [4, 36, 233, -317, 0, 231, -17, -350, -73, 66, -230, -191, 7, 194, -110, 122, 246, -220, 13, 254, 161, -356, 98, 325, -42, -407, 102, 500, -347, -283, 285, 17, -394, -95, 318, -67, -250, -32, 368, -265, -20, 505, 221, -210, 155, 315, -224, 42, 266, 447, -62, 360, 344, 126, 92, 118, 546, -233, -107, 199, 166, -172, 119, 166, -235, -85, 103, 183, -390, 84, 204, 0, -361, 95, 56, -489, -17, 151, 71, -500, 164, 179, -454, -260, 153, 323, -280, 27, 283, 55, 5, 98, -35, -10, 221, 163, -18, -85, 201, 113, -311, 22, 426, -94, -246, -11, 19, -224, -126, 52, -31, -194, -56, 286, -91, -305, 263, 69, -86, -290, 115, 211, -445, 239, 260, 21, -177, -6, 137, -209, 339, 259, -170, -230, -97, 259, -483, 20, 142, 44, -159, -52, 389, 88, -153, 135, 387, -244, 18, 223, 180, -154, 7, 154, -134, 28, 196, -139, -148, 330, 232, -227, -244, 207, 113, -124, 166, 66, -120, 67, 420, 222, -155, -176, 269, 14]
3731A4p7J16K12r3l69M24l7j69Q7K41m25r9M68j31l15k6L66m22k07L43L49l76
3753a26o4K09j22k35L41J54k59r4L43j40k63M19j55J14q9L12p5m77L59K8j33l03
3775b56M32L7k51k85O67q4k64O1K65l91l43N27p7k1j65L40k54j08K17J24k61K3
3797f7q6K96l55K94J02l50k17N03nm82J56M15k16o8j18K61k64j3L28k86K07k5
3819A0L47o24J65K36j61j69Q4L92n29K26K13j92M3k41L23p4j79pL76j0o08N26
3841A47j87k18M15q8l64j31M40j66P7k09M85j59p5k5K28J3o36P94k74k63K68K81
3863C53j04k35Q8Q3l33j0L71k3j79m5J41j61l50P71l83k81K57K66m23q2M32p0
3885H3k19J0L73l55L6J7J94k78o3M27j20o9o1q4o0K54j23M29l78J28l0J5o8N4
$$ y = [14, -63, 53, 265, 172, -197, 227, 190, 21, 108, 349, -76, -175, 293, 162, -153, -179, 187, -235, -442, -99, 250, -126, -190, 19, -103, -338, 3, 157, -102, -196, 147, 7, -256, 163, 8, 122, 33, 345, 270, -207, 152, 180, 47, -256, 176, 213, -38, -323, 344, 260, -4, 57, 322, -69, -412, 115, 38, 17, -148, 192, -62, -170, 47, 171, -90, -67, -153, 143, -212, 82, 184, -166, -383, 120, 115, -367, -211, 204, -12, -80, -198, 63, -201, -214, 114, -172, 35, 10, 357, -267, -102, 134, -27, -196, -112, 280, -249, -23, 190, -2, 41, -200, 123, 49, -130, -137, 239, 229, -379, 147, -40, -258, 157, 69, -295, -426, 14, -152, -75, -284, 201, 42, -33, -58, 170, 183, -453, 341, 67, -196, 72, 353, 249, 14, 102, 185, -148, -158, 213, 190, 11, -34, 107, -54, -404, 367, -16, -297, -40, 226, -197, -279, 153, 83, -136, -126, 247, -108, -72, -55, 139, -139, -202, 225, 105, 36, -25, -109, -169, 85, -38, 391, 13, 141, 111, 126, 58, 112]
3909A12K41l77l82O56J33p80K50N69n65l33M83k09J67o9J02J06o08P17j17k29
3929a33PL33k80j03L34L21n34Q7K6K61m48P7M78j70r1l4J90j49j6J43p1k16L4
3952D6K5P3k41M48j24l15N6o9J65j32J99l2k94RK62N3k82K66K28l94j11K33P1
3975A40j63j02K73q7n48N81M2j18j67J96N6m72K45N72l39k67M58q0l15q5O69m83
3997Fj05j59M48m33J34J69k48k59K73K19k16Q1K31J56n57J79J53j30j85M91J91
4018D39n45n1K18L2k77J45K89l92J96L78k87m62L76J27j14j72l4J86j92L7K25
4039A22P7l59J24K10j88j47K88l43m9K44K58n64p6L31J74r7j85L90k23j35K59
4060A11j9n1J87k28K8k98P6J82j97k22O63k06l18K48J51j69j65J90J71m50J44
$$ y = [112, 353, -24, -406, 250, 383, -397, -147, 422, -143, -476, 7, -202, -35, -104, -2, 104, -504, 213, 96, -133, -126, 207, -73, -176, 158, 479, -55, 32, 58, 319, -129, -52, 426, 256, 165, 131, 321, 172, 156, 299, 228, 12, 46, 71, 144, -97, 351, 227, -88, -32, -101, 64, -68, 131, 99, -195, -186, 76, 129, -153, 113, 341, -53, -164, 69, 140, -23, -125, 148, 61, -487, 94, 136, 18, -149, 47, 103, -369, -124, 448, 109, -158, 300, 220, -95, -180, 489, 6, -99, -258, 190, -243, -109, 60, -188, -447, -174, 45, -171, -90, 141, 297, -260, -81, 72, -58, -243, 248, 439, -106, -157, 61, 93, -184, -39, 250, -142, 54, 432, 145, -317, 59, 186, 72, -100, -134, 52, -140, -103, 122, 199, -160, -36, 174, -14, -161, 127, -216, -265, -21, 237, -327, -403, -72, 102, 5, -180, 210, -13, -148, 111, 92, 41, 228, 0, 28, -270, -194, -12, -209, -431, 232, 26, -292, -44, 107, -62, -227, -37, 134, -316, -172]
4081a72L29j52j41J24K19j73j03J02J55l69K01K27l15k13K81K43k88J34L1jj06
4102A3N7R9j76k7M3K69l42J36L81o52J39J20J25l74j67M60r4o1M9j88L4J18J23
4125H5L9k50K35%k37j05M78k22k05Q7L13j84k29M65J58m58j71K20K09k31m1L40
4147B96m24K64o4q5O4Qj26K03l76L54J75m27L55m25L75l17j02K91k35j00M10L11
4169D25m96J15M1O2k79J72l7j49R6J85j07j32M8J81j26R0j85R8j34j70L55Q4l36
4192a99K41J64k35q3K19J2l77K64j52L0k01L70J66l32oJ85J29m07J96J39k19K8
4214f8M74k59l57L16j86K21l56L69j01k64P1M51j83m71L37J92m21K45J73r3M5
4235A35j15p6J34j89K21n2j90M6J71k7l36K80J52k13P7J65j75k17J3L74j87j93
$$ y = [-172, 157, 5, -136, -12, 207, 34, -69, 33, 188, -181, 20, 247, -68, -281, 0, 243, -45, 89, 120, 119, 13, 70, 169, -7, -34, 9, 278, -64, 72, 453, -199, -60, 60, 185, -189, -356, 104, 10, -51, -2, -190, -156, -38, 85, 124, -126, 109, 109, -128, -233, 245, 23, -182, -95, 218, 34, -195, 270, 428, -30, -201, 19, 228, -3, -44, 296, -128, 136, 72, -13, 51, 59, -67, 136, -240, 114, 289, -138, 217, -208, 167, -150, -252, 39, -196, -296, 114, 425, -71, 44, 85, 147, -132, 40, 3, -146, -50, 135, 28, -104, -56, 125, -1, 89, -96, 2, -132, -302, 53, 137, -199, 42, 206, -29, -112, 107, 119, -258, 6, -146, -116, -317, 53, 219, -113, -119, 66, 195, -212, -16, 123, -96, -68, 406, 147, -210, 106, -80, 141, -215, 154, 53, -211, -140, 311, 128, -343, -6, 186, -235, 10, 183, 90, 135, 20, -56, 78, -111, 110, 58, -132, -86, 85, 58, -278, 2, 154, -59, 18, 183, 8, -209, -196, 178, -9, -202]
4257b02K21j8k95K85Q2j54jL69j95l7k6r8J22k77L48o6j50m1K70qk09N3K48j62
4281E9l27N81q8m15J17J64j68m9L32j3j69j25J79r2M0MJ21k05k05N00k45j26N9
4304g1J91l73L5L19J75l44j3K96j51k02K22l3J92l78K40Q9k50j44J46J70k99K23
4326D0j08J44k13O5K60l38J63J29p6k34J96j31Pq9L26n1n78O05M0m32J88K06Q9
4349B08k24R0j35J09j33K00M6k80J76J1j56o3M3J48m1j81L38q6j24O5P9j30k60
4372c00K21L38k72j18J10k0m1J25N1l04J27K94j83k29L10J38j75k35K19J34k28
4393c8R9J93j21m12K37o7J62P8l3j53k80L41K1r1r3J05J60j77R6J22j73j78M25
4416B23L2n23K23K73l68k11M96k9j16m4M3K85l74O0M16l80j42J57k1j71J20l8
$$ y = [-202, 19, 1, -294, -9, 73, -81, -82, 287, 92, 55, 29, -69, 53, -224, 124, 58, -92, -133, 137, 129, -80, -27, 221, 59, -268, 313, 225, -190, -73, 91, -77, -126, 206, 193, 24, -101, 78, -14, 26, 30, 151, -54, -259, 241, -4, -130, -71, 120, -253, -218, 101, 276, -68, -81, 215, 64, -138, 84, 51, 243, -135, 105, 194, -56, -200, -54, 116, -183, 40, -68, 76, -137, -72, 188, -150, 13, 142, 66, -168, 28, -103, -96, -185, 141, 90, -488, 117, 157, -275, -87, 119, 208, -16, 74, -61, 48, -85, 115, 161, -119, 57, 68, -88, -151, -108, 40, -1, -182, 156, 70, -54, 11, 90, -40, -300, -79, 259, -13, -131, -21, -41, -82, 43, 94, -210, -83, 211, 28, -201, 109, 247, 72, -163, 56, 190, -38, 61, 254, 133, -279, -42, -109, 53, 131, 98, -55, -335, 6, 27, -64, -157, -52, 108, -69, 27, 149, -24, -202, 223, 255, -268, -45, 228, -140, -351, 145, 116, 0, -44, -1, 284, -90, -30, 386, 6, -136, 21, 0, -171, -51, -89]
4438h9J20o5K71J55l35j40J64K2n4p0J16o1j56K15J1j61M5P5k57K32l6J54k04
4461d8j6L29j89j27n0M89k74j62j00K85k44j87N34k96K3k8K32l88M09m6j06j09
4483f9p5J78J03k88K16l3p4J0J68j98O4j55Q0l3N3J51N6l59n4M66n15L23o5L87
4507C37l60K0J62l07j2L21J0j08o9Q7j45o4K00J30j59j01J08ol8j20L56k81j62
4530b01K54O8j86n8K10j08O8L7l3r7J41J11J1k39j08L92j89k30O7K14k45J68q2
4553c5j20J48o4K08j54o8J82L5k32M0L04m28J46j13K17r5p7K87j16j51PJ33k90
4576b36K69j87R8k50L59Q0J72m20L89k41J4N6M2n4pr2K15n07J77K29J11l26k0
4599a29N31k74l11j6M08j28J2L4j11n8J9P1k18R1J22J44k49r5J65J23m55L49j10
$$ y = [-89, 31, -34, 237, 392, 57, -83, 81, 103, 49, -21, 95, 34, -122, 93, 104, -57, -12, 63, -194, 38, 2, 156, -48, -64, 265, 76, -51, -101, 388, 114, -48, -148, 137, -107, -294, 240, -56, -33, -61, 171, -217, 192, 146, 40, -69, -144, 34, 137, -151, 65, 32, -42, -32, 136, -62, 2, -153, -73, -106, -53, 98, 154, -205, -259, 207, -308, 15, -50, 337, -23, -3, 159, -148, -160, 161, 171, 63, -6, 81, -64, -128, 72, 202, 43, -58, 50, 44, 6, -114, 242, -39, -201, 53, 121, -65, -123, 87, -21, 47, 84, 51, -46, 95, 206, 217, -22, -130, 262, 73, -157, -90, 124, -121, 47, -35, -155, -7, -71, 137, -17, -85, 97, 132, -100, -60, 244, -184, -38, -151, 66, -29, -106, 181, 65, -86, -79, 54, -236, 33, -154, -56, -306, 53, 133, 305, -115, 274, 33, 47, 103, 145, 91, 84, -8, 207, -300, -123, 106, 217, -109, -129, 402, 128, -183, -199, 209, 81, 93, 127, 16, -42, -23, 48, -170, -79, 43, 187, -62, -157, 8, 131, -324, 25, -85]
4622h5m3Q7NO9n5P5k0R7j84N8l2K20m21M40l64K17j63K3j39J46M2J87k10r4L69
4647B25m49L51mk4M9L8O9L5k40l17L47j07J94j50j36nR1J86r8l7K7N5k62J82o3
4672d3J73j04J73k78k29K71L5%j90L34r3L6M5j82n0J09q8K57k30O3r9K34j76o3
4696i5J83l2J92k28j0J02J2j91J46k85J04J55R2j55l3J97l98K52r7K13k59J78
4718D3K93n55L00j68K84k24Nk5r7J06L18k42k25K48k4o4k79K22K47k82lJ18J66
4741A62k06j1p5Q9p7J13J40n12N91k58j87%L15o4Rn5j19J43k18N09j45p6l77L58
4765D9o0K4J32k24n4O7J12j14k13J26K46j01j05m7L00k79M6J22J70n32N09m33
4787b59N07o21N53ro11N75j82K25m05J52j1J99k45J25J25l04K94m34L62j44L19
$$ y = [-85, -128, -41, -36, 33, -22, 53, 33, 130, -54, 4, -28, 192, -229, 211, -153, 64, -99, -76, -215, -69, -27, 160, -50, -144, 225, -224, 127, 123, 99, 148, 186, 255, 290, 50, -267, 80, -27, 167, 17, -119, -124, -33, 153, 55, 18, 45, 100, -162, 20, -43, 130, 26, 199, -79, -308, -37, -2, -2, -192, 142, 49, 85, 130, -52, -102, 7, -81, 176, -54, 9, -90, 144, -32, -95, 88, 56, 248, 20, 10, 112, 124, -67, 79, -206, -102, 53, 145, -10, -43, 154, -244, 8, -89, 124, -135, 43, 336, -219, 81, -87, 197, -27, -22, -47, -144, -38, 280, 38, -187, 61, 37, -27, -306, -84, 163, -119, -122, -4, 162, -44, -55, -130, -41, -118, -5, 135, -377, 214, -44, -231, -231, 84, 20, 29, -26, -145, -2, -220, 289, 144, 68, -309, 49, -11, 13, 145, -79, -133, -66, 46, -68, -281, -155, 91, -10, -115, -162, 138, -141, -95, 27, 197, -335, 174, -259, 248, -373, 180, 171, -440, 135, -47, 178, -227, -75, -86, 113, -132, -7, 118, -186, 108, -326, 36, -108, 211]
4808B11r6j5j46O3O6r4l6Q8r2J18J04m5j60J20K0j26j72N04l80j89M59j02k38
4831a38L5K94j63k27k4L89j6k30JL59m24J7M2J1J28N2k42O4j13J64J97k76r1K46
4855E5J05l96K32N5N4l47K61K25l28k69L41j17j06J27k3L6p2Q8J82J9R9j88k6
4878GQ2j75J27j12j56L12k2n5q6m1N9J18l5j10K19j15r1j09J84j09J75j99j45
4901b77J24L04k86L52j80j29o5kK67j88J20Ok0k11J51L1j65K60K56n42K3K80r8
4924A1M9k06K41k09N4mP6k85L71J32o3l60J58j1r5M1J88p1p2Q6J67k71K2K40j58
4949C1k04K82k48K53k05J40j4j02J5n4q6L9J39J28j58j69L04L5l45N8M60m47J52
4972Dk8J44n30M29L26l72m9p8L05k75J25J92l39j36J29J21M8mR6rJ3mP0l3j89
$$ y = [211, 115, 100, -46, 17, 83, -11, -47, 41, -51, 67, 171, 126, -34, 86, 106, -20, -192, 312, -68, -257, 202, 100, -138, -103, 191, 28, -199, -223, 166, 150, -80, -79, 280, -144, -127, -85, -74, 54, 106, -136, -72, -185, -21, 176, -100, -191, 55, 160, -236, -4, 51, 105, -242, 19, 244, -84, -353, -12, -129, -235, -108, -131, -95, -167, -79, 103, 122, 221, 33, 7, 89, -86, 41, -71, -227, 85, 63, 8, -78, -119, -60, 58, 23, -87, 132, 17, -74, -183, 1, -108, 67, -132, -277, -153, 151, -135, 217, 37, -92, -157, -159, 108, -80, 40, 46, 26, -185, -34, -3, -168, 92, 348, -194, -171, 109, 11, 60, -146, 95, -114, -60, -64, 12, -273, 98, 230, 167, -193, -35, -46, -141, -100, 88, 17, -55, 31, 198, -73, -51, 189, 31, -173, 109, -139, 114, -91, 49, 35, -67, -52, -106, -192, -153, -14, 114, -44, -213, 91, 126, -219, -161, 299, -148, 4, -24, 120, -410, 19, 345, -27, -76, -154, 151, -124, 1, 193, -146, -282, -153, -32, 16, 12, 108, 99, 112, 108, 178, 145, -44]
4997d4P8k8J41j39j11J0J1j56K62J88m60L29L05l71j05J65k2o6J58k36K43j58
5019fO4J46k64k9L10l10K82k96J29K31l29J00k81K44j42L86j82K7LK3k65j13L42
5042G0J78n38J46J09K12k20j97J91L0l8J32j16j09L30j59j31J59j85K07j08l4
5063g1J76omj35J75j29N6J12j57m4qp8J66k07K40k14K60L6j26j30k3m0j3L14k85
5088a35J18p5K92p5p9j45q2J15Q3J28j78J17r8Q9L61n66J14r1K34l23M27n2k5
5111A54j86k30K36k28L80R3J11n45J59K66k72L4RL1p3OM3j70J52J17K5p5k3j65
$$ y = [-44, 34, 6, 147, 8, -103, -93, -82, -238, 24, 212, -248, 81, 386, 15, -90, 75, 53, -13, 145, -91, 152, -6, 58, 204, -60, -89, 221, -89, 193, -103, 26, 257, -72, 28, -253, -9, -151, 235, 53, 80, 83, 106, -159, -272, 70, 248, -290, -144, -35, 177, -43, -240, -49, -19, -57, 75, -41, -150, 180, 21, -110, 49, -136, 71, -37, -71, 105, 99, 95, -40, 135, 6, 62, 174, 17, -27, -35, -113, 53, -154, 86, -128, 132, 168, 42, -88, -111, -151, -164, 150, -135, -17, -92, 200, 125, 46, -99, -181, -66, 17, 145, -33, 84, -14, 75, 436, -130, -16, -107, 127, -196, 231, 179, 154, -32, -262, -26, -254, 126, 219, 330, -215, -56, 210, -62, -28, -19, 12, -61, -55, -12, -182, -30, 87, 112, 37, 14, -151]
$$ [...]
8191B9
##END NTUPLES=NMR FID
##END=
