##TITLE=1H_CA-8786
 CDcl3, 8 sc, 
 22.10.2020
##JCAMPDX= 6.0         $$ Bruker NMR JCAMP-DX V2.0
##DATA TYPE= NMR FID
##DATA CLASS= NTUPLES
##ORIGIN= UXNMR, Bruker Analytische Messtechnik GmbH
##OWNER= root
$$ XWIN-NMR		Version 3.5
$$ Thu Oct 22 12:04:34 2020 Russian Standard Time (UT+4h)  she@DPX200
##.OBSERVE FREQUENCY= 200.1315066352
##.OBSERVE NUCLEUS= ^1H
##.DELAY= (6, 6)
##.ACQUISITION MODE= SIMULTANEOUS
##.ACQUISITION SCHEME= undefined
##.AVERAGES= 8
##.DIGITISER RES= 18
##SPECTROMETER/DATA SYSTEM= spect
##.PULSE SEQUENCE= zg30
##.SOLVENT NAME= D2O
##.SHIFT REFERENCE= (INTERNAL, D2O, 0, 15.7039)
##AUDIT TRAIL= $$ (NUMBER, WHEN, WHO, WHERE, WHAT)
$$ ##TITLE= Audit trail, XWIN-NMR		Version 3.5
$$ ##JCAMPDX= 5.01
$$ ##ORIGIN= Bruker BioSpin GmbH
$$ ##OWNER= she
$$ F:/spectra/data/she/nmr/H-F/1/audita.txt
$$ ##AUDIT TRAIL=  $$ (NUMBER, WHEN, WHO, WHERE, WHAT)
(   1,<2020-10-22 12:03:34.01 +0400>,<she>,<DPX200>,
      <created by zg, POWCHK disabled, PULCHK disabled
       configuration hash MD5:
       00 E9 B6 7A A2 85 ED C7 34 08 36 98 17 FE 4E 26
       data hash MD5: 16K
       26 0F 80 23 87 FD A9 73 4D D7 22 DC 05 C6 C1 4C>)
$$ ##END=
$$ 
$$ hash MD5
$$ C3 74 9C 36 52 70 00 10 80 81 BB 96 8B BB 2E 0D
##$RELAX= 
##$RELAX= 
##$RELAX= 
##$RELAX= 
##$RELAX= 
##$RELAX= 
$$ Bruker specific parameters
$$ --------------------------
##$DU= <F:/spectra>
##$EXPNO= 1
##$NAME= <H-F>
##$PROCNO= 1
##$TYPE= <nmr>
##$USER= <she>
##$AMP= (0..31)
100 100 100 100 100 100 100 100 100 100 100 100 100 100 100 100 100 100 
100 100 100 100 100 100 100 100 100 100 100 100 100 100 
##$AQSEQ= 0
##$AQ_mod= 1
##$AUNM= <au_zg>
##$AUTOPOS= <>
##$BF1= 200.13
##$BF2= 200.13
##$BF3= 200.13
##$BF4= 200.13
##$BF5= 200.13
##$BF6= 200.13
##$BF7= 200.13
##$BF8= 200.13
##$BYTORDA= 1
##$CFDGTYP= 0
##$CFRGTYP= 5
##$CHEMSTR= <none>
##$CNST= (0..31)
1 1 145 1 1 1 1 1 1 1 1 1 1 1 1 1 1 1 1 1 1 1 1 1 1 1 1 1 1 1 1 1 
##$CPDPRG= <>
##$CPDPRG1= <>
##$CPDPRG2= <>
##$CPDPRG3= <>
##$CPDPRG4= <mlev>
##$CPDPRG5= <mlev>
##$CPDPRG6= <mlev>
##$CPDPRG7= <mlev>
##$CPDPRG8= <mlev>
##$CPDPRGB= <>
##$CPDPRGT= <>
##$D= (0..31)
0 1.2 0 0 0 0 0 0 0 0.06 0 0.03 0 0 0 0 0.0002 0 0 0 0 0 0 0 0 0 0 0 0 
0 0 0 
##$DATE= 1603353813
##$DBL= (0..7)
120 120 120 120 120 120 120 120 
##$DBP= (0..7)
150 150 150 150 150 150 150 150 
##$DBP07= 0
##$DBPNAM0= <>
##$DBPNAM1= <>
##$DBPNAM2= <>
##$DBPNAM3= <>
##$DBPNAM4= <>
##$DBPNAM5= <>
##$DBPNAM6= <>
##$DBPNAM7= <>
##$DBPOAL= (0..7)
0.5 0.5 0.5 0.5 0.5 0.5 0.5 0.5 
##$DBPOFFS= (0..7)
0 0 0 0 0 0 0 0 
##$DE= 6
##$DECBNUC= <off>
##$DECIM= 32
##$DECNUC= <off>
##$DECSTAT= 4
##$DIGMOD= 1
##$DIGTYP= 9
##$DL= (0..7)
0 120 120 120 120 120 120 120 
##$DP= (0..7)
150 150 150 150 150 150 150 150 
##$DP07= 0
##$DPNAME0= <>
##$DPNAME1= <>
##$DPNAME2= <>
##$DPNAME3= <>
##$DPNAME4= <>
##$DPNAME5= <>
##$DPNAME6= <>
##$DPNAME7= <>
##$DPOAL= (0..7)
0.5 0.5 0.5 0.5 0.5 0.5 0.5 0.5 
##$DPOFFS= (0..7)
0 0 0 0 0 0 0 0 
##$DQDMODE= 0
##$DR= 18
##$DS= 0
##$DSLIST= <SSSSSSSSSSSSSSS>
$$ [...]
##$SUBNAM2= <"">
##$SUBNAM3= <"">
##$SUBNAM4= <"">
##$SUBNAM5= <"">
##$SUBNAM6= <"">
##$SUBNAM7= <"">
##$SUBNAM8= <"">
##$SUBNAM9= <"">
##$SW= 16.880792210976
##$SWIBOX= (0..15)
0 0 2 0 0 0 0 0 0 0 0 0 0 0 0 0 
##$SW_h= 3378.37837837838
##$TD= 16384
##$TD0= 1
##$TE= 0
##$TE2= 300
##$TE3= 300
##$TEG= 300
##$TL= (0..7)
0 120 120 120 120 120 120 120 
##$TP= (0..7)
150 150 150 150 150 150 150 150 
##$TP07= 0
##$TPNAME0= <>
##$TPNAME1= <>
##$TPNAME2= <>
##$TPNAME3= <>
##$TPNAME4= <>
##$TPNAME5= <>
##$TPNAME6= <>
##$TPNAME7= <>
##$TPOAL= (0..7)
0.5 0.5 0.5 0.5 0.5 0.5 0.5 0.5 
##$TPOFFS= (0..7)
0 0 0 0 0 0 0 0 
##$TUNHIN= 0
##$TUNHOUT= 0
##$TUNXOUT= 0
##$USERA1= <user>
##$USERA2= <user>
##$USERA3= <user>
##$USERA4= <user>
##$USERA5= <user>
##$V9= 5
##$VALIST= <valist>
##$VCLIST= <CCCCCCCCCCCCCCC>
##$VD= 0
##$VDLIST= <DDDDDDDDDDDDDDD>
##$VPLIST= <PPPPPPPPPPPPPPP>
##$VTLIST= <TTTTTTTTTTTTTTT>
##$WBST= 1024
##$WBSW= 4
##$XGAIN= (0..3)
0 0 0 0 
##$XL= 0
##$YL= 0
##$YMAX_a= 180177
##$YMIN_a= -176127
##$ZGOPTNS= <>
##$ZL1= 120
##$ZL2= 120
##$ZL3= 120
##$ZL4= 120
##$ABSF1= 10
##$ABSF2= 0
##$ABSG= 5
##$ABSL= 3
##$ALPHA= 0
##$AQORDER= 0
##$ASSFAC= 0
##$ASSFACI= 0
##$ASSFACX= 0
##$ASSWID= 0
##$AUNMP= <proc_1d>
##$AZFE= 0.1
##$AZFW= 0.1
##$BCFW= 1
##$BC_mod= 2
##$BYTORDP= 1
##$COROFFS= 0
##$CY= 11.3945322036743
##$DATMOD= 1
##$DC= 2
##$DFILT= <>
##$DTYPP= 0
##$F1P= 16.9975609425685
##$F2P= -3.02152046262296
##$FCOR= 0.5
##$FTSIZE= 0
##$FT_mod= 4
##$GAMMA= 1
##$GB= 0.15
##$INTBC= 1
##$INTSCL= 1
##$ISEN= 128
##$LB= 0.24
##$LEV0= 0
##$LPBIN= 0
##$MAXI= 10000
##$MC2= 0
##$MEAN= 0
##$ME_mod= 0
##$MI= 1.114404
##$NCOEF= 0
##$NC_proc= 0
##$NLEV= 6
##$NOISF1= 3.799351
##$NOISF2= 2.8
##$NSP= 1
##$NTH_PI= 0
##$NZP= 0
##$OFFSET= 15.70392
##$PC= 1
##$PHC0= -10691.1
##$PHC1= 17.20089
##$PH_mod= 1
##$PKNL= yes
##$PPARMOD= 0
##$PSCAL= 0
##$PSIGN= 0
##$REVERSE= no
##$SF= 200.130013532006
##$SI= 16384
##$SIGF1= 3
##$SIGF2= 2
##$SINO= 400
##$SIOLD= 16384
##$SREGLST= <1H.CDCl3>
##$SSB= 0
##$STSI= 0
##$STSR= 0
##$SW_p= 3612.71676300578
##$SYMM= 0
##$S_DEV= 0
##$TDeff= 0
##$TDoff= 0
##$TI= <>
##$TILT= no
##$TM1= 0
##$TM2= 0
##$TOPLEV= 0
##$USERP1= <user>
##$USERP2= <user>
##$USERP3= <user>
##$USERP4= <user>
##$USERP5= <user>
##$WDW= 1
##$XDIM= 8192
##$YMAX_p= 0
##$YMIN_p= 0
$$ End of Bruker specific parameters
$$ ---------------------------------
##NTUPLES= NMR FID
##VAR_NAME=  TIME,          FID/REAL,        FID/IMAG
##SYMBOL=    X,             R,               I
##VAR_TYPE=  INDEPENDENT,   DEPENDENT,       DEPENDENT
##VAR_FORM=  AFFN,          ASDF,            ASDF
##VAR_DIM=   8192,          8192,            8192
##UNITS=     SECONDS,       ARBITRARY UNITS, ARBITRARY UNITS
##FACTOR=    0.000296,      1,               1
##FIRST=     0,             0,               0
##LAST=      2.424536,      0,               0
##MIN=       0,             -176127,         0
##MAX=       2.424536,      180177,          0
$$ Real data points
##PAGE= N=1
##DATA TABLE= (X++(R..R)), XYDATA
0 0 0 0 0 0 0 0 0 0 0 0 0 0 0 0 8 -8 8 -8 8 -16 16 -16 24 -24 32 -39 43 -48 56 -67 77 -88 100 -115 128 -147
36 -147 164 -185 205 -231 257 -287 318 -351 390 -431 476 -524 579 -638 702 -773 853 -940
54 -940 1039 -1147 1271 -1411 1571 -1759 1981 -2250 2578 -2997 3548 -4312 5460 -7401 11643
69 11643 -45978 44082 -45113 -176127 -35964 -18500 -96190 -41913 -49884 -107172 31475 3076
81 3076 -128379 -25992 115963 -57792 -76514 91220 41964 -13731 51105 41248 24865 122989
93 122989 41670 -22645 139305 133113 -20211 42670 170234 45387 22290 96660 55183
104 55183 56859 90412 3818 -258 135558 21859 -74838 64295 84334 -54397 -28429 51261
116 51261 -23573 -5284 2303 -59669 -2759 60165 -69845 -79463 86393 6841 -86175 13841
128 13841 54463 -22382 11023 27634 -13891 71296 59567 -35084 37471 140501 12875 -17278
140 -17278 120296 81120 18598 66777 73212 40879 100243 50370 -9035 102520 98136 -27450
152 -27450 11624 116923 12082 -26411 46516 15664 -3350 22382 -27610 -44060 56117
163 56117 -18584 -102600 8671 34777 -80855 -64344 20895 -42048 -42629 -17615 -57216 -24956
175 -24956 26061 -59480 -77842 56616 2584 -84300 -63 44664 -29343 -14028 20847 -19512
187 -19512 30656 30478 -41502 3728 85288 -12557 -52090 65860 36983 -31959 7925 28587
199 28587 -10352 23941 3205 -49464 32194 36789 -63450 -36598 60014 -21658 -66023 10319
211 10319 -4962 -32990 -8826 -28451 -47547 29140 -14186 -86351 5725 37967 -59045 -50806
223 -50806 36185 -15112 -31691 3560 -21176 -7439 32499 -24611 -48398 59233 21710 -60497
235 -60497 9214 54068 -16791 -15964 29416 -7265 16872 24711 -30259 -2074 63348 -11088 -52855
248 -52855 49984 31438 -38168 -2662 28630 -11055 7027 7353 -35694 24118 33983 -46158
260 -46158 -26406 59982 -5610 -53239 22568 16929 -19541 386 -1321 -23018 31803 6336
272 6336 -57312 16950 47244 -38344 -37231 45713 480 -29153 9864 -5513 -6114 22534 -15093
285 -15093 -41053 44285 18379 -58066 1889 45793 -20406 -27534 24940 -6273 989 14743
297 14743 -24595 -6443 46828 -9049 -49159 42285 31145 -37169 -3853 33485 -5820 -288
309 -288 13787 -22091 20257 31690 -33173 -19416 55364 561 -48685 23820 22596 -20630 -4674
322 -4674 5790 -17915 18331 5890 -48613 11059 38425 -35553 -37763 39889 1476 -34997
334 -34997 7490 1405 -8248 13655 -6970 -31522 36615 21186 -46563 6034 48677 -11321
346 -11321 -23408 32988 7733 1028 19373 -7807 1587 42776 1212 -37555 39844 33270 -33764
359 -33764 -4979 33807 -6037 -12372 9802 -20187 4405 16117 -36385 -29067 33406 -11136
371 -11136 -60740 5926 9322 -37350 -23825 -4533 -27659 -5798 -6637 -51246 -4436 22557 -39029
384 -39029 -42906 29484 -563 -41326 3605 5856 -10183 6647 -527 -22598 29631 22421 -37037
397 -37037 7243 47524 -7016 -22944 33549 12602 -5299 15081 -2729 -1435 29230 -1088
409 -1088 -37409 27060 23927 -39752 -14564 25215 -12945 -26906 2462 -20944 -9267 4271
421 4271 -35318 -30747 22506 -11312 -57837 5025 13129 -33810 -20335 6563 -14403 -3353 5671
434 5671 -29108 6648 32354 -17966 -22642 43292 19391 -23581 21092 28468 6340 17807 20005
447 20005 -271 36691 35016 -17303 18532 54885 5904 -13070 41518 24580 -1784 19871
459 19871 10440 5747 28322 8759 -23698 29715 31302 -27056 -4341 35622 1289 -17034 17392
472 17392 1225 2234 17939 -10256 -8954 35317 11000 -32421 23556 34445 -12689 -1879
484 -1879 28600 7707 7159 22101 -6615 15874 37708 -4619 -12949 43141 22771 -23526 17391
497 17391 26866 -935 4426 12266 -7104 15323 17886 -27417 91 31984 -11432 -31888 19834
510 19834 8134 -24334 -1398 -3157 -11651 4533 -5451 -32759 10395 16288 -36013 -15746 23439
523 23439 -6675 -28213 8891 -1813 -9040 6863 -12340 -14328 20703 3466 -36905 10858
535 10858 23511 -23242 -15412 15715 -4411 -13573 4743 -17874 -6221 13563 -20977 -30711 16497
548 16497 1907 -43717 -5865 7338 -22586 -20330 -5644 -21419 -9010 -813 -37085 -15625
560 -15625 14840 -20701 -39972 9415 3723 -31249 -6457 -502 -11201 46 -1419 -23336 9915
573 9915 19490 -26044 -8820 28841 1658 -21852 15712 10205 -4977 10761 -1370 -5835 20460
586 20460 9752 -27048 12490 26587 -18143 -12563 19273 987 -14013 7051 -8768 -4863
598 -4863 12820 -13140 -22846 17099 7805 -34682 -37 16262 -13964 -13199 6299 -6330 -2520
611 -2520 9744 -18271 -2944 24393 -4722 -22537 21442 19053 -17278 6030 16637 2532
623 2532 7904 11866 -6332 16175 26905 -13303 -143 33662 8841 -16046 19508 17238 -4162
636 -4162 10294 4936 -2333 16251 10196 -21781 9996 24535 -16689 -12586 18621 2801 -16444
649 -16444 6324 -3623 -6438 9752 -9370 -18450 14019 8535 -30222 -25 17838 -12512 -13485
662 -13485 8223 -2386 -5870 7997 -13677 -4208 19186 -5384 -22099 15860 15641 -21340 411
675 411 13512 -2895 -1677 6441 -8271 5390 17409 -16337 -6406 23814 2320 -21259 12189
688 12189 13887 -10850 3395 3816 -4125 8398 7615 -18682 6064 22181 -14981 -11643 18778
701 18778 5142 -16090 7535 3112 -5105 8387 -3746 -12247 12757 11054 -24062 805 19705
714 19705 -9761 -13079 9773 1478 -8159 6633 -8780 -5232 14247 -4544 -20286 11579 13902
727 13902 -21582 -2705 13094 -4338 -6248 5143 -5407 571 13651 -13685 -6948 19645 2411
740 2411 -20074 10184 14907 -11483 1242 6418 -2365 4256 7627 -13521 3865 19691 -12730
753 -12730 -10856 16938 5556 -16747 5288 5663 -6813 4340 -2645 -10254 7621 8599 -22081
766 -22081 -1411 17460 -10560 -14087 8529 2491 -10905 4263 -5051 -5295 11219 -3183 -16080
779 -16080 10056 14526 -18398 -1697 15817 -2038 -5643 7782 206 434 13463 -8023 -4083
792 -4083 18787 4426 -16362 10354 16754 -10843 319 8740 -1392 1398 6700 -9950 1010
805 1010 16355 -11910 -11257 14074 4352 -18026 2832 6662 -8782 953 -1298 -8248 4240 7632
819 7632 -17688 -1733 17425 -7788 -11959 10588 6959 -9100 6216 2246 -1405 11967 2354
832 2354 -9005 11836 17807 -12236 1726 19600 1875 -3848 10431 5477 266 12708 -3222
845 -3222 -2877 16173 4349 -14559 7285 15339 -12411 -3190 7340 -2920 -4164 2756 -9669
858 -9669 -4272 10239 -13016 -13878 8792 1159 -20433 -1715 5384 -11878 -4098 -2241 -8338 -676
872 -676 4290 -15713 -4489 13956 -8440 -13161 7764 5999 -11502 2204 2728 -4357 6261 106
886 106 -9367 5689 12211 -14267 -3877 13969 -2868 -9873 4070 1623 -7285 4023 -6694
899 -6694 -8745 7128 -1707 -18130 -728 8969 -16574 -9318 3528 -6404 -9513 -1454 -9126 -7888
913 -7888 5882 -12265 -13970 6127 1303 -18339 -2208 7832 -10039 -3573 1429 -4119 -7
926 -7 6082 -9322 -2234 14908 -4352 -9119 10035 9494 -8448 3857 7658 -1783 6404 3536 -4431
941 -4431 5985 13069 -9373 -1954 15651 96 -7604 6385 6362 -4989 5182 -706 -4488 8431
955 8431 2168 -11492 2556 12675 -10417 -4985 8978 -158 -5273 3239 -537 -3275 9154 -4361
969 -4361 -7012 9952 6431 -11095 2124 13111 -4927 -637 6366 1261 1656 7813 -3054 81
983 81 15179 -893 -6147 10406 10640 -7067 3438 9956 -1142 4724 4402 -2039 4466 11116 -6873
998 -6873 -2327 14419 470 -7415 5667 7485 -5481 3459 1742 -3827 6421 2352 -8767 1699
1012 1699 11719 -9023 -5426 8767 -150 -6040 1799 734 -4419 5757 -3661 -7598 6484 3966
1026 3966 -11383 -1207 10270 -7195 -4513 3706 -1016 -2777 3107 -4028 -4129 9383 -3661 -8920
1040 -8920 5546 6563 -9777 -1068 7269 -4190 -46 1809 -3070 477 7297 -6773 -4507 11104
1054 11104 -902 -8064 3649 6587 -6509 923 2640 -3814 4089 2015 -6770 642 10181 -7321
1068 -7321 -5543 8515 567 -6246 1528 2669 -4428 4244 -1452 -6005 5473 3916 -9007 -1298
1082 -1298 10271 -5571 -4465 4725 512 -2893 2388 -1374 -3707 7875 -2103 -6864 5077 6311
1096 6311 -8062 -1562 8060 -3917 -1034 2285 -1684 -832 5287 -4758 -4891 8957 -1352 -8220
1110 -8220 2061 5713 -7228 -1556 2673 -4470 943 285 -6017 -1592 6983 -7069 -6813 6654
1124 6654 -517 -7400 13 2888 -5458 1622 -879 -5502 3625 2518 -7589 -1959 8917 -4988
1138 -4988 -4945 4678 1024 -3351 1620 623 -3455 6371 -863 -5915 4301 5814 -6643 -1904 7978
1153 7978 -3173 -2152 2172 -762 -1543 3575 -3184 -4921 7398 -1226 -7525 1651 5331 -6252
1167 -6252 -2207 3728 -3517 366 877 -4036 -1495 6239 -4612 -5691 7184 833 -5673 1009 4856
1182 4856 -3553 1542 1716 -3009 3848 3297 -4079 -781 9440 -2815 -3889 5940 2619 -2394 1746
1197 1746 2647 -2515 5288 395 -4658 3749 5074 -5101 -2540 7603 -2643 -2882 2395 74 -2135
1212 -2135 2386 -1402 -4516 5803 -574 -6476 1641 5135 -5161 -2392 4885 -2429 -222 1486
1226 1486 -1742 -1147 5634 -2441 -4834 6760 1421 -4775 896 5339 -3187 415 2509 -2603 2151
1241 2151 2188 -3671 -2005 6804 -3085 -5541 3884 721 -4469 -1086 1302 -4655 1106 -1234 -6080
1256 -6080 580 1900 -6252 -4779 4895 -3992 -5204 388 -1191 -3625 -35 -1475 -5145 4060 -678
1271 -678 -5809 1009 4543 -4060 -2439 5228 -1319 -370 2088 43 -243 4952 -219 -3245 6989
1286 6989 2587 -3158 1834 6092 -1640 84 3823 -1218 2281 2849 -1553 -1129 6471 -1029 -4115
1301 -4115 4586 1896 -3047 103 3136 -2218 1626 1388 -3121 2146 3647 -2533 -2097 6749 -655
1316 -655 -2538 3657 2471 -475 2321 2855 -1394 5838 3063 -1968 3535 6759 -595 -491 7199 1137
1332 1137 891 3619 2187 881 4411 1496 -2325 5912 2307 -2992 991 5196 -2108 -1548 3035
1347 3035 -1981 139 755 -1938 -2618 3487 -1717 -5464 2602 510 -4168 -1794 2117 -3182 -544
1362 -544 881 -3251 693 1728 -2468 -2713 5267 -603 -3291 3098 1891 -1358 911 2479 -1866
1377 -1866 3466 1845 -2882 1840 4204 -1766 -2534 4869 -908 -1830 1079 116 -1763 775 -762 -4635
1393 -4635 2217 -290 -5300 -1912 1847 -3994 -4506 754 -3593 -2537 -1449 -3177 -4036 743 -2545
1408 -2545 -6110 1065 -322 -4447 -2286 1787 -3036 -1612 1089 -2847 213 1492 -1495 -2173 4243
1423 4243 -58 -2990 2789 2106 -951 -15 2945 -1393 1868 1794 -2442 1127 3221 -1445 -2767 4223
1439 4223 -290 -2397 957 346 -1617 54 309 -3880 1605 304 -4006 -1321 2076 -2560 -3792
1454 -3792 1929 -2082 -1740 -204 -1426 -2556 1258 -486 -4292 1809 876 -2983 -1393 2600 -1738
1469 -1738 -1327 1918 -1685 162 1017 -953 -1873 3049 48 -3353 1810 1135 -1689 -1043 1944 -2135
1485 -2135 271 1146 -2576 -75 1550 -1558 -3250 2723 -823 -3086 546 138 -1698 -808 608 -3128
1501 -3128 1056 362 -3133 -777 2103 -1460 -3295 2213 -819 -1160 313 -89 -1137 1369 1005 -2812
1517 -2812 2271 1685 -1398 -207 3376 -120 -545 3027 -55 1107 2341 1020 -478 3945 2093
1532 2093 -1374 3311 2950 338 714 3956 466 1568 3294 56 2007 3318 1042 -584 4383
1547 4383 1752 -837 2664 2301 601 717 2746 -978 1914 2009 -1367 577 2692 -51 -1982 3011
1563 3011 338 -845 924 581 -575 931 1406 -2403 1926 1606 -1503 -283 2721 75 -1321 2685
1579 2685 -117 506 1658 792 -387 2529 1827 -1734 2505 2303 -71 84 2966 34 431 2502
1595 2502 -494 859 1748 318 -1564 2223 432 -2412 733 252 -1193 -1453 670 -2461 -852 -432
1611 -432 -3209 -2155 -112 -2058 -4204 20 -1856 -3520 -1442 -1605 -2466 -1804 -681 -3493 -360 -29
1627 -29 -2795 -1580 748 -1011 -2467 1332 -836 -492 264 271 -1012 1342 1389 -1942 1717 1663 -551 -514
1645 -514 1975 -186 -726 1765 -777 -84 974 -271 -1715 1028 332 -2571 325 176 -1128 -1438
1661 -1438 668 -1861 -998 447 -1899 -635 505 -305 -2404 1219 244 -1556 532 592 -68 245 1884
1678 1884 -1033 1494 1996 -80 667 2756 1621 -596 3061 1395 939 1931 1582 783 1922 2490 -957
1695 -957 1934 1809 -213 -220 1799 49 -1276 1572 -1179 -606 -68 -528 -2256 -99 -332 -3254 -615
1712 -615 -758 -1785 -2131 -181 -2046 -1670 172 -2254 -1070 -282 -609 -2730 652 81 -1803 292 189
1729 189 -431 -530 1259 -1196 306 950 -723 -164 832 385 -1591 1405 12 -824 405 162 -691 -292
1747 -292 711 -2054 -24 113 -1390 -1548 102 -1003 -2209 276 -1689 -1088 -444 -570 -1853 -235
1763 -235 149 -2479 167 16 -564 -1195 558 -588 -813 799 -918 -77 506 462 -1380 953 841 -978
1781 -978 741 568 144 -280 1324 -695 59 1053 -499 80 743 525 -1351 1306 185 -517 634
1798 634 273 -85 142 1556 -902 828 1199 -31 153 1354 1029 -673 1858 576 598 1124 1271 363
1816 363 773 1971 -445 1535 1488 606 206 1581 595 -14 1723 -157 400 498 751 -587 495 744
1834 744 -1497 463 -56 -247 -1250 681 -953 -699 685 -958 -214 191 497 -1235 707 481 -430
1851 -430 756 434 241 -37 1519 -265 795 1696 271 707 1302 1488 -591 1721 488 408 951 569
1869 569 155 85 1443 -970 316 232 -371 -937 140 -231 -1581 322 -1284 -840 -911 -316 -1335 -460
1887 -460 269 -1803 -128 -249 27 -880 763 -296 -150 1355 -76 876 766 1487 115 1726 1582
1904 1582 726 1726 1456 1636 1139 2662 940 1456 2224 812 1178 1247 1346 -359 1340 409 -303 364
1922 364 190 -428 -1014 330 -1730 -675 -620 -1338 -1492 -1008 -1017 -2435 -541 -1679 -1314 -1044 -783 -1613 -1086
1941 -1086 -51 -1607 -247 -496 -246 -623 333 219 -440 960 -275 344 274 735 -541 680 825 -376
1959 -376 660 -73 318 -558 833 -781 -601 265 -1054 -820 -994 -558 -1976 -500 -1181 -1622 -930 -1289
1977 -1289 -1230 -2022 -484 -1842 -1336 -805 -1377 -1092 -815 -460 -1668 70 -878 -616 -262 -340 -262 -357 625 -775
1997 -775 396 382 109 -350 408 452 -559 944 -270 176 -47 271 -476 -54 523 -1106 22 -637 109
2016 109 -975 166 -730 -627 240 -804 28 -180 419 -632 288 253 -120 678 401 881 107 1660 252
2035 252 992 1621 923 1455 1190 1855 405 2007 1265 1331 1465 1362 1375 714 1755 273 1077 879 507
2054 507 209 694 561 -582 858 -227 5 -309 -107 -642 -711 414 -1060 -50 -684 -105 -683 56
2072 56 -59 -607 579 -432 355 -29 733 -183 465 698 3 996 255 744 -285 1227 185 271 526
2091 526 -130 267 -282 501 -575 246 -281 -445 -284 -639 -202 -1317 97 -1194 -837 -654 -933 -854 -851 -560
2111 -560 -1914 -328 -1011 -746 -944 -271 -557 -774 377 -761 243 -244 133 -187 388 399 -339 930
2129 930 168 639 173 1072 89 371 737 5 710 -35 548 -228 748 -134 -341 348 -589 -253 -699 202
2149 202 -672 -189 -369 -748 -197 -538 52 -809 386 -468 -118 124 -136 71 -30 850 -178 680 46
2168 46 615 490 707 602 125 1237 130 953 537 763 355 586 769 -85 1123 93 519 -32 455
2187 455 153 -32 477 -343 185 -367 189 -641 69 -118 -695 391 -421 165 -302 358 -312 184 376 -152
2207 -152 343 -4 504 -187 971 291 227 623 226 603 40 899 -278 614 -64 96 179 -4 206 -555
2227 -555 356 -696 -142 -460 -546 -392 -668 -455 -1164 -157 -852 -795 -724 -676 -560 -932 -367 -989 -85 -875 -319
2248 -319 -656 -239 -173 -684 236 -421 197 -327 395 -195 69 355 -316 293 -69 357 -467 575 -209 -104
2268 -104 338 -283 305 -343 342 -468 167 -171 -370 -7 -357 260 -675 187 -439 -82 7 -129 77 -149
2288 -149 636 -362 635 49 393 276 471 597 -145 834 -104 565 354 296 211 365 421 -333 567 -103 424
2309 424 -344 209 -224 -210 -173 -812 -113 -687 -311 -993 -182 -473 -908 -171 -677 -245 -748 -49 -535 61 80
2330 80 -52 474 184 815 173 1128 459 753 1037 1012 1128 830 1565 607 1425 1120 1035 904 954 998 63 1047
2352 1047 178 559 188 105 -178 -362 2 -1066 180 -721 -525 -878 -874 -931 -1147 -737 -1324 -641 -1103 -624
2372 -624 -1100 -516 -652 -881 -72 -865 -70 -333 474 -129 159 441 173 873 606 1090 377 1185 734 838
2392 838 1260 942 1049 477 1142 227 942 314 -72 379 60 262 -811 29 -509 -537 -500 -772 -802 -834 -723
2413 -723 -1411 -446 -1240 -976 -1112 -721 -836 -988 -221 -943 -305 -553 -63 -532 10 257 -366 829 -2 720
2433 720 243 706 362 395 900 106 599 255 673 -48 743 183 39 350 -200 102 -583 -33 -731 -379
2453 -379 -663 -694 -439 -929 -463 -1109 -317 -946 -817 -877 -925 -435 -538 -73 -895 11 -415 -213 -382 -56 190
2474 190 -259 295 35 570 347 401 402 526 833 25 853 179 698 95 301 509 45 543 -203 449 -162
2495 -162 277 -346 79 -320 -629 181 -392 70 -513 200 -555 -86 -82 -467 259 3 490 -206 576 201 334
2516 334 741 285 627 403 950 249 817 788 805 774 651 1096 278 1000 511 888 599 465 598 260 486
2537 486 -461 617 -66 -111 -263 -159 -305 -741 178 -803 -164 -538 -183 -545 -318 -265 -953 -95 -559 -233
2557 -233 -406 -13 -350 -98 254 -313 233 27 166 -289 596 207 166 707 69 679 200 736 48 580
2577 580 416 17 457 300 672 -218 505 187 153 15 -57 -26 -142 176 -720 22 -359 -378 -413 -402 -81 -705
2599 -705 -70 -792 -291 -620 -510 -784 -537 -416 -1064 -236 -700 -552 -797 -520 -680 -585 -248 -945 -240 -533
2619 -533 -55 -779 -113 -50 -559 102 -99 97 -195 285 -205 372 516 -24 583 374 563 -112 870 471
2639 471 396 670 364 603 413 673 -45 760 674 383 402 373 352 -56 396 -88 276 19 40 -322 -331 127 -751
2662 -751 -184 -554 -306 -668 -174 -580 -684 -52 -729 -246 -414 -119 -553 -31 276 -401 111 -172 342 96
2682 96 715 291 370 911 -50 512 584 975 179 949 495 447 693 535 387 467 696 -227 296 527 -152 -124
2704 -124 -80 106 -597 -13 -689 -541 -404 -367 -602 -801 -155 -1192 -281 -358 -505 -683 -324 -276 -574 326 -358
2725 -358 75 -81 169 -376 228 629 -6 686 259 669 77 651 91 348 588 112 141 326 362 -450 293
2746 293 -55 -480 -11 -451 -197 -545 17 -747 -527 -203 -816 -747 -753 -242 -1065 -122 -556 -416 -380 -599 -337
2767 -337 -299 355 -487 48 176 110 122 298 538 144 954 131 551 424 609 206 522 992 -164 643 523
2788 523 488 -65 345 253 -78 336 -498 57 -197 -245 -557 -364 -182 -704 -472 -600 -292 -630 -39 -623 -459
2809 -459 274 -324 -110 -103 307 -259 591 423 204 804 304 598 692 1259 183 816 1047 639 760 887 948
2830 948 222 1019 480 486 561 287 157 100 725 -331 168 49 49 -353 -198 -492 -680 -37 -741 -504 -417 -425 -790
2853 -790 -580 199 -860 -278 -244 -122 -160 6 -385 -151 555 -131 157 490 497 70 541 694 111 644 480
2874 480 361 341 1124 116 425 651 329 230 220 677 -293 500 115 -59 83 21 -148 -184 344 -858 -406
2895 -406 -246 -474 -660 -261 -294 -779 -198 -769 -435 -114 -219 -838 -273 155 -929 -171 -509 -223 -515 -23
2915 -23 -438 -568 230 -406 -349 -91 375 -642 39 202 -323 243 -137 -107 -108 491 -234 -71 337 39 -156
2936 -156 -125 709 -259 503 215 115 527 144 -133 27 802 -363 137 584 7 -61 -29 758 -260 572
2956 572 -107 27 213 240 -259 -163 585 -352 -79 -47 103 -420 -63 -161 -664 258 -396 -288 -193 111 -588 -89
2978 -89 567 -502 306 -287 210 -83 458 26 -179 747 70 0 34 452 -194 456 428 9 574 293 272
2999 272 155 766 -410 -124 633 -64 -96 179 502 -497 174 -91 -301 188 36 -408 -327 383 -582 -225
3019 -225 -62 -64 -307 161 -43 -469 468 -110 -181 -129 460 -476 -159 487 -334 -124 -23 287 -273 165 -256
3040 -256 -300 399 -344 -185 -114 248 -829 -151 188 -619 -325 -235 -481 -515 167 -712 -671 162 -376 -453 -394 79
3062 79 -914 -94 20 -638 165 -27 -45 -165 699 -386 -71 181 313 -137 287 491 -4 505 200 146 443
3083 443 508 107 74 776 -279 155 336 223 -207 75 82 -417 594 -306 -543 -138 389 -807 -67 47
3103 47 -599 -259 -328 -375 -376 296 -359 -547 627 -55 -331 -52 674 -25 436 575 139 827 685 573 286
3124 286 1322 310 498 1151 687 216 587 953 199 848 395 165 451 538 -227 -219 887 -553 -281 -148
3144 -148 -18 -504 -339 -108 -1072 83 -635 -818 -273 -82 -811 -878 171 -636 -298 -202 -137 -575 500 -234
3164 -234 -365 721 235 -168 183 969 -142 398 709 296 571 529 93 89 989 82 87 768 344 12 187
3185 187 491 -313 175 -36 -244 27 216 -496 -465 308 -655 -686 -98 -223 -772 -416 -362 -819 31 -515 -581
3206 -581 -359 87 -601 -666 496 -415 -234 -20 76 -274 226 174 -289 770 116 -188 49 689 -97 -67 434
3227 434 -104 379 290 195 -173 681 6 -340 622 117 -304 -168 383 -332 134 59 -457 154 78 -254 -465
3248 -465 715 -256 -252 377 112 -373 77 279 -462 384 -53 -276 167 433 -187 -410 748 3 -164 160
3268 160 197 -406 314 58 -575 501 -5 -544 48 472 -420 -447 526 -497 -106 -62 -196 -425 416 -243
3288 -243 -767 373 -48 -581 -186 488 -379 -182 89 -278 119 320 -122 -455 715 -50 -458 280 379 33
3308 33 44 581 -322 591 2 -216 190 380 27 -448 906 -171 -59 254 354 -44 387 394 -456 589
3328 589 211 -299 -119 522 -323 -250 462 -158 -55 120 -100 -193 253 -218 -716 449 126 -537 -270 482
3348 482 -418 -512 206 -424 76 -3 -204 -478 727 -217 -710 224 64 -275 -219 450 -475 145 -20 -661 29
3369 29 524 -278 -571 616 -81 -205 233 306 -137 159 379 -461 476 89 -315 -125 543 -413 -605 609
3389 609 -74 -174 -151 -169 -296 252 -177 -850 -77 128 -672 -548 526 -575 -554 273 -251 -69 -9 -259 -637
3410 -637 523 -171 -830 229 313 -234 -137 433 -345 99 394 -338 233 539 11 -457 858 395 -275 369
3430 369 324 28 93 574 -331 631 510 -485 -1 709 -341 -645 928 53 -352 82 182 -231 108 182
3450 182 -625 549 215 -523 -170 746 -379 -538 656 -62 227 394 126 -293 787 268 -516 631
3468 631 663 -117 115 952 217 518 849 279 427 707 286 -184 1016 413 -159 570 802 -319 113 609
3488 609 -214 389 246 -264 -2 425 -433 -751 260 -50 -247 216 67 -427 -196 7 -790 372 175
3507 175 -620 -249 593 -145 -645 458 4 -134 92 -100 -340 386 101 -846 362 235 -338 -368 630 -213
3527 -213 -292 152 -394 31 124 -366 -764 501 -74 -901 76 12 -470 -636 118 -729 -175 119 -799 -188 409
3548 409 -565 -742 656 -52 -538 -70 222 -263 -75 191 -569 228 314 -219 -181 572 -70 -578 985 158
3568 158 -26 300 150 -247 425 299 -927 407 362 -457 -535 683 -498 -570 45 -522 -148 -128 -170 -604
3588 -604 356 89 -827 170 207 -419 -427 457 -305 -9 426 -338 162 693 31 -444 731 461 -568 341
3608 341 695 119 201 546 -117 628 577 -59 288 813 202 -387 697 373 55 538 517 -205 374 151 -484
3629 -484 177 412 -566 -309 650 -68 -871 277 -94 -197 76 -314 -397 518 120 -1006 72 324 -399
3648 -399 -498 421 -241 -251 342 -457 36 315 -65 -430 640 445 -761 278 353 -179 -175 345 -278 85 395
3669 395 -455 -79 314 147 -592 575 297 -408 86 191 -190 11 265 -626 215 322 -458 -384 635 -25
3689 -25 -619 403 -153 -25 217 12 -421 320 162 -778 132 556 -453 -379 414 12 -350 308 -171 50
3709 50 327 183 -439 768 543 -806 94 388 8 -238 490 -167 103 467 -349 -71 566 115 -739 501
3729 501 387 -593 -5 365 -110 -58 264 -449 141 529 -511 -375 757 149 -613 373 199 -193 37 -8
3749 -8 -155 360 220 -934 175 700 -211 -675 506 5 -544 569 -155 -73 407 263 -383 600 537 -832
3769 -832 206 616 0 -187 303 -38 144 334 -259 5 517 58 -719 604 298 -552 -179 363 -160
3788 -160 -83 219 -390 107 665 -485 -531 638 -24 -853 235 184 -231 -33 211 -212 -41 276 -700 115
3808 115 575 -381 -473 513 118 -482 219 56 -161 319 -153 -571 211 293 -743 -86 520 -66 -503 360
3828 360 -62 -266 329 -350 -198 279 -97 -768 370 424 -731 -145 394 -133 -266 421 -611 -86 398
3847 398 -401 -354 579 164 -732 177 307 -174 20 -31 -307 27 308 -753 259 630 -442 -484 591 159
3867 159 -635 295 88 25 -5 32 -496 209 304 -617 -56 466 -329 -767 302 46 -278 61 -441 -253 186
3888 186 -11 -953 187 148 -832 -127 534 -207 -380 247 -222 -40 260 -336 -295 400 260 -839 420 451
3908 451 -181 -54 458 -62 31 419 -477 90 524 -71 -458 484 280 -787 345 154 -95 99 159 -171
3928 -171 290 471 -985 -109 426 -293 -692 386 170 -408 117 77 -169 335 39 -422 462 656 -488
3947 -488 51 580 55 -475 436 59 -103 427 -264 -133 470 263 -509 454 609 -473 98 544 49 -127
3967 -127 249 -282 -97 490 -106 -674 365 286 -665 179 296 -260 -202 209 -149 78 398 -529 -78 763
3987 763 82 -575 392 248 -213 409 162 155 616 192 -627 227 783 -608 -20 642 198 -466 234 153 -199
4008 -199 294 -511 -315 359 345 -858 252 618 -702 -339 317 -8 -443 153 -418 -137 219 -293 -527
4027 -527 328 408 -969 121 144 -385 -354 61 -160 -74 386 -460 -338 541 -342 -731 339 214 -446 378
4047 378 106 47 117 -4 -337 239 374 -773 -268 613 185 -506 120 188 -207 288 -143 -418 256 39 -634
4068 -634 100 496 -581 -366 380 77 -625 290 61 -37 489 -299 -334 496 515 -799 201 439 -200 -103
4088 -103 356 148 2 398 23 -165 580 -126 -628 368 309 -479 -59 157 -121 79 33 -330 142 395 -838
4109 -838 -83 566 -18 -646 315 84 -422 360 -124 -12 262 128 -643 134 789 -564 -178 616 141 -452
4129 -452 250 11 -13 550 -127 -157 333 410 -629 -1 535 -141 -121 321 95 -74 300 -240 -106 583 -263
4150 -263 -691 220 601 -646 -65 127 -133 -120 39 -115 0 478 -471 -146 682 14 -817 209 245 -418
4170 -418 -31 -2 -206 164 189 -568 -130 685 -548 -429 415 186 -614 142 30 -133 68 -131 -333 138
4190 138 570 -504 -13 518 -418 -422 244 -195 -221 345 -246 -253 382 -360 -772 199 515 -642 -196 471 15
4211 15 -4 179 -192 -147 373 -321 -29 703 241 -554 43 541 -239 192 98 -166 245 395 -487 250 719
4232 719 -157 -331 589 23 -269 379 337 -198 132 48 -156 384 545 -552 88 798 -324 -233 399 203
4252 203 -63 133 27 -10 565 -128 -365 314 616 -491 -41 445 -79 -167 8 76 -40 461 -252 -218 530
4273 530 253 -455 359 445 -472 58 251 -56 113 270 -342 66 501 -389 -323 512 300 -378 251 476 -384
4294 -384 114 26 -119 297 324 -360 -194 611 -383 -386 249 208 -189 152 -128 -230 281 -247 -420 292 216 -658
4316 -658 -142 469 -204 -132 131 77 -53 287 -228 -411 533 54 -529 93 334 -554 -459 149 -185 -40 88
4337 88 -225 -173 597 -604 -520 585 145 -758 185 503 -493 -106 32 -27 166 190 -478 -387 563 -342 -300 273
4359 273 371 -377 -113 182 -303 306 -167 -250 303 290 -482 89 395 -241 -180 153 108 -255 260 -31 -221 563
4381 563 0 -530 121 705 -504 -191 594 -3 -273 16 14 -296 609 -418 -478 420 100 -616 -56 246
4401 246 -331 -42 31 -112 83 263 -331 -196 544 -451 -586 85 227 -264 -9 41 -371 238 -213 -255 338
4422 338 325 -510 -186 662 -23 -351 23 265 -63 263 7 -205 303 -3 -445 116 487 -525 -45 581
4442 581 -75 -141 147 83 -57 425 -279 -204 402 28 -324 -67 470 -143 -176 94 -79 -158 229 -350 -124 642
4464 642 -328 -393 374 368 -447 -106 316 -178 193 -129 -216 120 367 -332 -83 666 -157 -376 249 336 -121 24
4486 24 40 -333 342 91 -407 153 432 -335 -252 555 -82 -142 238 -43 -188 277 -180 -379 507 -58 -546
4507 -546 -22 309 -562 -216 297 32 108 78 -255 -423 555 -337 -432 303 254 -283 -115 418 18 171 -102
4528 -102 -68 15 390 -182 -189 647 -89 -410 87 296 -79 92 142 -226 220 -80 -397 188 315 -374 -332 372
4550 372 -91 -456 -31 -19 -192 184 -153 -324 275 85 -447 -110 564 -444 -30 184 88 17 195 150 -192
4571 -192 561 -225 -446 389 380 -369 -138 352 -120 87 217 -36 128 290 -227 -128 538 -93 -352 214 459
4592 459 -210 159 208 -63 222 83 -316 185 284 -366 -190 531 -103 -149 147 195 -192 149 -114 -154 404 155
4614 155 -379 -1 386 -142 -69 322 4 7 180 -91 -173 576 -48 -296 342 152 -505 3 452 -99 -95 221
4636 221 -97 65 204 -179 -105 688 -218 -305 276 332 -301 -453 189 -51 -45 85 -345 -62 279 -424 -349 438
4658 438 56 -381 140 69 -413 -124 210 -271 380 11 -322 11 453 -221 -243 344 64 79 85 202 -43 323
4680 323 70 -438 218 139 -322 -22 402 -211 -274 200 -32 32 250 -303 -372 213 -302 -637 -14 403 -304
4701 -304 -190 281 -483 112 -45 -250 -21 234 -368 -288 398 68 -385 118 305 -245 -55 253 -91 295
4721 295 171 -375 220 580 -225 -146 393 179 -94 -14 144 133 117 -93 -246 277 142 -411 -43 470 -234
4742 -234 -299 28 -239 -110 171 -88 -405 333 -94 -417 176 237 -37 -55 222 -175 -18 -39 -208 147 280
4763 280 -108 -334 670 156 -374 181 461 -171 14 232 -91 227 181 -214 -65 413 -215 -476 458 -71
4783 -71 -116 77 45 -178 -99 -183 -347 219 -55 -443 -339 442 -149 -255 27 165 -165 47 81 -377 162 63
4805 63 -521 380 235 -166 34 306 -63 -176 140 99 1 363 -98 -156 438 245 -443 156 353 -70 29 438
4827 438 45 169 129 -258 114 408 -103 -414 504 61 -318 -7 -83 49 -74 140 -258 174 -52 -361 -263
4848 -263 545 -152 -503 50 109 -42 43 6 -199 219 31 -311 2 390 -281 -182 276 -165 -140 40 48 -113
4870 -113 242 13 -210 380 109 -295 205 514 -175 -140 294 -85 24 132 -28 37 206 72 -117 500 118
4891 118 -318 -30 297 -128 -28 210 -256 199 43 -138 -178 384 -191 -489 145 -5 -329 73 157 -72 101
4912 101 56 -460 80 290 -326 -381 356 -20 -327 258 60 -204 228 56 -315 157 185 -285 76 350 -187
4933 -187 -46 153 -85 77 167 -81 -76 110 115 -266 448 -99 -271 -79 156 32 -240 248 -264 96 145 -280
4955 -280 -123 136 -79 -445 223 -93 -166 -232 217 -73 28 45 -315 145 205 -206 34 428 47 -352 348
4976 348 160 5 -140 14 -120 339 340 -206 87 210 -3 -360 400 76 -167 130 -14 19 162 -145 -340
4997 -340 218 5 -436 103 130 -275 -394 197 -343 6 193 -153 -239 291 -60 -502 96 272 -125 -39 226
5018 226 -119 -44 123 -294 205 135 -194 31 432 65 -310 15 148 -63 48 109 -98 238 207 -337 46
5039 46 346 32 -247 362 35 -279 152 87 -161 120 -24 -154 317 -16 -313 53 79 -31 -122 62 -5 79
5061 79 135 -72 -105 283 264 -253 186 276 -104 102 408 26 -43 317 88 255 203 -51 -171 298 49 -378
5083 -378 236 -28 -82 -60 72 -137 0 134 -400 298 125 -206 -163 43 -51 -138 51 -178 -74 -33 80 -391
5105 -391 373 70 -198 122 74 -194 60 273 -32 248 324 161 -27 279 134 -216 516 411 -156 209 279
5126 279 -2 39 16 -104 84 297 -239 13 152 58 -343 223 -9 -37 -178 -128 -22 -27 -55 -205 -71 -82 -251
5149 -251 -423 244 76 -315 67 197 -15 -118 129 -105 61 191 -356 53 34 107 -131 242 1 -89 275
5170 275 -145 97 240 166 -274 142 138 -243 -187 259 121 -266 219 -190 79 -23 3 -143 220 -72 -322 266
5192 266 15 -85 -115 90 -74 -74 -21 -195 73 167 -112 -252 316 30 -214 37 -22 5 -88 30 -55 -38 48 -324
5216 -324 -12 269 -20 -284 230 -64 -46 -12 -47 75 -68 22 -401 168 196 -217 185 114 21 -176 207 -116
5238 -116 228 3 39 -250 -36 -40 -126 83 206 18 -114 -89 -57 -2 127 100 -1 261 -278 -345 73 117 -370
5261 -370 59 225 -302 -11 57 -89 126 -6 -171 -57 379 92 -270 214 75 -175 57 116 -46 17 59
5282 59 -279 2 229 -265 -134 -33 2 -241 120 103 22 59 -108 -71 169 143 -310 77 190 -174 -306 124
5304 124 -96 21 -43 -218 29 159 -179 -111 175 -95 -129 198 141 -163 -238 114 -123 11 338 -201 -40 202
5326 202 132 73 314 318 -125 63 290 -25 42 27 -260 163 -5 -163 -4 141 1 -85 73 -97 -136 60 -79
5349 -79 -163 193 -48 -388 -32 258 -386 -26 96 8 -187 106 30 146 106 142 -25 317 139 -104 320 225
5371 225 -31 186 40 -13 -107 143 -71 -32 133 129 -213 218 107 -262 79 83 -158 -127 -9 -235 -59 -78 -291
5394 -291 -123 32 -66 -360 -20 110 -242 41 -249 -204 170 26 -239 41 -12 -35 11 136 178 70 -90 -78
5416 -78 -38 154 117 -15 267 137 -204 55 268 184 -2 288 -1 -104 256 52 132 216 25 -319 165 172 -225
5439 -225 -105 55 -341 -210 165 -53 -133 283 -317 -222 -8 -43 -202 83 178 -214 73 -122 190 -172 410
5460 410 -104 7 258 -12 -25 304 77 -193 159 71 24 226 202 -9 -18 112 -105 -158 185 -62 -137 181 95
5483 95 -255 119 2 51 198 -136 -246 137 62 -373 52 -24 -110 -61 92 -7 32 -58 -53 -29 32 -43 -178 165 90
5508 90 -128 46 -266 130 14 -135 123 -194 295 -217 -22 148 -18 -208 -92 -146 -140 -18 -91 -221 -25 -55
5530 -55 -125 40 56 -211 15 -32 -35 -167 -171 -159 8 10 91 -304 -85 99 -286 -86 238 53 -134 16 -50 304
5554 304 89 -230 39 273 96 -312 122 135 -84 -187 111 103 -120 107 -132 -112 190 -134 -273 128 18
5575 18 -229 -106 -239 -374 143 88 -203 -113 86 -88 43 144 -64 -83 179 1 -236 -25 14 -101 -3 53
5597 53 -202 -67 370 -288 -56 141 -15 -41 -158 100 -16 243 10 9 -66 -75 -185 263 24 -232 -152 66 -50
5620 -50 -13 -29 -88 -92 297 -51 -8 196 136 -321 32 -55 -22 97 -16 54 -32 129 70 4 76 -106 -55 140 52 -162
5646 -162 53 62 -110 301 17 -100 -217 86 -209 42 -145 100 -166 180 100 -126 238 113 -27 318 136
5667 136 -164 52 233 -65 -75 228 -117 70 161 98 -105 -34 9 29 209 -21 -144 66 132 -97 -67 133 95
5690 95 -118 50 -97 -34 1 29 -73 93 -93 -201 28 -59 -91 79 133 -233 114 159 -329 -128 -3 13 -48
5713 -48 72 83 -259 270 24 264 27 -2 -104 185 64 -13 56 174 22 -83 101 -33 -73 -65 -183 -334 111
5736 111 -24 -36 109 84 -249 -74 -82 -100 -72 -29 -23 -154 45 -69 -226 50 16 -7 -27 29 34 33 -138 33 -128 18
5762 18 -164 153 0 23 100 53 241 -28 154 168 83 207 136 -24 118 -38 -165 74 79 58 -52 8 -172 -106
5786 -106 106 -48 -185 -44 51 -82 -103 92 -220 100 166 79 -149 -39 -87 -88 194 -170 80 -1 224 -258 1
5809 1 195 105 266 77 -327 -50 46 7 253 177 9 -50 90 64 -43 38 -43 -73 117 305 16 -171 192 -217
5833 -217 97 86 112 -136 -192 16 -134 85 -46 -257 -51 -11 -210 46 213 -227 -70 -105 -107 8 38 -76 38
5856 38 347 116 41 114 -41 98 31 417 -2 216 165 125 67 -98 184 -96 284 -6 -265 28 -144 -86 -73
5879 -73 -30 -194 -61 10 -238 -69 182 -301 -294 29 39 -105 -69 -50 -104 5 64 10 -56 -25 126 -59 25 -75 -6
5904 -6 87 148 110 104 -158 -1 76 144 99 76 145 11 -7 166 75 37 94 107 1 -23 -33 14 -123 -26 -98 -11 116 -202
5932 -202 18 242 41 103 -204 -130 58 -11 -184 60 159 45 56 10 236 -114 216 35 -175 48 82 59 162
5955 162 314 -33 65 301 168 105 167 53 -64 62 10 0 -19 73 27 32 195 85 148 -88 2 -54 -58 -1 -112
5980 -112 88 -81 -45 228 41 -154 -186 32 -150 -210 -149 -112 -38 35 50 -5 61 -75 -42 29 232 -133 -104 -38 205
6005 205 -1 153 -95 -79 78 50 -198 -5 -175 -184 -64 173 254 177 190 -127 122 343 122 41 -14 -124 173
6028 173 78 246 87 -26 -11 -87 23 -116 -87 -37 90 103 81 157 -153 -44 -77 83 56 33 22 -75 99 29 -137
6053 -137 27 25 -77 -121 156 -174 -178 -166 114 97 148 -187 -95 166 61 -83 -151 84 -151 35 8 -23 83 23
6077 23 -110 122 34 -118 -159 274 -73 -99 51 9 8 36 -107 -41 116 -34 20 -28 -88 -137 67 -200 26 -118
6101 -118 -61 151 -25 32 -8 -242 -99 -37 -86 132 79 -88 -98 104 -15 -11 -31 -6 4 103 243 82 -95 65
6125 65 33 56 134 87 -81 162 -232 -137 -111 -221 40 -79 -50 -11 -54 -68 -57 -69 -37 -142 -45 -66 -166 4 99 -122
6151 -122 118 249 -147 150 24 48 19 253 158 -18 157 63 3 145 198 199 61 81 228 108 62 -207 211
6174 211 163 81 -60 20 253 -86 -11 108 12 -79 -57 27 -155 56 -150 -263 87 46 24 -212 25 -122 9
6197 9 185 -72 96 122 47 -40 10 -76 -80 -18 166 12 171 85 35 128 163 -41 203 -14 2 -94 88 -147 8
6222 8 -136 -171 -124 -6 29 -73 14 37 -69 -23 -62 -202 -77 -209 -125 6 -190 -74 -189 34 -168 -109 95 -200
6246 -200 199 -88 255 -41 46 59 -60 172 25 71 8 -101 -15 107 70 126 -121 -150 301 -73 -87 -93 16 -170
6270 -170 -97 -69 -62 82 -57 -8 26 -115 -39 -19 -24 63 151 -13 63 -40 121 -61 8 -58 -106 -87 18 147 142 173 11
6297 11 17 -100 114 -220 101 122 87 303 172 22 50 -23 88 -112 86 140 19 191 6 -108 -54 254 -11
6320 -11 255 38 110 12 125 -92 -92 221 -37 -67 151 -10 -41 14 -47 -65 -39 52 -43 120 -46 43 -41 -126 -163 48
6346 48 111 -53 -89 177 107 -128 33 -23 65 -96 155 -74 2 -3 -95 56 53 -93 -102 83 77 -121 83 -97 89
6371 89 -183 -243 -32 -45 -93 -154 27 -135 -48 -37 265 -18 -43 -11 -161 -303 -76 90 54 -24 26 -194 148 -22
6395 -22 -30 -98 193 48 53 -45 84 -28 104 9 -152 92 19 80 -148 55 80 184 120 11 -150 90 -40 -253
6419 -253 -32 -212 -125 -115 -110 -44 -160 57 5 81 70 -75 52 0 131 0 -2 -10 134 -43 28 -3 -78 117 34 128
6445 128 -55 -193 69 -106 79 -11 7 19 165 206 -271 -114 -11 -11 -173 158 120 83 -18 -123 -61 43 -95
6468 -95 7 -218 -100 76 119 115 64 -49 186 -1 201 -387 130 -26 90 59 -151 87 -57 114 -117 133
6490 133 -118 -171 -50 -185 38 -129 193 60 46 -16 -52 -114 215 176 -127 -53 58 79 -159 -23 226 -74 -7
6513 -7 -22 -33 137 46 24 43 61 -22 59 -129 89 30 114 109 7 80 -13 138 20 -119 -81 43 -96 80 131 -101
6539 -101 41 -53 -16 7 118 -16 -69 139 -82 96 68 189 39 195 26 44 1 36 -41 -99 31 -91 -27 42
6563 42 21 109 54 76 -66 104 -21 -171 -12 -40 149 90 17 37 136 -156 -141 106 -74 -28 -284 201 114 251
6587 251 -48 -86 154 94 -66 -103 -36 15 -5 40 -120 23 77 -71 39 -160 -83 29 -144 112 96 91 25 -63 108
6612 108 9 44 22 50 -8 -57 -15 12 -51 -255 28 -111 -62 47 111 -65 -66 -24 -266 112 4 47 102 41 210 -149
6638 -149 7 66 -197 -160 132 104 100 -64 -47 23 237 76 112 -80 -4 121 2 80 115 66 -67 132 -64 63
6662 63 -51 98 56 172 79 -111 -52 61 83 -108 41 -14 -36 -195 229 29 -60 50 -70 -113 -156 171 67
6685 67 -115 94 3 377 66 -80 -42 73 -59 24 81 56 119 84 180 -140 148 -136 149 8 -81 42 -86
6708 -86 10 -168 20 67 247 -39 -63 102 -93 62 29 149 -85 -138 -136 -57 -160 -29 -72 -163 -66 -228 -81 4
6732 4 -183 274 -118 70 -60 -112 -19 69 -7 16 60 -210 139 97 -115 -145 139 65 -60 58 18 132 -71 -149
6756 -149 81 -5 -1 -57 122 -105 121 -162 238 16 31 126 64 105 107 -104 -138 6 30 113 -80 -9 -78 -20 148
6781 148 111 32 -20 -59 171 43 -70 -142 188 26 -84 84 64 5 -46 27 -59 -88 39 -329 -73 189 -91 30
6805 30 -44 22 -52 -17 -16 -139 7 -112 -34 183 -109 53 -10 53 -16 -62 -115 -39 66 9 -24 -81 -76 -33 178 38 -52
6832 -52 -48 -158 68 10 37 -56 -126 -31 -142 156 -75 -23 -8 -72 24 -20 85 -208 238 51 32 -1 69 144 -185 18
6858 18 -130 145 10 248 145 -142 -52 119 -17 -43 116 71 165 -41 -33 112 -221 -96 7 82 157 58 -172
6881 -172 19 95 132 134 45 -106 -225 -174 34 72 -98 -29 -119 9 0 -140 11 145 -74 81 -3 -55 12 -18 15
6906 15 216 -51 -164 -53 -74 -125 -86 70 21 21 -5 -98 -71 -40 54 -62 156 17 -66 139 172 162 -131 45 -85
6931 -85 -91 -210 52 -67 -89 -94 165 34 -24 -91 -263 -9 11 2 -85 86 -15 18 -188 -9 -101 -120 -46 47 27 -42
6957 -42 -129 87 30 63 -126 90 1 56 33 -130 14 76 -137 -60 240 102 99 145 -71 0 62 -272 52 -135 61
6982 61 -55 -57 8 -144 -83 -132 -74 144 113 -17 60 -108 -94 138 98 -59 -62 -1 143 25 31 133 -17 -58 273 24
7008 24 2 -15 235 -58 88 -70 36 135 15 110 7 238 -71 -130 73 37 14 -86 -121 27 78 -3 18 -256
7032 -256 74 91 -70 167 69 -106 36 -118 -86 45 -28 -41 29 94 194 -149 -14 -3 5 130 48 41 -74 -33 -64
7057 -64 -211 -20 85 109 191 -199 98 153 88 -82 -140 -72 -43 -62 -69 164 35 91 -4 -9 -68 -1 14 -215 -41 15
7083 15 -2 -33 -31 -114 -40 -149 75 -19 91 189 72 -193 -16 85 -62 -12 -117 32 6 -179 41 155 121 31
7107 31 -64 -145 -12 -96 -174 -14 -28 43 44 -91 -107 119 4 10 -87 37 -71 11 97 -53 17 59 -125 30 24 -17 -124
7134 -124 -30 -45 88 -41 36 233 -50 54 72 -166 -37 21 -123 90 181 -48 134 -126 79 -87 -167 229
7156 229 -49 -160 -49 -63 -79 179 -150 -75 22 154 79 46 -28 -30 78 -101 55 110 -84 165 -71 73 65 -255
7180 -255 -69 162 94 52 34 83 -141 95 53 39 -6 -106 120 -97 173 42 90 26 77 -199 79 25 -28 -68
7204 -68 38 63 214 -152 60 -158 7 56 -36 -29 116 54 -50 -29 8 -27 -201 45 56 -13 -37 -37 240 186 175 -11
7230 -11 217 -48 -77 92 -40 129 -137 -142 8 -34 66 -131 40 108 93 127 -149 5 -164 169 -20 -68 -147
7253 -147 -100 -12 -77 241 -116 46 51 51 -13 -130 -94 218 -108 46 11 -191 -19 -109 -41 151 -104 16 12 -78 31
7278 31 261 102 196 -25 -32 -23 -171 -111 -7 29 11 -5 -64 98 -187 -20 -100 -48 -171 -68 -116 35 -48 -84 -31 -225
7304 -225 -97 -78 15 -38 94 -95 6 -21 207 4 198 -55 28 86 -51 20 139 44 -100 93 -51 -164 124
7327 124 155 63 -169 -26 248 145 -260 -1 111 73 5 -129 98 117 -71 -200 -69 -126 -117 -152 -256 196 -108
7350 -108 -110 148 0 -19 -204 88 -61 212 41 -133 226 -61 -121 -128 136 1 -26 90 154 -49 20 -27 -131
7373 -131 195 -46 69 3 -96 -125 -55 95 -45 -165 -122 210 27 -39 -9 -159 -146 -140 159 -8 24 -10 -144 -142 -46
7398 -46 -194 37 -73 30 146 81 69 -93 171 -124 -69 -7 124 117 -30 93 145 144 -29 -38 68 92 28 134 -66
7423 -66 63 36 47 -39 -76 17 40 -108 36 18 67 -40 -180 149 -68 58 52 84 -16 147 78 161 92 -54 -95
7448 -95 -2 -95 103 49 -122 -5 99 -86 151 -105 364 47 -187 56 -78 72 144 60 91 37 -163 -75 -76 93
7472 93 237 -26 48 1 -65 67 -48 -117 -55 64 75 61 18 25 196 71 -76 -82 55 -12 164 102 -82 -36 -170
7497 -170 9 116 153 75 -15 -8 67 164 178 32 37 -27 -28 21 209 -212 74 -167 18 97 11 85 -53 -3 -73 39
7523 39 115 -24 75 45 -11 150 124 65 121 -114 12 26 126 -28 68 -204 51 9 -196 113 82 21 -68 -3 -139
7548 -139 14 -131 -117 -18 86 105 -97 54 -89 -131 13 157 -10 -241 5 -11 177 179 -172 -31 128 164 -149
7571 -149 28 -65 -18 -48 -69 58 38 17 107 126 54 68 163 39 72 30 -213 -113 -2 32 -27 -118 -105 -114 76 52 215
7598 215 -50 -43 4 -148 -76 48 -210 61 72 73 -22 -93 -4 -139 71 46 -10 -142 12 -132 54 129 -234 -223 10
7623 10 83 199 12 -39 127 23 33 -29 -105 -211 27 70 137 -41 -3 94 19 117 91 -105 124 -55 -103 66 -45
7648 -45 -41 -138 2 261 164 0 9 -77 77 224 -214 53 228 -37 136 -57 102 82 60 -122 13 -177 71
7671 71 -265 153 16 134 39 11 103 -15 -24 56 109 -102 6 -17 -122 -186 61 -95 113 -104 9 -33 52 103
7695 103 49 -138 -38 252 -29 -69 -25 9 -74 20 40 23 -12 -48 -11 -235 147 138 8 31 16 204 -55 89 28
7720 28 90 22 -87 -33 13 -194 -234 30 -69 -20 0 -118 -40 73 46 -44 85 -51 149 -124 -79 49 48 -28 -17 -87
7746 -87 -90 -248 -32 -29 -119 156 -32 -132 -151 40 99 -10 139 1 109 93 77 -77 27 30 120 7 120 -144
7770 -144 163 -97 17 -87 -119 67 -64 64 35 -9 73 188 -13 -54 -139 36 -150 -38 55 -153 55 107 -280
7793 -280 -140 61 -159 -115 -169 -72 118 -52 119 -43 34 66 -11 -138 44 45 -80 73 -190 -8 -52 30 69 22
7817 22 110 32 34 -4 -64 61 -9 -36 -139 -28 49 22 -55 -168 -3 195 163 105 129 45 -94 -147 89 195 37 -132
7843 -132 58 -22 -188 25 52 191 59 144 16 -102 67 121 110 -34 140 -119 16 28 -88 -78 41 -93
7865 -93 -95 -139 5 207 58 -6 51 97 -81 -58 -37 -52 33 -25 -161 22 -206 -45 -124 23 -46 -86 136 -10 -66
7890 -66 -61 84 -60 39 11 149 -117 159 12 98 150 -12 -27 -66 -171 -30 44 177 -54 29 -81 -13 -50 -63 202
7915 202 100 5 47 -126 -47 30 -52 -169 -225 -100 -207 418 116 -98 -56 150 24 -52 84 143 -198 203 -19
7938 -19 -52 -43 21 -106 30 71 -80 -50 -23 21 -161 -116 81 -4 -24 121 25 -52 60 -197 -92 17 141 106 -134
7963 -134 -98 -294 110 1 13 110 47 -141 -6 85 -248 108 4 -100 121 -75 9 31 80 52 210 171 -6
7986 -6 154 228 76 -56 10 -31 313 -149 13 -81 -20 -123 52 -132 31 270 20 -53 88 -69 75 -16 -67
8009 -67 -30 -53 34 -132 -74 -74 -30 114 68 -123 -111 67 -85 221 110 -59 62 115 -97 -177 77 -5 -101 4 -70
8034 -70 -197 76 -80 -66 122 -24 185 4 27 50 184 218 -117 70 -88 -108 -31 93 14 -93 153 -21 -53
8057 -53 21 -51 120 -147 92 -7 -42 54 51 -15 161 -4 -27 104 187 61 169 6 8 113 -85 -119 -36 -57 116
8082 116 195 214 -8 5 -27 -63 52 190 245 -177 -69 -28 55 -66 88 145 180 157 105 -29 85 170 139 -220 -107
8107 -107 -96 169 40 -68 -53 118 4 -91 -77 70 35 11 -171 -40 -5 -67 -110 -70 26 -46 -32 48 -45 -34 -32 -143
8133 -143 -37 45 181 55 -89 -139 -60 -193 -8 -64 43 -41 -111 108 -78 -28 -115 -94 -173 120 109 -46 -62 -75
8157 -75 -60 -22 52 176 -35 17 7 75 -63 -87 64 -39 -105 -48 -105 -1 23 15 78 -105 -51 20 -108 -24 177 -7
8183 -7 -110 100 -2 -120 39 104 -191 84
8191H4
$$ Imaginary data points
##PAGE= N=2
##DATA TABLE= (X++(I..I)), XYDATA
0 0 0 0 0 0 0 0 0 0 0 0 0 1 -8 8 -8 8 -16 16 -24 24 -32 32 -40 48 -56 65 -77 89 -104 119 -135 153 -174 197
34 197 -222 249 -280 314 -352 392 -435 482 -534 593 -656 723 -798 878 -968 1067 -1176 1294
52 1294 -1427 1574 -1739 1927 -2139 2386 -2671 3006 -3413 3911 -4541 5366 -6499 8156 -10815
67 -10815 15777 -28223 126856 180177 -29758 122984 165891 62677 62007 111310 19783 104867
79 104867 104785 -39037 13817 153205 2152 -92307 88949 57263 -59594 1208 19218 -27753
91 -27753 28307 5088 -92923 46361 72458 -82655 -47625 106589 10415 -64289 54226
102 54226 37598 9354 53520 16472 -8943 115594 64913 -61417 79650 133428 -5534
113 -5534 -7420 111452 47962 15989 62418 7806 31621 90548 -4889 -58824 97562 51714
125 51714 -89297 4153 62437 -32182 -42802 10400 -44568 -5953 9257 -89043 -46869 53779
137 53779 -45777 -122543 25403 13536 -86354 -35865 603 -41309 -11177 -9113 -79189 14568
149 14568 43090 -75152 -52293 70692 -1968 -78843 24084 18851 -24887 5034 -8676 -37916
161 -37916 41670 14289 -90749 10732 60521 -55867 -65842 40311 -8513 -55300 -4307
172 -4307 -34662 -29842 14106 -42464 -87819 30919 11670 -106432 -28615 35314 -43305 -60180
184 -60180 5288 -30529 -17494 9747 -55070 -27831 52908 -13115 -80677 41101 43800 -49958
196 -49958 -8576 37024 -2667 4094 22816 -31347 27068 57023 -37448 -26953 74445 19466
208 19466 -59547 29493 35845 -17653 2778 7074 -20725 27587 20166 -66473 7937 57807 -39139
221 -39139 -54130 43476 9601 -46428 5957 -5352 -13999 19350 -12301 -51000 38099 34141
233 34141 -67786 -5970 56976 -12363 -36539 30560 5829 -3517 25729 -19334 -6671 54723
245 54723 6814 -55077 42270 51897 -39176 -7123 42101 3028 -6613 21002 -19559 13403
257 13403 41810 -32735 -28227 56149 14626 -60821 18714 34196 -23720 -8669 9519 -15149
269 -15149 12871 17212 -51747 4171 50613 -30846 -46981 41735 17203 -44427 6523 7534
281 7534 -11160 11466 -4373 -37162 27423 31069 -57927 -8656 49974 -13125 -41669 24158
293 24158 7684 -16581 12628 -16372 -12186 34199 1002 -52537 27478 42558 -42067 -14608
305 -14608 37741 1857 -16546 18034 -9214 7171 34710 -22323 -20099 50922 19850 -49756
317 -49756 21746 42778 -17614 -6294 19993 -2047 8882 20267 -34173 5223 46141 -23535
329 -23535 -40675 36918 17807 -46036 1224 10874 -16425 -2397 -6715 -34239 10564 19101 -56394
342 -56394 -17315 37202 -19467 -48954 14579 6263 -27713 1754 -12470 -14659 20396 -808
354 -808 -45155 19453 38526 -38341 -14931 37953 4340 -20675 17393 1011 2188 27546 -15033
367 -15033 -16971 40216 16878 -46929 14020 38622 -22355 -15314 16075 -3979 -6581 10069 -30962
380 -30962 -5608 31418 -26303 -42577 25795 13512 -48881 -4343 14009 -16824 -7476 -506
392 -506 -21487 8996 22944 -38240 -6743 44802 -3486 -31807 28715 27244 -12541 16238 13269
405 13269 5556 31110 18612 -18725 30995 50929 -19199 -994 49296 17091 -13498 24313
417 24313 14935 3092 25276 -5876 -11188 33653 15928 -41397 10265 36722 -23283 -18504 17314
430 17314 -518 -11977 8913 -19305 -4684 29161 -15534 -29812 30376 24563 -34385 7488
442 7488 32385 -839 4705 19456 3867 21328 37831 -11700 11049 57222 14522 -14228
454 -14228 40268 41930 -3976 20588 25088 10323 25545 18147 -14355 20706 39123 -24949 -13109
467 -13109 32986 1819 -32438 3549 585 -21481 -2300 -22337 -30898 3877 -7348 -57151
479 -57151 -14725 13871 -42251 -39200 -410 -15099 -32396 -7893 -24519 -19573 10924 -22230
491 -22230 -35360 16010 14592 -40221 -3207 25645 -9587 -8507 10731 -1036 4590 21241 -17431
504 -17431 -3611 36167 -873 -29079 18621 23614 -25153 -3874 7760 -10681 -2907 -4088 -29550
517 -29550 -5747 13421 -41175 -32197 11661 -14621 -48158 -12174 -7482 -33749 -15163 -23960 -32032
530 -32032 -4423 -8386 -48615 -13439 17403 -32762 -30340 10019 -1300 -22441 3123 -4164 -7024
543 -7024 19811 -4243 -16855 25046 26741 -23573 6994 37373 898 -1717 20491 11125 7443
556 7443 23802 -5284 1291 35803 4999 -21404 20413 28285 -19863 -993 16840 -3181 -398
569 -398 4456 -13771 1218 20954 -23315 -17659 24295 2046 -29968 4420 14878 -15057 1156
582 1156 1168 -8316 11739 11585 -21741 4533 34303 -11294 -11985 26444 15770 -9680 14075 12881
596 12881 2180 22955 5965 -7267 24859 27585 -17961 5925 36124 -74 -6105 17697
608 17697 10689 -371 15556 -4095 -3723 25799 1222 -22358 13729 23525 -21825 -5704 16762
621 16762 -4109 -5380 3752 -8694 -1847 17313 -17915 -15539 22230 3055 -27229 3948 17418
634 17418 -15381 -2307 3625 -7324 4973 7131 -19779 -1483 25677 -15170 -18240 17720 8249
647 8249 -19020 2632 7123 -8762 8101 -2516 -14823 10257 14511 -24510 -5705 24957 -9066
660 -9066 -16405 9257 5250 -10081 5712 -5025 -8599 16639 -1934 -21685 9368 20340 -21098
673 -21098 -7637 18011 -3166 -7600 5161 -2726 -2301 15020 -11673 -12248 21213 4673 -22972
686 -22972 4955 19747 -13558 -3694 7878 -4179 2340 7007 -13211 -2165 22796 -11877 -16801
699 -16801 17350 9282 -18462 1794 11150 -7998 4449 620 -10202 7774 13207 -19064 -5641
712 -5641 23976 -6785 -15762 9721 7885 -10644 3565 -381 -8084 12229 -868 -18199 6155
725 6155 17665 -19582 -9633 16904 -3563 -11009 3083 -604 -5839 9812 -9184 -12738 16226
738 16226 3345 -21530 2514 18836 -13114 -6008 9783 -2066 -475 6589 -7416 -2066 20683
751 20683 -7522 -13523 17517 11011 -15232 2559 15391 -5730 3140 4358 -5464 6564 12079
764 12079 -13533 -5007 22490 -5360 -15243 9380 8870 -11667 440 2333 -8146 7824 -1334
777 -1334 -15838 3351 14351 -17935 -10957 15895 -3638 -12898 2725 1948 -6902 6767 -4806
790 -4806 -10316 14209 4175 -17042 3114 19709 -10399 -5576 13080 1084 -543 7233 -1745
803 -1745 -1146 18561 -3834 -10765 17066 11350 -13695 1404 16308 -5953 -257 5133 -4061 2657
817 2657 8393 -11533 -7147 17994 -5996 -16866 6818 7164 -13736 -3307 3331 -8891 2550
830 2550 -1615 -13911 516 11281 -15777 -11440 14691 -3433 -13424 2219 3988 -7751 3464
843 3464 -2312 -9722 10365 2984 -15301 663 16565 -11119 -8937 10552 -1004 -5818 2315
856 2315 -2800 -6194 10256 -6689 -14629 8992 4867 -17489 -5548 10981 -10794 -8176 816
869 816 -7237 -4106 2203 -11766 -10489 11921 -7395 -17784 4174 6168 -13852 -5096 5805 -7197
883 -7197 896 803 -8766 1585 11518 -9813 -8443 16498 788 -9923 5395 8766 -4416 4144
897 4144 3658 -5088 10470 5936 -9661 2108 17192 -6572 -7528 12959 2152 -4928 3251 2082
911 2082 -4010 9135 -1520 -10214 10102 7516 -11844 -2277 14768 -5199 -5107 6768 71 155
925 155 6263 -2353 -3579 15753 915 -9332 10262 13019 -5805 554 13894 112 4680 7407
939 7407 -753 5882 14144 -2705 -3802 18609 4658 -7011 7125 11384 -3052 2935 6149 -3614
953 -3614 7712 5088 -8209 572 13986 -6813 -9542 10855 1132 -7510 799 2112 -5666 4316
967 4316 -1327 -10186 6496 5628 -11198 -3989 12656 -5114 -6945 6249 423 -1951 3666 -749
981 -749 -4291 11508 701 -9491 7555 10182 -6985 -2709 11690 -2022 -227 4198 -2271 1033
995 1033 7963 -4469 -7883 12093 359 -11391 1842 6804 -7279 -4049 2689 -7253 349 43
1009 43 -10419 -4086 7779 -8755 -12748 6742 -1717 -10455 -2904 1057 -7504 -354 -1982 -10484
1023 -10484 3330 3045 -10827 -5233 10387 -5007 -8631 5388 688 -3077 1614 497 -4547 8159
1037 8159 838 -8772 5887 8617 -6264 -3702 10926 -1600 -2048 4309 -748 168 5960 -2138
1051 -2138 -6337 10667 1753 -9520 2684 7811 -5460 -3638 5522 -4152 761 2116 -6281 -1960
1065 -1960 8028 -4719 -9973 7971 1112 -8387 -1143 3824 -4739 -401 1115 -7166 2948 3613
1079 3613 -8031 -4333 9706 -3384 -8565 5312 1217 -4158 115 1164 -4567 4986 958 -8438
1093 -8438 3809 6650 -6189 -4759 9559 -1857 -4200 3597 -456 -1099 3497 -1327 -6139 8285
1107 8285 1376 -8888 1757 6838 -4783 -4631 5790 -3040 -894 2064 -4258 -2089 6015 -3081
1121 -3081 -9157 7191 1661 -8069 -955 4571 -4001 -2147 2062 -5266 2182 3317 -5795 -3437 8625
1136 8625 -1516 -7522 5881 2767 -3239 259 3672 -2477 4277 2865 -5482 4702 7408 -3487
1150 -3487 -2961 10148 689 -3304 5120 1917 -147 3363 1516 -4069 7210 2993 -6631 2334 6775
1165 6775 -3188 -4348 6106 -1737 -1774 1762 -2561 -1872 4069 -1878 -8019 5840 1842 -7493 -1065
1180 -1065 4495 -3290 -3042 2833 -3919 1138 2765 -3899 -2637 7371 -294 -6794 5980 3710 -2794
1195 -2794 767 4759 -1102 2899 3690 -3843 4185 6241 -2143 -2853 8823 1046 -4383 4144 1743
1210 1743 -999 1398 1301 -4573 3868 1924 -7399 508 4503 -4490 -6537 3996 -2719 -4528 -166
1225 -166 -3534 -3484 919 -2433 -8449 3179 636 -8062 -1955 3499 -3479 -4518 2754 -3001 -117
1240 -117 2358 -2787 -2012 5831 732 -5789 5586 3822 -2411 376 4941 -185 1662 4416 -2347
1255 -2347 3313 5616 -1410 -2282 7463 1772 -4426 4115 2584 -1122 631 1989 -3228 2643 2172
1270 2172 -5967 686 4329 -2721 -4790 5197 -228 -3251 1913 -336 -980 2134 754 -4649 4892
1285 4892 3643 -4191 833 6197 306 -1713 5848 858 1653 4389 739 552 6681 3243 -3509
1300 -3509 6131 5306 -1319 896 5705 606 402 4179 -2166 1976 3866 -1829 -3108 4864 593
1315 593 -6072 1730 1039 -3004 -1831 526 -4080 -479 339 -6428 -1237 1813 -3811 -6102 2909 -978
1331 -978 -5420 83 -848 -2293 -353 115 -4867 2108 2151 -5069 -660 3862 -1039 -3875 3474 -490
1347 -490 -1180 1753 -982 -1278 2537 814 -5468 2807 2394 -3856 -1918 2445 -1721 -3020 1321 -3652
1363 -3652 -1367 702 -3017 -4558 2040 -763 -7125 404 -108 -3982 -3041 168 -3651 -1721 591
1378 591 -5553 -1360 1585 -2681 -5214 2691 -171 -4741 621 46 -1749 -279 898 -3498 1567
1393 1567 2529 -3764 -449 3625 -482 -3680 3314 164 -1766 1822 -326 -1062 1752 1304 -4205 2209
1409 2209 2607 -2972 -1087 3108 -285 -2609 2688 -1620 -255 2228 -1143 -2126 2845 1536 -4223
1424 -4223 2203 2321 -1513 -1007 2571 -546 -181 2930 -2370 702 3075 -537 -2773 3620 1613 -3323
1440 -3323 1869 1276 -673 -38 1796 -2190 935 2744 -3324 -356 2911 -241 -3702 2798 498
1455 498 -2049 1127 -229 -1158 740 1508 -3533 1197 2502 -2775 -976 2794 332 -2481 2728 -386
1471 -386 -555 2025 -299 -1213 2385 2033 -3295 1997 2746 -1045 -476 2644 370 -823 3072 -1384
1487 -1384 554 2672 -52 -2044 3028 2018 -2869 1795 1975 -67 -145 2015 -785 750 2959 -1770
1503 -1770 617 3568 1142 -1958 3467 2294 -726 2652 1795 1040 1864 2945 -889 2627 4073 -500
1519 -500 832 3854 1955 -906 3844 1423 500 2829 984 -160 2136 2652 -2310 1781 2484 -940
1535 -940 -556 2031 278 -1461 2042 -1526 -550 1099 -702 -2504 1311 1008 -3504 530 780 -1063
1551 -1063 -1433 1093 -1120 -1152 1668 -2333 -725 1743 -276 -2940 1409 1089 -2459 570 -34 -440
1567 -440 -532 1326 -2174 -103 1817 -2453 -1040 1205 -12 -3030 988 -876 -2309 292 -1363 -2077
1583 -2077 -796 185 -4010 -990 544 -2723 -2474 14 -1277 -3596 153 -2226 -2158 -189 -1310 -2818
1599 -2818 -419 366 -3980 -347 395 -1468 -1953 454 -1088 -1801 990 -2150 -1204 724 -199 -2594
1615 -2594 549 753 -2693 -53 39 -690 -899 739 -1532 -565 1750 -2125 -969 1019 326 -2465 1179
1632 1179 417 -1315 928 95 -197 411 1972 -1568 908 2390 -605 157 2077 1711 -825 2421
1648 2421 770 351 2016 1099 60 1483 2697 -1413 1316 1943 160 -120 1523 700 -765 2175
1664 2175 -937 -267 1260 476 -1653 653 1395 -2140 310 198 -459 -1040 646 -935 -852 1410 -1581
1681 -1581 -674 641 461 -1859 799 1044 -1309 712 201 -208 -39 1551 -1291 126 1679 -1031
1697 -1031 -436 828 572 -1872 995 -141 -1134 289 -595 -1345 -942 670 -2799 -830 68 -1784 -1922
1714 -1922 -458 -815 -2652 -29 -2167 -1813 -598 -1142 -2371 -629 579 -2589 -316 56 -429 -662
1730 -662 897 -53 -696 1809 -486 92 1438 1479 -495 1490 2197 -429 1754 1244 995 699 2193
1747 2193 -373 605 2202 -354 180 900 1063 -1502 703 387 -1199 437 -500 -892 -1024 1058 -1937
1764 -1937 -608 533 -1168 -1126 -88 59 -1665 1019 -442 -360 822 710 -399 676 2179 -332
1780 -332 1345 2049 1198 889 2264 1939 752 3112 1150 1614 2246 2111 390 1909 2569 23 1846
1797 1846 1288 883 318 1586 -26 -357 1506 -790 -422 -72 270 -1579 47 34 -1616 -157 -854
1814 -854 -1127 -1299 348 -1689 -918 494 -1071 -666 -48 567 -1157 956 122 -354 772 407 -87 133
1832 133 1872 -534 804 985 514 134 725 983 -742 1630 -180 -140 518 547 -955 -298 905 -1619
1850 -1619 -235 -394 -541 -1084 -172 -669 -1452 145 -1408 -941 -540 -85 -1581 -508 57 -1452 41
1867 41 -447 -19 -714 969 -549 -76 1279 -301 341 709 1259 -614 1062 723 -57 898 314 370 113
1886 113 1527 -580 205 840 -54 -332 138 452 -1043 826 -516 -469 51 -53 -796 -683 645 -1391
1904 -1391 -345 -81 -430 -834 102 -224 -1249 591 -713 -493 -295 128 -1023 -345 437 -1276 45
1921 45 -586 -433 -1284 111 -961 -1316 -90 -1556 -912 -1006 -463 -2051 -931 -734 -1663 -839 -1371 -1237 -1765
1940 -1765 -169 -1706 -1027 -424 -1207 -926 -650 247 -1398 408 -232 -345 558 389 174 -64 1333 -239
1958 -239 749 919 683 323 800 992 -403 1490 232 271 316 642 -58 17 682 -986 265 -459 -430 -1230
1978 -1230 -226 -608 -1276 163 -1283 -809 -841 -207 -1483 -445 38 -1090 188 -322 191 -397 999
1995 999 -57 327 1369 613 921 1204 1975 600 2202 1598 1529 2108 1797 1979 1310 2609 1060 1786
2013 1786 1854 1367 1384 1268 1579 20 1559 530 282 528 389 -80 -446 589 -1068 68 -404 -440 -786
2032 -786 -225 -225 -1265 340 -1073 -164 -298 178 -445 179 604 -523 642 -77 852 -101 1144 509 272
2051 272 1376 198 807 501 1210 -128 721 449 -94 394 -140 6 -784 464 -920 -510 -359 -1055
2069 -1055 -773 -1160 -543 -2026 -752 -1341 -1517 -1291 -1392 -1153 -1664 -726 -1530 -778 -955 -778 -667 -453 3
2088 3 -1018 387 -386 138 -33 519 144 269 990 -58 793 312 793 2 942 676 -86 927 -51
2107 -51 372 -63 628 -635 68 218 -659 -30 -735 -133 -1058 175 -802 -690 -158 -557 -290 -592 410
2126 410 -894 184 -213 -334 235 -20 556 -128 1245 79 827 815 772 673 742 1262 170 1535 453
2145 453 837 538 737 494 190 1071 -200 690 152 591 -192 332 180 -591 247 -594 -126 -475 -191 -517
2165 -517 -239 -206 -839 -8 -341 107 -526 129 -297 -258 503 -232 431 -175 609 -269 530 422 260 494 55
2186 55 673 -198 731 23 300 263 -76 -111 -85 244 -841 -2 -546 -369 -451 -596 -314 -1084 110 -1073 -618
2207 -618 -556 -300 -828 -435 -213 -1104 -11 -988 -455 -534 -100 -435 -531 207 -721 281 -207 164 -341 307
2227 307 59 -232 465 -348 300 -359 285 -430 -69 92 -487 156 -675 129 -854 80 -872 -407 -215 -486
2247 -486 -177 -688 318 -956 100 -284 -145 161 65 417 -249 993 35 744 470 641 712 647 1128 402
2267 402 1410 676 1077 658 872 727 470 1224 118 842 328 703 -52 158 353 -475 265 -527 -107
2286 -107 -801 -128 -941 -511 -268 -1074 -378 -1169 -162 -919 -284 -712 -527 -171 -446 -58 -326 350 -388 458
2306 458 474 152 772 418 941 379 1381 681 1072 799 712 888 607 1340 168 1047 231 580 361 311
2326 311 333 -257 359 -721 189 -470 -137 -595 -369 -98 -1118 -263 -921 -188 -825 -298 -658 -514 -94 -847
2346 -847 82 -474 -131 -490 29 0 -281 449 -205 356 -56 518 -312 485 197 104 301 -8 494 -389 273
2367 273 -232 -124 -137 -308 -252 -354 306 -877 139 -513 -652 -348 -685 -266 -824 -253 -881 -168 -529 -428
2387 -428 -537 -125 120 -761 429 -258 189 33 392 478 203 881 -101 719 166 668 142 642 495 -112
2407 -112 688 -224 315 -136 200 -421 -167 -100 -629 -208 -889 -258 -866 -289 -644 -659 -374 -966 -492 -914 -5
2428 -5 -1013 -281 -312 -445 -78 -512 216 -278 541 -19 342 356 446 556 546 1085 168 797 506 743 615 720
2450 720 692 420 969 -186 566 489 655 -14 174 278 -253 396 -192 47 -607 16 -548 -400 1 -727
2470 -727 -8 -459 126 -536 -154 -220 -295 174 -284 236 -8 505 -157 511 543 421 636 324 811 76 1019
2491 1019 505 548 899 696 650 625 1342 256 1029 482 630 461 413 387 -68 666 -267 85 -283 152 -221
2512 -221 -137 241 -518 144 -440 -79 -423 -117 -347 -424 43 -642 -109 -506 -60 -643 -355 -246 -527 131 -451
2533 -451 -39 -359 48 -439 -15 108 -447 -47 -360 208 -549 54 -382 -390 34 -245 -89 -544 343 -440 -14
2554 -14 -211 -254 -65 -241 207 -140 490 -196 143 107 32 -18 125 491 -476 66 -42 293 -158 62 -119 -162
2576 -162 366 -668 4 -579 -55 -634 -104 -160 -690 -260 -722 -178 -501 -231 -954 -513 -157 -1090 -679 -826
2596 -826 -88 -836 -250 -407 -222 -50 -410 9 -297 479 -314 334 368 232 431 291 685 151 804 415
2616 415 584 750 609 576 419 1128 106 829 254 407 227 626 363 73 772 -233 244 168 -11 -413
2636 -413 -9 196 -295 82 -316 -4 -155 123 -347 -288 399 -338 -84 -77 390 -317 226 203 28 426 33
2657 33 348 135 568 -225 290 618 -62 316 -5 379 -482 215 -246 -384 153 -197 -440 -490 349 -695
2677 -695 -265 -485 -496 -216 -301 -307 -772 129 -481 -247 -112 -47 -348 46 422 -362 412 5 350 170 586 156
2699 156 149 961 159 523 385 647 75 383 404 19 341 -95 191 -295 194 -516 -474 162 -723 -371 -549
2720 -549 -141 -1306 -521 -855 -996 -569 -579 -677 -894 -144 -993 -573 -103 -391 40 -344 207 -268 521 -30
2740 -30 171 696 652 563 513 1038 275 909 725 808 718 921 818 440 1181 211 439 228 550 97 203 380
2762 380 -355 215 -226 -232 -440 -98 -579 -858 -265 -821 -611 -625 -247 -922 -231 -235 -392 -110 -364 -116 -266 684
2784 684 -221 119 803 226 341 637 895 248 1147 584 444 1139 1044 641 372 1185 125 735 763 417
2804 417 573 406 215 78 545 -340 -41 -150 13 -348 -597 -102 -681 -431 -691 -694 -773 -206 -595 -760 -49
2825 -49 -647 -396 -640 153 -657 -204 99 -690 228 95 117 12 713 -106 42 751 -255 -69 83 537
2845 537 -45 502 207 -198 580 113 68 -298 585 -420 -315 19 -12 -191 -82 225 -650 209 -443 -243
2865 -243 -167 -113 -530 -620 154 -619 -140 -193 -267 -208 166 -256 -546 384 -226 -96 -251 128 -84 109 57 -465
2887 -465 402 -107 -29 -369 309 -177 -131 358 -294 -178 -547 310 -508 -53 -89 -568 170 -272 -342 -255 307 -593
2909 -593 -340 2 -273 31 -319 68 -461 542 -98 -168 248 222 60 -226 790 1 256 370 257 187
2929 187 406 260 -169 751 128 21 241 415 59 -20 724 -180 639 371 181 79 674 165 -305 705
2949 705 54 -192 20 435 -256 115 214 -397 121 13 -366 -492 304 -372 -601 53 -337 -183 -452 -30
2969 -30 -686 -3 -324 -863 -26 -176 -333 -703 587 -422 -187 -16 -138 -50 101 55 -584 791 -52 -114
2989 -114 297 629 91 31 757 153 494 616 414 275 674 353 -23 967 240 -104 146 668 -139 106
3009 106 288 -271 59 -6 -725 -713 26 -907 -899 -195 -731 -689 -1007 -393 -999 -594 -656 -966 -304 -628 -753 -771
3031 -771 273 -604 -487 34 -186 141 299 296 -78 823 130 83 593 957 410 394 1146 362 676 687 428
3052 428 385 784 430 -157 796 130 126 -133 616 -148 -383 118 -631 -76 -97 -459 -676 27 -491 -794 -49
3073 -49 -573 -445 -580 43 -560 -9 76 -620 346 245 96 -346 864 34 195 776 681 637 669 973 243
3094 243 1289 934 431 761 992 564 16 1123 133 445 488 167 251 277 250 -722 524 -168 -506 -472 -93
3115 -93 -575 -814 104 -942 -382 -295 -733 -943 -46 -545 -880 78 -344 -441 -245 328 -230 13 519 -321 382
3136 382 223 47 -187 1061 114 -238 751 452 29 245 489 -298 485 342 -239 265 470 -309 -803 544
3156 544 -539 -599 -129 -411 -628 -262 0 -965 -188 -283 -736 -482 95 -581 -838 383 -394 -190 21 -184
3176 -184 -222 439 160 -787 662 230 139 4 756 -41 180 590 -265 529 447 99 -273 655 353 -472 345
3197 345 -42 -195 -240 153 -486 -116 -14 -856 -38 -79 -501 -1037 208 -448 -647 -297 -462 -275 -330 -37 -675
3218 -675 342 28 -483 225 461 -66 -238 1041 69 479 598 422 285 808 899 -121 1077 742 -22
3237 -22 166 792 382 109 508 -149 234 318 -126 -367 474 53 -777 183 -235 -240 -486 -66 -535 -276 -221 -973
3259 -973 -223 23 -617 -805 12 -559 -812 -22 -67 -360 -187 106 -711 352 23 -516 195 433 66 -344
3279 -344 753 118 183 395 326 70 537 570 -460 977 415 -150 -69 872 187 -351 740 -144 329 225
3299 225 -209 -247 333 264 -864 211 -13 -436 -437 158 -389 -135 114 -673 -118 -16 -305 -676 354 -43
3319 -43 -522 -78 -101 -98 -224 383 -522 187 254 -697 119 360 70 -464 568 30 -330 178 131 -34 168 298
3341 298 -650 345 261 -278 -305 575 47 -541 580 -295 -183 198 -194 -555 369 42 -995 57 105 -512
3361 -512 -508 263 -552 -507 325 -673 16 57 -370 -681 572 59 -814 268 21 89 -169 378 -268 122 347
3382 347 -357 187 320 20 -584 741 636 -24 339 285 151 118 603 -435 576 658 -301 -277 661 89
3402 89 -717 462 45 -52 359 49 -280 343 207 -1028 292 453 -304 -561 187 -152 -218 282 -268 39
3422 39 611 -100 -200 516 345 -610 558 365 86 158 672 117 354 853 -115 165 807 468 -316 743
3442 743 525 -385 490 416 10 -28 362 -613 147 617 -506 -175 400 -104 -652 274 -175 -455 -191 -74
3462 -74 -454 -75 24 -913 78 414 -597 -406 527 -20 -445 474 -258 -87 241 -109 -516 608 460 -751
3482 -751 210 582 155 -275 417 -185 -132 240 -488 -175 310 -470 -1058 112 38 -998 -195 -298 -554 -709
3502 -709 -108 -875 -337 67 -1034 -678 -49 -449 -1198 -62 -291 -707 -315 -345 -596 -28 194 -818 109
3521 109 613 -448 -216 566 510 -531 622 -77 182 568 271 -69 461 690 -706 417 565 -164 -362
3540 -362 640 -98 -210 467 -474 -158 316 -97 -857 113 248 -845 37 47 -40 -248 324 -499 -124 545
3560 545 -744 -435 293 40 -829 371 359 -247 313 309 32 428 557 -484 350 981 -266 -186 758 629
3580 629 -477 512 374 153 349 285 -41 826 564 -701 482 934 -10 -340 401 164 -307 429 -159
3599 -159 -169 252 -144 -639 537 221 -356 314 612 -55 -361 335 32 -129 496 -260 -315 568 208 -584
3619 -584 128 405 -453 252 258 33 -180 443 -355 285 770 -534 -260 343 240 -770 163 -55 -307 -105
3639 -105 -219 -543 84 321 -883 -78 619 -643 -750 356 253 -438 353 -145 -298 123 -43 -497 424
3658 424 580 -689 -36 354 -188 -349 450 -57 -185 574 -121 3 615 291 -693 167 591 -329 -15 332
3678 332 3 -139 386 -325 -17 580 -561 -387 425 36 -684 256 69 -295 171 -57 -417 85 310 -803
3698 -803 -31 561 -366 -579 291 187 -502 231 22 -279 212 -8 -514 383 820 -585 32 891 -5 -270
3718 -270 317 194 -316 447 -297 -64 525 220 -665 240 625 -641 -6 375 68 -370 299 -491 -112 526
3738 526 -579 -393 386 254 -931 204 366 -279 -76 -136 -158 -131 341 -646 41 700 -289 -465 563 377
3758 377 -303 237 145 -122 426 72 -317 165 530 -701 -18 476 85 -528 265 183 -293 429 -106 -236
3778 -236 568 97 -667 -3 564 -644 25 375 142 -287 43 -253 -357 920 -691 -472 261 410 -860
3797 -860 99 437 -504 -132 -7 -72 -111 133 -772 -142 485 -440 -578 535 325 -666 -51 178 -264 -22
3817 -22 78 -127 268 660 -478 -212 642 -128 -469 316 435 -391 440 -107 -233 500 342 -465 182 705
3837 705 -475 -154 266 19 -517 172 16 -317 312 -410 -498 392 263 -999 -68 466 -590 -226 -88
3856 -88 -59 -236 314 -393 -268 728 -471 -718 314 607 -678 124 376 -219 64 131 -68 83 773 -525
3876 -525 35 664 -44 -370 262 331 -329 275 186 -78 316 216 -522 270 589 -737 -258 484 -49 -364
3896 -364 329 207 -368 465 -274 -229 443 433 -648 194 849 -321 -37 292 297 -170 654 -159 -50 1006
3916 1006 -140 -325 468 573 -369 341 655 -165 206 304 -22 88 579 -315 -234 688 -8 -257 124 427
3936 427 -497 79 60 -204 181 124 -614 -146 507 -750 -200 439 23 -435 -18 255 -126 266 12 -219
3956 -219 513 350 -587 -14 701 -314 -297 399 329 -302 177 16 -464 540 -194 -529 307 416 -677 -225
3976 -225 673 -415 -264 170 155 -158 249 -324 -287 763 9 -821 22 411 -608 44 62 -354 -42 -369
3996 -369 -713 -114 419 -751 -455 659 -24 -470 76 279 -477 245 -144 -335 260 233 -711 -201 739 -513
4016 -513 -381 477 -33 -477 160 -46 -488 390 -491 -467 247 316 -699 -312 608 -318 -248 183 -52 -318 417
4037 417 -239 -225 452 -200 -539 64 509 -544 160 184 -78 115 109 67 75 688 -211 -277 652 83 -564 295
4059 295 639 -312 281 18 -55 303 184 -347 -69 682 -458 -478 255 263 -266 -115 303 -248 283 -9 -352
4080 -352 285 325 -653 -77 716 -341 -283 218 36 -117 195 -92 -198 737 33 -558 230 627 -646 -170
4100 -170 474 -144 94 132 43 -77 724 -365 -498 744 104 -650 98 497 -243 16 55 -412 125 58 -639
4121 -639 -263 952 -334 -502 391 189 -521 161 306 -265 357 93 -277 154 320 -614 -220 694 -293
4140 -293 -482 217 329 -68 1 -142 -146 476 -134 -426 149 557 -737 -244 520 -156 -230 -32 7 -300 409
4161 409 -373 -317 576 49 -464 -73 407 -577 -285 125 -389 300 103 -355 -468 702 -444 -356 450 474
4181 474 -466 -145 446 -338 349 96 -115 437 536 -300 -133 747 145 -372 302 426 -176 312 -134 -299
4201 -299 516 147 -342 292 602 -588 -334 601 -120 -172 154 160 -293 363 -100 -383 485 256 -513 411 511
4222 511 -429 18 239 -288 300 87 -257 -301 547 -119 -353 610 463 -372 107 498 -350 9 139 -198
4242 -198 319 252 -300 -282 669 -109 -394 278 152 -156 52 162 -206 438 -291 -459 307 341 -295 -318 464
4263 464 -230 -430 176 -52 -282 465 -35 -485 589 -70 -647 36 525 -441 -332 488 2 -1 116 -107
4283 -107 -261 559 -347 -447 478 112 -514 -132 603 -542 -207 109 -341 -51 91 -349 -444 687 -89 -694
4303 -694 217 235 -311 -244 346 -234 86 96 -421 180 472 -515 -317 520 -129 -467 -172 32 -112 41 -94
4324 -94 -316 337 199 -509 168 561 -359 -323 483 -46 -113 55 -75 11 496 -231 -509 619 133 -326 -110
4345 -110 544 -330 -311 323 -32 9 427 -469 -392 472 -306 -436 441 291 -369 71 299 -229 241 -2 -406
4366 -406 166 164 -281 -300 468 91 -366 8 385 -238 210 110 -348 413 139 -405 -30 556 -527 -456 415
4387 415 5 -144 -8 -3 -140 191 15 -441 407 217 -521 -149 501 -195 -403 297 -81 -56 178 -69 -298
4408 -298 671 -104 -551 308 338 -320 -226 455 -224 86 -18 -288 239 409 -239 -421 704 4 -390 335
4428 335 396 -240 334 290 -150 324 171 -241 -13 526 -133 -268 588 -155 -57 219 9 -104 429 105 -431
4449 -431 448 363 -358 -180 531 2 -372 374 -129 -104 -33 -254 -420 414 -114 -814 29 252 -439 -285 396
4470 396 -316 -25 34 -249 157 289 -205 -330 702 -49 -438 143 424 -290 -159 256 -222 223 193 -419
4490 -419 137 484 -366 -385 650 55 -453 91 21 -295 127 168 -384 420 115 -478 -75 567 -177 -234 370
4511 370 -68 -320 23 -65 -289 527 110 -491 318 167 -467 -278 520 -162 -366 217 -209 72 211 -373
4531 -373 -465 581 62 -459 115 473 105 -212 531 -401 226 298 -211 190 559 -294 -273 619 0 -247 51
4552 51 254 -244 305 157 -438 229 199 -464 -197 597 -105 -507 345 70 -28 137 37 -214 404 17 -348
4573 -348 428 159 -395 -318 705 213 -359 65 -66 -30 207 -192 -398 344 229 -422 86 289 -283 -187 280
4594 280 -254 -41 156 -298 114 409 -17 -419 494 52 -429 -8 254 -183 -157 162 -430 -33 -31 -531 -149
4615 -149 334 -336 -627 277 -81 -285 9 -239 -153 110 100 -436 201 49 -397 -294 520 -71 -270 247 65
4636 65 -44 42 -200 -265 419 117 -728 252 253 -35 -166 454 107 13 179 -275 85 295 47 -414 473 67
4658 67 -331 -95 328 -82 -166 -6 -405 40 62 -377 -245 167 -265 -504 349 -69 -354 -63 112 -134 177
4679 177 104 -276 270 321 -242 -138 425 278 -263 460 120 58 136 100 -290 530 160 -351 276 366 -264 -333
4701 -333 435 75 -33 249 -169 -63 16 -137 -338 163 175 -485 240 221 -100 -85 266 -174 117 167 -316 43
4723 43 295 -79 -472 439 174 -467 31 357 285 14 415 -130 250 300 -7 27 510 177 -393 487 214
4744 214 -162 81 100 -336 332 75 -503 69 643 -245 -159 235 215 -62 97 26 -27 116 41 -269 273 -10
4766 -10 -567 2 293 -175 -256 306 -225 -20 54 -318 -115 327 163 -493 388 251 -308 73 230 -199 85
4787 85 215 -348 45 308 -176 -350 172 227 -374 203 147 -47 -51 167 -195 220 13 -328 -1 406 -249 -180
4809 -180 548 155 -288 -17 77 -84 19 -36 -251 148 268 -467 14 425 -22 -231 304 70 -46 56 -167
4830 -167 -28 291 -86 -487 243 397 -249 -96 215 -125 -28 83 -242 156 258 -374 -139 328 43 -438
4850 -438 279 181 -75 -76 -112 -66 -128 210 -346 271 312 -106 -399 346 111 -270 233 91 -82 222 -98 -240
4872 -240 319 164 -559 196 297 -30 -283 179 85 -154 182 -180 -87 17 103 -384 417 231 -410 -82 179
4893 179 -92 -311 309 -66 -65 11 -349 -74 123 48 -429 60 292 -172 -152 77 -5 45 175 -233 -40 366
4915 366 -129 -303 149 33 -565 215 19 -144 -23 103 -80 -14 145 -501 55 115 -37 -139 69 -99 -282
4936 -282 150 -77 92 342 -126 -304 286 215 -314 31 293 -12 -70 285 47 82 221 -172 10 153 135
4957 135 -318 272 333 -162 -154 253 -20 -267 56 -253 -91 153 -252 -485 177 -71 -231 -54 71 -53 -93
4978 -93 28 -274 -94 245 -217 109 393 -107 -254 316 119 -264 124 -153 -75 222 197 -290 265 527 -232
4999 -232 126 210 -117 -257 191 158 -210 211 -104 -138 -151 193 -372 -21 125 -377 -260 193 31 -224 33
5020 33 -134 -112 167 -88 -321 118 129 -238 63 284 -163 -101 221 8 106 275 -171 121 275 -11 -9 270
5042 270 590 -224 194 173 125 128 164 -51 141 349 -37 -187 127 -135 -102 69 18 -326 6 -78 -254 -4 6
5065 6 -309 100 55 -381 -196 126 107 -170 83 -227 9 208 -100 -98 171 332 -160 328 370 -55 110 63 42
5088 42 47 109 -97 182 218 79 -13 400 155 -163 4 99 -22 44 49 -190 60 301 -364 -122 287 -195 -157 23
5112 23 182 -297 134 -109 -175 118 -37 -250 259 283 -216 -93 339 -35 -25 37 -117 -200 197 -251 -171 34
5134 34 163 -305 162 329 -223 -34 -84 -98 -104 48 -116 -66 43 -274 -332 32 205 -391 4 112 -243 -13
5156 -13 104 -13 15 213 -219 108 200 247 -287 42 27 -196 23 54 -3 231 328 -154 55 331 -105 -207 247
5179 247 88 -442 133 10 -118 112 -37 -74 89 149 -250 238 119 -207 -314 -26 67 -86 132 -134 -323
5200 -323 164 -172 -58 60 173 -257 37 58 58 0 137 170 -100 211 -246 -321 140 -132 -280 -131 263 -289
5222 -289 -213 96 -167 12 -45 -45 48 344 -237 -256 277 -76 -262 -111 32 -118 11 20 -237 142 149 -207 143
5245 143 313 -117 -55 93 -64 -111 76 14 -82 274 -88 -150 160 159 -182 106 8 -187 -225 15 -152 69 37
5268 37 -203 -116 100 20 -495 198 205 -226 109 90 -130 -3 -127 -220 76 258 -48 37 -14 110 15 283 276 10
5292 10 26 -87 28 157 361 -425 43 317 191 71 12 296 28 93 20 -141 134 -266 -144 175 -6 -213
5314 -213 126 198 44 -47 9 -12 -232 -73 -125 -54 126 -10 -255 92 42 -304 71 81 321 10 64 9 38 243
5338 243 1 -87 285 76 -98 265 259 -28 -3 252 -117 63 41 -148 -70 121 -206 -1 157 174 -187 313
5360 313 118 17 82 -96 -189 -63 -9 -311 57 247 -168 -19 89 88 -34 -22 -215 -37 216 -112 -160 6
5382 6 104 -22 140 -29 141 -3 -19 97 152 196 -140 50 315 -10 -220 38 228 -72 68 -53 -22 153
5404 153 87 -79 52 75 -92 -178 138 -90 -422 97 165 -78 121 83 87 104 92 -184 124 2 -68 3 100 126
5428 126 -244 328 60 -80 76 99 -101 171 84 -69 -272 297 -146 -133 153 -9 97 50 -97 -286 24
5449 24 -59 -260 -16 61 -319 78 -142 8 -110 -115 -167 -112 -33 -12 0 214 90 -114 75 169 -29 137 -71 13
5473 13 121 329 -63 113 551 38 -6 -25 282 113 194 76 -40 157 115 -78 100 72 -347 20 93 -142
5495 -142 -327 15 47 -122 -53 -204 -63 16 -214 -400 -76 44 -247 -206 -75 -30 -44 -62 -153 -39 285 -94 32
5518 32 99 213 -136 117 176 7 303 137 -8 53 -4 -50 166 440 73 42 78 6 59 343 37 -10 21 -30
5542 -30 -31 164 190 -260 -132 63 -220 -35 13 -104 -96 58 -90 -57 139 -121 -107 78 154 -227 58 173 39
5565 39 -214 166 -65 -37 80 21 -270 -24 129 -206 -54 252 16 -102 24 -31 -9 126 67 -45 375 135
5587 135 -76 22 30 6 29 222 49 143 -48 89 214 43 -106 50 207 0 5 -40 123 -148 24 88 -202
5610 -202 283 33 -119 21 94 -64 -109 94 -52 74 176 52 -65 155 69 95 59 -63 -8 48 196 -135
5632 -135 13 90 42 22 38 220 -57 28 25 -208 -24 68 -154 189 88 -284 -42 17 -71 116 80 -180 -130 214
5656 214 29 -145 56 -56 -106 -102 -43 -151 135 133 -182 60 -32 -212 -154 55 -158 -34 -41 123 -28 -42 -90 -42
5680 -42 49 171 21 -100 224 13 160 65 191 -53 -48 158 219 196 -81 -114 291 31 -241 84 -115 -57 -140
5703 -140 117 -33 -123 -173 -79 -185 60 50 -291 173 44 -272 -12 7 -128 -168 -191 -57 -118 137 -90 -65 276
5726 276 149 -129 13 65 15 86 -90 70 -93 -50 297 -56 229 -78 -139 186 105 -64 52 144 -89 132
5748 132 5 -93 -105 60 -136 -75 -115 -143 -93 -56 -67 133 76 -12 -112 286 62 -115 133 110 -221 -61 115 6
5772 6 181 64 -19 100 321 197 63 52 179 205 144 174 148 7 221 88 67 36 -134 36 111 -65 0 -37
5796 -37 101 -207 135 90 -162 -100 -142 -184 -115 -188 -205 -38 113 -262 -118 -158 -154 30 13 -60 -138 103 -68 -232 -138
5821 -138 223 49 71 4 -31 98 29 -14 112 15 161 -175 100 140 -161 115 182 32 -41 -154 -112 85 -45
5844 -45 -106 -2 99 -393 -180 6 -95 -189 -278 -45 -42 114 -266 -318 30 36 -116 -307 176 -167 -117 137 -72
5867 -72 133 117 23 102 105 7 4 60 235 -7 116 56 105 28 96 70 194 124 -22 -29 117 -73 -123 -59 96 -45 79
5894 79 95 -89 -20 -48 -228 121 142 -117 46 -103 -31 -5 14 -20 -4 349 149 -164 -2 201 140 -89 156 114
5918 114 -51 265 144 91 139 184 -98 128 50 -2 224 71 84 -159 237 -172 -19 37 15 -75 120 103 -122
5941 -122 24 -129 -41 -80 -48 77 77 83 -98 64 179 -33 -1 127 -174 -279 15 60 -4 98 211 -108 115
5964 115 -32 -95 63 9 -2 53 86 -126 -69 0 -172 -62 -88 214 -99 4 27 60 -67 -126 -237 -106 78 -50
5988 -50 64 -250 -28 -318 -47 60 -155 -75 -47 -240 33 22 -79 77 -7 -9 58 23 -23 -178 187 -73 -25 3
6012 3 83 -12 -146 103 41 174 -18 -6 -7 120 -95 -113 53 42 -108 -6 -132 -49 -88 91 -133 -65 36 -10 -107
6037 -107 173 168 -38 203 -48 30 -95 60 20 30 -64 -101 -55 212 -212 -63 0 -239 -97 233 44 -59 -149
6060 -149 -187 -164 -160 40 -234 107 103 -42 88 -97 -158 83 79 -149 38 210 -11 -66 200 -9 -213 -38 26 -52
6084 -52 26 111 -10 -121 40 -79 -57 69 -85 -97 123 81 -20 -226 -105 -212 -27 -141 -53 89 -76 -3 -76
6107 -76 -1 52 -96 43 209 122 48 20 49 -23 107 28 91 -10 144 169 122 -39 57 -42 -4 195 263 -82 -83 134
6133 134 84 112 145 -4 145 -21 127 -223 -143 199 -47 116 -28 -182 -129 -146 -192 -182 -176 60 -206 13 -36 -195
6157 -195 -123 104 -218 -27 136 67 -213 170 77 -81 169 96 -20 -279 -17 -42 135 158 -100 -161 -83 168 -15
6180 -15 146 -83 -40 3 -16 109 -125 -77 -50 53 -232 -87 -259 3 -108 -16 -148 -161 -151 -16 -127 -179 103
6203 103 -157 0 -105 -53 -235 -47 -29 -117 185 149 -6 119 127 79 -106 207 30 130 -48 10 8 -78 -61 -139
6227 -139 54 108 99 86 93 100 44 -65 -3 -81 35 24 -95 -38 71 -43 13 51 -76 -28 49 -106 -79 146 97 -126
6253 -126 -67 164 -56 56 -132 90 44 -33 107 -12 74 152 90 204 22 -55 111 -47 -120 182 62 -64 161
6276 161 24 124 -38 -59 62 182 38 -66 11 -74 -74 -172 48 17 168 -19 117 194 29 258 -154 -105 42
6299 42 13 -132 142 147 -150 129 -25 104 -20 -174 -118 89 82 1 177 -3 83 -140 -37 34 73 20 9 -29 119
6324 119 17 -109 135 -76 -27 -125 -102 34 -158 -61 5 132 -210 -152 -69 -158 36 -154 -242 -68 -144 14 -48 -1
6348 -1 -93 146 -84 197 -73 -29 251 -30 90 -174 138 -144 -5 49 48 -221 118 87 -166 19 54 -57 -56 -2
6372 -2 -4 79 20 130 28 -99 276 5 251 -76 -125 123 71 25 -22 0 70 -242 35 -69 290 147 -46 -175
6396 -175 -149 73 127 53 35 -43 87 33 -95 87 196 -12 92 18 -105 4 83 -103 51 -82 -79 56 -81
6419 -81 125 -104 3 -95 97 105 -37 -293 -11 -13 7 -20 -142 50 -16 30 62 40 -11 -10 -71 -168 124 183 119 -88
6445 -88 18 158 -9 116 82 184 83 -72 146 104 -49 -73 28 204 27 134 -17 -32 39 49 58 73 68 124
6469 124 102 44 158 -25 25 80 -19 -42 -37 -351 -188 21 2 120 -157 -17 -97 -64 56 128 -19 -28 211 -12 -31
6494 -31 75 183 57 -35 56 176 50 112 -37 -86 106 184 -65 -25 11 -30 -22 -47 6 90 186 15 -5 117 31 -38
6520 -38 24 96 197 136 -128 -80 -104 16 28 -133 -13 -158 72 -31 103 -14 -127 -98 -84 -149 -134 -150 12 -98
6544 -98 -34 156 -7 -94 63 -74 -235 -80 -53 -189 -25 101 -124 12 87 1 -234 -92 120 -85 -94 -71 32
6567 32 -118 -14 68 -293 78 41 -8 117 -203 -12 52 -268 75 -169 157 37 42 -52 3 74 137 52 -75 -188
6591 -188 -185 -134 215 -39 -19 -63 -216 -146 -127 13 25 138 -13 106 -87 120 67 -112 -37 94 -137 145 -125
6614 -125 4 3 163 -75 136 21 -9 -141 -92 59 -131 -3 6 -149 256 109 26 -104 50 -46 -51 26 -282 -41
6638 -41 58 58 -138 66 -26 -197 75 35 -178 139 -67 135 -122 28 -199 69 -58 -79 -84 -244 -23 29 260
6661 260 185 38 -75 87 -87 0 16 -72 -14 85 156 74 -139 20 -29 -13 -19 -113 -108 146 -76 189 -75 -66 -155 102
6687 102 -133 -60 -20 -55 -2 -61 -302 48 135 159 -84 -23 -42 -88 138 -103 -77 -82 -121 -73 21 -244 -213 96 -125 -162
6713 -162 9 -67 -257 -5 -123 33 -106 43 81 79 122 12 102 -160 73 41 33 -61 42 -75 171 -32 67 -17
6737 -17 -130 -172 35 139 -96 -198 -73 -38 -69 90 33 9 -37 11 92 -10 -56 49 154 -23 173 46 121 -64
6761 -64 142 26 -208 -90 -58 26 -174 -7 -55 -113 82 -158 -86 51 -31 -137 -173 49 -112 -37 -161 43 81
6784 81 205 -79 -43 36 -20 -194 29 172 46 199 -92 139 54 -74 23 10 77 -6 50 47 156 -32 -3 83 154
6809 154 78 -58 254 -47 20 -5 92 -158 -25 167 61 -169 -96 91 5 -112 21 -4 -22 -30 191 86 -72
6832 -72 -28 -36 40 49 -84 -134 -33 -140 139 -30 213 96 47 -66 -38 -45 131 22 -167 -11 35 -39 18 -92 19
6857 19 -12 -156 25 73 23 207 125 -59 83 46 -57 5 18 131 127 -78 -72 -18 -45 -63 -55 -63 57 -151 68 57 -54
6884 -54 -52 -80 64 28 69 88 131 76 35 6 137 -243 81 114 25 241 113 -70 -43 -5 -124 -27 129 -90 22
6909 22 0 46 -35 223 -29 -112 -204 119 47 -3 11 21 43 110 145 11 31 182 187 132 -134 -19 61 113 -97 -78 -32
6936 -32 43 92 33 -10 117 157 -50 -29 29 -226 74 116 22 -53 121 106 -199 46 56 41 -143 173 59 -45 54
6961 54 -118 -52 197 54 109 125 315 57 -139 132 -36 225 -26 134 125 39 -110 145 101 151 -104 -239 -95
6984 -95 -3 35 -49 -52 -118 60 36 99 40 16 54 -58 -252 -22 -61 -251 85 178 -6 142 -21 67 -113 16 24 -71
7010 -71 -222 -132 115 -86 -200 -178 1 -44 -93 -161 -24 162 18 -57 18 -33 84 -13 15 79 14 66 112 150 -32
7035 -32 43 -60 21 10 -147 -30 195 -88 -9 -49 -60 45 -106 -45 33 79 -27 -47 -22 -21 -125 251 -80 57 75
7060 75 -4 154 -196 47 -78 -104 -54 70 79 -162 30 -37 78 -29 102 -108 -23 -183 -237 113 17 -1 -57 6
7084 6 -147 -100 -33 22 -36 -225 -101 63 34 78 -4 32 -80 -78 106 -46 -240 107 -49 -38 59 36 72 36 90 17
7110 17 -139 157 -22 45 31 -10 109 42 -80 -186 54 -44 125 -24 -2 54 -12 85 -72 83 71 -69 -116 98
7134 98 -58 101 126 52 99 164 86 7 80 -122 -20 -74 4 -72 285 -131 -46 -164 30 49 -188 -71 -81 -71 -5
7159 -5 -66 144 -67 -138 -50 -85 180 151 -23 15 35 117 201 -31 10 37 -67 20 4 -17 24 101 -194 94 176 -85
7185 -85 59 -95 97 -133 -112 -47 0 171 157 99 -74 27 203 35 -102 115 93 -38 153 -5 -55 -131 12
7208 12 144 -238 -6 4 87 -106 -77 -39 -76 -24 -107 231 -18 -48 -80 -15 104 -111 109 -20 292 151 194 -14
7232 -14 -37 25 10 -297 -16 6 70 -154 -26 -19 246 -36 172 66 84 72 3 70 55 75 73 60 -131 83 -16 -171
7258 -171 42 -177 -224 168 -18 10 -41 62 -95 1 172 -141 -30 22 37 -56 -52 152 -57 -101 38 37 -204 49
7282 49 -125 114 -51 7 -7 183 -196 143 137 -47 -131 -45 156 137 4 -107 217 -26 238 -149 -161 -39 -43 -10
7306 -10 63 -91 97 286 -24 -207 -15 -138 -3 -46 -169 -8 -74 -69 144 142 -59 -102 -30 222 -50 -140 146 134
7330 134 -19 201 183 138 -205 85 92 6 114 -16 -16 93 -144 144 85 -64 -58 9 -102 -15 210 -54 -130 2
7354 2 -8 7 -18 -133 -94 -247 75 227 48 108 1 -30 -170 64 84 -126 24 -87 174 -122 -144 89 37 234
7378 234 -65 -48 145 122 -60 51 141 -7 193 -170 85 76 60 -65 197 -81 -250 115 -147 52 30 -15 -158
7401 -158 106 34 -58 105 30 168 137 7 -132 -5 78 -195 -120 -8 -11 51 -82 -20 -27 142 -79 -312 145 132
7425 132 -41 72 146 -231 95 -106 -7 17 29 -41 -158 -22 -35 -242 -61 54 -112 40 -161 50 -40 54 -40
7448 -40 -92 -141 -44 105 61 148 -79 -14 95 -93 -220 64 97 91 112 34 -28 -24 3 14 21 162 137 -89 -64 190 50
7475 50 93 14 88 110 -14 -9 24 -47 -95 -62 -117 6 137 2 -221 -32 15 35 -53 -66 -75 37 -87 141 -32 198
7501 198 -5 -206 11 -33 -71 -23 8 -101 -93 -16 -68 235 -56 -59 10 52 85 -132 48 46 207 47 44 -29 4 -42 -62
7528 -62 77 -87 156 -81 39 70 66 68 -118 104 25 102 -8 -156 -160 101 -1 -113 20 51 199 -200 -29 112
7552 112 261 63 88 -62 7 -59 -32 17 71 195 -102 -11 -141 -24 14 -114 58 78 42 29 -48 209 33 -148
7576 -148 189 -19 35 -157 -144 -50 141 -63 -111 54 12 8 217 119 -59 -354 93 111 12 -2 -31 -20 173 119 175
7601 175 -127 12 11 -110 -3 -84 4 -63 -155 80 -77 -11 75 -52 55 -128 28 -25 -72 -41 272 57 -142 -10
7625 -10 44 -119 24 -80 -58 131 12 -124 144 -119 -180 -94 -77 -62 -13 29 76 26 30 -75 4 -112 -26 80 111
7650 111 162 26 -12 30 -18 17 -126 26 221 162 96 -111 -32 -122 -17 71 139 25 77 -22 -14 -36 75 -31 89
7675 89 104 -35 -1 -47 -149 90 41 -50 -160 -76 40 -20 -10 115 -1 141 71 -39 13 -90 -19 -145 140 44
7699 44 124 -75 -122 125 -79 -2 -127 -12 14 212 49 85 44 40 -24 86 71 -127 -4 40 -123 -39 -37 -120 167
7724 167 -60 -42 105 6 -15 -30 -9 12 -64 24 -99 -91 -149 63 95 87 89 -82 -64 0 134 -101 -89 -166 42 -176 -39
7751 -39 78 -179 -161 12 93 -132 38 -38 -277 -353 56 -62 65 84 118 -120 14 67 59 62 -3 167 -150 44
7775 44 124 2 -54 65 -65 -87 -114 144 25 -76 -154 -308 -11 1 8 80 -313 -180 -67 110 -34 86 -218
7798 -218 -133 -34 104 -2 -13 -111 -67 145 45 2 57 52 -53 -36 154 68 58 -243 70 201 41 -26 -148 118
7822 118 -19 -96 -32 67 -34 28 95 -260 50 -71 -230 84 194 -28 43 3 96 123 -108 -86 39 -77 9 58
7846 58 120 77 58 -220 131 -12 126 -21 -88 -13 -35 -179 -26 97 -10 30 47 100 -31 -49 79 172 181 44 70
7871 70 -24 -141 183 116 109 -89 96 146 -15 -90 36 145 -138 -46 -32 -256 95 -113 -8 -87 -91 26 -4 -51 -19
7896 -19 -34 122 -12 -186 79 -158 8 -217 77 -102 -173 -23 49 59 -8 54 50 -169 -42 167 15 143 -122
7919 -122 61 94 -130 -110 12 93 -62 -25 -110 -288 182 -164 -138 -84 103 -129 159 -78 -74 85 -81 62 -37
7942 -37 106 241 -6 -10 89 -17 16 70 -8 -209 14 -163 173 -223 -68 -56 20 -59 -221 -105 63 58 90 -11
7966 -11 -50 -107 66 -54 31 -70 -10 226 -21 -44 133 -3 70 -33 -128 150 -249 -204 -19 96 89 60 22 -149
7990 -149 -9 18 -67 29 53 59 83 -40 -65 -35 -203 -211 1 -38 -143 -67 28 -174 14 83 165 134 77 43 6 -1 4 44
8018 44 99 68 -46 -14 -49 80 155 90 50 203 171 23 97 40 6 32 -121 22 -42 -5 -81 -116 -12 -27 8 -299
8044 -299 134 60 20 99 -56 -51 44 19 -21 70 9 -107 62 15 80 53 -68 122 17 98 -87 86 5 77 11 155
8070 155 -18 144 135 237 271 28 54 63 248 71 21 7 68 2 55 -116 4 -7 -122 118 -217 27 179 -110
8094 -110 25 16 59 5 2 192 -113 21 -129 -114 -70 122 40 -146 -12 -16 -15 -41 129 69 -111 -6 135 -87 -66
8119 -66 113 172 20 -246 88 32 58 -42 -90 0 -90 -44 -100 -75 17 -47 112 -141 71 -40 -17 0 -63 68 -29
8144 -29 -103 36 -229 -89 4 -99 63 -43 154 116 -8 75 -113 31 169 35 52 72 8 71 -107 28 182
8167 182 -181 199 132 -69 26 54 56 115 117 -11 80 234 -37 -15 23 -123 49 149 83 -187 -29 24 -158 -113
8191a13
##END NTUPLES=NMR FID
##END=
