##TITLE=1H_CA-8784-1
 CDCl3, 8 sc, 
 21.10.2020
##JCAMPDX= 6.0         $$ Bruker NMR JCAMP-DX V2.0
##DATA TYPE= NMR FID
##DATA CLASS= NTUPLES
##ORIGIN= UXNMR, Bruker Analytische Messtechnik GmbH
##OWNER= root
$$ XWIN-NMR		Version 3.5
$$ Wed Oct 21 11:44:20 2020 Russian Standard Time (UT+4h)  she@DPX200
##.OBSERVE FREQUENCY= 200.1315066352
##.OBSERVE NUCLEUS= ^1H
##.DELAY= (6, 6)
##.ACQUISITION MODE= SIMULTANEOUS
##.ACQUISITION SCHEME= undefined
##.AVERAGES= 8
##.DIGITISER RES= 18
##SPECTROMETER/DATA SYSTEM= spect
##.PULSE SEQUENCE= zg30
##.SOLVENT NAME= CDCl3
##.SHIFT REFERENCE= (INTERNAL, CDCl3, 0, 15.7039)
##AUDIT TRAIL= $$ (NUMBER, WHEN, WHO, WHERE, WHAT)
$$ ##TITLE= Audit trail, XWIN-NMR		Version 3.5
$$ ##JCAMPDX= 5.01
$$ ##ORIGIN= Bruker BioSpin GmbH
$$ ##OWNER= she
$$ F:/spectra/data/she/nmr/H-F/1/audita.txt
$$ ##AUDIT TRAIL=  $$ (NUMBER, WHEN, WHO, WHERE, WHAT)
(   1,<2020-10-21 11:43:13.43 +0400>,<she>,<DPX200>,
      <created by zg, POWCHK disabled, PULCHK disabled
       configuration hash MD5:
       00 E9 B6 7A A2 85 ED C7 34 08 36 98 17 FE 4E 26
       data hash MD5: 16K
       8C 72 36 A4 3C D1 D1 46 93 FD 56 FA B7 10 4B 02>)
$$ ##END=
$$ 
$$ hash MD5
$$ 35 4D 0A 34 48 83 79 3A 94 17 4A DB 29 E4 07 3C
##$RELAX= 
##$RELAX= 
##$RELAX= 
##$RELAX= 
##$RELAX= 
##$RELAX= 
$$ Bruker specific parameters
$$ --------------------------
##$DU= <F:/spectra>
##$EXPNO= 1
##$NAME= <H-F>
##$PROCNO= 1
##$TYPE= <nmr>
##$USER= <she>
##$AMP= (0..31)
100 100 100 100 100 100 100 100 100 100 100 100 100 100 100 100 100 100 
100 100 100 100 100 100 100 100 100 100 100 100 100 100 
##$AQSEQ= 0
##$AQ_mod= 1
##$AUNM= <au_zg>
##$AUTOPOS= <>
##$BF1= 200.13
##$BF2= 200.13
##$BF3= 200.13
##$BF4= 200.13
##$BF5= 200.13
##$BF6= 200.13
##$BF7= 200.13
##$BF8= 200.13
##$BYTORDA= 1
##$CFDGTYP= 0
##$CFRGTYP= 5
##$CHEMSTR= <none>
##$CNST= (0..31)
1 1 145 1 1 1 1 1 1 1 1 1 1 1 1 1 1 1 1 1 1 1 1 1 1 1 1 1 1 1 1 1 
##$CPDPRG= <>
##$CPDPRG1= <>
##$CPDPRG2= <>
##$CPDPRG3= <>
##$CPDPRG4= <mlev>
##$CPDPRG5= <mlev>
##$CPDPRG6= <mlev>
##$CPDPRG7= <mlev>
##$CPDPRG8= <mlev>
##$CPDPRGB= <>
##$CPDPRGT= <>
##$D= (0..31)
0 1.2 0 0 0 0 0 0 0 0.06 0 0.03 0 0 0 0 0.0002 0 0 0 0 0 0 0 0 0 0 0 0 
0 0 0 
##$DATE= 1603266192
##$DBL= (0..7)
120 120 120 120 120 120 120 120 
##$DBP= (0..7)
150 150 150 150 150 150 150 150 
##$DBP07= 0
##$DBPNAM0= <>
##$DBPNAM1= <>
##$DBPNAM2= <>
##$DBPNAM3= <>
##$DBPNAM4= <>
##$DBPNAM5= <>
##$DBPNAM6= <>
##$DBPNAM7= <>
##$DBPOAL= (0..7)
0.5 0.5 0.5 0.5 0.5 0.5 0.5 0.5 
##$DBPOFFS= (0..7)
0 0 0 0 0 0 0 0 
##$DE= 6
##$DECBNUC= <off>
##$DECIM= 32
##$DECNUC= <off>
##$DECSTAT= 4
##$DIGMOD= 1
##$DIGTYP= 9
##$DL= (0..7)
0 120 120 120 120 120 120 120 
##$DP= (0..7)
150 150 150 150 150 150 150 150 
##$DP07= 0
##$DPNAME0= <>
##$DPNAME1= <>
##$DPNAME2= <>
##$DPNAME3= <>
##$DPNAME4= <>
##$DPNAME5= <>
##$DPNAME6= <>
##$DPNAME7= <>
##$DPOAL= (0..7)
0.5 0.5 0.5 0.5 0.5 0.5 0.5 0.5 
##$DPOFFS= (0..7)
0 0 0 0 0 0 0 0 
##$DQDMODE= 0
##$DR= 18
##$DS= 0
##$DSLIST= <SSSSSSSSSSSSSSS>
$$ [...]
##$SUBNAM2= <"">
##$SUBNAM3= <"">
##$SUBNAM4= <"">
##$SUBNAM5= <"">
##$SUBNAM6= <"">
##$SUBNAM7= <"">
##$SUBNAM8= <"">
##$SUBNAM9= <"">
##$SW= 16.880792210976
##$SWIBOX= (0..15)
0 0 2 0 0 0 0 0 0 0 0 0 0 0 0 0 
##$SW_h= 3378.37837837838
##$TD= 16384
##$TD0= 1
##$TE= 0
##$TE2= 300
##$TE3= 300
##$TEG= 300
##$TL= (0..7)
0 120 120 120 120 120 120 120 
##$TP= (0..7)
150 150 150 150 150 150 150 150 
##$TP07= 0
##$TPNAME0= <>
##$TPNAME1= <>
##$TPNAME2= <>
##$TPNAME3= <>
##$TPNAME4= <>
##$TPNAME5= <>
##$TPNAME6= <>
##$TPNAME7= <>
##$TPOAL= (0..7)
0.5 0.5 0.5 0.5 0.5 0.5 0.5 0.5 
##$TPOFFS= (0..7)
0 0 0 0 0 0 0 0 
##$TUNHIN= 0
##$TUNHOUT= 0
##$TUNXOUT= 0
##$USERA1= <user>
##$USERA2= <user>
##$USERA3= <user>
##$USERA4= <user>
##$USERA5= <user>
##$V9= 5
##$VALIST= <valist>
##$VCLIST= <CCCCCCCCCCCCCCC>
##$VD= 0
##$VDLIST= <DDDDDDDDDDDDDDD>
##$VPLIST= <PPPPPPPPPPPPPPP>
##$VTLIST= <TTTTTTTTTTTTTTT>
##$WBST= 1024
##$WBSW= 4
##$XGAIN= (0..3)
0 0 0 0 
##$XL= 0
##$YL= 0
##$YMAX_a= 433743
##$YMIN_a= -253622
##$ZGOPTNS= <>
##$ZL1= 120
##$ZL2= 120
##$ZL3= 120
##$ZL4= 120
##$ABSF1= 10
##$ABSF2= 0
##$ABSG= 5
##$ABSL= 3
##$ALPHA= 0
##$AQORDER= 0
##$ASSFAC= 0
##$ASSFACI= 0
##$ASSFACX= 0
##$ASSWID= 0
##$AUNMP= <proc_1d>
##$AZFE= 0.1
##$AZFW= 0.1
##$BCFW= 1
##$BC_mod= 2
##$BYTORDP= 1
##$COROFFS= 0
##$CY= 11.3945322036743
##$DATMOD= 1
##$DC= 2
##$DFILT= <>
##$DTYPP= 0
##$F1P= 16.9975609425685
##$F2P= -3.02152046262296
##$FCOR= 0.5
##$FTSIZE= 0
##$FT_mod= 4
##$GAMMA= 1
##$GB= 0.15
##$INTBC= 1
##$INTSCL= 1
##$ISEN= 128
##$LB= 0.24
##$LEV0= 0
##$LPBIN= 0
##$MAXI= 10000
##$MC2= 0
##$MEAN= 0
##$ME_mod= 0
##$MI= 1.114404
##$NCOEF= 0
##$NC_proc= 0
##$NLEV= 6
##$NOISF1= 3.799351
##$NOISF2= 2.8
##$NSP= 1
##$NTH_PI= 0
##$NZP= 0
##$OFFSET= 15.70392
##$PC= 1
##$PHC0= -10686.62
##$PHC1= 10.20089
##$PH_mod= 1
##$PKNL= yes
##$PPARMOD= 0
##$PSCAL= 0
##$PSIGN= 0
##$REVERSE= no
##$SF= 200.130013532006
##$SI= 16384
##$SIGF1= 3
##$SIGF2= 2
##$SINO= 400
##$SIOLD= 16384
##$SREGLST= <1H.CDCl3>
##$SSB= 0
##$STSI= 0
##$STSR= 0
##$SW_p= 3612.71676300578
##$SYMM= 0
##$S_DEV= 0
##$TDeff= 0
##$TDoff= 0
##$TI= <>
##$TILT= no
##$TM1= 0
##$TM2= 0
##$TOPLEV= 0
##$USERP1= <user>
##$USERP2= <user>
##$USERP3= <user>
##$USERP4= <user>
##$USERP5= <user>
##$WDW= 1
##$XDIM= 8192
##$YMAX_p= 0
##$YMIN_p= 0
$$ End of Bruker specific parameters
$$ ---------------------------------
##NTUPLES= NMR FID
##VAR_NAME=  TIME,          FID/REAL,        FID/IMAG
##SYMBOL=    X,             R,               I
##VAR_TYPE=  INDEPENDENT,   DEPENDENT,       DEPENDENT
##VAR_FORM=  AFFN,          ASDF,            ASDF
##VAR_DIM=   8192,          8192,            8192
##UNITS=     SECONDS,       ARBITRARY UNITS, ARBITRARY UNITS
##FACTOR=    0.000296,      1,               1
##FIRST=     0,             0,               0
##LAST=      2.424536,      0,               0
##MIN=       0,             -253622,         0
##MAX=       2.424536,      433743,          0
$$ Real data points
##PAGE= N=1
##DATA TABLE= (X++(R..R)), XYDATA
$$ [...]
$$ plain form
2193 1609 -2458 -1162 500 -1884 2132 3063 -930 -2264 385 -666 -84 3516 -612 -2951 596
2208 596 2712 -465 477 -486 -3715 786 3906 626 -2371 -716 -1991 -416 3566 195 -3696 -1064
2224 -1064 1805 -511 935 -479 -4278 -1509 3112 1260 -1624 -58 -2956 -2107 2810 1796 -2554
2239 -2554 -1480 375 -803 2336 1059 -3457 -2441 2701 1819 -383 1388 -1674 -2098 1791 2373 -869
2255 -869 680 821 -1902 1541 3206 -219 -2265 999 522 1285 4018 -264 -3528 -194 3052 654
2271 654 1667 210 -2729 751 4143 783 -2712 -40 -565 1257 3981 349 -3687 -813 2119
2286 2119 -277 1158 710 -1783 -788 2594 353 -1337 1038 -2061 -2037 2597 2588 -2302 -2091 -745 -1452
2303 -1452 1932 1394 -3019 -2807 1793 -7 -1791 143 -2409 -2919 194 1690 -2014 -857 -1482 -4382
$$ packed form
2193A609m067J296J662k384M016R31l993j334K649j051N82L600m128k339L547
2208E96K116l177R42r63l229M501L120l280k997J655j275J575L982l371l891K632
2224a064K869k316J446j414l799K769M621j852k884J566k898Q49M917j014m350
2239b554J074J855j178L139j277m516J016N142q82k202J771l062m24L889N82l242
2255h69J549J41k723L443J665l425k046L264m77P63K733m282l264L334L246k398
2271F54J013j457k939L480L392l360l495K672n25J822K724l632m036K874K932
2286B119k396J435m48k493R95L382k241j690K375l099K4M634rm890K11J346p07
2303a452L384n38m413K12M600j800j784J934k552n10L113J496l704J157o25k900
$$ plain form
2319 -4382 -636 2765 -907 -4041 -900 -1147 82 1760 -2198 -5034 -437 3071 -469 -348 -1134 -2934
2335 -2934 -263 3173 358 -2010 848 -373 101 2331 1032 -2437 33 2356 482 2399 2045
2350 2045 -1326 -1509 2927 2581 1048 1823 -789 -574 3512 3501 -1438 -426 1313 974 2634 2651 -781
2367 -781 -1986 1872 1112 856 2575 155 -2296 568 3331 217 -143 -1040 -1557 1792 4267 -214
2383 -214 -3355 125 623 917 1479 239 -2284 365 2195 -679 453 325 -1756 -873 3312 1528
2399 1528 -1513 -642 -1533 -97 2553 1558 -2756 -817 1312 -153 445 242 -1888 -2138 1955 958 -337
2416 -337 64 -2047 -2553 1013 2923 -1373 -1878 -453 -821 576 1308 -1834 -3340 1112 640 -21 252
2433 252 -1539 -3629 -163 2384 -735 -826 -988 -1908 -340 2117 -871 -3283 -407 28 -136 1168 -220
$$ packed form
2319d382L746L401l672l134L141k47J229J678l958k836M597L508l540J21p86j800
2335b934K671L436k815k368K858j221M74K230j299l469K470K323j874J917l54
2350B045l371j83M436l46j533P75k612K15M086j1m939J012J739l39J660J7l432
2367g81j205L858p60k56J719k420k451K864K763l114l60q97n17L349K475m481
2383b14l141L480M98K94N62j240k523K649J830k874J132j28k081Q83M185j784
2399A528l041Q71q91J436K650r95m314J939K129j465N98k03k130k50M093r97j295
2416c37M01k111n06L566J910m296n05J425l68J397P32l142j506M452m72o61K73
2433B52j791k090L466K547l119r1j62r20J568K457k988k412K876M35j64J304j388
$$ plain form
2450 -220 -3797 -1724 1208 21 300 -548 -2597 -1740 2399 323 -2690 -1245 -843 -610 1448 1275 -3009
2467 -3009 -1406 136 -718 316 1918 -1003 -2838 1603 1407 194 108 -1134 -1552 2552 3574 -1126
2483 -1126 -1314 287 532 1041 2817 271 -1173 1490 1380 1092 1999 574 -2223 1161 4212 1265
2499 1265 46 -196 -417 993 3890 716 -1532 787 1217 421 1355 1358 -1868 -132 1647 679 553
2516 553 550 -1989 -1956 2522 1406 -915 -755 -804 -953 1393 1347 -2597 -1586 216 218 309 1216 -1978 -3010
2535 -3010 901 1327 184 -206 -767 -2426 950 2414 -1010 -1772 -657 -197 569 2650 -837 -2931
2551 -2931 -211 1142 1055 1027 -500 -2489 837 2494 -155 -1038 34 -39 -173 2143 125 -1117 -300
2568 -300 -285 -622 1803 1966 -2279 -1618 654 1037 335 -112 -2259 -1518 2563 1082 -1310 -1583 -615 -906
$$ packed form
2450b20l577K073K932j187K79q48k049Q57M139k076l013J445M02K33K058j73m284
2467c009J603J542q54J034J602k921j835M441j96j213q6j242m18M104J022m700
2483a126j88J601K45N09J776k546j444K663j10k88R07j425k797L384L051k947
2499A265j219k42k21J410K897l174k248K319M30p96R34Ll226J736J779r68j26
2516E53lk539L3M478j116k321J60m9j49K346m6l944J011J802KR1R07l194j032
2535c010L911M26j143l90n61j659L376J464l424p62J115M60P66K081l487k094
2551b931K720J353q7k8j527j989L326J657k649q83J072p3j34K316k018j242Q17
2568c00J5l37K425J63m245O61K272L83p02m47k147P41M081j481k392k73R68k91
$$ plain form
2586 -906 932 1392 -1655 -1448 -403 -184 105 1269 -1507 -2712 655 1743 405 -757 -1355 -2292 1189
2603 1189 2511 -656 -1707 -284 312 46 1650 -646 -1759 403 1342 252 597 457 -2014 -65
2619 -65 1690 688 -141 477 -894 -982 2233 1183 -980 -1230 87 148 1842 1586 -2585 -1786 953 1580
2637 1580 -94 280 -1665 -1308 1710 1282 -1061 -977 192 -834 1312 1711 -1075 -1953 28 733 602
2654 602 1777 -860 -1937 907 2007 -31 -439 96 -990 1254 2211 125 -1139 320 -52 325
2670 325 2478 852 -1278 -253 1023 298 1037 663 -1703 -201 1898 1211 -484 -56 -1293 -912 2425
2687 2425 1509 -1204 -1329 76 -547 1506 609 -2494 -1857 1278 1228 -475 -259 -1947 -1207 1284 887
2704 887 -1208 -865 -153 -1208 463 937 -911 -1606 35 52 1 1258 -1130 -2148 -381 1407 129
$$ packed form
2586i06J838M60l047K07J045K19K89J164k776j205L367J088j338j162n98r37L481
2603A189J322l167j051J423N96k66J604k296j113K162R39j090L45j40k471J949
2619f5J755j002q29O18j371q8L215j050k163k50J317O1J694k56m171P99K739O27
2637A580j674L74j945L57L018m28k343Q4J169j026K146L99k786q78J981P05j31
2654F02J175k637j077K844J100k038m08N35j086K244R57k086j264J459l72L77
2670C25K153j626k130J025J276p25P39l74k366J502K099o87j695M28j237L81L337
2687B425r16k713j25J405o23K053q97l103O37L135n0j703K16j688P40K491l97
2704H87k095L43P12j055J671M74j848o95J641J7n1J257k388j018J767J788j278
$$ plain form
2721 129 257 -320 -2307 -4 1569 286 -1509 -539 -823 -44 1664 -432 -2483 -1383 663 -138 700
2738 700 -124 -2249 -1212 904 484 -1043 -380 -1555 -828 1622 811 -1796 -1866 113 -191 1301 623
2755 623 -1631 -1186 956 843 -352 639 -758 -684 1038 1741 -102 -201 188 -841 1190 2312 803
2772 803 -1131 195 623 1161 2028 -45 -1199 387 2370 949 538 -185 -1110 789 2368 1130 -757
2789 -757 283 -77 837 1786 392 -1273 -453 1568 492 825 401 -1050 -579 1602 1517 -128 422 -776
2807 -776 -228 1627 1897 -691 -722 749 554 1448 1038 -416 -1130 963 1068 530 1310 -36 -976 516
2825 516 1892 490 11 -489 -741 812 1877 -1 -2391 -522 314 574 788 -868 -2402 -669 958
2842 958 -253 -822 -1009 -1588 -934 763 -275 -2154 -1099 -1149 -888 178 -64 -2010 -1617 -174 -1034 -263
$$ packed form
2721A29J28n77j987K303J573j283j795R70k84P79J708k096k051J100K046q01Q38
2738G00q24k125J037K116m20j527O63j175P27K450q11k607p0J979l04J492o78
2755F23k254M45K142j13j195R91j397P4J722P03j843r9L89j029K031J122j509
2772H03j934J326M28N38Q67k073j154J586J983j421m11p23r25J899J579j238j887
2789g57J040l60R14R49j394j665Q20K021j076L33m24j451M71K181q5j645N50j198
2807g76N48J855K70k588l1J471j95Q94m10j454p14K093J05n38P80j346r40J492
2825E16J376j402m79n00k52J553J065j878k390J869Q36K60K14j656j534J733J627
2842I58j211n69j87n79O54J697j038j879J055n0K61J066k42j946L93J443q60P71
$$ plain form
2860 -263 -359 -1872 -2079 393 382 -827 -863 -1679 -1473 551 1459 -1164 -1788 -490 -342 482 784 -1086 -1625
2879 -1625 635 845 126 423 -916 -1638 620 2246 22 -557 -432 -478 577 1820 -30 -1583 511
2896 511 609 515 957 302 -1304 -150 1560 468 699 -222 -949 -451 1777 611 -994 -11 -78 279 1093
2915 1093 1084 -1091 -423 431 242 1040 873 -856 -1615 1374 1535 277 -149 -794 -662 1636 1884 -914
2933 -914 -878 333 557 1122 1072 -545 -1342 1137 901 297 498 -28 -861 628 1627 117 59 -323 -402 464
2953 464 1974 347 -1068 -186 61 719 1023 327 -1510 -276 1321 695 355 -331 -832 -352 1515 640
2971 640 -722 -329 -327 -253 810 1068 -948 -910 -107 418 844 422 -1532 -1700 1132 1254 -153 -886 -854 -277
2991 -277 666 732 -1213 -706 -136 8 -10 691 -522 -1499 -391 233 494 100 -538 -1722 -238 1128 203
$$ packed form
2860b63r6j513k07K472j1j209l6q16K06K024R08k623o24J298J48Q24L02j870n39
2879a625K260K10p19K97j339p22K258J626k224n79J25m6J055J243j850j553K094
2896E11R8r4M42o55j606J154J710j092K31r21p27M98K228j166j605R83o7L57Q14
2915A093rk175O68Q54j89P98j67j729p59K989J61j258m26o45J32K298K48k798
2933i14L6J211K24N65n0j617p97K479k36o04K01n26q33J489R99j510n8l82p9Q66
2953D64J510j627j415Q82K47O58L04o96j837J234J597o26l40o86n01M80J867q75
2971F40j362L93KP4J063K58k016L8Q03N25M26m22j954j68K832J22j407p33L2N77
2991b77R43O6j945N07N70J44j8P01j213r77J108O24K61l94o38j184J484J366r25
$$ plain form
3010 203 -469 -941 -382 -159 1236 77 -1263 -565 114 614 674 275 -1359 -503 687 668 536 -94 -797
3029 -797 -343 1524 759 -343 -680 -79 270 1385 1274 -866 -582 313 985 691 534 -437 -1035 1235
3047 1235 924 -142 -603 -113 -826 370 1120 -392 -714 -516 -510 -255 1035 -442 -1912 -619 504 104
3065 104 -401 -900 -1823 -148 738 -117 -879 -738 -811 -923 938 114 -1252 -1047 35 156 596 79 -1886
3084 -1886 -602 1014 736 -425 -392 -674 -541 1242 595 -321 -232 273 -326 919 1380 -550 -656 304
3102 304 910 704 726 -441 -1143 967 1305 174 -110 49 -652 486 1271 -86 -786 -70 163 288 1416
3121 1416 -373 -1237 -156 778 418 390 112 -1333 241 1222 457 -454 -393 -430 3 1599 195 -801 -542
3140 -542 297 317 805 244 -1143 -86 532 529 -88 357 -669 -613 820 608 -25 -627 -491 -519 1100 943
$$ packed form
3010B03o72m72N59K23J395j159j340O98O79N00O0l99j634Q56J190j9j32o30p03
3029g97M54J867p65j102l37O01L49J115j11k140K84Q95O72k94j57r71n98K270
3047A235l11j066m61M90p13J196P50j512l22J98OK55J290j477j470J293J123m00
3065A04n05m99r23J675Q86q55p62J41p3j12J861q24j366K05J082J21M40n17j965
3084a886J284J616k78j161L3k82J33J783o47r16Q9N05n99J245M61j930j06R60
3102C04O06k06K2j167p02K110L38j131k84J59p01J138P85j357p00P16K33J25J128
3121A416j789q64J081R34l60k8k78j445J574R81p65r11O1l7M33J596j404r96K59
3140e42Q39K0M88n61j387J057O18lo17M45j026N6J433k12o33o02J36k8J619j57
$$ plain form
3160 943 -849 -1071 93 879 159 333 -1027 -777 308 610 -66 -262 -394 -1147 474 766 -49 -585
3178 -585 -345 -168 178 1197 -330 -1018 -309 888 619 251 -161 -1025 -63 809 679 -256 -216 -381 -60
3197 -60 1256 337 -418 -765 196 323 886 420 -1141 -800 150 1013 89 -7 -960 -643 455 588 -206 -894
3217 -894 -477 -375 598 359 -582 -1158 -249 529 45 243 -583 -773 -14 818 228 -265 -341 -706 469 1281
3237 1281 540 -739 -239 319 500 985 211 -524 159 1019 501 586 276 -622 -16 1047 1320 -40 -157
3256 -157 -340 161 1098 1051 -552 -746 456 248 807 267 -797 -870 466 736 -109 -293 -785 -803 336
3275 336 570 -451 -838 -232 -802 178 566 -496 -1404 -127 359 60 147 -831 -1192 -492 816 -252 -542
3294 -542 -296 -874 54 964 408 -959 -373 -103 215 535 152 -1131 -488 651 264 436 -12 -856 -380
$$ packed form
3160I43j792k22J164P86p20J74j360K50J085L02o76j96j32p53J621K92q15n36
3178e85K40J77L46J019j527o88P09J197k69l68m12q64R62Q72j30r35M0j65L21
3197f0J316r19p55l47R61J27N63m66j561L41R50Q63r24r6r53L17J098J33p94o88
3217h94M17J02R73k39r41n76R09P78m84J98q26j90P59Q32n90m93p6l65J175Q12
3237A281p41j279N00N58J81M85p74p35O83Q60n18Q5l10q98O06J063K73j360j17
3256a57j83N01R37m7j603j94J202k08N59n40j064p3J336K70q45j84m92j8J139
3275C36K34j021l87O06n70R80L88j062r08J277M86k99Q7r78l61P00J308j068k90
3294e42K46n78R28R10n56j367N86K70L18L20l83j283O43J139l87J72m48q44M76
$$ plain form
3313 -380 811 722 -349 -150 -716 -171 854 642 -829 -625 123 14 570 277 -408 -629 366 411 369 -16
3333 -16 -588 -582 454 1004 -109 -456 -441 -537 465 853 -189 -904 -198 120 475 582 -477 -778 215 1091
3353 1091 177 143 -568 -497 386 915 350 -546 -44 -216 441 928 300 -886 -193 624 273 594 -142 -723
3373 -723 -358 609 705 -16 -192 -687 -99 656 555 -644 -349 151 68 608 318 -506 -799 275 374 417 128
3394 128 -396 -613 304 1112 19 -302 -416 -107 518 787 -26 -865 -66 225 676 382 -387 -639 7 875
3414 875 569 204 -359 -252 140 770 525 -367 -378 -223 350 514 438 -780 -381 325 487 240 -384 -659
3434 -659 -672 635 746 -290 -681 -625 -207 174 640 -510 -847 -306 181 84 141 -318 -1173 -120 461 311
3454 311 -454 -457 -736 -62 824 -164 -610 -582 4 93 529 75 -879 -85 252 248 178 50 -934 -347 925 406
$$ packed form
3313c80J191q9j071J99n66N45J025k12j471K04P48j09N56k93o85k21R95M5m2l85
3333a6n72OJ036N50j113l47J5r6J002L88j042p15P06L18L55J07j059l01R93Q76
3353A091r14l4p11P1Q83N29n65q96N02j72O57M87o28j186O93Q17l51L21p36n81
3373g23L65R67R6p21j76m95N88P55j01j199K95N00q3N40k90q24k93J074R9M3k89
3394A28n24k17R17Q08j093l21j14L09O25K69q13q39P99K91M51k94p69k52O46Q68
3414H75l06l65n63J07L92O30k45q92j1J55N73J64p6j218L99P06J62k47o24k75
3434f59j3J307J11j036l91N6M18L81M66j150l37N41M87r7N7m59q55J053N81j50
3454C11p65lk79O74Q86r88m46K8N86Q9M36m54r54P94L37mp0j28r84N87J272n19
$$ plain form
3476 406 -138 -433 -130 -125 839 385 -448 -405 18 202 524 375 -862 -627 129 362 95 216 -671 -702 773
3497 773 551 -246 -214 -398 -372 639 799 -243 -489 -179 324 426 585 -387 -916 420 435 327 -12 -285
3517 -285 -555 253 1040 20 -246 -275 -237 213 1069 12 -770 -115 92 374 350 109 -812 -142 767 435
3537 435 -159 -347 -502 -47 1001 260 -468 -162 -34 -54 602 462 -595 -346 -2 282 750 199 -747 -508
3557 -508 792 643 324 43 -157 -363 640 698 -182 -380 -300 392 703 622 -520 -563 435 407 567 -39 -192
3578 -192 -664 325 680 126 -250 -729 -181 82 663 -18 -639 -508 159 331 228 -522 -881 -237 60 295
3598 295 -144 -524 -706 -315 444 83 -239 -734 -355 20 401 495 -585 -642 -107 639 486 148 -823 -368
3618 -368 190 599 214 -439 -486 -146 528 618 31 -341 -254 425 509 408 -167 -530 -13 511 553 -157 -250 -496
$$ packed form
3476D06n44k95L03NR64m54q33M3M23J84L22j49j237K35P56K33k67J21q87l1J475
3497G73k22p97L2j84K6J011J60j042k46L10N03J02J59r72n29J336J5j08l39k73
3517b85k70Q08P87j020k66k9L8M50Q56j057p82O55K07K82k4k41r21O70R09l32
3537D35n94j88j55M55J048p41p28L06J28k0O56j40j057K49L44K84M68n51r46K39
3557e08J300j49l19k81k00k06J003N8q80j98Q0O92L11q1j142m3R98k8J60o06j53
3578a92m72R89L55n54l76m79N48K63N81o81o21J31O67J72j03p50l59O44K97K35
3598B95m39l80j82L91P59l61l22m95L79L75L81R4j080n7N35P46j53l38r71M55
3618c68N58M09l85o53m7L40O74R0n87l72Q7O79Q4j01n75l63N17N24M2p10r3k46
$$ plain form
3640 -496 249 412 441 -435 -504 -240 39 617 92 -324 -574 388 339 -54 11 -653 -199 200 566 -98 -305
3661 -305 -550 -542 588 478 -92 -786 -349 119 349 296 -485 -799 72 598 -170 216 -466 -523 247 686 43
3682 43 -596 -12 -202 140 546 -99 -722 -139 142 49 693 -229 -677 -172 515 141 74 -27 -590 142 723
3703 723 614 -357 -21 -104 117 847 483 -573 -352 499 440 549 207 -430 -355 561 533 -21 122 -343 10
3724 10 802 693 -283 -403 120 -96 330 359 -229 -374 115 356 358 520 -390 -263 285 602 122 -214 -300 -368
3746 -368 540 422 -57 -601 -129 -279 158 664 -143 -732 -245 147 393 333 -457 -853 245 683 402 -556
3766 -556 -258 -425 211 519 241 -443 -434 31 355 505 23 -321 -340 267 413 123 -15 -512 123 214 436
3787 436 274 -288 -228 -275 552 125 -157 -431 -322 108 376 135 -585 -291 237 481 354 -133 -694 -314 302
$$ packed form
3640d96P45J63K9q76o9K64K79N78n25m16k50R62m9l93O5o64M54L99L66o64k07
3661c05k45QJ130j10n70o94M37M68K30n3p81l14Q71N26p68L86o82n7P70M39o43
3682D3o39N84j90L42M06o45o23N83K81r3O44r22m48N05O87l74o7j01n63P32N81
3703G23j09r71L36q3K21P30l64j056K21Q51n9J09l42o37P5R16k8n54J43m65L53
3724A0P92j09r76j20N23k16M26K9n88j45M89K41KJ62r10J27N48L17m80l36q6o8
3746c68R08j18m79n44M72j50M37N06q07n89M87L92K46o0p90l96J098M38k81r58
3766e56K98j67O36L08k78o84RM65L24J50m82l44j9O07J46k90j38m97O35R1K22
3787D36j62n62O0m7Q27m27k82k74J09M30K68k41p20K94N28K44j27m87n61L80O16
$$ plain form
3808 302 501 133 -463 -515 -101 321 202 -243 -647 -472 340 473 71 -585 -619 -42 332 336 -296 -539 -211
3829 -211 265 104 189 -169 -401 79 270 421 -154 -430 -471 161 534 139 -174 -163 -194 244 526 227 -426
3850 -426 -421 -30 546 403 -104 -666 -220 637 612 -148 -80 -210 -81 637 246 -60 -157 -208 215 597 462 -589
3872 -589 -362 198 477 191 18 -476 -203 640 289 213 -227 -452 -201 334 657 -302 -267 -329 162 217 498
3893 498 -408 -574 16 132 275 221 -132 -746 57 433 71 -288 -384 -350 319 674 -204 -285 -282 -156 191 633
3915 633 -338 -594 -30 376 171 15 -158 -475 200 577 79 98 -34 -42 264 885 333 -273 2 172 260
3936 260 445 58 -611 25 340 155 437 57 -340 -386 516 383 188 -344 -481 119 575 282 -453 -329
3956 -329 -153 353 202 -21 -464 -503 158 -58 232 -124 -733 -544 522 615 -85 -328 -184 -130 371 190 -359
$$ packed form
3808C02J99l68n96n2M14M22j19m45m04J75Q12J33m02o56l4N77L74Mo32k43L28
3829b11M76j61Q5l58k32M80J91J51n75k76m1O32L73l95l13J1l1M38K82k99o53
3850d26NL91N76j43n07n62M46Q57k5p60O8j30J29P18l91l06r7n1M23L82j35j051
3872e89K27N60K79k86j73m94K73Q43l51p6m40k25K51N35L23r59L5o2M91N5K81
3893D98r06j66N90J16J43n4l53o14Q03L76l62l59r6L4O69L55q78q1LJ26L47M42
3915F33r71k56N64M06k05j56j73l17O75L77m98J9j32qL06O21n52o06K75J70Q8
3936B60J85l87o69O36L15j85K82l80l97m6R02j33j95n32j37O00M56k93p35J24
3956c29J76N06j51k23m43l9O61k16K90l56o09J89J066R3p00k43J44N4N01j81n49
$$ plain form
3977 -359 -545 -156 25 362 111 -566 -271 8 234 170 15 -391 -380 56 478 171 -187 -438 -226 593 590
3998 590 -112 -367 -173 151 435 459 -48 -372 -144 425 406 144 -488 -325 190 549 191 -280 -12 -250 384
4019 384 269 243 -149 -560 -232 147 494 -228 -523 -220 412 437 145 -329 -414 133 375 159 135 -197 -218 150
4041 150 427 154 -100 -398 -183 309 749 -53 -646 -143 77 284 325 -158 -494 -118 260 490 226 -520
4061 -520 -247 182 566 -48 -289 -244 -136 511 360 -79 -555 -68 -71 309 210 -219 -303 -71 496 93 411 -57
4083 -57 -680 100 393 330 -245 -110 -443 260 626 369 -415 -129 -1 121 638 327 -394 -131 180 439 165
4104 165 76 -573 -233 504 409 -69 -215 -270 -83 576 181 -433 -302 -32 -25 471 220 -540 -356 48 497 8
4126 8 -268 -372 -249 252 309 183 -259 -119 -423 293 504 -218 -373 -313 169 329 273 -451 -526 86 425 356
$$ packed form
3977c59j86L89J81L37k51o77K95K79K26o4j55m06J1M36M22l07l58k51K12Q19l
3998E90p02k55J94L24K84K4n07l24K28N69j9k62o32J63N15L59l58m71K68k38O34
4019C84j15k6l92m11L28L79L47p22k95L03O32K5k92m74q5N47K42k16k4l32k1L68
4041A50K77k73k54k98K15M92M40q02n93N03K20K07M1m83l36L76L78K30k64p46
4061e20K73M29L84o14k41M5J08O47j51m39m76M87lL80r9m29q4K32N67m03L18m68
4083e7o23P80K93o3n75J35l33P03L66k57p84K86J28J22N17l11p21K63L11K59k74
4104A65q9o49L40P37r5m78j46n5J87O59l95o14J31K70PM96k51p60J84M04M49m89
4126Hk76j04J23N01N7j26m42J40l04P16K11p22j55O0M82J60n6p24p5O12L39o9
$$ plain form
4148 356 6 -82 -558 146 631 135 -181 -160 -95 296 756 -106 -385 -136 320 251 354 -98 -468 -119 211
4169 211 399 188 45 -257 110 481 144 2 -257 -177 -148 632 11 -209 -428 -18 338 507 36 -474 -195
4190 -195 201 139 88 -314 -193 -166 322 274 87 -412 -525 -14 442 146 -679 -243 -149 241 313 -143 -463 -472 92
4213 92 164 334 -206 -312 -357 126 301 -283 -234 -431 36 232 111 -213 -340 -54 -63 309 -30 -274 -476 57
4235 57 409 248 114 -441 -130 118 189 120 -70 -321 -318 305 544 28 -337 -79 12 565 302 -386 -208 -71
4257 -71 195 376 172 -412 -369 38 170 150 -122 -334 -390 332 258 -189 -256 -255 -229 50 328 -442 -386 -283 167
4280 167 376 321 -383 -416 503 330 62 -12 -81 -432 145 432 -221 41 -243 -191 278 627 76 -388 -162 27
4302 27 515 275 21 -451 88 287 241 182 -327 -183 40 668 -48 -192 -253 -108 164 263 -26 -463 -220 101
$$ packed form
4148C56l50q8m76P04M85m96l16K1O5L91M60q62k79K49M56o9J03m52l70L49L30
4169B11J88k11j43l02L67L71l37j42k59Q0K9P80o21k20k19M10L56J69m71n10K79
4190a95L96o2n1m02J21K7M88m8j87m99j13N11M56k96q25M36R4L90P2m56l20rN64
4213I2P2J70n40j06m5M83J75n84M9j97M67J96j21l24j27K86rL72l39k44k02N33
4235E7L52j61j34n55L11K48P1o9j90k51LO23K39n16l65K58R1N53k63o88J78J37
4257g1K66J81k04n84M3M07J32k0k72k12n6P22p4m47o7JK6K79K78p70N6J03M50
4280A67K09n5p04l3R19j73k68p4o9l51N77K87o53K62k84N2M69L49n51m64K26J89
4302B7M88k40k54m72N39J99m6n9n09J44K23O28p16j44o1J45K72R9k89m37K43L21
$$ plain form
4324 101 134 499 -201 -484 196 435 71 -160 -137 -301 -79 185 181 -228 -64 -438 -79 285 41 -339 -260 76
4346 76 195 145 -20 -618 -356 155 -28 107 -132 -568 -321 213 194 -156 -315 -228 91 630 34 -392 -334 -11
4368 -11 33 149 -82 -369 -335 56 416 349 20 -228 -432 442 527 -182 -250 -118 -24 350 363 -117 -270 -156 147
4391 147 -23 274 -245 -391 221 295 328 22 -285 -200 173 279 161 -328 -298 -32 384 577 -192 -344 -148
4412 -148 223 198 577 -17 -301 21 171 328 198 -347 -370 237 388 52 -214 -308 -186 199 289 -175 -262 -405
4434 -405 -126 120 93 -77 -589 -58 128 211 11 -234 -263 138 327 157 160 -229 -373 56 535 279 -288 -334
4456 -334 -226 403 160 -37 -471 -142 329 51 114 -158 -311 60 370 240 220 -74 -302 11 259 128 -171
4477 -171 -138 -255 201 450 -47 -384 -238 90 263 186 -46 -513 -53 113 59 72 -56 -412 -200 315 321 -196
$$ packed form
4324A01L3L65p00k83O80K39l64k31K3j64K22K64mm09J64l74L59L64k44l80P9L36
4346G6J19n0j65n98K62N11j83J35k39m36K47N34j9l50j59Q7L19N39n96m26N8L23
4368a1M4J16k31k87L4L91L60o7l29k48k04Q74Q5p09o8J32R4L74J3m80j53J14L03
4391A47j70K97n19j46O12P4L3l06l07Q5L73J06j18m89L0K66M16J93p69j52J96
4412a48L71k5L79n94k84L22J50J57j30n45k3O07J51l36k66r4J22L85R0m64q7j43
4434d05K79K46k7j70n12N31J86Q3k00k45k9M01J89j70Ll89j44M29M79k56n67m6
4456c34J08O29k43j97m34L29M71k78O3k72j53L71L10j30k0k94k28L13K48j31k99
4477a71L3j17M56K49m97l37J46L28J73p7k32m67M60J66n4J3j28l56K12N15On17
$$ plain form
4499 -196 -378 -378 -32 492 190 -342 -392 89 199 54 146 -492 -218 118 153 334 -211 -363 -90 569 423 -394
4521 -394 -290 -166 120 33 273 -133 -212 241 254 182 229 -342 -222 312 391 300 -273 -76 74 116 401 7 -63
4544 -63 -137 224 363 472 -31 -214 -137 263 241 234 -3 -444 68 332 200 -35 -23 -393 341 415 -59 -460 -369
4567 -369 -102 249 116 -101 -347 -300 67 97 148 -230 -276 -220 279 173 70 -304 -179 -111 275 249 -221 -238 -169
4590 -169 -133 384 321 -352 -235 -37 162 354 -288 -583 -339 555 36 62 61 -307 -142 357 459 -35 -155 -214
4612 -214 -88 680 175 -352 -294 144 225 250 -86 -195 -250 144 391 218 155 -349 -190 285 304 -30 -209 -357
4634 -357 -26 306 -185 -344 -250 -108 -194 209 134 -320 -228 -66 128 43 -56 -359 -337 190 250 26 -270 -376 -196
4657 -196 133 281 -419 -405 -84 242 79 88 -332 -339 92 275 158 154 24 -494 204 343 136 50 -120 -78 339
$$ packed form
4499a96j82%L46N24l02n32n0M81J10j45R2o38K74L36L5J81n45j52K73O59j46q17
4521c94J04J24K86q7K40m06p9M53J3p2M7n71J20N34P9r1n73J97J50M2K85l94p0
4544f3p4L61J39J09n03j83P7M00k2pk37m41N12K64j32k35J2l70P34P4m74m01R1
4567c69K67L51j33k17k46M7L67L0N1l78m6N6M99j06j03l74J25O8L86k6m70j7O9
4590a69L6N17o3o73J17J98J99J92o42k95K44Q94n19K6jl68J65M99J02m94j20n9
4612b14J26P68n05n27N8M38Q1K5l36j09n5L94K47j73o3n04J59M75J9l34j79j48
4634c57L31L32m91j59R4J42q6M03p5m54R2J62J94q5r9l03K2N27O0k24k96j06J80
4657a96L29J48p00J4L21L26j63Rm20pM31J83j17mj30n18O98J39k07q6j70M2M17
$$ plain form
4680 339 331 -5 -156 -228 -24 269 347 134 -337 5 211 511 109 -212 -2 75 490 -24 29 -112 -236 23
4702 23 418 267 -110 19 -130 229 142 -64 -555 -36 174 283 243 20 -356 -166 445 -18 -107 -273 -177 206
4724 206 125 136 -306 -34 3 27 243 35 -143 -181 6 216 208 -7 -419 -147 215 350 -115 -287 -213 21 205
4747 205 -4 -127 -266 -193 -48 256 -26 -425 -298 -84 137 82 36 -356 -179 168 190 12 -169 -247 -322 364
4769 364 138 -148 -267 -229 -58 111 101 -408 -332 -171 -42 -11 16 -327 -37 98 222 126 -135 -198 -382 201
4791 201 126 -384 -106 -60 19 209 524 45 -256 -23 49 462 53 -393 -273 287 370 121 -8 -69 -164 199
4813 199 364 112 23 -211 -15 203 375 107 -268 87 10 475 23 22 -170 215 371 176 130 -74 -229 103
4835 103 497 129 -117 -139 -98 245 146 287 -171 112 -122 139 349 -201 -278 -125 382 -27 65 -389 -249 -59
$$ packed form
4680C39ql36j51p2K04K93P8k13m71L42K06L00m02l21K10P7M15n14N3j41j24K59
4702B3L95j51l77J29j49L59q7k06m91N19K10J09m0k23l76J90O11m63q9j66R6L83
4724B06q1J1m42K72L7K4K16k08j78l8J87K10qk15m12K72L62J35m65j72P4K34J84
4747B05k09j23j39P3J45L04k82l99J27K14K21n5m6l92J77L47K2j78j81p8p5O86
4769C64k26k86j19L8J71J69j0n09P6J61J29L1K7l43K90J35J24r6k61o3j84N83
4791B01p5n10K78M6P9J90L15m79l01K33P2M13m09m46J20N60Q3k49j29o1r5L63
4813A99J65k52q9k34J96K18J72k68l75L55p7M65m52jj92L85J56j95m6k04j55L32
4835A03L94l68k46k2M1L43r9J41m58K83k34K61K10n50p7J53N07m09R2m54J40J90
$$ plain form
4857 -59 268 163 -183 -254 -314 -217 350 -16 -320 -324 227 47 42 -242 -553 -188 -32 91 31 -66 -236 -176 81 194
4881 194 -291 -286 -267 -10 216 146 -322 -22 -120 -82 216 78 -295 -145 13 296 179 -99 -356 -60 72 163
4903 163 -162 -225 -44 -363 278 266 42 -378 -220 201 361 -47 -176 -201 -31 201 88 -91 -260 -392 83
4924 83 40 30 -240 -282 3 96 197 -144 -212 -123 -33 61 20 112 -221 90 258 196 4 -101 -232 156 371 89
4948 89 -11 -299 53 208 227 42 -238 -143 -163 361 18 67 -218 -45 121 285 244 -142 -106 6 24 129 9
4971 9 -58 -296 66 259 -20 -310 -253 -119 260 215 -291 -126 -227 186 126 156 12 -298 -68 382 84 -77
4993 -77 -113 -332 37 215 -72 -7 -141 -18 25 304 104 -175 -261 124 356 265 80 -353 44 363 96 132
5015 132 -11 -177 31 412 389 -22 -56 -12 67 240 324 -469 -255 59 181 178 -59 -207 -251 295 94 -61 -242
$$ packed form
4857e9L27j05l46p1o0R7N67l66l04mN51j80nk84l11L65J56J23o0r7j70O0K57J13
4881A94m85NJ9K57K26p0m68L00r8L8K98j38l73J50J58K83j17k78k57K96J32R1
4903A63l25o3J81l19O41j2k24m20J58M21J60m08j29k5J70K32j13j79j69j32M75
4924H3m3j0k70m2K85R3J01l41o8Q9R0R4m1R2l33L11J68o2j92j05j31L88K15k82
4948H9j00k88L52J55J9j85k80R5k0N24l43M9k85J73J66J64m1l86L6J12J8J05j20
4971Io7k38L62J93k79k90N7J34L79m5n06J65j01M13o0L0j44l10K30M50k98j61
4993g7l6k19L69J78k87O5j34J23M3K79k00k79q6L85K32r1j85m33L97L19k67L6
5015A32j43j66K08L81k3m11l4M4P9J73Q4p93K14L14J22lk37j48m4N46k01j55j81
$$ plain form
5038 -242 -328 -250 132 259 -187 -334 -265 -26 219 195 -206 -275 209 183 84 122 -28 -348 267 330 -103 -72 -344
5061 -344 -193 234 100 -62 -261 -78 49 141 353 -132 -351 285 284 121 90 60 -262 -109 124 70 -149 -187
5083 -187 -256 93 359 -94 -213 -404 14 234 61 144 -254 -108 119 206 88 32 -158 -404 96 283 -175
5104 -175 -118 6 -90 115 139 -214 -140 -103 148 211 79 -81 -232 156 168 253 -79 -48 -44 343 308 -103 260 -194
5128 -194 84 206 107 75 -234 -179 250 391 160 -85 -128 20 204 337 110 -234 -116 -67 246 96 -29 49
5150 49 121 264 121 202 -217 63 -55 233 84 25 -124 -65 16 253 147 -248 -120 25 111 151 -74 -294 -429
5173 -429 165 209 -4 -214 -467 -176 319 260 -257 -201 -191 -71 158 -114 -112 -308 -120 89 169 7 -336 -273 52
5196 52 426 8 -151 -395 -212 284 278 -64 -446 -61 45 121 103 -27 -177 -53 236 242 242 -217 -289 163 330
$$ packed form
5038b42q6P8L82J27m46j47O9K39K45k4m01o9M84k6r9L8j50l20O15O3m33L1k72
5061c44J51M27j34j62j99J83J27R2K12m85k19O36jj63l1l0l22J53K33n4k19l8
5083a87o9L49K66m53j19j91M18K20j73Q3l98J46K27Q7j18n6j90k46N00J87m58
5104a75N7J24r6K05K4l53P4L7K51O3j32j60j51L88J2Q5l32L1ML87l5m11L63m54
5128a94K78J22r9l2l09N5M29J41k31k45m3J48J84J33k27l44J18M9L13j50j25P8
5150D9P2J43j43Q1m19K80j18K88j49n9j49N9Q1K37j06l95J28J45Q6M0k25k20j35
5173d29N94M4k13k10k53K91M95n9n17N6J0J20K29k72Kj96J88K09Q0j62l43O3L25
5196E2L74m18j59k44J83M96ol42l82L85J06P6j8j30j50J24K89O%m59p2M52J67
$$ plain form
5219 330 -1 -35 -70 -205 12 198 93 -376 -191 85 183 206 25 -288 -333 232 122 -20 -136 -379 41 203
5241 203 81 -152 9 -34 48 222 194 -154 -167 8 73 261 57 -239 -215 136 20 95 94 -259 10 189 282
5264 282 -186 -107 50 -97 221 231 -36 -32 28 206 268 141 -220 -213 36 261 58 -87 -155 5 122 293 63
5287 63 -100 53 -32 226 210 93 -148 -164 -10 97 310 -63 -198 101 214 256 21 56 -129 250 -20 107
5309 107 -88 22 -68 -18 288 -147 -197 -96 -83 119 -52 -56 -141 -113 78 101 -91 -356 -266 17 38 139 -92 -297
5333 -297 -176 69 -16 196 -305 -121 -14 233 243 -45 -172 -107 138 109 174 -99 -238 -14 196 94 10 -254
5355 -254 -107 139 205 14 80 -149 -152 278 119 -63 -90 -178 138 -41 149 -283 -169 -134 281 77 5 56 -288
5378 -288 77 84 181 9 -169 -221 226 214 215 -470 -329 117 -30 237 -255 -144 81 -22 -47 -82 -52 -138 -213 199
$$ packed form
5219C30l31l4l5j35K17J86j05m69J85K76R8K3j81l13m5N65j10j42j16k43M20J62
5241B03j22k33J61m3Q2J74k8l48j3J75O5J88k04k96K4L51j16P5jl53K69J79R3
5264B82m68P9J57j47L18J0k67MO0J78O2j27l61PK49K25k03j45o8J60J17J71k30
5287F3j63J53q5K58j6j17k41j6J54J07K13l73j35K99J13M2k35L5j85L79k70J27
5309A07j95J10r0N0L06m35n0J01J3K02j71mq5K8J91K3j92k65R0K83K1J01k31k05
5333b97J21K45q5K12n01J84J07K47J0k88j27O5K45k9O5k73j39K24K10j02q4k64
5355b54J47K46O6j91O6k29lM30j59j82k7q8L16j79J90m32J14L5M15k04p2N1l44
5378b88L65PR7j72j78n2M47j2Jo85J41M46j47K67m92J11K25j03k5l5L0q6p5M12
$$ plain form
5402 199 15 -166 -104 -109 173 253 -147 -240 11 152 -37 46 166 -319 40 81 128 -87 34 -102 61 215 135
5425 135 -108 -129 -303 77 193 312 -108 -83 131 -22 72 256 -99 -153 300 268 7 -217 -118 -296 117 347
5447 347 138 -63 -38 -78 -57 262 -143 -275 -165 44 161 148 -150 -184 53 -23 11 -50 -184 -47 162 92 -96
5470 -96 -176 -69 -63 57 152 -66 -402 -118 190 45 142 -47 -340 58 325 136 4 -234 -155 12 194 199 -101
5493 -101 -125 -287 173 101 109 -309 -195 -97 297 134 -187 -182 -61 101 3 77 -123 -301 -41 167 102 1 -39 -216
5517 -216 -56 263 -43 102 -498 -69 221 228 141 -179 -100 -50 208 -24 1 -147 144 204 156 97 -174 -21 46
5540 46 351 -24 117 -247 131 155 0 36 -47 17 -37 236 283 10 -176 -96 140 383 49 74 -271 -214 314
5563 314 -70 -118 -206 -200 -34 213 110 -178 -23 -97 -49 91 14 -129 38 19 197 75 -100 -188 -182 275 313 -83
$$ packed form
5402A99j84j81O2nK82Q0m00r3K51J41j89Q3J20m85L59M1M7k15J21j36J63J54q0
5425A35k43k1j74L80J16J19m20K5K14j53R4J84l55n4M53l2k61k24R9j78M13K30
5447C47k09k01K5m0K1L19m05j32J10K09J17j3k98l4K37p6L4o1j34J37K09p0j88
5470i6q0J07OJ20R5k18l36K84L08j45R7j89k93L98K67j89j32k38P9J67J82Nl00
5493a01k4j62M60p2Qm18J14R8L94j63l21NJ21J62r8P4k00j78K60K08o5j01m0j77
5517b16J60L19l06J45o00M29K90Pq7l20P9N0K58k32K5j48K91O0m8n9k71J53O7
5540D6L05l75J41l64L78K4j55L6q3O4n4K73M7k73j86Q0K36K43l34K5l45N7N28
5563C14l84m8q8OJ66K47j03k88J55p4M8J40p7j43J67j9J78j22j75q8OM57L8l96
$$ plain form
5587 -83 -83 -166 57 261 268 -71 -120 -30 -69 130 320 -229 -47 63 266 28 -102 -226 -103 88 48 0 -111 -107
5611 -107 -169 91 118 -61 -175 -102 45 330 54 -154 -246 -133 183 148 25 -199 -358 251 67 44 -218 112
5633 112 -171 67 226 -175 -250 -95 56 -90 -11 -57 -121 37 311 6 -94 23 -191 -51 277 -2 -206
5654 -206 -186 -31 -72 202 61 -251 -72 121 20 8 309 -119 -80 101 60 182 -38 -112 -83 109 -122 -198 1
5677 1 47 126 266 13 -64 -237 -34 65 -15 47 -113 -277 65 88 47 -173 -185 -47 174 44 -143 -162 -206 414
5701 414 75 85 -221 -160 -58 -84 277 -182 -132 -25 14 28 219 34 20 17 67 78 18 -73 -204 271 294 74 29
5726 29 -193 -58 21 170 49 -95 -182 51 182 -23 -72 -45 -297 12 163 147 -49 -103 -96 148 102 -5 -205
5749 -205 -143 33 219 187 -163 -48 -80 4 -49 50 -106 -325 20 109 -13 -92 -132 63 201 144 -124 -149 -350 23
$$ packed form
5587h3%q3K23K04Pl39m9R0l9J99J90n49J82J10K03k38j30j24J23J91m0m8j11M
5611a07o2K60K7j79j14P3J47K85k76k08r2J13L16l5j23k24j59O09j84k3k62L30
5633A12k83K38J59m01p5J55J51j46P9m6o4J58K74l05j00J17k14J40L28k79k04
5654b06K0J55m1K74j41l12J79J93j01j2L01m28L9J81m1J22k20p4K9J92k31p6J99
5677AM6P9J40k53p7j73K03R9q0O2j60j64L42K3m1k20j2J38K21j30j87j9m4O20
5701D14l39J0l06O1J02k6L61m59N0J07L9J4J91j85j4lN0J1o0r1j31M75K3k20m5
5726B9k22J35P9J49j21j44q7K33J31k05m9K7k52L09J51j6j96n4PK44m6j07k00
5749b05O2J76J86l2l50J15l2Q4n3R9j56k19L45Q9j22p9m0J95J38n7k68k5k01L73
$$ plain form
5773 23 191 261 -35 -94 -208 275 58 37 -254 -126 -42 273 82 -39 120 -145 -66 123 64 -12 -43 -100 341
5796 341 333 8 -109 -158 -63 6 137 -67 -223 -159 312 183 223 -106 -169 -49 146 68 -2 30 -103 131 292 -16
5820 -16 -173 -53 199 95 98 176 -117 6 371 209 -18 -89 -183 -70 108 125 -223 -46 -53 72 57 66 -20 -306
5844 -306 77 107 119 -183 -243 -401 140 67 -9 10 -219 -39 -110 -6 53 -363 -81 -19 97 7 -127 -302 -182
5867 -182 68 -9 -49 5 55 89 170 4 16 -136 -74 -9 140 219 -294 -61 181 72 148 52 -236 -225 115 190 -14
5892 -14 -13 -123 -232 77 240 -112 -203 95 200 154 73 -158 -117 -14 155 105 -6 103 -139 131 176 -24 -122
5915 -122 -213 45 160 82 -3 -114 -94 152 57 59 206 -277 -147 128 96 125 -165 -140 137 237 -114 -236 -95
5938 -95 -47 52 17 336 -296 -12 -33 -13 81 -89 -60 -214 187 113 27 -143 -261 -205 162 430 -139 -190 54 197
$$ packed form
5773B3J68P0k96n9j14M83k17k1k91J28Q4L15j91j21J59k65P9J89n9p6l1n7M41
5796C41ql25j17m9R5O9J31k04j56O4M71j29M0l29o3J20J95p8p0L2j33K34J61l08
5820a6j57J20K52j04LP8k93J23L65j62k27p1r4J13J78J7l48J77pJ25j5Rq6k86
5844c06L83L0J2l02o0j58N41p3p6J9k29J80p1J04N9m16K82O2J16r0j34j75J20
5867a82K50p7m0N4N0L4Q1j66J2j52O2O5J49P9n13K33K42j09P6r6k88J1L40P5k04
5892a4Jj10j09L09J63l52r1K98J05m6q1k31M1J03J69n0j11J09k42K70M5k00r8
5915a22r1K58J15p8q5j11K0K46r5KJ47m83J30K75l2K9k90K5K77J00l51j22J41
5938i5M8R9l5L19o32K84k1K0R4j70K9j54M01p4q6j70j18N6L67K68n69n1K44J43
$$ plain form
5962 197 59 276 -199 -228 -68 129 152 3 -175 -135 104 240 74 -73 119 58 -18 214 110 -169 -127 158
5984 158 43 8 103 -272 -39 71 151 -106 -188 -65 -42 122 -75 -116 64 -63 -95 128 211 -285 -138 -181 -14
6007 -14 42 93 -196 -424 123 26 160 -60 -49 -55 202 97 -112 -166 -2 -69 105 239 0 -149 -68 248 233 10
6031 10 25 -115 199 191 136 -36 -156 -256 232 358 -40 -236 -205 -16 147 274 42 -153 -124 240 -56 -66 -26
6054 -26 -100 -32 285 63 12 -125 -20 11 7 38 -114 -256 -33 -53 86 55 -253 -21 275 227 -73 -42 -56 -380
6078 -380 -19 195 -83 -267 -66 5 234 98 -265 -340 -193 174 210 -44 -279 -205 90 96 108 24 146 -156 -113
6101 -113 91 200 -47 -125 -29 -13 72 38 -261 -132 -14 30 221 -57 -250 -70 211 87 -42 -69 79 -163
6123 -163 226 206 -257 -206 -139 409 180 12 -237 -167 -134 36 104 -223 -190 -157 59 -14 146 -332 68 -23 217
$$ packed form
5962A97j38K17m75k9J60J97K3j49j78M0K39J36j66j47J92o1p6K32j04k79M2K85
5984A58j15l5R5l75K33J10Q0k57q2J23K3J64j97m1J80j27l2K23Q3m96J47m3J67
6007a4N6N1k89k28N47r7J34k20J1oK57j05k09n4J64o7J74J34k39j49Q1L16j5k23
6031A0J5j40L14qn5j72j20j00M88J26l98j96L1J89J63J27k32j95K9L64k96j0M0
6054b6p4O8L17k22n1j37J05L1mL1j52j42K23k0J39l1l08K32K96m8l00L1j4l24
6078c80L61K14k78j84K01P1K29j36l63p5J47L67L6k54k35P4K95OJ2q4J22l02M3
6101a13K04J09k47p8R6J6Q5l4k99J29J18M4J91k78j93J80K81j24j29k7J48k42
6123a63L89k0m63N1O7N48k29j68k49P0L3J70O8l27L3L3K16p3J60m78M00r1K40
$$ plain form
6146 217 129 -166 -128 11 190 46 164 -229 -157 81 210 44 -83 -268 -74 225 314 -20 -174 -192 6 172
6168 172 81 151 -188 -121 192 -4 52 -143 -209 -57 174 157 -206 -69 -87 -12 68 26 -122 -88 130 132 -30 -1 5
6193 5 -76 -62 90 30 -11 -27 -197 85 278 125 -39 -3 -84 -69 120 -270 -188 66 262 205 114 -73 -246 -79
6217 -79 188 115 -64 -180 -199 224 301 63 -106 -275 -74 -4 151 44 24 -68 141 166 -102 0 -323 -140 75
6240 75 333 -196 35 -56 -57 97 280 -91 -137 92 192 81 83 104 -8 76 218 194 -70 -139 -198 -51 203 -9
6264 -9 -13 38 -91 225 99 -175 -275 22 65 230 146 -133 -229 94 255 21 -48 -181 -206 -13 283 41 -262
6287 -262 -265 7 13 31 10 13 -162 208 123 -4 -158 -346 -62 241 -33 -99 -100 -34 -120 -55 172 -310 -352 131 5
6312 5 134 -131 -232 -28 -76 159 -118 180 -110 -176 -10 138 102 -13 32 17 93 293 -180 -273 105 -43 63
$$ packed form
6146B17q8k95L8J39J79j44J18l93P2K38J29j66j27j85J94K99Q9l34j54j8J98J66
6168A72r1P0l39O7L13j96N6j95o6J52K31j7l63J37j8P5Q0m2j48L4K18Kj62K9O
6193Eq1J4J52o0m1j6j70K82J93j53j64L6q1J5J89l90Q2K54J96n7r1j87j73J67
6217g9K67p3j79j16j9M23P7k38j69j69K01P0J55j07k0r2K09K5k68J02l23J83K15
6240G5K58n29K31r1jJ54J83l71m6K29J00j11KK1j12Q4J42k4k64o9n9J47K54k12
6264imN1j29L16j26k74j00K97M3J65q4k79r6L23J61k34o9j33k5J93K96k42l03
6287b62lK72OJ8k1Lj75L70q5j27j54j88K84L03k74o6jO6q6O5K27m82m2M83j26
6312EJ29k65j01K04m8K35k77K98k90o6J66J48l6j15M5j5P6K00m73r3L78j48J06
$$ plain form
6335 63 76 -133 45 12 292 67 -7 -19 -83 292 158 130 -25 -307 31 218 -31 122 158 -189 161 91 261
6358 261 29 -22 -115 -36 227 -38 -23 20 20 100 10 -155 -191 93 65 73 39 -120 -160 45 65 122 -158 -13 -192 -11
6384 -11 82 -119 -134 -47 67 121 -33 70 -226 91 314 -23 -33 -51 -8 -20 154 6 5 -85 -74 66 45 3 -334
6409 -334 -209 65 76 33 20 -205 -157 108 368 -2 -70 -144 -346 45 226 -12 -127 -113 68 217 185 -128 -276
6432 -276 91 183 262 -12 -144 -310 147 97 111 -260 -80 -118 19 317 -113 -236 -57 -214 16 307 -141 -263
6454 -263 -103 29 92 -53 72 -327 39 162 -87 -25 -173 120 -73 141 82 5 0 -27 72 88 121 -96 -194 178
6478 178 154 -24 46 -226 51 3 99 16 -15 -12 68 35 -9 -102 -76 1 218 92 5 43 -169 -47 399 4 -208
6503 -208 146 83 -119 167 -165 -58 -212 52 137 158 -98 -148 -217 -192 213 -126 40 -173 -63 -39 97 -71
$$ packed form
6335F3J3k09J78l3K80k25p4j2o4L75j34k8j55k82L38J87k49J53L6l47L50p0J70
6358B61k32n1r3P9K63k65J5M3%Q0r0j65l6K84k8Ql4j59m0K05K0N7k80J45j79J81
6384a1R3k01j5Q7J14N4j54J03k96L17K23l37j0j8M3j2J74j48jr0J1J40k1m2l37
6409c34J25K74J1m3j3k25M8K65K60l70o8p4k02L91J81k38j15J4J81J49l2l13j48
6432b76L67R2P9k74j32j66M57n0J4l71J80l8J37K98m30j23J79j57K30K91m48j22
6454b63J60J32O3j45J25l99L66J23k49O2j48K93j93K14n9p7nk7R9J6L3k17r8L72
6478A78k4j78P0k72K77m8R6q3l1LQ0l3m4r3K6P7K17j26q7L8k12J22M46l95k12
6503b08L54o3k02K86l32J07j54K64Q5K1k56n0o9K5M05l39J66k13J10K4J36j68
$$ plain form
6525 -71 -91 -44 74 134 144 -227 -123 -65 -96 -98 153 -122 -76 22 85 -7 -151 -54 -158 169 48 107 -130 -54 178
6550 178 306 96 105 -143 -101 207 -15 90 65 -86 114 210 106 -16 -159 4 -9 247 18 25 -15 117 154
6573 154 158 -206 -69 5 268 209 209 295 -76 -44 271 202 46 -205 -62 126 148 145 -131 -113 -97 163 184 130 -220
6598 -220 -316 -123 83 -24 160 -261 100 -121 145 -66 -41 -143 -57 -17 175 -117 -280 -294 44 62 170 -47
6620 -47 -166 -71 138 21 -181 -167 -94 59 57 -30 -138 -121 30 104 133 12 -123 -66 149 76 -62 184 -3 -64
6644 -64 187 250 -155 -103 -108 -52 137 283 -87 -304 95 3 -101 82 -169 -217 -38 159 50 50 -164 -143 119 89
6668 89 229 -178 -221 -83 115 172 26 -172 -55 145 119 -103 -152 45 -33 268 95 45 159 -70 57 285
6690 285 -122 -94 -167 15 -13 145 -93 -446 -81 102 66 161 -42 -282 2 276 89 -174 50 -57 6 115
$$ packed form
6525g1k0M7J18O0J0l71J04N8l1kK51k75M6R8O3r2j44R7j04L27j21N9k37P6K32
6550A78J28k10Rk48M2L08k22J05k5j51K00R6j04j22j43J63j3K56k29Pm0J32L7
6573A54Ml64J37P4K63n9%Q6l71L2L15o9j56k51J43J88K2lk76J8J6K60K1n4l50
6598b20r6J93K06j07J84m21L61k21K66k11K5j02Q6M0J92k92j63j4L38J8J08k17
6620d7j19R5K09j17k02J4P3J53kq7j08J7J51P4K9j21j35N7K15p3j38K46j87o1
6644f4K51O3m05N2nN6J89J46l70k17L99r2j04J83k51m8J79J97j09%k14K1K62l0
6668H9J40m07m3J38J98N7j46j98J17K00k6k22m9J97p8L01j73n0J14k29J27K28
6690B85m07K8p3J82k8J58k38l53L65J83l6R5k03k40K84K74j87k63K24j07O3J09
$$ plain form
6712 115 279 -49 -218 -8 92 -4 -62 -185 96 57 200 -18 -61 -8 -243 100 17 136 -73 -262 27 216
6734 216 148 -10 -178 -152 92 82 44 -100 -169 17 338 -1 29 -179 -115 -51 353 45 -156 -1 -51 -73 -1 11
6758 11 -64 -182 111 -10 75 -44 -168 -46 41 143 -66 61 -8 225 120 268 -88 -74 -216 265 50 101
6780 101 -3 -115 76 112 334 65 -141 -13 48 306 -27 -95 61 -108 234 236 154 -148 50 -62 147 55
6802 55 -111 -196 -15 308 63 -110 19 57 122 161 9 -121 -140 -20 15 126 8 -211 -142 189 -28 40 41 -202
6826 -202 -82 75 30 -161 -174 -178 -57 265 148 137 -125 8 15 -58 145 -124 -193 -12 304 46 23 -34 8 133
6850 133 252 -116 -75 -41 14 190 15 -127 -56 251 2 -62 52 139 -118 -85 440 159 112 -50 -129 236 258
6873 258 -15 -38 -242 147 102 59 191 -28 3 49 162 125 118 -133 -351 47 98 80 4 66 84 -145 137 -156
$$ packed form
6712A15J64l28j69K10J00r6n8j23K81l9J43k18m3N3k35L43q3J19k09j89K89J89
6734B16o8j58j68K6K44j0l8j44o9J86L21l39L0k08O4O4M04l08k01J55n0k2P2J2
6758A1p5j18K93j21Q5j19j24J22Q7J02k09J27o9K33j05J48l56J4j42M81k15N1
6780A01j04j12J91L6K22k69k06J28O1K58l33o8J56j69L42Kq2l02J98j12K09r2
6802E5j66q5J81L23k45j73J29L8O5L9j52j30j9J20L5J11j18k19O9L31k17O8Jk43
6826b02J20J57m5j91j3mJ21L22j17j1k62J33Pp3K03k69o9J81L16k58k3n7M2J25
6850A33J19l68M1L4N5J76j75j42P1L07k49o4J14Q7k57L3N25k81m7j62p9L65K2
6873B58k73k3k04L89m5m3J32k19L1M6J13l7pk51k18L98N1j8p6O2J8k29K82k93
$$ plain form
6897 -156 -81 -171 -26 80 -63 81 -119 -107 41 138 -95 62 -288 39 26 138 66 -160 -27 48 167 -35
6919 -35 -207 -88 243 123 167 39 68 80 154 221 -18 21 -192 132 75 143 185 53 38 -53 82 -43 -76 -46 -9
6944 -9 282 185 -313 -117 -41 131 3 123 -118 -12 -173 -126 76 -230 93 63 66 154 88 56 -47 35 31 159 10
6969 10 -69 -66 -59 227 -71 -125 28 -43 20 149 -126 -234 -255 -193 106 200 53 -197 -113 -108 2 116 -194 -67 -137
6994 -137 269 53 -51 -25 -81 -22 81 90 -1 -219 162 58 8 141 -59 64 156 142 -142 -40 -203 -30 185
7017 185 377 220 -159 -6 84 194 108 -36 -192 23 111 115 225 26 -260 136 48 30 -10 30 123 58 427 61
7041 61 -122 -108 96 156 81 -124 -186 -9 71 68 50 44 -100 -111 182 -62 -166 -174 100 43 100 171 -166 -229 -145 103
7067 103 -62 192 -154 -144 73 313 -59 109 33 -31 97 126 131 -114 -166 34 -113 281 -142 -150 145 80 -32
$$ packed form
6897a56P5r0J45J06j43J44k00J2J48R7k33J57l50L27j3J12p2k26J33P5J19k02
6919c5j72J19L31j20M4j28K9J2P4O7k39L9k13L24n7O8M2j32j5r1J35j25l3L0L7
6944iK91r7m98J96P6J72j28J20k41J06j61M7K02l06L23l0LQ8o6l2j03Q2mJ28j49
6969A0p9LPK86k98n4J53p1O3J29k75j08k1O2K99R4j47k50Q4NJ10J14l10J27p0
6994a37M06k16j04K6n6N9J03Rr1k18L81j04n0J33k00J23R2j4k84J02j63J73K15
7017A85J92j57l79J53R0J10q6j44j56K15Q8MJ10j99k86L96q8j8m0M0R3o5L69l66
7041F1j83J4K04O0p5k05o2J77Q0lj8oj44j1K93k44j04qK74n7N7P1l37o3Q4K48
7067A03j65K54l46J0K17K40l72J68p6o4J28K9Nk45n2K00j47L94m23qK95o5j12
$$ plain form
7090 -32 28 -157 -210 69 54 157 -76 164 11 -122 100 -160 -298 -260 -89 -92 4 18 -175 -44 117 84 -35
7113 -35 -160 -110 97 148 263 2 -44 -119 -73 218 -25 -156 41 102 72 147 60 -168 -165 55 198 42 -127 72
7137 72 -42 35 29 -142 -10 -62 82 -180 88 7 -29 86 174 315 94 159 -192 -2 277 103 -33 -97 -94 -64
7161 -64 121 -33 -16 44 -50 201 117 41 -167 31 103 290 -24 -45 -147 -111 93 41 -141 88 -58 -125 73 36
7185 36 -85 -287 -34 44 180 67 -148 44 51 236 14 -125 -35 -71 37 151 119 127 -165 59 68 25 -174 -68
7209 -68 -138 107 -51 -64 -71 -41 -83 172 264 -239 -92 -308 60 15 53 -186 -254 53 158 9 -188 -45 -150 11
7233 11 256 -26 -50 -91 22 162 161 -115 -215 -36 203 295 171 -150 -290 0 195 52 2 -113 -156 -65 321
7256 321 -130 -67 -181 -175 95 167 148 -49 198 94 39 269 6 -176 -58 57 -16 70 -162 -231 29 248 11
$$ packed form
7090c2O0j85n3K79j5J03k33K40j53j33K22k60j38L8J71lR6J4j93J31J61l3j19
7113c5j25N0K07N1J15k61m6p5M6K91k43j31J97O1l0P5q7k28LK20J43j56j69J99
7137G2j14P7oj71J32n2J44k62K68q1l6J15Q8J41k21O5l51J90K79j74j36o4LL0
7161f4J85j54J7O0r4K51q4p6k08J98P2J87l14k1j02L6K04n2j82K29j46o7J98l7
7185C6j21k02K53P8J36j13k15J92PJ85k22j39R0l6J08J14l2Qk92K24Rm3j99J06
7209f8p0K45j58j3pL0m2K55R2n03J47k16L68m5L8k39o8L07J05j49j97J43j05J61
7233A1K45k82k4m1J13J40jk76j00J79K39R2j24l21j40K90J95j43n0j15m3R1L86
7256C21m51O3j14OK70P2j9j97K47j04n5K30k63j82J18J15p3Q6k32o9K60K19k37
$$ plain form
7279 11 -103 -96 -57 19 36 93 -152 -171 -57 105 195 17 -91 -155 195 79 64 -192 -23 -28 154 139 -44 1 90
7304 90 -34 -120 129 -71 -9 171 142 104 -110 -60 -204 -92 552 155 -35 -331 -177 254 256 60 -206 -162 -354
7327 -354 -48 80 34 -109 40 143 -3 66 170 -30 -10 239 85 134 95 -16 167 -34 187 82 -58 -110
7349 -110 -102 119 44 -15 -102 44 160 -58 -277 -50 -286 61 4 -83 -70 86 -61 235 210 -124 -338 -114 187
7372 187 260 128 -103 2 -38 93 225 -82 -150 -2 89 198 108 -368 -108 -184 -76 115 316 -231 -227 104 119
7395 119 136 -16 -172 -204 243 -145 110 21 -108 -37 133 114 -65 -92 -11 170 -50 -24 -248 -25 31 36 83 -34
7419 -34 -96 -44 104 50 -73 -80 23 -163 108 79 -75 -312 -66 85 52 143 -80 -127 -34 145 -138 -128 -4 -44
7443 -44 73 215 55 -26 49 -75 102 292 32 -117 -80 191 48 199 -78 -4 80 61 170 241 -216 -94 22
$$ packed form
7279A1j14PL9P6J7N7k45j9J14J62R0j78j08o4L50j16j5k56J69nJ82j5j83M5Q9
7304I0j24q6K49k00O2J80k9l8k14N0j44J12O44l97j90k96J54M31Kj96k66M4j92
7327c54L06J28m6j43J49J03j46O9J04k00K0K49j54M9l9j11J83k01K21j05j40n2
7349a10QK21p5n9q7J46J16k18k19K27k36L47n7q7J3J56j47K96k5l34k14K24L01
7372A87P3j32k31J05m0J31J32l07o8J48R1J09r0m76K60p6J08J91K01n47ML31J5
7395A19J7j52j56l2M47l88K55q9j29P1J70j9j79k7Q1J81k20K6k24K23N6NM7j17
7419c4o2N2J48n4j23pJ03j86K71k9j54k37K46J51l3R1k23m7R3J79k83J0J24m0
7443d4J17J42j60q1P5j24J77J90k60j49L7K71j43J51k77P4Q4j9J09P1m57J22J16
$$ plain form
7466 22 266 -35 -111 -31 106 124 67 203 -171 -143 257 113 42 -96 9 -191 -135 391 -70 -169 -74 -321 5
7489 5 198 97 25 -204 188 113 -81 -117 -213 123 141 -81 -59 -148 160 -200 159 -12 45 -276 13 -124 99
7512 99 -29 -42 17 -122 155 55 0 -14 -61 49 245 95 -304 -55 -23 92 188 -62 -191 -152 161 227 83
7535 83 -106 -179 -39 232 44 55 188 -130 75 176 45 -104 -26 135 29 154 -95 40 -287 125 137 97
7557 97 31 119 70 185 -46 -90 63 -55 -111 268 77 67 -328 -112 180 13 -87 -151 -99 48 78 48 144 -172
7581 -172 -187 194 -12 0 -403 -114 -196 135 -22 34 -253 -119 165 13 97 -62 -90 136 51 18 -9 -121 20
7604 20 25 254 41 -8 -62 -36 -60 155 -49 55 -173 -28 238 37 13 -273 -168 197 243 -54 15 -46 -302 39
7628 39 109 -88 -92 29 86 142 -87 -93 -6 74 218 89 132 -94 -84 -121 56 -87 -43 139 -30 204 215 5 -57
$$ packed form
7466B2K44l01p6Q0J37J8n7J36l74K8M00j44p1j38J05k00N6N26m61r9R5k47L26
7489EJ93j01p2k29L92p5j94l6r6L36J8k22K2q9L08l60L59j71N7l21K89j37K23
7512I9j28j3N9j39K77j00n5j4m7J10J96j50l99K49L2J15R6k50j29L9L13O6j44
7535H3j89p3J40K71j88J1J33l18K05J01j31j49P8J61j06J25k49J35l27M12J2m0
7557I7o6Q8m9J15k31m4J53j18n6L79j91j0l95K16K92j67j00o4N2J47L0l0R6l16
7581a72j5L81k06J2m03K89q2L31j57N6k87J34K84j52Q4j59k8K26q5l3k7j12J41
7604B0NK29k13m9n4K6k4K15k04J04k28J45K66k01k4k86J05L65M6k97O9o1k56L41
7628C9P0j97mJ21N7N6k29oQ7Q0J44j29M3k26J0l7J77j43M4J82j69K34J1k10o2
$$ plain form
7653 -57 -100 -197 268 16 -97 -92 -180 12 219 34 -13 -188 -82 156 183 -83 -196 -71 220 309 222 -281 -48
7676 -48 99 -43 77 -33 -53 135 252 35 29 31 -124 69 275 147 -15 -140 -130 -16 278 -118 -43 -192 36
7699 36 129 59 -15 -270 -130 -73 151 25 -233 -259 -96 80 181 127 -237 -205 -155 -142 22 -199 -161 69 110 -134
7723 -134 -107 -129 -173 14 173 18 -215 -88 -15 -68 60 119 -255 -269 -42 28 66 138 -7 -105 141 258 -52 -57
7747 -57 -195 70 52 123 -79 -420 40 -28 114 175 -175 -154 88 95 99 147 -282 -54 -6 328 20 -97 -33 -240
7771 -240 363 25 3 -290 0 -3 10 -74 -104 -2 -100 150 102 -22 -86 39 51 322 261 -3 -20 -101 144 0
7795 0 77 -228 -45 138 13 3 -209 -141 9 165 181 40 -128 -149 -120 41 213 -92 -161 -40 96 89 185 -53
7819 -53 -262 101 94 -16 9 -127 -117 -19 184 -39 -22 -121 47 207 129 193 -77 15 19 158 -103 21 -189 23
$$ packed form
7653e7m3r7M65k52j13Nq8J92K07j85m7j75J06K38K7k66j13J25K91Q9q7n03K33
7676d8J47j42J20j10k0J88J17k17oKj55J93K06j28j62j25J0J14K94l96P5j49K28
7699C6R3p0p4k55J40N7K24j26k58k6J63J76J01n4l64L2N0J3J64k21L8K30M1k44
7723a34K7k2m4J87J59j55k33J27P3n3J28N9l74j4K27P0L8P2j45r8K46J17l10n
7747e7j38K65j8P1k02l41M60o8J42O1l50K1K42PMM8m29K28M8L34l08j17O4k07
7771b40O03l38k2k93K90lJ3q4l0J02r8K50m8j24o4J25J2K71o1k64j7q1K45j44
7795@P7l05J83J83j25j0k12O8J50J56J6j41j68k1K9J61J72l05o9J21J36pR6k38
7819e3k09L63pj10K5j36J0R8K03k23J7r9J68J60p8O4k70R2MJ39k61J24k10K12
$$ plain form
7843 23 212 133 -129 -105 -171 -172 214 -74 -124 -230 -316 13 132 -21 -402 -144 -94 68 175 1 42 -144 80
7866 80 88 23 -155 -295 -95 227 -44 -24 -196 -198 94 234 64 253 -93 18 47 113 216 171 -175 -98 203 60
7890 60 2 -184 -41 -45 304 51 -130 109 25 111 73 47 -238 81 83 -46 40 45 -59 205 418 156 -32 -155
7914 -155 -178 102 156 24 -123 197 78 190 219 -207 -94 -90 160 -60 -113 10 -181 20 217 124 -6 -311
7936 -311 -104 -49 142 276 -41 -178 -8 264 25 94 -152 -144 30 220 105 13 33 -217 213 199 -29 -99 -87
7959 -87 24 -50 126 -71 -216 -226 120 -93 136 -70 -344 -163 196 106 -84 -171 118 -149 61 28 -190 -129
7981 -129 -1 74 30 -63 -274 -30 172 234 56 -65 -94 94 146 206 -11 -43 -112 -125 57 312 81 -195 -7
8004 -7 159 71 -28 -216 -132 -71 198 -6 -200 231 -129 -140 197 -89 -204 -153 103 50 67 4 -134 -72 34 214
$$ packed form
7843B3J89p9k62K4o6jL86k88n0j06q6L29J19j53l81K58N0J62J07j74M1j86K24
7866H0Qo5j78j40K00L22k71K0j72kK92J40j70J89l46J11K9O6J03m5l46P7L01j43
7890F0n8j86J43mL49k53j81K39q4Q6l8k6k85L19Kj29Q6Nj04K64K13k62j88j23
7914a55k3K80N4j32j47L20j19J12K9m26J13MK50k20n3J23j91K01J97r3j30l05
7936c11K07N5J91J34l17j37J70K72k39O9k46QJ74J90j15r2K0k50M30j4k28p0J2
7959h7J11p4J76j97j45j0L46k13K29k06k74J81L59r0j90q7K89k67K10l3k18O1
7981a29J28P5m4r3k11K44K02O2j78j21k9J88N2O0k17l2o9j3J82K55k31k76J88
8004gJ66q8r9j88Q4O1K69k04j94M31l60j1L37k86j15N1K56n3J7o3j38O2J06J80
$$ plain form
8028 214 9 38 -93 -28 139 59 -3 -200 -102 -66 -149 91 -23 -224 -87 19 -121 94 -208 40 17 251 -66
8051 -66 -4 44 -25 161 180 -42 39 26 92 171 331 93 -38 -143 198 41 57 -13 -186 -1 111 129 60 -34 -24
8076 -24 193 148 52 -229 -161 -107 123 67 -28 -47 36 204 -58 69 -217 47 -126 239 2 -203 -26 -24 -69 85
8100 85 149 -79 -2 2 90 50 224 -195 -268 244 18 202 -70 105 -94 -94 233 110 -246 -175 75 -30 202 -206
8124 -206 -17 -133 190 -4 -13 -50 -3 152 156 -58 -176 80 -222 64 88 -33 -53 -70 6 39 109 30 -69 27 -65
8149 -65 0 -119 -43 -170 14 -45 82 -88 -177 2 49 224 86 -129 -90 -69 -98 18 175 -250 14 110 -75
8172 -75 33 -101 -169 -58 52 -25 60 -118 -48 -164 148 97 -175 -74 7 201 -226 103 64
$$ packed form
8028B14k05K9j31O5J67q0o2j97R8L6q3K40j14k01J37J06j40K15l02K48k3K34l17
8051f6O2M8o9J86J9k22Q1j3O6P9J60k38j31j05L41j57J6p0j73J85J12J8o9r4J0
8076b4K17m5r6k81O8N4K30n6r5j9Q3J68k62J27k86K64j73L65k37k05J77Km5J54
8100H5O4k28P7MQ8m0J74m19p3N12k26J84k72J75j99%L27j23l56P1K50j05K32m08
8124b06J89j16L23j94rl7M7J55Mk14j18K56l02K86K4j21k0j7P6L3P0p9r9R6r2
8149f5O5j19P6j27J84n9J27j70q9J79M7J75j38k15L9K1k9J16J57m25K64R6j85
8172g5J08j34o8J11J10p7Q5j78P0j16L12n1k72J01Q1J94m27L29l9
8191F4
$$ Imaginary data points
##PAGE= N=2
##DATA TABLE= (X++(I..I)), XYDATA
$$ plain form
0 0 0 0 0 0 0 0 0 0 0 0 -8 8 -8 16 -16 24 -24 32 -40 48 -56 67 -80 96 -112 129 -152 175 -202 230 -263 300
32 300 -341 384 -435 488 -549 615 -686 765 -852 946 -1048 1162 -1285 1418 -1564 1724 -1901
49 -1901 2093 -2305 2539 -2800 3089 -3414 3782 -4201 4682 -5242 5908 -6707 7695 -8942
63 -8942 10581 -12838 16154 -21514 31626 -57383 263301 433743 -106870 19002 215605
74 215605 211495 168716 137729 -19663 164917 293052 96913 -9529 128066 80896 34952
85 34952 151426 69840 10811 147509 67045 -110465 31953 138914 -44478 -8219 84633
96 84633 -21515 -44244 80040 -34088 -130594 25057 36252 -41776 13539 7835 -108668
107 -108668 -39097 1859 -80867 5332 49084 -93574 -103229 68245 3270 -113529 -60116
$$ packed form
0@%%%%%%%%%%qJ6j6K4l2M0m8N6p2Q8j04J23j47J76k08K41k81L27l77M32m93N63
32C00o41P25q19R23j037J164j301J451j617J798j994K210k447K703k982L288l625
49a901L994m398M844n339N889o503P196p983Q883r924J1150j2615J4402j6637
63h942J9523k3419K8992l7668N3140q9009L20684J70442n40613J25872J96603
74B15605m110m2779l0987j57392J84580J28135j96139j06442J37595m7170m5944
85C4952J16474q1586n9029J36698q0464j77510J42418J06961j83392L6259R2852
96H4633j06148k2729J24284j14128r6506J55651J1195p8028N5315n704j16503
107a08668O9571M0956q2726Q6199M3752j42658r655J71474o4975j16799N3413
$$ plain form
118 -60116 -51673 -36967 78328 34206 -173391 -112784 26801 3761 -33555 -59405 -107341 -30458
130 -30458 92855 -49203 -176423 -77882 15311 -18324 -34193 -53961 -92043 -7568 -16096 -130863
142 -130863 -96747 41414 -9242 -102524 -46022 -23942 -39937 -44723 -64059 -87534 -3069 32436
154 32436 -44459 -41928 -25747 -72076 -60521 47604 17134 -63224 -36262 8318 18486 6461
166 6461 -35306 -87401 10473 90777 20935 -37290 -4908 -4801 -24554 40666 31741 -15167 3097
179 3097 36805 16842 21814 22775 -49676 -13207 77560 62087 -6284 17000 12130 -18462 41937
192 41937 40653 -12606 18669 77559 13456 -7069 36765 8382 4788 41498 19612 -2088
204 -2088 90079 59954 -62522 -28520 60652 51431 29034 27218 -35481 16168 98192 14028
$$ packed form
118f0116Q443J4706J15295m4122k07597O0607J39585k3040l7316k5850m7936P6883
130c0458J23313j42058j27220R8541R3193l3635j5869j9768l8082Q4475q528j14767
142a30863L4116J38161n0656r3282N6502K2080j5995m786j9336k3475Q4465L5505
154C2436p6895K531J6181m6329J1555J08125l0470q0358K6962M4580J0168j2025
166F461m1767n2095R7874Q0304o9842n8225L2382J07j9753O5220q925m6908J8264
179C097L3708j9963M972R61p2451L6469R0767j5473o8371K3284m870l0592O0399
192D1937j284n3259L1275N8890o4103k0525M3834k8383l594L6710k1886k1700
204b088R2167l0125j22476L4002Q9172r221k2397j816o2699N1649Q2024q4164
$$ plain form
216 14028 -69037 3879 45765 13670 66682 27757 -71560 -20560 62960 3746 -17806 28353
228 28353 -20957 1161 59186 -16371 -78097 23565 28322 -53374 20404 52074 -31573 -40612
240 -40612 -295 -41841 6319 57665 -49205 -54946 55030 20377 -74642 -7353 5963 -42160
252 -42160 19183 33703 -33107 -8593 20469 -74985 -31096 72596 2871 -52682 13176 4486
264 4486 -33124 38596 -8051 -86844 5690 74711 -2491 -16646 1250 -66967 -4162 74565
276 74565 -16835 -62963 39221 29044 -35813 17482 -4033 -51801 12423 42949 -25767 13295
288 13295 44158 -56089 -40137 43381 6080 -27999 37773 1534 -39955 29670 16049 -45168
300 -45168 -9386 20026 -25370 29256 51361 -50847 -55166 25499 8033 -23619 27688 -6544
$$ packed form
216A4028q3065P2916M1886l2095N3012l8925r9317N1000Q3520n9214k1552M6159
228B8353m9310K2118N8025p5557o1726J01662M757q1696P3778L1670q3647r039
240d0612M0317m1546M8160N1346j06870n741J09976l4653r5019O7289J3316m8123
252d2160O1343J4520o6810K4514K9062r5454M3889J03692o9725n5553O5858q690
264D486l7610P1720m6647p8793R2534O9021p7202j4155J7896o8217O2805P8727
276G4565r1400m6128J02184j0177o4857N3295k1515m7768O4224L0526o8716L9062
288A3295L0863j00247J5952Q3518l7301l4079O5772l6239m1489O9625j3621o1217
300d5168L5782K9412m5396N4626K2105j02208m319Q0665j7466l1652N1307l4232
$$ plain form
312 -6544 -34661 20540 12047 -40690 -8293 8287 -42403 16333 57571 -22111 -56165 313
324 313 -1145 -11172 31370 -8043 -32398 18764 22302 -30663 -4800 11007 -34665 7598 54078
337 54078 8580 -31498 2421 -7212 -10346 34252 14916 -13780 13538 24755 -16642 9761
349 9761 24662 -23976 -12053 45201 38414 -3701 5807 -13238 -12978 33380 33581 -4628 7976
362 7976 28703 -5468 13551 31154 -8763 -20857 34144 47438 14151 16230 -4175 -12910 21727
375 21727 40548 5239 13723 37510 249 2567 36020 18141 -21590 13349 35655 22241
387 22241 31243 9905 -26885 -5487 38965 7214 2580 26032 -5682 -18600 22044 16060 -37998
400 -37998 -13981 6810 -2048 14668 8512 -46818 -41054 11423 -17615 -22610 9026 -16597 -48369
$$ packed form
312f544k8117N5201q493n2737L2397J6580n0690N8736M1238p9682l4054N6478
324C13j458j0027M2542l9413k4355N1162L538n2965K5863J5807m5672M2263M6480
337E4078m5498m0078L3919r633l134M4598j9336k8696K7318J1217m1397K6403
349I761J4901m8638J1923N7254o787m2115R508j9045K60M6358K01l8209J2604
362G976K0727l4171J9019J7603l9917j2094N5001J3294l3287K079k0405q735L4637
375B1727J8821l5309Q484K3787l7261K318L3453j7879l9731L4939K2306j3414
387B2241R002k1338l6790K1398M4452l1751m634K3452l1714j2918M0644n984n4058
400c7998K4017K0791q858J6716o156n5330N764N2477k9038m995L1636k5623l1772
$$ plain form
413 -48369 -4826 1258 -48334 -28176 -15634 -30417 -3499 17425 -42669 -51959 -4089 -29428
425 -29428 -30319 17917 -2406 -55147 -9934 7871 -31386 -14607 -12346 -39839 -1292 42174 -25454
438 -25454 -42404 4063 -23007 -33369 23398 13374 -41880 -4767 1347 -29048 833 1444 -52871
451 -52871 -19517 44806 -10379 -32490 -1629 -30130 -41430 21528 12231 -39541 187 1582
463 1582 -31345 1362 13648 -45354 -18391 40969 -3901 -11231 25730 -9427 -40112 24641
475 24641 30670 -2699 30887 16833 -19430 29467 55708 -17120 -1990 55016 24221 22827
487 22827 57746 17546 -17305 40812 39853 18405 55561 37085 -12912 32212 67227 -1621
499 -1621 1178 40870 17723 20164 53872 13898 -20702 23486 12365 -4227 37310 31449 -26788
$$ packed form
413d8369M3543O084m9592K0158J2542j4783K6918K0924o0094r290M7870k5339
425b9428q91M8236k0323n2741M5213J7805l9257J6779K261k7493L8547M3466o7628
438b5454j6950M6467k7070j0362N6767j0024n5254L7113O114l0395K9881O11n4315
451e2871L3354O4323n5185k2111L0861k8501j1300O2958r297n1772L9728J395
463A582l2927L2707J2286n9002K6963N9360m4870p330L6961l5157l0685O4753
475B4641O029l3369L3586j4054l6263M8897K6241p2828J5130N7006l0795j394
487B2827L4919m0200l4851N8117r59k1448L7156j8476m9997M5124L5015o8848
499a621K799L9692k3147K441L3708l9974l4600M4188j1121j6592M1537n861n8237
$$ plain form
512 -26788 -348 34265 -11925 -8868 12595 -12888 -9449 35133 6652 -26750 -387 -14422
524 -14422 -24039 21062 28436 -29705 -16167 16251 -9911 -8335 4866 -18842 -16601 30295 9494
537 9494 -16570 1946 -10601 -28496 7472 29849 -11330 -10109 4269 -12783 -7801 11402 -13819
550 -13819 -30462 8758 8832 -5600 -2616 -19033 -42797 -9838 20370 -15104 -23688 -6770 -13736
563 -13736 -25942 -10057 -18234 -28521 -7701 -15378 -21295 1747 790 -51012 -45529 4359 7506
576 7506 -11447 -19638 -22874 -18021 9834 -9926 -35565 -9141 8808 -6174 -1623 14340 -18967
589 -18967 -25171 2475 8299 4120 14417 2712 -17405 12436 15127 -9056 -103 17574 -1182
602 -1182 7485 35938 3949 -16201 2146 9467 6159 31817 18664 -17944 5989 22041 926
$$ packed form
512b6788K6440L4613m6190L057K1463k5483L439M4582k8481l3402K6363j4035
524a4422r617M5101P374n8141J3538L2418k6162J576J3201k3708K241M6896k0801
537I494k6064J8516j2547j7895L5968K2377m1179J221J4378j7052M982J9203k5221
550a3819j6643L9220P4j4432K984j6417k3764L2959L0208l5474q584J6918o966
563a3736j2206J5885q177j0287K0820p677n917K3042r57n1802N483M9888L147
576G506j8953q191l236M853K7855j9760k5639K6424J7949j4982M551J5963l3307
589a8967o204K7646N824m179J0297j1705k0117K9841K691k4183Q953J7677j8756
602a182Q667K8453l1989k0150J8347P321l308K5658j3153l6608K3933J6052k1115
$$ plain form
615 926 1582 17583 -9059 1854 39895 13401 -16424 -1556 2996 -6352 29511 23566 -17059
628 -17059 -1981 17894 -3810 -858 19638 -16852 -10412 35381 18106 -17771 -1092 -396 -17416
641 -17416 20147 19789 -14048 3175 18820 -20541 -10940 29610 -8406 -22590 16553 16079 -6172
654 -6172 10507 -9249 -32718 15998 22684 -15733 2052 25583 -23661 -21640 24744 5248 -14373
667 -14373 566 -3857 192 39374 -2182 -55866 -3171 38796 4553 -7156 6507 -17938
679 -17938 2356 26628 -15110 -25713 19547 12388 -14362 19099 7136 -25800 -994 11269
691 11269 -16027 8095 31569 -17604 -19184 13920 -173 -11331 12514 -7132 -18695 27855
703 27855 15422 -26103 -10046 7774 -17091 4268 25895 -10618 -12613 6599 -9701 -13051
$$ packed form
615I26O56J6001k6642J0913L8041k6494k9825J4868M552r348L5863n945m0625
628a7059J5078J9875k1704K952K0496l6490O440M5793j7275l5877J6679O96j7020
641a7416L7563l58l3837J7223J5645l9361R601M0550l8016j4184L9143m74k2251
654f172J6679j9756k3469M8716O686l8417J7785K3531m9244K021M6384j9496j9621
667a4373J4939m423M049L9182m1556n3684N2695M1967l4243j1709J3663k4445
679a7938K0294K4272m1738j0603M5260p159k6750L3461j1963l2936K4806J2263
691A1269k7296K4122K3474m9173j580L3104j4093j1158K3845j9646j1563M6550
703B7855j2433m1525J6057J7820k4865K1359K1627l6513j995J9212j6300l350
$$ plain form
715 -13051 20001 -2907 -26063 9599 16992 -5990 -2741 -6146 -33298 2800 37188 1359 -23713
728 -23713 -8860 -1445 4229 16441 -22046 -31204 21153 31395 -14980 -22118 1332 -4763 1958
741 1958 968 -10156 5278 21712 -13746 -31586 11436 16773 -8863 -10963 2587 3022 13973
754 13973 5501 -26884 -13228 14628 10394 -1439 9624 -4979 -16078 7066 10141 -6067 -4440
767 -4440 6284 -3571 9124 16137 -10200 -19826 -457 8982 6748 16753 -4980 -22410 923
780 923 18421 -2225 -13016 206 -1031 11463 15163 -9541 -23386 1961 10469 -3509 7234
793 7234 4589 -7775 -1350 7884 -12217 -7014 17180 2162 -9015 5513 10155 -2989 2952
806 2952 -9779 -17445 20692 32368 -6852 -22024 5927 5658 6507 10538 -9888 -10322 21461 19743
$$ packed form
715a3051L3052k2908k3156L5662P393k2982L249l405k7152L6098L4388l5829k5072
728b3713J4853P415N674J2212l8487r158N2357J0242m6375p138K3450o095O721
741A958r90j1124J5434J6434l5458j7840M3022N337k5636k100J3550M35J0951
754A3973q472l2385J3656K7856m234j1833J1063j4603j1099K3144L075j6208J627
767d440J0724r855J2695P013k6337r626J9369R439k234J0005k1733j7430K3333
780I23J7498k0646j0791J3222j237J2494L700k4704j3845K5347Q508j3978J0743
793G234k645j2364O425R234k0101N203K4194j5018j1177J4528M642j3144N941
806B952j2731p666L8137J1676l9220j5172K7951k69Q49M031k0426m34L1783j718
$$ plain form
820 19743 -11015 -595 -1799 -13356 11230 28879 -2541 -14286 8395 -1183 -888 11291 -4178
833 -4178 -14049 16606 15082 -13240 3022 4167 -18573 -4996 22408 1629 -6165 7195 -11777
846 -11777 -9699 14084 1045 -20206 10442 11658 -14199 3303 9114 -17487 -12352 12530 -4035
859 -4035 3168 18009 -14724 -25846 10079 12190 -12473 2751 -3909 -14853 16222 19645 -26485
872 -26485 -26373 10979 5084 6587 8420 -18931 -18962 18366 5786 -24452 1599 7936 -8585 3819
886 3819 11071 -16485 -9349 8451 -12056 -1637 21598 836 -18663 5733 744 -11691 12969
899 12969 7961 -15032 2084 20568 -5055 -3576 4411 -13489 289 26081 6912 -13342 8367
912 8367 42 -10708 12662 13101 -10865 -1806 14615 -1340 5854 5676 -19847 -11458 23936 13830
$$ packed form
820A9743l0758J0420j204j1557K4586J7649l1420j1745K2681r578K95J2179j5469
833d178r871L0655j524k8322J6262J145k2740J3577K7404k0779p794J3360j8972
846a1777K078K3783j3039k1251L0648J216k5857J7502N811k6601N135K4882j6565
859d035P203J4841l2733j1122L5925K111k4663J5224o660j0944L1075L423m6130
872b6485J12L7352n895J503J833k7351l1L7328j2580l0238K6051O337j6521J2404
886C819P252k7556P136J7800k0507J0419K3235k0762j9499K4396m989j2435K4660
899A2969n008k2993J7116J8484k5623J479P987j7900J3778K5792j9169k0254K1709
912H367q325j0750K3370M39k3966R059J6421j5955P194j78k5523Q389L5394j0106
$$ plain form
926 13830 -11011 205 -5579 -8974 9062 7550 -16453 -4902 12223 -2954 -506 1349 -15894
939 -15894 -14639 12564 4324 -9664 5138 -578 -14280 -5511 5215 -5523 1748 4021 -11215
952 -11215 -803 14785 -2733 -20637 -385 6611 5256 11250 684 -14183 -3164 12604 -219
965 -219 1219 5127 -3162 686 16755 5129 -15621 -1603 5371 4572 10944 9508 -9207 -5911
979 -5911 8094 -970 1184 7450 -1551 -7912 11606 9880 -10205 -6484 -1728 -2487 6872 14419 -7631
994 -7631 -10659 2478 -2749 -3878 5721 873 -11234 5955 7371 -7416 -4032 605 -10188 -3863
1008 -3863 17017 3281 -6265 -3088 -8052 -5117 14815 5858 -17780 471 13893 1318 -4280
1021 -4280 -668 -11076 -1744 17601 1715 -4804 5276 -2875 -13893 8933 11404 -9222 -1057
$$ packed form
926A3830k4841J1216n784l395J8036j512k4003J1551J7125j5177K448J855j7243
939a5894J255K7203q240j3988J4802n716j3702Q769J0726j0738P271K273j5236
952a1215J0412J5588j7518j7904K0252O996j355N994j0566j4867J1019J5768j2823
965b19J438L908q289L848J6069j1626k0750J4018O974p99O372j436j8715L296
979e911J4005r064K154O266r001o361J9518j726k0085L721M756p59R359P547k2050
994g631l028J3137n227j129R599m848j2107J7189J416j4787L384M637j0793O325
1008c863K0880j3736r546L177m964K935J9932q957k3638J8251J3422j2575n598
1021d280L612j0408R332J9345j5886o519J0080q151j1018K2826K471k0626Q165
$$ plain form
1034 -1057 6165 -1159 2141 8132 -14730 -10793 13656 5645 -2330 6894 -2701 -17688 5944 10451
1048 10451 -7101 -1330 4989 -5979 1548 13300 -11889 -13737 7435 3594 -2290 12013 908
1061 908 -20090 1440 8463 -4775 1175 6192 -10226 66 16677 -7541 -12680 4029 123
1074 123 -4639 15857 5845 -16742 -723 4640 -5605 3861 10838 -11218 -3788 14520 -1719
1087 -1719 -7231 3352 -5679 -9900 18569 12186 -13288 -5191 1976 -4740 4592 10304 -12555 -2950
1101 -2950 14104 -1834 -8509 6151 -3268 -14355 9922 11084 -3179 -788 -3117 -13364 4517
1114 4517 15642 -10086 -8224 9002 2546 -5196 4990 -5273 -12534 8049 7121 -3221 3919
1127 3919 4133 -14892 -3847 11858 -369 -1923 4465 -3112 -4255 13375 1083 -14505 -1010
$$ packed form
1034a057P222p324L300N991k2862L937K4449q011p975R224r595j4987K3632M507
1048A0451j7552N771O319j0968P527J1752k5189j848K1172l841n884J4303j1105
1061I08k0998K1530P023j3238N950N017j6418J0292J6611k4218n139J6709l906
1074A23m762K0496j0012k2587J6019N363j0245R466O977k2056P430J8308j6239
1087a719n512J0583r031m221K8469o383k5474Q097P167o716R332N712k2859R605
1101b950J7054j5938o675J4660r419j1087K4277J162j4263K391k329j0247J7881
1114D517J1125k5728J862J7226o456p742J0186j0263p261K0583r28j0342P140
1127C919K14j9025J1045J5705j2227j554O388p577j143J7630j2292j5588J3495
$$ plain form
1140 -1010 7601 4427 7579 4472 -15148 -4003 11746 2280 -3225 4621 278 -4231 10240 2877
1154 2877 -9536 -2727 3817 -119 7347 9600 -10110 -8216 4076 1821 -2701 5395 -341 -7649
1168 -7649 4741 3914 -5188 -4573 -584 -6553 4600 12859 -4617 -10722 -1468 363 -3485 6645
1182 6645 1543 -7819 662 4698 -1663 -1782 794 -10356 -28 15190 4688 -8670 -4050 -597
1196 -597 -2334 9256 4384 -6576 -381 7765 -424 -922 4161 -8203 -4278 11116 8785 -4081
1210 -4081 -842 -2805 -7591 6751 7067 -5646 -3606 6668 -3125 -3124 4325 -7126 -8762 4045 4003
1225 4003 -5020 4337 -2422 -16835 -3709 7821 -1016 -4934 -688 -10309 -972 9902 -7613 -17949
1239 -17949 497 7462 -3022 2767 -2817 -12525 -2051 5575 -4894 -851 8582 -7716 -6527
$$ packed form
1140a010Q611l174L152l107j9620J1145J5749r466n505P846m343m509J4471p363
1154B877j2413O809O544l936P466K253j9710J894J2292k255m522Q096n736p308
1168g649J2390q27r102O15L989n969J1153Q259j7476o105R254J831l848J0130
1182F645n102r362Q481M036o361j19K576j1150J0328J5218j0502j3358M620L453
1196e97j737J1590m872j0960O195Q146q189m98N083j2364L925J5394k331j2866
1210d081L239j963m786J4342L16j2713K040J0274r793JP449j1451j636J2807m2
1225D003r023R357o759j4413J3126J1530q837l918M246r621R337J0874j7515j0336
1239a7949J8446O965j0484N789n584r708J0474P626j0469M043R433j6298J189
$$ plain form
1252 -6527 9435 3766 -9689 -692 2138 -449 13067 6268 -11460 -4258 10364 -281 1578
1265 1578 11142 -2163 -3639 10297 5686 -5958 5284 2564 -4263 11265 13107 -4342 -3657 5971
1279 5971 -4266 3730 15286 -76 -7593 7079 6782 -2196 6613 -1540 -9147 9016 16094 -2408
1293 -2408 -4818 3686 -5389 2341 12254 353 -6335 7572 3759 -5251 6528 2250 -8083 1664
1307 1664 10983 265 2248 4370 -11128 -4447 12216 5090 -6710 2539 648 -3630 6122 769
1321 769 -10021 -1523 7485 -3526 1707 6183 -9766 -11990 3181 4628 -2895 1042 -7245 -8107
1335 -8107 5854 3137 -13684 -8803 4054 -2718 -570 1746 -7979 -10723 -678 -2837 -5202 4867
1349 4867 -2680 -11690 -2350 4638 -6249 -6779 -2186 -6771 1251 7138 -3769 -12341 -2265 -1469 -3302
$$ packed form
1252f527J5962n669j3455Q997K830k587J3516o799j7728P202J4622j0645J859
1265A578R564j3305j476J3936m611j1644J1242k720o827J5528J842j7449O85R628
1279E971j0237P996J1556j5362p517J4672k97q978Q809q153p607J8163P078j8502
1293b408k410Q504r075P730R913j1901o688J3907l813r010J1779m278j0333R747
1307A664R319j0718J983K122j5498O681J6663p126j1800R249j891m278R752n353
1321G69j0790Q498R008j1011N233M476j5949k224J5171J447p523L937q287q62
1335h107J3961k717j6821M881J2857o772K148K316r725k744J0045k159k365J0069
1349D867p547r010R340O988j0887n30M593m585Q022N887j0907q572J0076P96j833
$$ plain form
1364 -3302 4788 513 -8027 -2803 4505 -4135 -2236 431 -6279 -2746 8103 4564 -6351 -2878
1378 -2878 -4678 -3290 7293 6759 -6449 -5348 5282 418 787 782 -5713 -3972 9758 7328 -5189
1393 -5189 -1400 -1085 -2773 3384 6976 -2461 -157 6373 -2996 -2317 6576 2636 -6266 2251 5883
1408 5883 3781 6647 -1349 -10094 879 14757 2867 -2877 2764 746 1818 7210 1416 -6655
1422 -6655 4776 6500 1272 5936 5786 -6935 -4201 9661 4448 2732 4477 -2240 -3133 9663
1436 9663 5924 -7038 818 4228 1793 6625 7165 -7749 -5319 7411 1558 385 5398 271
1450 271 -5914 5001 2876 -5865 2101 2639 -5578 842 9800 -2859 -6231 -915 -4511 -224 9695
1465 9695 785 -12001 -153 3619 -1929 384 -2045 -9708 640 12058 -2796 -8302 -2152 -3396
$$ packed form
1364c302Q090m275q540N224P308q640J899K667o710L533J0849l539j0915L473
1378b878j800J388J0583n34j3208J101J0630m864L69no495J741J3730k430j2517
1393e189L789L15j688O157L592r437K304O530r369O79Q893l940q902Q517L632
1408E883k102K866p996q745J0973J3878j1890n744N641k018J072N392n794q071
1422f655J1431J724n228M664j50j2721K734J3862n213j716J745o717q93J2796
1436I663l739j2962P856L410k435M832N40j4914K430J2730n853j173N013n127
1450B71o185J0915k125q741P966N38q217O420Q958j2659l372N316l596M287R919
1465I695q910j2786J1848L772n548K313k429p663J0348J1418j4854n506O150j244
$$ plain form
1479 -3396 -2092 7289 978 -8981 1803 1871 -4781 523 3166 -8009 -2531 8568 -40 -1912 1026
1494 1026 -5174 -6240 8183 5011 -4588 1289 746 -4374 2252 6270 -6692 -3440 6284 775 124
1509 124 4203 -3827 -8851 4122 3846 -1246 3504 -151 -8903 -503 8388 -3884 -5885 -640 -1531
1524 -1531 2181 7051 -5530 -14007 737 4067 -925 71 -1770 -8653 -794 5355 -5702 -6316 -234
1539 -234 -2048 -2455 5092 -2155 -9064 -1360 -909 -3814 2324 4636 -6767 -4532 2146 -1890 -1319 1416
1555 1416 -4161 -5070 7513 4278 -5417 -3133 -1577 -2531 4510 7794 -4039 -3252 2711 200 166 4566
1571 4566 -1248 -5423 6126 6796 546 -548 -1259 -4721 3767 10785 412 -3125 1296 1912 992
1586 992 5617 -54 -5176 4673 6876 1112 506 2174 -4748 -359 7840 3067 -179 2101 -3
$$ packed form
1479c396J304R381o311r959J0784O8o652N304K643j1175N478J1099q608j872K938
1494A026o200j066J4423l172r599N877n43n120O626M018j2962L252R724n509o51
1509A24M079q030n024J2973k76n092M750l655q752Q400Q891j2272k001N245q91
1524a531L712M870j2581q477J4744L330m992R96j841o883P859O149j1057o14O082
1539b34j814m07P547p247o909P704M51k905O138K312j1403K235O678m036N71K735
1555A416n577r09J2583l235r695K284J556r54P041L284j1833P87N963k511l4M400
1571D566n814m175J1549O70o250j094p11l462Q488P018j0373l537M421O16r20
1586I92M625n671n122R849K203n764o06J668o922M389Q199m773l246K280k104
$$ plain form
1601 -3 -2502 5896 3078 -4035 1107 4359 483 2374 5696 -4975 -4796 4047 4877 2452 3692 -2727
1617 -2727 -6141 6533 6132 -3671 -3205 2798 1190 3724 5543 -4906 -5125 3006 3068 -484 5245 729
1633 729 -6878 1038 4200 -1084 -1276 1085 -4269 1280 7840 -2276 -7722 -1182 742 -1342 5245
1648 5245 216 -7570 -1244 2574 -3146 -2152 1842 -6198 -2401 4981 -447 -5889 -1571 -3429 -6038
1663 -6038 5225 3465 -5895 -4329 -244 -3794 494 3579 -6973 -5417 4671 3039 -3397 -814
1677 -814 -4622 -6030 5694 5343 -3959 -2827 2158 -3766 -86 5126 -2653 -3843 2637 1630 -897
1692 -897 5444 -2253 -9178 1912 7982 868 -1596 239 -4864 1333 5921 -2786 -4855 3623 1869
1707 1869 -2983 4374 608 -6240 -1400 3112 249 3331 4038 -6699 -3237 6135 2794 -3181 1316
$$ packed form
1601ck499Q398k818p113N142L252l876J891L322j0671J79Q843Q30k425J240o419
1617b727l414J2674m01r803M66O003j608K534J819j0449k19Q131O2l552N729m516
1633G29p607P916L162n284j92K361n354N549O560j0116n446O540J924k084O587
1648E245n029p786O326L818n720R94L994q040L797P382n428n442M318j858k609
1663f038J1263j760r360J566M085l550M288L085j0552J556J0088j632o436K583
1677h14l808j408J1724l51r302J132M985n924L680N212p779j190O480j007k527
1692h97O341p697o925J1090O070p114k464J835n103O197M588q707k069Q478j754
1707A869m852P357l766o848M840M512k863L082P07j0737L462R372l341n975M497
$$ plain form
1722 1316 23 -915 7408 2923 -5153 -1570 4340 54 4197 6816 -2303 -3003 3695 3210 233 4443
1738 4443 -696 -3290 6214 7117 -1628 -3100 861 -1404 4480 7068 -2245 -5301 1754 1794 -1543 2569
1754 2569 -1803 -4820 1832 4347 -3030 -3399 -524 -5326 -1459 3864 -589 -4774 -1297 -3313 -4778
1769 -4778 2842 430 -6289 -3996 2443 -755 -570 -1336 -7702 -3320 4733 2515 -4285 -430 -1654
1784 -1654 -4143 1928 2583 -2387 -2266 1766 -1152 2602 4060 -4558 -6276 2812 6133 650 818 -2860
1800 -2860 -3662 3676 5178 -2834 -2960 3124 219 1504 3112 -1972 -4803 1568 2334 -462 3894 655
1816 655 -4981 -1620 4224 -515 -930 1845 -2614 -378 4524 1321 -4568 -114 -83 -1128 5426 4178
1832 4178 -4574 -4342 3508 1286 1868 2024 -3724 -2160 6529 4539 -4318 -1056 -196 -706 5023 5318
$$ packed form
1722A316j293r38Q323m485q076L583N910m286M143K619r119p00O698m85k977M210
1738D443n139k594R504R03q745j472L961k265N884K588r313l056P055M0l337M112
1754B569m372l017O652K515p377l69K875m802L867N323m453m185L477k016j465
1769d778P620k412o719K293O439l198J85p66o366M382Q053k218o800L855j224
1784a654k489O071O55m970J21M032k918L754J458q618j718R088L321n483J68l678
1800b860q02P338J502q012j26O084k905J285J608n084k831O371P66k796M356l239
1816F55n636L361N844m739m15K775m459K236M902l203n889M454L1j045O554j248
1832D178q752K32P850k222N82J56n748J564Q689j990q857L262Q60n10N729K95
$$ plain form
1848 5318 -3099 -2817 2839 -555 1110 4164 -1423 -4181 4091 4356 -1741 551 -1429 -3460 2612
1863 2612 6563 -1934 -2178 1890 -2209 -371 4223 590 -4301 2328 1813 -1848 2363 476 -5194
1878 -5194 -1335 5335 420 615 1271 -4921 -3874 4877 3359 -3949 -1032 -921 -636 4499 1607 -8272
1894 -8272 -4835 5375 2158 -191 -1193 -4768 -3231 4064 246 -5658 469 713 -2875 -156 2282
1909 2282 -3905 -3434 233 -2336 1036 4405 -2776 -7748 872 2537 -1555 321 -1474 -3157 1544
1924 1544 4241 -3483 -2633 1139 -1923 -259 4813 1920 -4700 -493 -523 -93 4452 1817 -5426 -1350
1940 -1350 6025 1381 -884 -1526 -3356 -33 7188 2846 -5139 -1048 419 266 2800 1705 -4319
1955 -4319 -544 5075 173 -1046 693 -889 -2307 3869 2630 -997 1879 -347 -3215 1412 5983
$$ packed form
1848E318q417K82N656l394J665L054n587k758Q272K65o097K292j980k031O072
1863B612L951q497k44M068m099J838M594l633m891O629n15l661M211j887n670
1878e194L859O670m915J95O56o192J047Q751j518p308K917J11K85N135k892r879
1894h272L437J0210l217k349j002l575J537P295l818n904O127K44l588K719K438
1909B282o187M71L667k569L372L369p181m972Q620J665m092J876j795j683M701
1924A544K697p724Q50L772l062J664N072k893o620M207l0M30M545k635p243M076
1940a350P375m644k265o42j830L323P221m342p985M091J467j53K534j095o024
1955d319L775N619m902j219J739j582j418O176j239l627K876k226k868M627M571
$$ plain form
1970 5983 -654 -1623 1493 492 2568 4004 -1235 -4632 3407 4650 1306 1572 354 -3223 565
1985 565 5450 324 -392 840 -1111 394 4940 453 -5930 -558 2564 1944 1833 -160 -5478 -1826
2001 -1826 3997 -560 -2134 -147 -1433 -2646 2848 491 -4968 -1775 -524 -1147 1337 2545 -4696
2016 -4696 -4026 1517 -594 -1171 1274 -1084 -4247 1967 1639 -2271 -826 -1081 -3415 1293 6045 -1434
2032 -1434 -4182 -1189 -232 887 3851 -1342 -5738 1735 3572 -326 -1585 -1122 -3558 946 5269
2047 5269 -973 -3087 -590 -868 -1676 3241 699 -4076 36 1518 -1070 80 1472 -4514 -2184
2062 -2184 3699 1368 -484 190 -2249 -3608 3863 3165 -2294 -1033 910 -428 1877 3304 -3772
2077 -3772 -2288 3023 2126 545 2545 -1028 -4528 2329 3638 340 154 322 -2214 2122 5385 -2036
$$ packed form
1970E983o637r69L116j001K076J436n239l397Q039J243l344K66j218l577L788
1985E65M885n126p16J232j951J505M546m487o383N372L122o20j11j993n318L652
2001a826N823m557j574J987j286j213N494k357n459L193J251o23K484J208p241
2016d696O70N543k111n77K445k358l163O214l28l910J445k55k334M708M752p479
2032a434k748K993R57J119K964n193m396P473J837l898j259M63k436M504M323
2047E269o242k114K497k78q08M917k542m775M112J482k588J150J392n986K330
2062b184N883k331j852O74k439j359P471o98n459J261J943j338K305J427p076
2077c772J484N311q97j581K000l573l500O857J309l298j86J68k536M336L263p421
$$ plain form
2093 -2036 -3652 680 2269 1378 3423 -1194 -4452 1648 3048 -361 -87 1767 -2139 480 3632
2108 3632 -378 -1849 833 -106 -837 4605 2091 -2956 -1077 697 119 2479 3215 -3843 -1969 3452
2124 3452 2382 -791 -329 -2236 -1981 5192 2892 -3131 -2670 165 -847 1448 2637 -3364 -2634 1526
2140 1526 283 -1778 685 -2276 -4372 1714 2367 -1334 -2114 -1199 -3882 3 3108 -1990 -3495 -268
2156 -268 -144 -1622 1738 -1373 -4649 -174 2257 -197 -490 255 -3963 -1051 3362 1175 -1414 55
2172 55 -769 -1659 3962 1842 -3038 -1802 2150 1738 2729 2195 -3934 -2015 3868 3435 -696 487 -480
2189 -480 -778 3765 2036 -2469 -1260 2152 81 1177 3125 -1421 -2317 919 1618 -246 2722 -358
2205 -358 -3177 1035 2858 -98 -1274 421 -2021 1070 4242 -36 -3256 -977 362 -124 3212
$$ packed form
2093b036j616M332J589q91K045m617l258O100J400l409K74J854l906K619L152
2108C632m010j471K682r39p31N442k514n047J879J774n78K360P36p058J874N421
2124C452j070l173M62j907K55P173k300o023M61K835j012K295J189o001P30M160
2140A526j243k061K463k961k096O086O53l701p80R15k683L885L105n098j505L227
2156b68J24j478L360l111l276M475K431k454k93P45m218K912M413k187k589J469
2172E5q24q90N621k120m880J236L952m12R91n34o129J919N883m33m131J183r67
2189d80k98M543j729m505J209L412k071J096J948m546q96L236O99j864K968l080
2205c58k819M212J823k956j176J695k442L091L172m278l220K279J339m86L336
$$ plain form
2220 3212 298 -3594 -1179 2785 192 -831 69 -3165 -430 3771 1543 -2879 -1345 -1263 -1558 2911
2236 2911 1691 -2817 -2349 1456 -29 594 638 -3635 -1965 3027 2393 -1880 -211 -1148 -1920 1921 2351
2253 2351 -1033 -1098 1328 -1339 478 2724 -808 -2754 875 2064 400 2455 -1028 -3742 129
2268 129 3860 573 -603 135 -2649 482 3482 139 -3765 -618 1227 495 2574 -901 -4420 -1503
2284 -1503 2853 -295 -639 299 -2324 -1134 1724 350 -2681 217 -1070 -1896 2279 1871 -2981 -3296
2300 -3296 711 -59 1507 1401 -2398 -2348 2274 2053 -1985 358 -430 -1329 1555 2889 -774 -1432 296
2317 296 -1898 1122 3977 395 -3545 208 1516 489 1716 -1391 -3250 847 4436 -47 -1646
2332 -1646 -417 -1887 386 3260 657 -3012 376 707 -377 1498 464 -2346 -706 2911 224
$$ packed form
2220C212k914l892K415L964k593j023R00l234K735M201k228m422J534Q2k95M469
2236B911j220m508M68L805j485O23M4m273J670M992o34m273J669r37p72L841M30
2253B351l384o5K426k667J817K246l532j946L629J189j664K055l483k714L871
2268A29L731l287j176P38k784L131L000l343l904L147J845p32K079l475l519K917
2284a503M356l148l44R38k623J190K858j374l031K898j287q26M175m08m852l15
2300c296M007p70J566j06l799N0M622k21m038K343p88q99K884J334l663o58J728
2317B96k194L020K855l582l940L753J308j027J227l107j859M097L589m483j599
2332a646J229j470K273K874k603l669L388L31j084J875j034k810J640L617k687
$$ plain form
2347 224 459 755 -2166 -1826 2242 2706 -1140 179 -840 -1006 2376 2175 -2468 -2324 1863 610 1164
2364 1164 847 -1785 -2701 1285 1495 -538 935 -641 -2598 -147 2880 -974 -2294 -605 -1221 1592
2380 1592 2744 -1099 -4469 10 2233 262 726 -514 -1856 165 2826 -351 -367 938 -778 112
2396 112 3433 2247 -2032 -306 711 1513 3009 1895 -1625 -593 3239 993 547 801 -445 -672
2412 -672 2720 2557 -907 -56 -811 -864 1779 3074 -1470 -2579 514 105 364 592 -1708 -3411 898
2429 898 1363 -1236 -1102 -1843 -2930 -695 2385 -1344 -2690 -1204 -1607 -512 980 -917 -4260 -487
2445 -487 683 -660 -114 -929 -3341 -1790 2436 85 -877 -686 -1929 -1234 2237 1132 -3259 -1005
2461 -1005 688 329 954 932 -2348 -1490 1605 295 214 1201 -870 -2648 1611 2339 -660 -604 -798 -642
$$ packed form
2347B24K35K96k921L40M068M64l846J319j019j66L382k01m643J44M187j253N54
2364A164l17k632r16L986K10k033J473j576j957K451L027l854j320J689o16K813
2380A592J152l843l370M479K223j971M64j240j342K021K661l177j6J305j716Q90
2396A12L321j186m279J726J017Q02J496j114l520J032L832k246m46K54j246k27
2412f72L392j63l464Q51p55n3K643J295m544j109L093m09K59K28k300j703M309
2429H98M65k599J34p41j087K235L080l729j346J486m03J095J492j897l343L773
2445d87J170j343N46q15k412J551M226k351r62J91j243O95L471j105m391K254
2461a005J693l59O25k2l280Q58L095j310q1R87k071j778M259P28k999N6j94J56
$$ plain form
2479 -642 1943 2924 -1929 -2551 825 1157 742 1460 214 -2281 1376 1800 177 742 149 -1454 529
2496 529 4257 367 -1612 -665 337 1385 2922 540 -2440 710 1764 480 527 1192 -1369 -198
2512 -198 2715 1101 51 150 -875 -1083 2813 2206 -1545 -570 144 278 1191 1829 -1726 -1352 1711 1068
2530 1068 454 428 -915 -2106 2218 2321 141 -469 -471 -676 1152 2965 -852 -1558 409 1147 1050 1822
2548 1822 -815 -2923 556 2278 956 -187 -428 -2035 297 2420 -895 -1932 -143 424 -464 843
2564 843 -201 -2520 -604 -179 -416 350 783 -3123 -2661 796 419 -808 -1580 -1917 -1619 1989 501
2581 501 -2751 -2235 -209 104 261 1217 -1994 -1838 201 473 -77 659 -942 -2438 1135 2248 -187
2598 -187 -1421 -826 -832 1305 2673 -925 -1753 91 1185 248 1173 -333 -1749 877 1636 218 -316
$$ packed form
2479f42K585R81m853o22L376L32m15P18j246k495L657M24j623N65n93j603J983
2496E29L728l890j979R47J002J048J537k382k980L150J054j284M7O65k561J171
2512a98K913j614j050R9j025k08L896o07l751R75P14J34R13O38l555L74L063o43
2530A068o14k6j343j191M324J03k180o10kk05J828J813l817p06J967P38r7P72
2548A822k637k108L479J722j322j143k41j607K332K123l315j037J789N67q88J307
2564H43j044k319J916M25k37P66M33l906M62L457l77j227p72l37K98L608j488
2581E01l252N16K026L13J57R56l211J56K039K72n50P36j601j496L573J113k435
2598a87j234N95oK137J368l598q28J844J094r37R25j506j416K626P59j418n34
$$ plain form
2615 -316 140 -1353 -69 2397 675 -613 -272 -299 -830 1719 1171 -1536 -960 870 993 832 972 -2531
2633 -2531 -1346 2013 2173 -270 -450 -762 -1089 2003 1373 -1362 -1325 785 389 544 1675 -1630 -1908
2650 -1908 353 1467 313 396 -1113 -2247 950 1755 -351 -1417 17 -748 163 1708 -722 -1866
2666 -1866 -448 369 -138 1266 58 -2107 -625 1291 544 -375 265 -1528 -222 2065 776 -1378
2682 -1378 -944 -202 -328 2321 1248 -1713 -1529 702 816 795 880 -2090 -1014 1828 2108 -777 -863 -635
2700 -635 -714 1885 1443 -1179 -1227 808 -204 519 1480 -762 -1092 441 1115 -1 1097 -414 -1777
2717 -1777 834 2277 863 -604 312 -1014 719 2399 529 -1232 192 960 563 2121 358 -1758
2733 -1758 -73 2126 1196 222 361 -1385 -66 2011 1392 -895 -500 -148 -270 2100 589 -1883 -1848
$$ packed form
2615c16M56j493J284K466j722j288L41k7n31K549n48k707N76J830J23j61J40l503
2633b531J185L359J60k443j80l12l27L092o30k735L7K110l96J55J131l305k78
2650a908K261J114j154Q3j509j134L197Q05k106j066J434p65R11J545k430j144
2666a866J418Q17n07J404j208k165J482J916p47r19O40j793J306K287j289k154
2682a378M34P42j26K649j073k961J84K231J14k1Q5k970J076K842K80k885q6K28
2700f35p9K599m42k622m8K035j012P23R61k242l30J533O74j116J098j511j363
2717a777K611J443j414j467R16j326J733J680j870j761J424P68l97J558j763k116
2733a758J685K199r30r74J39j746J319K077o19k287L95L52j22K370j511k472L5
$$ plain form
2750 -1848 878 625 439 146 -1948 -1142 988 869 -1294 -530 -609 -1207 681 747 -859 -1477 -129 -754
2768 -754 324 1162 -670 -2021 -529 445 -108 825 -1029 -1957 -148 1870 144 -1598 -781 -1328 401
2785 401 1730 -15 -2233 -852 141 -129 871 -486 -1577 -721 1394 275 -579 -150 -1306 -643 974
2802 974 945 -1089 -885 -649 -572 1067 1029 -1095 -1439 626 610 251 235 -1140 -1254 889 1577 -169 207
2821 207 -399 -910 560 1709 139 -1146 84 -64 1121 1488 -240 -1956 -70 1705 821 814 -706
2838 -706 -1134 161 2048 515 -893 -345 -693 326 1321 293 -1771 -490 516 160 491 327 -1154
2855 -1154 -837 1292 498 240 174 -666 -799 1066 1370 -692 -508 -263 93 1356 1741 -684 -1588 825
2873 825 711 897 841 -643 -990 1291 1872 -22 196 -488 -733 666 1911 84 -1447 -255 -24 483
$$ packed form
2750a848K726k53j86k93k094Q06K130j19k163P64p9n98J888O6j606o18J348o25
2768g54J078Q38j832j351J492R74n53R33j854r28J809K018j726j742Q17n47J729
2785D01J329j745k218J381R93k70J000j357j091Q56K115j119q54M29j156O63J617
2802I74k9k034K04K36P7J639l8k124l44K065j6l59j6j375j14K143O88j746L76
2821B07o06n11J470J149j570j285J230j48J185L67j728j716J886J775q84pj520
2838g06m28J295J887j533j408N48l48J019R95j028k064J281J006l56L31j64j481
2855a154L17K129p94k58o6q40j33J865L04k062J84K45L56J263L85k425r04K413
2873H25j14J86n6j484l47K281N81j894K18o84k45J399J245j827j531J192K31N07
$$ plain form
2891 483 895 -356 -1983 81 884 -298 -26 -479 -1598 -677 1423 -40 -937 -875 -1155 -404 1011 100
2909 100 -2305 -476 -7 -213 287 143 -1375 -1126 753 307 251 32 -1072 -1374 1042 1434 -614 -603
2927 -603 -704 112 1319 1270 -1430 -1603 814 873 760 147 -563 -878 962 1446 -133 237 -273 -356 360
2946 360 1778 -124 -881 48 38 750 1198 339 -1635 31 661 562 487 8 -1297 -235 1857 510
2964 510 -449 -724 -517 58 1339 461 -1330 -534 -141 -3 496 608 -1071 -1165 667 551 369 -260 -1217
2983 -1217 -1332 1453 1477 -793 -1217 -731 396 816 768 -1016 -799 397 404 159 267 75 -1130 495 1122
3002 1122 754 528 -560 -768 256 2016 503 -472 -194 319 554 1319 384 -1213 21 946 953 376
3020 376 40 -923 -406 1315 645 -113 -681 -399 -387 1284 617 -1395 -841 -124 315 242 437 -1589 -1391
$$ packed form
2891D83M12j251j627K064Q03j182K72m53j119R21K100j463q97O2k80P51J415r11
2909A00k405J829M69k06N00j44j518K49J879m46n6k19j104l02K416L92k048J1
2927f03j01Q16J207m9k700j73K417N9j13o13p10l15J840M84j579L70n10q3P16
2946C60J418j902p57R29j0P12M48q59j974J666O30r9p5m79j305J062K092j347
2964E10r59k75K07N75J281q78j791P96L93J38M99J12j679r4J832j16j82o29r57
2983a217j15K785K4k270m24M86J127M20m8j784K17J196Pk45J08j92j205J625O27
3002A122l68k26j088k08J024J760j513r75K78N13K35P65r35j597J234R25Pn77
3020C76l36r63N17J721o70p58n68K82J2J671o67k012N54P17M39p3J95k026J98
$$ plain form
3039 -1391 404 450 -99 -699 -789 -1160 768 644 -800 -1129 -584 -236 26 958 -764 -1209 -366 192 60
3058 60 547 -284 -1774 -62 1101 703 -771 -848 -915 343 1555 -271 -930 -743 -13 -212 877 471
3076 471 -1401 -685 312 662 82 -152 -1590 -593 1537 602 -799 -853 -194 -404 960 423 -733 -472
3094 -472 157 -144 338 1080 -904 -980 489 1001 257 442 -479 -928 1196 1385 29 -620 251 -54 459
3113 459 1420 -530 -762 139 805 364 1039 -137 -1318 130 1045 486 -226 -30 -877 232 1479 327
3131 327 -785 -456 221 129 1385 235 -1176 -416 890 686 241 175 -963 247 1197 701 -96 126
3149 126 23 -289 1389 1120 16 -352 93 627 1271 1266 -628 -667 903 1290 323 134 -377 -319 1031 914
3169 914 40 -380 -167 -292 516 1078 -188 -1050 -410 307 306 775 -839 -1356 -409 689 -53 -474 -783 -1315
$$ packed form
3039a391J795M6n49o00r0l71J928j24j444l29N45L48K62R32j722m45Q43N58j32
3058F0M87q31j490J712J163l98j474p7o7J258J212j826o59J87P30j99J089m06
3076D71j872P16R97L50n80k34j438R97K130r35j401n4O59k10J364n37j156K61
3094d72O29l01M82P42j984p6J469N12p44J85r21m49K124J89j356o49Q71l05N13
3113D59R61j950k32R01O66m41O75j176j181J448R15n59p12J96q47J109J247j152
3131C27j112L29O77r2J256j150j411P60J306k04m45o6j138J210R50m96p97K22
3149A26j03l12J678k69j104l68M45N34O44nj894l9J570L87r67j89n11N8J350j17
3169I14q74m20K13j25Q08N62j266q62O40P17jM69j614n17R47J098p42m21l09n32
$$ plain form
3189 -1315 -275 604 -147 -944 -1045 -506 -344 475 -321 -1263 -1278 -169 243 -29 -122 -1668 -889 112 597
3208 597 -468 -746 -841 -375 611 339 -518 -1179 -211 138 485 312 -956 -970 -79 720 -50 20 -713 -734 205
3229 205 861 144 -888 -354 -509 382 911 67 -1239 -518 534 396 617 -443 -592 -164 853 432
3247 432 -418 9 -833 -136 1035 925 -536 -817 -146 75 1122 317 -705 -791 594 704 237 164 -662
3266 -662 -369 570 1064 -461 -112 -354 -325 670 736 -32 -775 131 291 490 731 -166 -801 107 1134 299
3286 299 378 -363 -547 274 1434 372 -247 96 -205 575 1108 273 -1131 -10 994 596 734 116 -728
3305 -728 -377 1187 403 -57 -4 -557 84 858 674 -801 -266 -218 131 815 310 -1084 -685 418 287
3324 287 217 37 -661 -681 426 699 -315 -36 -465 -581 479 766 -481 -1048 -98 -143 281 304 -514 -1003
$$ packed form
3189a315J040Q79p51p97j01N39J62Q19p96r42j5J109M12k72r3j546P79J001M85
3208E97j065k78r5M66R86k72q57o61R68L49L47j73j268j4Q91P99p70P0p33k1R39
3229B05O56p17j032N34j55Q91N29q44j306P21J052j38K21j060j49M28J017m21
3247D32q50M27q42O97J171j10j461k81O71K21J047q05j022q6J385J10m67p3q26
3266f62K93R39M94j525L49k42K9R95O6p68p43R06J60J99K41q97o35R08J027q35
3286B99P9p41j84Q21J160j062o19L43l01P80N33q35j404J121J004l98J38o18q44
3305g28L51J564p84m60N3n53O41P74j84j475N35M8L49O84n05j394L99J103j31
3324B87p0j80o98k0J107K73j014K79m29j16J060K87j247n67R50m5M24K3q18m89
$$ plain form
3344 -1003 -57 542 194 -27 -642 -968 105 968 -257 -631 -348 -630 364 709 -30 -1163 -448 -45 136
3363 136 387 -355 -1012 -479 617 106 -179 -389 -958 -146 561 606 -480 -446 -554 21 844 343 -577 -554
3383 -554 316 278 540 -14 -544 -605 497 909 101 -63 -739 -206 226 933 -43 -667 -272 355 625 328
3403 328 3 -837 -26 671 413 134 -625 -474 130 878 276 -393 -318 -110 260 489 572 -735 -387 145
3423 145 569 432 -73 -619 -598 623 615 -34 -152 -95 -135 614 792 -201 -439 -44 470 434 695 -330 -888
3444 -888 174 456 403 -114 -19 -715 271 723 123 -396 -584 -516 1 868 -151 -1120 -459 180 334 89
3464 89 -82 -990 14 443 308 23 -209 -539 -380 1067 378 -294 -584 -208 129 616 390 -740 -312
3483 -312 334 131 261 137 -749 -713 731 433 -168 -449 -476 -559 592 584 -524 -561 -427 -75 235 500 -700
$$ packed form
3344a003R46N99l48k21o15l26J073Q63j225l74K83k82R94L45p39j133P15M03J81
3363A36K51p42o57N33J096n11k85k10n69Q12P07M5j086L4j08N75Q23n01r20K3
3383e54Q70l8K62n54n30o1J102M12q08j64o76N33M32P07r76o24L95O27K70k97
3403C28l25q40Q11O97k58k79p59J51O04P48o02o69P5K08L70K29Q3j307L48N32
3423A45M24j37n05n46K1J221qo49j18N7m0P49J78r93k38L95N14l6K61j025n58
3444h88J062K82n3n17R5o96R86M52o00n19j88O8N17Q67j019r69O61O39J54k45
3464H9j71r08J004M29j35k85k32l30J59J447o89o72k90L76L37M87k26j130M28
3483c12O46k03J30j24q86L6J444k98o01k81k7q3J151qj108l7J34L52L10K65j200
$$ plain form
3504 -700 -1063 -28 293 261 -78 -589 -1117 95 631 -90 -420 -473 -628 196 899 -240 -434 -348 111 236
3524 236 462 22 -813 57 480 520 361 59 -697 10 1169 399 -260 -285 -19 293 1029 398 -528 -68
3544 -68 258 344 434 422 -542 -216 396 655 636 -128 -581 -483 833 650 -326 -332 -135 160 554 531 -618 -415
3566 -415 21 242 460 270 -455 -781 324 631 295 -301 -336 -467 198 864 -104 -358 -423 -25 199 561
3586 561 -121 -1033 22 246 578 64 -433 -588 -88 522 167 16 -658 -322 -13 434 225 -411 -360 -151
3606 -151 317 294 75 -531 -639 52 539 270 -390 -781 -351 594 535 57 -496 -415 314 307 328 -440 -506 -313
3628 -313 646 328 122 -435 -617 132 497 495 -612 -433 -294 164 403 203 -563 -571 -100 143 604 -221 -731
3649 -731 -552 201 395 -355 -261 -541 -299 389 338 -140 -611 -293 -347 565 442 -388 -803 -17 423 107 185
$$ packed form
3504g00l63J035L21l2l39n11n28J212N36p21l30n3j55Q24P03j139j94Q6M59J25
3524B36K26m40q35Q70M23M0j59l02p56P07J159p70o59k5K66L12P36o31r26M60
3544f8L26Q6R0j2r64L26O12K59j9p64m53R8J316j83r76oJ97K95L94k3j149K03
3566d15M36K21K18j90p25l26J105L07l36n96l5j31O65O66r68k54o5L98K24L62
3586E61o82r12J055K24L32n14m97j55N00O10l55j51o74L36L09M47k09o36N1K09
3606a51M68k3k19o06j08O91M87k69o60l91M30R45n9m78n53Q1P29pK1p68o6J93
3628c13R59l18k06n57j82P49L65kj107J79J39M58K39k00p66qM71K43M61q25n10
3649g31J79P53J94p50R4k80K42O88n1m78m71L18n4R12j23q30m15P86M40l16P8
$$ plain form
3670 185 -500 -418 318 816 -111 -266 -2 -522 505 563 -3 -616 67 337 349 702 -104 -508 -24 554 86
3691 86 511 -73 -697 71 728 557 -116 53 -232 330 836 285 -284 -340 136 289 734 111 -687 -360 569
3712 569 494 180 84 -677 -24 563 470 -444 -432 -475 -437 677 292 -488 -650 224 239 309 80 -518 -537 293 694
3735 694 -47 -83 -513 -527 298 720 0 -626 -259 -147 463 397 -423 -307 2 118 448 598 32 -630 -130
3756 -130 759 525 -122 -308 -410 444 582 92 -590 -495 -84 346 667 -271 -538 -340 216 404 412 -258 -729
3777 -729 -102 353 244 -507 -244 -328 -198 336 227 -406 -411 -244 -82 442 58 -551 -491 -272 486 264 0
3798 0 -777 -154 63 186 25 -468 -344 -249 319 177 -27 -432 -439 136 346 63 -476 -466 -341 386 393 -126 -617
3821 -617 -522 199 255 302 -445 -486 101 415 203 -123 -243 -213 196 468 408 -280 -313 -75 280 525 -46 -364
$$ packed form
3670A85o85Q2P36M98r27j55K64n20J027N8n66o13O83K70J2L53q06m04M84N78m68
3691H6M25n84o24P68O57j71o73J69k85N62N06n51n69n6M76J53M45o23p98L27R29
3712E69p5l14r6p61O53N87r3r14J2m3L8J114l85p80j62Q74J5P0k29n98j9Q30M01
3735F94p41l6m30j4Q25M22p20o26L67J12O10o6q20J16L09J16L30J50n66o62N00
3756a30Q89k34o47j86j02Q54J38m90o82R5M11M30L21r38k67J98N56J88Qo70m71
3777g29O27M55j09p51K63q4J30N34j09o33nJ67J62N24l84o09O0K19P58k22k64
3798@p77O23K17J23j61m93J24R5N68j42k04m05pN75K10k83n39J0J25P27Pn19m91
3821f17R5P21N6M7p47m1N87L14k12l26j20L0M09K72o0o88l3K38L55K45n71l18
$$ plain form
3843 -364 -158 280 373 587 243 -385 -66 408 622 362 50 -375 281 944 543 -129 -194 30 200 831 183
3864 183 -350 -99 141 284 447 273 -749 -449 449 571 115 -37 -361 -88 601 321 18 -361 -255 -217
3884 -217 316 498 -656 -586 -97 6 196 254 -316 -566 289 314 91 13 -354 -505 262 864 -163 -406 -332
3905 -332 30 367 416 -264 -417 -37 193 372 483 -153 -787 87 625 130 -173 -256 -300 188 477 -102 -369
3926 -369 32 -358 -18 358 -65 -774 -388 155 386 81 -193 -550 -293 385 -16 -122 -274 -628 -151 286
3946 286 291 -341 -413 -400 73 421 94 -517 -442 485 20 185 -108 -403 -522 193 354 -122 -65 -617 -91 337
3968 337 567 -276 -513 28 107 488 202 -276 -498 196 237 233 103 -247 -100 381 563 163 -24 -274 32
3989 32 395 515 215 -197 -281 84 647 315 154 -434 -14 500 460 394 -355 -362 151 520 135 -99 -640 -192
$$ packed form
3843c64K06M38R3K14l44o28L19M74K14k60l12m25O56O63m01o72o5K24J70O31o48
3864A83n33K51K40J43J63j74j022L00Q98J22m56j52l24K73O89k80l03l79J06L8
3884b17N33J82j154P0M89J03J90N8n70k50Q55K5k23p8l67j51P67O02j027k43P4
3905c32L62L37M9o80j53L80K30J79J11o36o34Q74N38m95l03q3m4M88K89n79k67
3926c69M01l90L40L76m23p09L86N43K31l05k74l57K57O78m01j06j52l54M77M37
3946B86No32p2J3M73L48l27o11P5R27m65J65k93k95j19P15J61m76N7n52N26M28
3968C37K30q43k37N41P9L81k86m78k22O94M1mj30l50J47M81J82m00j87k50L06
3989C2L63J20l00m12q4L65N63l32j61n88M20N14m0o6p49pN13L69l85k34n41M48
$$ plain form
4011 -192 266 247 217 -446 -342 148 286 218 -198 -158 -303 -157 374 361 -398 -705 -60 300 536 -190 -445 -506
4033 -506 282 517 -125 -119 -452 -78 95 391 29 -237 -336 -185 313 174 -232 -501 -88 211 342 239 -288
4054 -288 -531 234 401 39 -144 -356 -270 416 689 62 -549 16 -14 241 312 -105 -294 -257 301 93 190 -181
4076 -181 -441 -277 568 264 -100 -255 -424 235 449 123 -416 -377 -51 203 597 96 -356 -250 311 234 293
4097 293 80 -446 42 336 560 -31 -83 -501 -54 745 418 -406 -423 -53 64 464 116 -255 -227 -116 -13
4118 -13 150 168 -640 -402 543 501 -71 -317 -369 -160 515 296 -3 -223 -58 96 327 524 -285 -621 -3
4139 -3 413 48 283 -379 -474 264 416 51 -164 -117 -249 261 816 21 -403 -290 -60 400 592 -122 -428
4160 -428 23 223 288 254 -222 -390 -6 448 149 -118 -384 -388 -108 329 -154 -408 -445 -31 -34 -35 43 -706 -56
$$ packed form
4011a92M58j9l0o63J04M90J38o8m16M0j45J46N31j3p59l07O45L60K36p26k55o1
4033e06P88K35o42Ol33L74J73K96l62k66r9J51M98j39m06k69M13K99J31j03n27
4054b88k43P65J67l62j83k12Q6O86K73o27o11N65l0K55P1m17j89L7N58k08R7l71
4076a81k60J64Q45l04l64j55j69O59K14l26n39L9L26K54L94n01m52J06N61p7N9
4097B93k13n26M88K94K24n91n2m18M47P99l27q24j7L70J17M00l48l71K8J11J03
4118a3J63J8q08K38R45m2n72k46n2K09O75k19k99k20J65J54K31J97q09l36O18
4139cM16l65K35o62r5P38J52l65k15M7j32N10N55p95m24J13K30M60J92p14l06
4160d28M51K00O5l4m76j68L84M54k99k67k66mK80M37m83k54l7M14ljP8p49O50
$$ plain form
4183 -56 -238 297 10 -221 -549 -289 324 48 -103 -388 -403 -272 377 257 -332 -470 -327 172 395 181 -518
4204 -518 -315 69 296 38 -83 -317 -395 361 387 194 -231 -405 -160 389 432 -300 -388 -142 261 322 105 -301
4226 -301 -463 29 113 390 51 -241 -176 144 352 -232 17 -414 -79 480 108 -108 -86 35 20 376 216
4247 216 -130 -205 191 431 468 137 -456 -86 200 307 143 98 -318 -215 327 256 426 -139 -273 12 735
4268 735 535 -248 -310 -173 387 424 322 -273 -294 -39 139 412 23 57 -305 433 550 3 -141 -303 123
4289 123 54 406 107 -217 -50 -176 236 429 -133 -534 -70 226 196 150 -195 -355 329 438 -14 -204 -483
4310 -483 -325 30 537 -91 -669 -141 80 236 -30 -102 -391 -278 320 153 -70 -376 -548 -95 281 113
4330 113 -393 -390 -359 -18 115 163 -382 -436 -163 -31 299 -45 -475 -422 -1 13 10 -330 -456 -48 263 456 -287
$$ packed form
4183e6j82N35k87k31l28K60O13k76j51k85j5J31O49j20n89j38J43M99K23k14o99
4204e18K03L84K27k58j21k34p8P56K6j93m25j74K45N49M3p32q8K46M03O1k17m06
4226c01j62M92Q4K77l39k92O5L20K08n84K49m31L35N59l72k16K2J21j5L56j60
4247B16l46p5L96K40L7l31n93L70K86J07j64m5m16J03N42p1J70n65j34K85P23
4268G35k00p83o2J37N60L7j02n95k1K55J78K73l89L4l62P38J17n47j44j62M26
4289A23o9L52k99l24J67j26M12J93n62m01M64K96l0m6l45j60O84J09m52j90k79
4310d83J58L55N07o28n78N28K21J56k66p2k89J13N98j67k23l06j72M53L76j68
4330A13n06LL1L41J33M8n45n4K73J32L30l44m30N3M21J4ll40j26M08L11J93p43
$$ plain form
4353 -287 -144 -286 -130 462 340 -329 -360 -32 29 454 211 -314 -291 309 365 197 164 -275 -208 475 476 107 -205
4376 -205 -295 -80 479 322 5 -278 -40 170 328 221 -298 -287 143 283 263 330 -221 -274 426 312 222 -121
4398 -121 -294 -304 420 441 -129 -131 -336 213 310 461 -287 -346 158 438 288 -37 -239 -202 311 502 233 -156
4420 -156 -333 -270 72 483 -237 -260 -204 -39 370 272 -102 -102 -206 41 291 120 -52 -526 -29 511 235 -188
4442 -188 -186 -160 220 519 -23 -94 -25 -224 138 300 39 -526 -389 59 243 262 -209 -651 -90 379 166 -28
4464 -28 -86 -322 239 156 131 -158 -147 -156 -157 303 100 -277 -406 112 144 356 -51 -477 -134 283 304 10 -87 -281
4488 -281 -113 320 22 -67 -129 -106 -203 433 250 -414 -332 -159 217 352 134 -636 -100 303 493 60 75 -209
4510 -209 -217 289 320 3 -391 -70 -121 455 248 -564 -427 35 474 237 183 -207 -281 329 125 332 108 -212
$$ packed form
4353b87J43j42J56N92j22o69l1L28O1M25k43n25K3O00N6j68l3m39O7O83Jl69l12
4376b05r0K15N59j57l17k83K38K10J58j07n19J1M30J40k0O7n51n3P00j14r0l43
4398a21j73j0P24K1n70kk05N49R7J51p48n9N04K80j50l25k02L7N13J91k69l89
4420a56j77O3L42M11p20k3N6J65M09r8l74%j04K47K50j71j72m74M97N40k76m23
4442a88KK6L80K99n42p1O9j99L62J62k61n65J37M48J84J9m71m42N61M69k13j94
4464b8n8k36N61q3k5k89J1rjM60k03l77j29N18L2K12m07m26L43M17K1k94r7j94
4488b81J68M33k98q9o2K3r7O36j83o64Q2J73L76J35k18p70N36M03J90m33J5k84
4510b09qN06L1l17l94L21n1N76k07q12J37M62M39k37n4l90p4O10k04K07k24l20
$$ plain form
4532 -212 -210 455 425 1 -486 -112 -193 146 304 -426 -305 -8 105 249 146 -26 -381 32 176 161 -105 -496
4554 -496 -564 36 300 -110 -154 -472 -172 162 460 -209 -387 -25 72 274 107 -154 -462 -117 -50 86 271
4575 271 -184 -440 23 581 282 -167 -107 -101 386 189 342 -242 110 -72 71 330 262 -360 -143 245 382
4596 382 453 -193 -296 115 428 328 -116 18 -16 24 356 275 -92 -213 -90 59 194 46 -493 -521 196 151
4618 151 -102 -136 -573 -177 69 -2 -46 -311 -222 -272 281 186 -291 -426 -3 108 152 20 -346 -244 179 248 -69
4641 -69 37 -409 -183 215 349 -53 -192 9 -339 342 209 9 -282 -159 143 130 338 -215 -271 -15 181
4662 181 158 -181 -87 -356 98 144 -31 -161 -126 -294 212 246 -38 -180 -193 42 254 224 -71 -362 94 20 115
4685 115 -8 -171 -394 -111 496 110 192 -233 -66 154 484 -133 -236 4 152 190 308 -101 -347 -63 280
$$ packed form
4532b12KO65l0m24m87L74q1L39J58p30J21K97J13J44j03j72l55M13J44j5k66l91
4554d96o8O00K64m10m4l18L00L34K98o69j78L62R7K02j67k61l08L45O7J36J85
4575B71m55k56M63N58k99m49O0OM87j97J53n84L52j82J43K59o8o22K17L88J37
4596C82P1o46j03M11L13j00m44J34l4M0L32q1l67j21J23J49J35j48n39k8P17m5
4618A51k53l4m37L96K46p1m4k65Q9n0N53r5m77j35M23J11M4j32l66J02M23O9l17
4641f9J06m46K26L98J34m02j39K01l48O81j33k00k91J23L02j3K08n53n6K56J96
4662A81k3l39R4k69M54M6j75j30L5j68N06L4k84j42j3K35K12l0k95k91M56p4R5
4685A15j23j63k23K83O07l86Q2m25J67K20L30o17j03K40J48L8J18m09k46K84L43
$$ plain form
4706 280 335 228 -134 -489 -88 518 24 -29 -193 -210 -7 325 121 -47 -2 -91 328 303 142 -304 -64 172
4728 172 132 278 41 -382 -254 159 333 287 57 -254 53 246 351 26 -165 -107 10 372 159 -128 -407
4749 -407 -29 280 254 65 -554 -23 5 428 163 -34 -292 -162 183 149 92 -248 -168 -133 412 -68 -235 -328
4771 -328 72 347 135 13 -550 -140 121 186 177 -70 -82 -432 206 142 -49 -106 -313 -267 329 302 -268 -344 -179
4794 -179 -137 271 266 -62 -411 101 339 168 143 -330 -154 395 411 -202 -42 -135 22 168 283 -77 -398 -42
$$ packed form
4706B80N5j07l62l55M01O06m94n3j64j7K03L32k04j68M5q9M19k5j61m46K40K36
4728A72m0J46k37m23J28M13J74m6k30l11L07J93J05l25j91N8J17L62k13k87k79
4749d07L78L09k6j89o19N31K8M23k65j97k58J30L45l4n7l40Q0L5N45m80j67r3
4771c28M00K75k12j22n63M10K61O5rk47j2l50O38o4j91n7k07M6N96k7n70p6J65
4794a79M2M08nl28l49N12K38j71k5m73J76N49J6o13J60r3J57J46J15l60l21L56
$$ [...]
8191A5
##END NTUPLES=NMR FID
##END=
