##TITLE=1H_CA-8781-1
 CDCl3, 8 sc, 
 19.10.2020
##JCAMPDX= 6.0         $$ Bruker NMR JCAMP-DX V2.0
##DATA TYPE= NMR FID
##DATA CLASS= NTUPLES
##ORIGIN= UXNMR, Bruker Analytische Messtechnik GmbH
##OWNER= root
$$ XWIN-NMR		Version 3.5
$$ Mon Oct 19 10:26:11 2020 Russian Standard Time (UT+4h)  she@DPX200
##.OBSERVE FREQUENCY= 200.1315066352
##.OBSERVE NUCLEUS= ^1H
##.DELAY= (6, 6)
##.ACQUISITION MODE= SIMULTANEOUS
##.ACQUISITION SCHEME= undefined
##.AVERAGES= 8
##.DIGITISER RES= 18
##SPECTROMETER/DATA SYSTEM= spect
##.PULSE SEQUENCE= zg30
##.SOLVENT NAME= CDCl3
##.SHIFT REFERENCE= (INTERNAL, CDCl3, 0, 15.7039)
##AUDIT TRAIL= $$ (NUMBER, WHEN, WHO, WHERE, WHAT)
$$ ##TITLE= Audit trail, XWIN-NMR		Version 3.5
$$ ##JCAMPDX= 5.01
$$ ##ORIGIN= Bruker BioSpin GmbH
$$ ##OWNER= she
$$ F:/spectra/data/she/nmr/H-F/1/audita.txt
$$ ##AUDIT TRAIL=  $$ (NUMBER, WHEN, WHO, WHERE, WHAT)
(   1,<2020-10-19 10:24:55.46 +0400>,<she>,<DPX200>,
      <created by zg, POWCHK disabled, PULCHK disabled
       configuration hash MD5:
       00 E9 B6 7A A2 85 ED C7 34 08 36 98 17 FE 4E 26
       data hash MD5: 16K
       97 EE 14 4B 25 67 A7 F1 BF FB 2A D4 85 1A 31 AC>)
$$ ##END=
$$ 
$$ hash MD5
$$ 78 F9 26 79 D2 66 6A 47 3F 52 29 BD 7D 49 7D 65
##$RELAX= 
##$RELAX= 
##$RELAX= 
##$RELAX= 
##$RELAX= 
##$RELAX= 
$$ Bruker specific parameters
$$ --------------------------
##$DU= <F:/spectra>
##$EXPNO= 1
##$NAME= <H-F>
##$PROCNO= 1
##$TYPE= <nmr>
##$USER= <she>
##$AMP= (0..31)
100 100 100 100 100 100 100 100 100 100 100 100 100 100 100 100 100 100 
100 100 100 100 100 100 100 100 100 100 100 100 100 100 
##$AQSEQ= 0
##$AQ_mod= 1
##$AUNM= <au_zg>
##$AUTOPOS= <>
##$BF1= 200.13
##$BF2= 200.13
##$BF3= 200.13
##$BF4= 200.13
##$BF5= 200.13
##$BF6= 200.13
##$BF7= 200.13
##$BF8= 200.13
##$BYTORDA= 1
##$CFDGTYP= 0
##$CFRGTYP= 5
##$CHEMSTR= <none>
##$CNST= (0..31)
1 1 145 1 1 1 1 1 1 1 1 1 1 1 1 1 1 1 1 1 1 1 1 1 1 1 1 1 1 1 1 1 
##$CPDPRG= <>
##$CPDPRG1= <>
##$CPDPRG2= <>
##$CPDPRG3= <>
##$CPDPRG4= <mlev>
##$CPDPRG5= <mlev>
##$CPDPRG6= <mlev>
##$CPDPRG7= <mlev>
##$CPDPRG8= <mlev>
##$CPDPRGB= <>
##$CPDPRGT= <>
##$D= (0..31)
0 1.2 0 0 0 0 0 0 0 0.06 0 0.03 0 0 0 0 0.0002 0 0 0 0 0 0 0 0 0 0 0 0 
0 0 0 
##$DATE= 1603088695
##$DBL= (0..7)
120 120 120 120 120 120 120 120 
##$DBP= (0..7)
150 150 150 150 150 150 150 150 
##$DBP07= 0
##$DBPNAM0= <>
##$DBPNAM1= <>
##$DBPNAM2= <>
##$DBPNAM3= <>
##$DBPNAM4= <>
##$DBPNAM5= <>
##$DBPNAM6= <>
##$DBPNAM7= <>
##$DBPOAL= (0..7)
0.5 0.5 0.5 0.5 0.5 0.5 0.5 0.5 
##$DBPOFFS= (0..7)
0 0 0 0 0 0 0 0 
##$DE= 6
##$DECBNUC= <off>
##$DECIM= 32
##$DECNUC= <off>
##$DECSTAT= 4
##$DIGMOD= 1
##$DIGTYP= 9
##$DL= (0..7)
0 120 120 120 120 120 120 120 
##$DP= (0..7)
150 150 150 150 150 150 150 150 
##$DP07= 0
##$DPNAME0= <>
##$DPNAME1= <>
##$DPNAME2= <>
##$DPNAME3= <>
##$DPNAME4= <>
##$DPNAME5= <>
##$DPNAME6= <>
##$DPNAME7= <>
##$DPOAL= (0..7)
0.5 0.5 0.5 0.5 0.5 0.5 0.5 0.5 
##$DPOFFS= (0..7)
0 0 0 0 0 0 0 0 
##$DQDMODE= 0
##$DR= 18
##$DS= 0
##$DSLIST= <SSSSSSSSSSSSSSS>
$$ [...]
##$SUBNAM2= <"">
##$SUBNAM3= <"">
##$SUBNAM4= <"">
##$SUBNAM5= <"">
##$SUBNAM6= <"">
##$SUBNAM7= <"">
##$SUBNAM8= <"">
##$SUBNAM9= <"">
##$SW= 16.880792210976
##$SWIBOX= (0..15)
0 0 2 0 0 0 0 0 0 0 0 0 0 0 0 0 
##$SW_h= 3378.37837837838
##$TD= 16384
##$TD0= 1
##$TE= 0
##$TE2= 300
##$TE3= 300
##$TEG= 300
##$TL= (0..7)
0 120 120 120 120 120 120 120 
##$TP= (0..7)
150 150 150 150 150 150 150 150 
##$TP07= 0
##$TPNAME0= <>
##$TPNAME1= <>
##$TPNAME2= <>
##$TPNAME3= <>
##$TPNAME4= <>
##$TPNAME5= <>
##$TPNAME6= <>
##$TPNAME7= <>
##$TPOAL= (0..7)
0.5 0.5 0.5 0.5 0.5 0.5 0.5 0.5 
##$TPOFFS= (0..7)
0 0 0 0 0 0 0 0 
##$TUNHIN= 0
##$TUNHOUT= 0
##$TUNXOUT= 0
##$USERA1= <user>
##$USERA2= <user>
##$USERA3= <user>
##$USERA4= <user>
##$USERA5= <user>
##$V9= 5
##$VALIST= <valist>
##$VCLIST= <CCCCCCCCCCCCCCC>
##$VD= 0
##$VDLIST= <DDDDDDDDDDDDDDD>
##$VPLIST= <PPPPPPPPPPPPPPP>
##$VTLIST= <TTTTTTTTTTTTTTT>
##$WBST= 1024
##$WBSW= 4
##$XGAIN= (0..3)
0 0 0 0 
##$XL= 0
##$YL= 0
##$YMAX_a= 246563
##$YMIN_a= -344925
##$ZGOPTNS= <>
##$ZL1= 120
##$ZL2= 120
##$ZL3= 120
##$ZL4= 120
##$ABSF1= 10
##$ABSF2= 0
##$ABSG= 5
##$ABSL= 3
##$ALPHA= 0
##$AQORDER= 0
##$ASSFAC= 0
##$ASSFACI= 0
##$ASSFACX= 0
##$ASSWID= 0
##$AUNMP= <proc_1d>
##$AZFE= 0.1
##$AZFW= 0.1
##$BCFW= 1
##$BC_mod= 2
##$BYTORDP= 1
##$COROFFS= 0
##$CY= 11.3945322036743
##$DATMOD= 1
##$DC= 2
##$DFILT= <>
##$DTYPP= 0
##$F1P= 16.9975609425685
##$F2P= -3.02152046262296
##$FCOR= 0.5
##$FTSIZE= 0
##$FT_mod= 4
##$GAMMA= 1
##$GB= 0.15
##$INTBC= 1
##$INTSCL= 1
##$ISEN= 128
##$LB= 0.24
##$LEV0= 0
##$LPBIN= 0
##$MAXI= 10000
##$MC2= 0
##$MEAN= 0
##$ME_mod= 0
##$MI= 1.114404
##$NCOEF= 0
##$NC_proc= 0
##$NLEV= 6
##$NOISF1= 3.799351
##$NOISF2= 2.8
##$NSP= 1
##$NTH_PI= 0
##$NZP= 0
##$OFFSET= 15.70392
##$PC= 1
##$PHC0= -10486.83
##$PHC1= 10.40089
##$PH_mod= 1
##$PKNL= yes
##$PPARMOD= 0
##$PSCAL= 0
##$PSIGN= 0
##$REVERSE= no
##$SF= 200.130013532006
##$SI= 16384
##$SIGF1= 3
##$SIGF2= 2
##$SINO= 400
##$SIOLD= 16384
##$SREGLST= <1H.CDCl3>
##$SSB= 0
##$STSI= 0
##$STSR= 0
##$SW_p= 3612.71676300578
##$SYMM= 0
##$S_DEV= 0
##$TDeff= 0
##$TDoff= 0
##$TI= <>
##$TILT= no
##$TM1= 0
##$TM2= 0
##$TOPLEV= 0
##$USERP1= <user>
##$USERP2= <user>
##$USERP3= <user>
##$USERP4= <user>
##$USERP5= <user>
##$WDW= 1
##$XDIM= 8192
##$YMAX_p= 0
##$YMIN_p= 0
$$ End of Bruker specific parameters
$$ ---------------------------------
##NTUPLES= NMR FID
##VAR_NAME=  TIME,          FID/REAL,        FID/IMAG
##SYMBOL=    X,             R,               I
##VAR_TYPE=  INDEPENDENT,   DEPENDENT,       DEPENDENT
##VAR_FORM=  AFFN,          ASDF,            ASDF
##VAR_DIM=   8192,          8192,            8192
##UNITS=     SECONDS,       ARBITRARY UNITS, ARBITRARY UNITS
##FACTOR=    0.000296,      1,               1
##FIRST=     0,             0,               0
##LAST=      2.424536,      0,               0
##MIN=       0,             -344925,         0
##MAX=       2.424536,      246563,          0
$$ Real data points
##PAGE= N=1
##DATA TABLE= (X++(R..R)), XYDATA
0 0 0 0 0 0 0 0 0 0 0 0 -8 8 -8 8 -14 16 -17 24 -32 32 -40 48 -61 72 -85 97 -113 132 -153 177 -201 230 -261
33 -261 295 -335 376 -423 475 -531 595 -661 736 -816 906 -1002 1107 -1222 1346 -1485 1636
50 1636 -1802 1986 -2187 2412 -2664 2948 -3267 3634 -4057 4556 -5148 5868 -6765 7920 -9465
65 -9465 11659 -15036 20960 -34483 134538 -59701 -93170 246563 83165 33773 98368 108254
77 108254 4298 30150 185026 131098 -60343 8343 62474 108570 79885 -67156 20808
88 20808 92578 -72210 53352 149436 -91147 -71933 146491 82937 -94787 -69946 71314
99 71314 -12293 -66962 87249 23357 -89958 55870 46955 -42933 -11188 -38930 13236 43308
111 43308 -56133 -11677 47803 -25656 -32063 43472 39435 -68645 -28317 128449 -20895 -148757
123 -148757 49581 60965 -64864 20969 40955 -35206 7125 31035 1943 -36579 -49356
134 -49356 240 31156 26022 -29929 -47567 42318 17122 -53606 46101 8666 -108613 29483
146 29483 85024 -57003 -70325 10872 23054 7301 19064 9781 -40449 -7917 37234 -25503
158 -25503 -16402 2830 -38791 37143 69360 -34285 -17479 36706 -19500 -5623 47236 1248
170 1248 -50798 11298 67206 -9969 -33025 35494 17869 1400 37987 -1045 -10497 14963
182 14963 -23924 1439 42470 -7468 -10067 49822 26323 -25471 3044 31867 -23173 -29371
194 -29371 49866 16025 -35412 26519 32932 -16275 -1811 16197 20252 16202 -22191 -5695 30840
207 30840 -322 -22424 18555 36087 -7056 6977 58062 -1125 -50784 31989 29000 -37171
219 -37171 23208 49334 -16238 -2948 53562 24851 -23982 -4118 33671 18940 2721 8713
231 8713 3788 14502 7327 8548 46449 14462 -28104 36361 48481 -33411 -16607 39998 2433
244 2433 -22789 49144 57057 -33111 -18945 56719 18627 -35211 1949 25771 8242 -2342
256 -2342 11442 25581 -2687 -15146 24763 35603 -8536 -14472 18141 6725 -20750 8919
268 8919 25927 -15845 1620 46026 11463 -23859 3884 11912 -13136 -5191 14842 8484 -2163
281 -2163 10454 13355 2151 -1764 2476 9326 214 -4682 10845 6492 -20618 1482 31782 75
295 75 -13984 27752 26833 -25973 -14638 23129 -1865 -22097 12636 24872 1212 4565 14644
308 14644 2504 -9522 1761 9629 900 -2978 5053 11055 -221 -1663 13632 13464 -5496 3229
322 3229 21706 517 -19182 -1041 12082 -3303 4247 21422 7298 -2847 14076 10072 -18456
335 -18456 -8323 16005 2463 -11561 15314 21272 -10966 -8893 19584 13500 -14010 -4278 15680
348 15680 1667 -14399 517 7206 -4943 3373 15984 10515 -6159 -3933 7958 -7106 -19580
361 -19580 4373 14994 -7025 -2871 20434 12677 -19838 -8449 22900 -2737 -20656 10607
373 10607 13122 -12547 -2914 12725 5243 -5735 7678 22070 -3989 -13658 9654 6100 -15017
386 -15017 -4645 21096 18216 -9165 3675 31657 -5792 -22271 13944 11330 -9107 1646
398 1646 13064 8766 -229 2864 11081 305 5820 9427 -3714 3394 -870 -5442 10233 -1955
412 -1955 -4615 25930 10271 -8952 7991 5654 -9550 -9285 9465 7126 -10170 12179 20245
425 20245 -10330 5901 13990 -16778 5258 18482 -6299 -3933 3889 2888 8185 5551 1407
438 1407 4112 15845 16015 -15088 -2494 18125 -17280 -5587 29281 3124 -4349 14160 7946
451 7946 8112 -3492 -11963 5892 8633 1269 -3733 4710 9401 -11347 3599 27977 -18458 -18646
465 -18646 34694 45 -31937 1902 10164 -6622 -6611 10184 16098 -9041 -10128 11128 -1165
478 -1165 -12566 -16246 3505 27735 -13363 -17452 32556 -2220 -23146 29107 6061 -28578 8663
491 8663 29184 -4463 -26373 16242 27231 -13877 11153 32152 -10150 -323 15949 2871
503 2871 10937 -10849 -3146 43805 15133 -13828 20597 20627 -8051 2358 33710 5857 -37856
516 -37856 31797 57013 -34934 -13990 50844 4585 -10295 24779 16315 -6128 -14220 16669
528 16669 25670 -15274 -8726 22176 24690 6380 -15751 11307 17770 -32563 9754 42079 -36051
541 -36051 -17558 50911 9285 -31043 1872 26948 -1769 -20563 20286 11884 -31867 3262
553 3262 19500 -1473 -2118 -10293 17852 27645 -29790 -9782 27587 -22820 -16596 30293 7461
566 7461 -28633 -69 45149 -5749 -46386 23252 22060 -32955 7536 15222 -17396 -996 2235
579 2235 8264 9559 -16122 -1052 20312 1034 -15522 -10705 12410 -614 -16070 31787 8363
592 8363 -36695 27412 30514 -33719 -8480 19785 -840 -2383 8642 11328 -6706 -77 21613
605 21613 1394 395 8574 -6550 15136 13418 -21792 10351 19318 -12023 16584 26700 -9599
618 -9599 -8004 21276 13768 -19974 -6929 27121 3110 -5958 19389 2071 -612 9250 -5641
631 -5641 8993 10952 -18861 2327 23433 -8319 -14788 13201 15941 -11102 -567 23660 -11288
644 -11288 -20468 18596 1798 -20289 5893 8532 5621 5959 -10465 1094 12559 -10574 -13784
657 -13784 13434 8419 -19098 -744 27629 -9507 -21874 26130 9074 -21956 11601 12383 -19691
670 -19691 -3077 14991 -2200 -7799 8006 14734 1955 -2901 -1973 1029 5017 -9054 -5223 20482
684 20482 993 -17916 20224 16306 -23535 -779 24641 -7835 -17253 17438 9018 -22423 -514
697 -514 23991 -3447 -12653 12367 12175 -4165 -11797 -2052 10757 -4820 -16463 14980 20114 -16911
711 -16911 -7211 23071 -1264 -23979 9297 15806 -19337 -6103 22682 -3669 -18224 11957
723 11957 11552 -7876 -2429 6828 2826 -7361 -9617 4273 9730 -9052 -6048 18939 9452 -17226
737 -17226 335 15894 -15442 -13000 20749 1906 -20545 12051 17887 -14073 -6111 15584 686
750 686 -12134 4917 7838 -6020 -6943 90 5873 5962 -3537 -1300 12603 -512 -11615 4048
764 4048 2067 -13262 1814 14394 -5441 -5072 13377 1296 -13780 5020 8490 -11677 -4445
777 -4445 9019 -807 -6573 1808 2104 605 2134 705 535 -874 -4325 -3476 215 -5065 -2221 9533
793 9533 2261 -7819 5012 7425 -12018 -7564 6760 -1837 -8209 3178 4431 -4517 -808 1482
807 1482 -2179 1121 2094 -6628 -3206 3225 -4338 -5475 -109 581 2605 5000 -2067 -2627 2142 -4308
823 -4308 -7486 2076 2672 -7679 2287 11549 -3575 -5776 8332 -505 -9933 6462 7638 -8481
837 -8481 -6717 8553 5784 -6330 -323 9046 4243 -1528 -150 1404 1267 -5905 -2947 9695 4037
852 4037 -2555 5438 7022 -1255 -1427 2186 450 -3460 3121 7371 -3283 -162 7884 1121 -972
867 -972 4531 4266 1933 -1920 -1004 3758 -1285 458 4548 2328 5703 6523 1486 -232 -1252 1630
883 1630 3239 -3546 4086 8724 -1160 2155 7244 3214 113 -1277 3772 7161 -1908 -1039 2502
898 2502 352 6392 2365 -67 7896 3129 -847 2820 -2142 -1606 412 69 6636 1175 812 6856
914 6856 -1737 -780 3451 -4131 78 2070 -1932 5601 -2361 -5138 8589 4028 -3879 -1744 4935
929 4935 6110 -8962 -6341 10336 -5185 -5465 14024 1111 -5334 5089 4266 -1577 -6686 -95
943 -95 6035 -5765 1333 10763 -4357 -3621 3125 5967 5279 -12030 -3764 16880 -4646 -13478 8470
958 8470 3418 -7090 1603 12692 1166 -16785 4798 13769 -16297 -8592 12450 -3249 -4478
971 -4478 5618 4787 -1482 -12617 2813 13983 -11162 -13358 8721 6266 -6438 -7624 6684
984 6684 5366 -13050 7320 14154 -18286 -7299 14816 -4760 -10389 2934 6018 840 -4745
997 -4745 8226 5133 -15285 -2245 10618 -447 -7832 -6741 10748 10325 -17213 1417 16124
1010 16124 -14712 -4337 18062 -4430 -18670 1588 15690 -5844 -17169 13945 9499 -15784
1022 -15784 5403 8173 -10724 -7318 -2287 7870 5091 -16602 -459 17865 -4112 -10402 2760
1035 2760 5577 -6648 -6564 14096 -1459 -20819 12077 14627 -15106 1051 10766 -2438 -626
1048 -626 946 2000 -3253 -6793 7813 8684 -2573 -615 1810 9659 2911 -12400 6731 6487 -10634
1063 -10634 9709 10031 -12973 1389 13613 1250 -4929 1014 9134 -2453 -5001 8147 -2395
1076 -2395 -5723 5925 2116 7023 3715 -12864 7106 11460 -13360 -4159 8092 -1401 -3169 5526
1090 5526 6453 -7599 -4760 14165 -1957 -10599 7748 -773 -3549 4753 -4904 716 6543 -5676
1104 -5676 2821 10629 -4120 -9200 3155 9879 -9141 -9170 15849 2305 -10635 11791 4656 -11377
1118 -11377 4094 5033 -3420 -2140 603 4821 578 -3292 1605 4431 2507 -3862 -101 11310
1132 11310 -7098 -13678 14799 4721 -16705 4775 14546 -4943 -5714 6891 2220 -9804 -1413
1145 -1413 8454 -4005 -5512 4491 4171 163 -5468 -1136 9721 -3930 -11848 10548 5345 -16821
1159 -16821 -1992 15043 -3403 -12557 9470 9163 -12330 -2899 10017 -8359 -9247 7013 1475
1172 1475 -4737 17 2918 1264 -4329 -5775 4224 2898 -11069 -4885 11194 -1369 -16535 5781
1186 5781 12560 -13857 -7010 15906 -3091 -17534 5157 6893 -11944 -5001 9542 220 -7113
1199 -7113 1953 4756 -2680 -8269 -2424 6649 642 -10988 1244 12243 -5916 -9765 10959 5756
1213 5756 -13380 947 11676 -6469 -8150 7170 2190 -6098 4301 6544 -2289 -1680 3414 650
1227 650 -2663 -2776 31 5424 -94 -4309 5991 5627 -7855 -1024 8876 -3901 -6636 6462 2119
1242 2119 -8772 2388 7107 -5960 -2142 8362 -505 -5957 2188 326 -3599 -1722 -1210 2188
1256 2188 4144 -2482 -3315 6220 1565 -8465 -5 6132 -5298 -3245 7713 -1258 -5048 5117
1270 5117 2749 -4065 2873 3713 -4339 -764 3811 -2025 -2031 4188 -115 583 7175 -190 -4781 3620
1286 3620 2593 -4595 318 3758 6 393 3417 1054 191 2290 -1679 -225 4834 -1060 -4127
1301 -4127 3610 1301 -2815 3581 2591 -1969 2048 4433 -3037 -3996 3285 370 -4456 2053 4657
1316 4657 -999 547 741 -337 1503 -2208 -2743 2786 773 -3651 1244 2944 -2320 -1874 4664 495
1332 495 -5400 3441 2136 -8261 -993 5472 -3594 -3022 3721 1737 -981 -1564 -904 -2152 -1464 -199
1348 -199 -2460 -320 2023 -2760 -503 2739 -3603 -698 1661 -4072 -455 2160 -4030 -3949 2562 2741
1364 2741 -2902 -1979 5449 -211 -5029 2240 -1128 -4221 2133 1398 -786 1392 788 2083 98 -2232
1380 -2232 2121 135 -1225 1214 762 1388 -808 -959 5661 1481 -3238 3800 1167 -1031 1831 -2203
1396 -2203 -1423 3041 2803 1417 -1202 1709 5121 -3365 -1899 3941 -2130 -1548 2317 2256 1584 -3626
1412 -3626 -142 7511 -1842 -3967 4022 -138 -2205 362 2080 -498 -5540 4432 10014 -6646 -4698
1427 -4698 8229 -1 -4639 -708 2720 1339 -4407 3996 7843 -5977 -2778 6297 568 -583
1441 -583 -1896 345 3571 -3184 2139 5124 -6261 -8 9436 726 -4706 -2441 5119 2172 -8569
1456 -8569 3700 6912 -7875 1452 9956 -2997 -6029 602 4964 -402 -7168 4001 3104 -7085
1470 -7085 3385 5590 -4940 -3680 1788 6401 -976 -11737 3163 7335 -7649 -2172 5519 -91
1484 -91 -3525 513 6453 -3070 -11087 5583 5608 -7864 247 3289 -1626 172 728 2320 -2530 -6858
1500 -6858 6341 5384 -8876 -3479 4056 3073 -2420 -3328 5688 12 -7003 6718 2527 -10980 -72
1515 -72 4779 59 -990 -1579 2636 229 -2695 3810 -828 -6108 998 2817 3124 -3019 -7052 7628
1531 7628 5205 -7601 2034 4745 -4326 -544 3154 798 -3912 -1903 7465 1455 -2755 3946 -705
1546 -705 -718 4105 -2299 -243 2162 -2564 5331 4463 -4977 21 5621 2611 -3021 -1215 5711 -805
1562 -805 -4180 6598 508 -4971 5159 3442 -546 757 -1257 1461 1087 -2960 1825 1554 -2005
1577 -2005 1598 3770 2171 -5327 -2467 9333 -703 -9538 5089 4711 -5521 318 3662 642
1591 642 -2722 -184 5961 -134 -5623 895 2809 -487 -2567 286 6205 -2632 -4355 9970 540
1606 540 -11623 3512 8548 -5190 -5159 5322 4386 -5661 -883 7254 -2527 -4238 3490 1025 -1387
1621 -1387 -1885 -1663 3460 -931 -3879 5467 1737 -6553 641 5789 -4152 -8380 4897 5920 -9268
1636 -9268 -2389 10459 -3347 -8010 4641 2739 -5405 -2799 2990 489 -4847 -1182 4020 -1025
1650 -1025 -4448 854 4598 -2060 -7574 3462 4983 -9564 -3780 10341 -923 -9201 3948 6180
1664 6180 -5706 -5097 4614 358 -5813 273 3029 -1693 -2593 203 1814 -518 -4184 1247 3359
1679 3359 -5795 -4364 5732 149 -8899 1724 7546 -4787 -5607 5735 343 -7914 646 3223
1693 3223 -3659 -2402 2257 -8 -1400 -112 -468 -128 -1164 -2059 1622 1638 -5447 -1628 6320 -1306
1709 -1306 -5720 4294 4440 -5653 -1154 5201 -2254 -4592 3156 1908 -2192 2126 1561 -1537 1113
1724 1113 1371 -1362 94 458 -685 1913 1201 -2284 592 4230 -1382 -2140 4431 660 -4096 1367
1740 1367 2590 -2591 -125 2300 -129 607 2060 -608 -1248 1348 -805 -1172 1693 -577 -1171 3473
1756 3473 249 -3685 2777 3027 -3695 -1433 3938 -451 -3503 1352 1455 -1156 698 672 -302 2371
1772 2371 -893 -3447 2347 1279 -4119 134 4019 -1969 -1957 4223 -100 -5503 2040 3598 -4840
1787 -4840 -1707 3145 -1098 -2214 711 331 -414 -631 -1096 363 363 -2359 -3178 1609 803 -3779 1126
1804 1126 2178 -3512 364 2922 -4255 -2622 3120 -290 -3629 557 3186 -2216 -2168 3131 580
1819 580 -2392 557 347 287 101 -2279 1659 1930 -2116 1460 3479 -1475 -1318 3115 990 -3946 237
1836 237 5922 -1588 -3342 5349 2125 -2706 1357 1592 -187 617 -160 1402 929 -849 1040 1480
1852 1480 1351 222 194 2241 -613 -819 3584 -1930 -2975 5922 1790 -3221 1924 2977 -479 -691
1868 -691 1763 916 -2363 1657 4041 -2415 189 3322 -856 1128 1921 -250 995 -622 149 3516
1884 3516 -1203 -1932 2525 2933 1055 -1968 1160 2898 -2728 350 3431 -3403 -172 4692 -602
1899 -602 -1129 577 1444 467 -1934 1761 1752 -4016 353 3747 -981 -1787 -790 3294 2334 -4396 313
1916 313 3042 -3690 -213 3271 -2204 -1723 1683 3307 -664 -4410 2580 2320 -4081 925 2221 -2605
1932 -2605 -458 803 2218 403 -4788 2038 4284 -2883 -1419 634 -820 177 -106 1593 -923
1947 -923 -3578 5111 2269 -6294 397 2565 -2261 -797 702 1278 -2042 -2892 5274 761 -6074 1004
1963 1004 2102 -437 -864 -2256 970 11 -2438 3894 218 -4978 2043 3001 -778 -3296 -1746 4216
1979 4216 -146 -3878 4185 1286 -4074 2059 2622 -153 -2384 -1433 4471 1024 -3249 1688 955 -185
1995 -185 2744 -153 204 210 -578 3688 -262 -3638 2478 2432 -115 1042 -49 1434 43 -1133 3355
2012 3355 -664 -3171 2315 1863 127 -172 -1794 1999 1521 -1916 1468 -909 -2460 2162 915 -1881
2028 -1881 -1863 232 3389 -1244 -3302 2804 -668 -3535 1308 304 -1432 -1886 -664 3365 -447 -4754
2044 -4754 922 1675 -1645 -1565 -415 852 -2753 -1397 4326 -2215 -5446 4258 2575 -4635 -1432 2088
2060 2088 146 -3740 -464 3765 -2115 -3398 3120 1732 -2416 -2073 206 2708 -2113 -2873 3546
2075 3546 -112 -3798 2644 2798 -3552 -2047 3899 2288 -5369 -1156 5711 -1921 -4048 3778 2681
2090 2681 -2686 -1201 2837 2497 -3589 -2355 4766 555 -3671 1608 3587 -1510 -2276 3599 2657 -5116
2106 -5116 -547 6792 -1988 -4838 3546 3060 -2742 -1324 3394 1889 -3155 -745 3798 -478 -3248
2121 -3248 487 2812 -100 -2829 2118 3073 -4151 -1299 5273 -2057 -5178 3356 3240 -4429 -2554
2136 -2554 4808 610 -5087 951 3753 -2564 -2823 1272 922 -1510 -2647 1178 2162 -2634 -1724 2909
2152 2909 -241 -4511 464 3240 -3039 -4025 4029 1685 -5513 -158 4007 -1825 -3511 1362 1403 -1821
2168 -1821 -1950 631 875 -1260 -1106 711 1244 -1511 -1117 1728 -668 -2828 1454 1574 -2844 -129
2184 -129 2987 -714 -2490 1497 1417 -1940 -518 1063 -143 -287 -103 -363 1096 308 -1336 928 1086
2201 1086 -1594 -487 1706 -1397 -1730 2472 765 -2813 1060 2772 -2378 -1707 1856 219 -1615
2216 -1615 -140 411 272 313 -1233 -339 1792 -447 -2500 1476 1603 -3192 -462 2607 -1461 -2065 2656
2233 2656 739 -2735 408 2005 -1674 -1845 1312 473 -703 -575 204 1328 -75 -2042 564 2123
2249 2123 -1897 -1755 2280 571 -2822 876 2219 -2173 -509 2754 -648 -2217 1393 990 -1703
2264 -1703 -729 1384 933 -926 -467 1053 1345 -1331 -1918 2256 1276 -3168 203 3349 -1984 -1704 2894
2281 2894 342 -2731 883 2484 -2153 -1767 2456 139 -2451 979 1219 -396 -246 -770 1033 648
2297 648 -2431 -474 2206 -648 -1932 1036 1455 -1872 -775 2917 -1790 -2707 3433 345 -3846 1142
2313 1142 2147 -1700 -1095 1332 1294 -1709 -897 1789 -254 -1313 -510 287 1508 -873 -1446 2388 -465
2330 -465 -2203 2284 64 -2754 508 2090 -699 -2192 952 1926 -2104 -440 2360 -1639 -922 946
2346 946 -515 265 -566 -1061 1612 286 -786 792 -836 -241 1033 38 -850 -1178 2074 1806 -2876
2363 -2876 557 3171 -2283 -124 2933 -886 -903 955 1497 353 -926 1293 1456 -390 1817 829
2379 829 -873 1112 119 1582 1583 -2556 1257 4146 -1034 -1020 1844 849 -33 -153 1922 -4 -2175
2396 -2175 2685 1610 -2267 1181 818 -1056 1602 259 -772 -581 -951 2153 526 -2536 261 1252
2412 1252 294 -407 -1774 641 101 -1974 2042 -204 -3252 1348 1292 -1339 -536 -579 285 -281 -1091 1467
2430 1467 -1408 -2498 1684 964 -694 -1351 -1206 2339 366 -3358 827 303 -1795 1224 220 -1156
2446 -1156 -679 -37 1463 -911 -1959 1394 -671 -1087 1695 -1337 -1078 379 -341 1454 -797 -2798
2462 -2798 1266 921 -1245 -786 -1314 871 148 -1270 1121 -1253 -1924 1975 -345 -1897 33 -1125
2478 -1125 406 106 -1421 397 -1225 -1102 1464 -519 -1358 -995 -1001 1946 -761 -3436 1110 733 -1085
2495 -1085 -58 -827 -290 -625 -1069 1404 -997 -2555 1594 401 -1074 -64 -584 72 -528 -409 1608
2512 1608 -1463 -2300 2431 811 -1817 -628 693 1538 -951 -1067 1703 -724 -1600 2101 362 -1571
2528 -1571 69 1193 1235 -1598 -578 2462 -946 -1819 2633 859 -2390 -457 2599 1550 -3197 -720
2544 -720 4064 -531 -2808 1852 1373 -1821 -601 2114 1118 -2750 133 3619 -1287 -2320 1994 1092
2560 1092 -1690 -511 1911 1116 -2674 -295 3690 -746 -2901 1262 2297 -1091 -1970 1443 1635 -2567
2576 -2567 -251 3287 -1432 -2241 2179 1183 -2415 -988 2121 204 -2793 638 2769 -1974 -2153 1875
2592 1875 1159 -2046 -1849 1733 1158 -2841 -801 2552 -1112 -2353 1511 1213 -2301 -1500 2330 188
2608 188 -3441 166 2716 -1684 -2154 1830 1340 -1928 -1709 1848 1114 -2728 -823 2629 -70 -2303
2624 -2303 648 1811 -1009 -1562 1823 790 -2406 317 2113 -1182 -1409 1640 1069 -1130 -638 1577
2640 1577 699 -1606 -380 1487 377 -1418 -154 1839 42 -1930 949 1575 -1782 -538 1792
2655 1792 -302 -1615 908 1240 -1444 -737 1669 335 -1448 98 776 26 -896 -599 997 573 -1397
2672 -1397 -375 1742 -255 -1759 402 1266 -1250 -921 1381 -92 -1230 608 703 -956 -419 736
2688 736 196 -869 -581 835 249 -1145 -533 1484 323 -1837 192 1787 -994 -1762 1416 624 -1677
2705 -1677 7 1392 -590 -1082 951 542 -1046 -491 996 262 -1168 -553 1461 635 -2094 -51
2721 -51 2619 -527 -2689 1486 2061 -2348 -1179 2560 315 -2295 901 1837 -1172 -887 1460 385
2737 385 -1261 169 1077 163 -1094 -15 1742 110 -1835 789 2332 -1303 -1573 2043 1135 -2116
2753 -2116 102 2431 -700 -1291 1866 713 -1668 615 1373 -629 -582 946 1020 -838 -632 1383 976
2770 976 -1412 -557 1642 683 -1826 -281 2343 -775 -1835 1873 851 -2080 220 1474 -892 -1342
2786 -1342 490 827 -1243 -670 1233 -332 -1347 -132 623 178 -1737 -1155 1933 -502 -2424 884
2802 884 578 -1641 -360 811 -581 -1603 305 882 -1963 -528 1325 -1520 -594 1097 -690 -782
2818 -782 -303 -207 644 -889 -1160 576 155 -159 -703 -224 712 -1021 7 1086 -1883 -294 1856 -1343
2836 -1343 -783 954 -267 -451 -72 686 -322 -1709 719 883 -1271 57 -268 -434 1227 -772 -754
2853 -754 336 -774 509 630 -1662 -101 769 -216 -202 -637 691 -182 -1205 1630 61 -2136 819
2870 819 588 -510 576 -907 -72 919 -229 291 -528 -755 1020 324 -274 -281 -819 1504 376 -1746
2888 -1746 1231 137 -1369 1267 444 -1067 -93 30 742 76 -663 561 -803 372 1633 -1558
2904 -1558 -775 1158 -198 655 -80 -1342 1295 417 -550 472 -301 116 141 58 961 -893 -832 1891
2922 1891 -143 -459 780 -930 457 1043 -542 -36 -337 -107 1550 -158 -763 37 -18 1371 -384
2939 -384 -1343 1064 47 -711 957 -411 -487 270 -492 1089 -29 -1716 365 727 -109 -405 -887 417
2957 417 258 -751 950 -894 -1651 1598 173 -1433 -156 -139 221 -108 -801 490 -556 -997 957
2974 957 -93 -686 -550 -439 1134 -256 -1582 893 -52 -1111 1191 -239 -1509 -94 945 441
2990 441 -1820 -541 2017 -765 -1507 1386 -68 -1143 4 670 670 -1611 -742 1946 -283 -1510 789
3007 789 261 -559 -216 636 384 -1978 40 2481 -1134 -1909 1435 967 -939 -755 740 849 -1849
3024 -1849 -219 2148 -895 -1701 1046 943 -895 -853 793 655 -1741 326 1867 -1740 -1398 1841
3040 1841 787 -1716 -799 1519 617 -2084 1 1899 -1113 -1256 1159 805 -1081 -920 1154 724
3056 724 -1680 -72 1638 -969 -1039 1209 721 -1408 -729 1803 463 -2193 155 2093 -940 -1419
3072 -1419 1024 875 -992 -669 1293 328 -1396 257 1246 -891 -639 817 267 -924 -330 1154 -25
3089 -25 -1488 402 1439 -900 -1258 831 987 -1025 -1166 1279 683 -1527 -84 1391 -522 -1166 632
3106 632 639 -835 -630 1048 251 -1222 156 1097 -439 -1085 535 922 -562 -1094 822 925 -1106 -634
3124 -634 1026 486 -940 -196 898 29 -847 236 704 -470 -215 556 225 -511 112 708 -110 -793
3142 -793 409 1008 -730 -589 945 579 -953 -212 1179 80 -968 288 855 -455 -296 457 330
3159 330 -310 -152 666 96 -690 128 902 -399 -928 754 1137 -1061 -929 1714 552 -1761 24 1811
3177 1811 -446 -1376 807 1141 -848 -735 1191 345 -952 72 998 -61 -881 437 1068 -633 -989
3194 -989 1407 901 -1581 -332 1829 40 -1788 629 1744 -891 -1155 1449 717 -1234 -91 1124
3210 1124 -20 -1012 374 1001 -781 -815 1260 601 -1508 -149 1628 -92 -1869 643 1664 -1383
3226 -1383 -1266 1649 607 -1720 -43 1315 -193 -1159 347 846 -803 -647 780 199 -1126 -167
3242 -167 1098 7 -1517 204 1674 -1069 -1379 1444 573 -1673 -45 1482 -311 -1359 542 1066
3258 1066 -1006 -484 906 -292 -640 434 229 -400 -547 268 884 -865 -924 980 401 -1123 -466 941
3276 941 -14 -1282 367 1262 -1285 -859 1141 -193 -795 -40 94 -151 -384 -26 288 -936 -358 821
3294 821 -197 -736 -428 438 450 -1077 -314 938 -698 -395 806 -511 -387 15 -82 303 -230 -238 63
3313 63 -206 582 83 -1014 469 233 -171 456 -852 -157 1008 -505 -290 319 -389 160 9 22 -26
3332 -26 -833 468 343 -769 566 -92 -923 987 226 -843 165 -245 404 368 -732 -58 -172 307
3350 307 623 -1062 -171 995 -677 171 316 -699 466 -34 -118 777 -572 -428 783 101 243 -553
3368 -553 -355 1123 -276 -106 501 -973 333 1134 -613 -149 107 -14 845 -494 -222 510 -453 363
3386 363 426 -350 178 -390 174 1157 -933 -342 669 -399 680 296 -1172 236 713 43 -205 -747
3404 -747 489 421 -682 618 -303 -795 903 -15 -398 435 -695 95 645 -497 117 -350 -353 766 -34
3423 -34 -391 -352 -334 1131 -99 -1415 698 129 -650 723 -238 -666 106 229 343 -583 -565 798 -480
3442 -480 -462 817 -417 -526 94 325 524 -1043 -729 1436 -10 -1139 306 146 -164 -170 120 203 -888
3461 -888 -87 1173 -671 -806 714 -73 -264 43 26 169 -896 -26 1252 -645 -1264 678 610 -411
3479 -411 -757 214 558 -970 77 1011 -1214 -761 1374 -19 -1029 -116 641 127 -1113 331 1054
3496 1054 -1090 -713 1128 380 -880 -722 771 842 -1385 -287 1371 -621 -768 881 288 -870 -312
3513 -312 1053 317 -1509 324 1300 -917 -608 922 300 -755 -374 924 416 -1314 51 1217 -498
3530 -498 -666 430 364 -425 -242 723 -14 -1006 584 899 -945 -404 798 248 -780 -333 895 90
3548 90 -1140 258 1035 -631 -806 516 647 -588 -655 777 204 -937 269 729 -710 -453 759
3565 759 233 -788 -297 906 24 -946 157 763 -310 -606 234 530 -260 -795 471 547 -619 -350
3583 -350 509 79 -486 99 381 -233 -508 521 215 -714 -59 670 -116 -722 192 600 -176 -724 389
3602 389 584 -513 -398 492 348 -541 -215 502 130 -570 148 537 -438 -338 507 225 -638 -123 769 -45
3622 -45 -997 232 899 -605 -850 628 568 -850 -502 793 157 -974 -97 717 -312 -575 326 377 -576
3641 -576 -368 686 28 -947 81 790 -534 -846 549 637 -895 -729 1022 282 -1202 -70 1037
3658 1037 -258 -888 417 744 -636 -578 886 137 -1009 252 1010 -535 -911 815 749 -1058 -598
3675 -598 1391 173 -1343 159 1231 -291 -1043 471 952 -526 -752 926 410 -964 25 938 -86
3692 -86 -963 460 948 -841 -663 1291 230 -1267 186 1152 -352 -1099 659 1059 -895 -528 956
3709 956 167 -745 125 515 -170 -557 397 641 -809 -310 933 -29 -871 294 838 -377 -912 763
3727 763 919 -1167 -462 1205 139 -870 -6 713 -40 -627 317 656 -704 -189 917 6 -694 126
3745 126 747 -115 -719 517 766 -851 -178 1074 -44 -681 49 680 217 -518 -24 554 -179 2 234
3764 234 -150 60 -31 252 165 -556 194 665 -534 -243 558 -150 -307 51 495 -25 -792 302 594 -425
3784 -425 -172 20 -224 399 -209 -290 221 -375 124 263 -460 -284 131 21 88 -545 46 318 -704 155
3804 155 393 -593 -281 149 241 226 -790 -196 657 -274 -205 -45 -275 210 -86 -134 55 -624 208 534 -759
3825 -759 -20 135 -336 206 -94 -72 48 -654 326 684 -720 -320 77 252 314 -735 -88 492 -596 327
3845 327 442 -940 39 598 -105 -137 -522 336 218 -698 485 144 -876 245 309 -11 -47 -901 428
3864 428 736 -768 -164 173 -261 324 -81 -199 -152 -461 748 116 -965 521 220 -441 345 -50 -251
3883 -251 7 -204 710 9 -920 442 236 -112 276 -349 -73 306 14 442 -496 -545 1172 18 -637
3902 -637 343 82 91 85 -2 487 -430 -388 1048 22 -436 114 -5 461 53 -303 392 -248 -102 973 -400
3923 -400 -688 541 422 80 -432 140 570 -516 -11 758 -612 -327 658 -22 -117 -163 -34 285 -264 95
3943 95 288 -726 -83 812 -102 -382 -338 455 539 -858 -59 762 -538 -313 552 -80 -457 -171 421 192
3963 192 -822 103 447 -565 -123 450 -292 -448 -29 516 8 -1060 286 811 -622 -529 407 40 -435
3982 -435 -176 368 -47 -778 370 424 -669 -154 287 -87 -305 -22 332 -90 -734 436 558 -719 -484
4001 -484 527 337 -580 -422 593 110 -754 316 530 -631 -144 453 -3 -357 -25 383 -84 -473 302
4020 302 305 -587 -58 396 207 -446 -374 542 244 -703 -5 483 -247 -203 171 252 -206 -231 471 9 -378 286
4042 286 365 -329 -57 311 177 -273 -202 606 23 -633 55 614 -135 -377 213 502 -145 -337 362 238 -294
4063 -294 32 350 90 -195 39 364 5 -392 406 423 -467 -159 647 263 -648 9 784 -18 -723 385
4083 385 609 -357 -367 410 380 -361 -119 398 110 -386 130 378 -216 -267 379 294 -575 -117 701 0 -698
4104 -698 248 751 -507 -546 474 451 -603 -305 680 37 -591 136 674 -294 -408 529 268 -707 -104 862
4124 862 -119 -859 403 820 -557 -597 713 496 -729 -382 880 97 -786 67 773 -243 -668 395
4142 395 526 -586 -440 790 26 -828 211 769 -539 -714 679 506 -864 -395 883 -18 -917 142
4160 142 625 -349 -657 365 482 -578 -393 658 -39 -665 213 530 -407 -586 530 496 -832 -350 936
4179 936 -25 -953 148 688 -211 -677 387 583 -675 -355 665 0 -598 109 435 -107 -490 420 400
4198 400 -743 -94 806 -153 -696 291 518 -232 -594 350 505 -567 -101 434 -22 -323 16 411 106
4217 106 -490 120 487 -429 -63 457 -130 -349 209 531 -208 -635 532 615 -649 -109 506 44 -49 -36
4237 -36 335 104 -399 180 423 -270 -72 180 151 85 -247 177 153 -447 282 426 -548 -137 358 230 -108
4258 -108 -511 236 389 -427 -72 193 -190 -84 -24 89 81 -513 124 374 -342 -12 132 -247 101 102 -62 -121
4280 -121 -364 433 377 -618 -105 247 32 -86 -287 210 146 -491 279 353 -618 -26 335 43 -120 -230 222
4301 222 -1 -420 485 22 -775 285 473 -127 -363 -312 506 258 -669 84 347 -398 88 213 -6 -245
4321 -245 -397 618 106 -780 215 247 -461 191 86 -276 -255 -57 698 -189 -895 401 428 -415 -44 -129 -59
4342 -59 -16 -247 371 -266 -665 557 153 -440 78 -177 -24 7 -141 385 -415 -553 830 48 -664 -83
4362 -83 135 278 -125 -442 418 -99 -449 592 -173 -527 186 195 93 -325 -168 401 -293 -190 710 -441
4382 -441 -491 416 186 -34 -446 -116 593 -154 -169 367 -341 -34 387 -82 -28 -208 107 538 -372 -130 571
4403 571 -259 -27 404 -45 -132 -335 372 574 -551 -233 573 -107 16 149 -102 99 -13 260 215 -532
4423 -532 200 525 -366 25 321 -92 22 -53 223 116 -539 233 456 -246 -47 85 -2 252 -70 84 18
4444 18 -335 416 276 -464 -58 347 59 -211 -126 395 26 -507 353 274 -441 -42 307 108 -200 -235 208
4465 208 70 -274 158 25 -324 165 254 -62 -227 -40 363 -3 -437 182 244 -233 -80 42 112 -108 -152
4486 -152 259 177 -263 84 113 -111 55 33 3 -89 24 208 -134 -311 261 210 -311 -88 177 106 -216 -89
4508 -89 279 58 -189 43 197 -80 -65 -20 161 46 -179 152 73 -244 11 323 -160 -283 182 247 -204 -321
4530 -321 382 199 -384 -106 271 40 -244 -105 256 -26 -365 130 230 -198 -78 127 -3 -184 5 164
4550 164 -123 -369 290 246 -374 -153 424 151 -390 -66 480 52 -511 188 442 -275 -280 306 309 -371 -17 460
4572 460 -101 -320 363 365 -493 -142 459 164 -447 24 606 -25 -561 206 544 -235 -332 322 390 -405 -217
4593 -217 539 34 -535 168 412 -430 -272 458 203 -608 42 625 -210 -611 342 438 -525 -440 428 345 -536
4614 -536 -199 577 -47 -603 147 417 -372 -405 441 143 -661 -94 649 -261 -686 344 487 -546 -487 470
4634 470 282 -681 -256 681 -50 -614 112 508 -239 -508 324 333 -565 -132 566 -240 -506 283 333 -314 -324
4655 -324 364 153 -543 -142 475 -66 -513 93 385 -47 -474 193 440 -396 -189 396 -67 -365 227 361
4675 361 -219 -385 454 183 -599 25 488 -127 -337 154 368 -124 -370 276 383 -392 -254 290 154 -234
4695 -234 -124 251 31 -363 229 359 -517 -108 380 37 -280 -141 324 37 -447 122 328 -350 -185 159
4715 159 150 -192 -414 265 250 -453 34 263 -338 -21 95 -101 -204 -286 291 58 -535 20 185 -193 -97 -20
4737 -20 77 -115 -555 345 261 -614 -135 395 26 -284 -138 187 25 -365 312 2 -633 192 347 -185 -239
4758 -239 -58 214 31 -459 219 249 -441 66 331 78 -328 -204 564 144 -675 173 256 -357 143 191 -200
4779 -200 -133 89 472 -183 -549 429 236 -417 -7 95 6 -205 -108 570 -156 -640 415 408 -409 -144 35
4800 35 52 -52 -69 278 -345 -384 630 122 -541 10 144 117 -218 -285 434 -172 -463 482 159 -446 -113 280
4822 280 242 -313 -328 379 -146 -176 451 -240 -370 300 196 -78 -296 -127 452 -85 -260 307 -110 -121 128
4843 128 69 53 -222 -80 486 -105 -278 329 -108 -67 270 -50 -116 -228 254 456 -475 -305 459 -90 -137 83
4865 83 -24 68 -176 95 366 -384 -119 404 -94 -36 51 -138 154 -2 93 189 -424 112 476 -206 -128 75
4887 75 53 227 -135 -3 223 -163 141 259 -198 55 9 -49 246 -165 108 118 -249 264 158 -422 -29 331
4909 331 85 -62 -263 241 208 -270 104 30 -174 167 64 -107 36 -145 114 114 -187 168 -4 -147 118
4930 118 91 -28 -102 -142 272 98 -352 123 148 -55 75 -84 -9 57 1 139 -46 -130 249 -44 -79 152 9
4953 9 -33 -21 -29 106 -21 -193 163 137 -9 -66 -84 154 46 -186 36 71 -75 48 -21 -56 60 -85 63 -55
4977 -55 -97 48 25 -161 -20 89 -63 -82 -67 229 -66 -296 35 141 -58 -148 -4 14 46 -75 13 7 -100 15
5001 15 87 -113 -66 85 -5 -194 14 230 -75 -312 251 218 -282 -165 254 95 -301 -4 240 -64 -255 192
5023 192 89 -186 -34 153 7 -198 5 210 -73 -301 181 255 -288 -229 299 207 -349 -103 411 22 -346
5044 -346 158 248 -176 -217 155 34 -210 -19 238 -41 -231 275 234 -351 -115 265 153 -409 -110 353 -87
5065 -87 -405 266 373 -259 -139 264 93 -297 -3 259 -170 -279 187 183 -284 -105 370 84 -447 -16 496
5086 496 -165 -461 298 397 -396 -256 452 217 -481 -30 424 -180 -312 238 97 -269 -62 271 -25 -381
5106 -381 -24 337 -193 -335 218 303 -310 -271 318 232 -493 -70 372 -184 -333 147 205 -268 -163 207 66
5127 66 -339 146 225 -254 -228 257 175 -259 -285 344 203 -468 16 394 -33 -326 75 165 -161 -301 260 138
5149 138 -296 43 220 -68 -106 52 91 -115 -235 236 125 -312 -40 346 49 -303 -61 278 -18 -407 143
5170 143 184 -267 24 171 -77 -172 -37 121 -76 -247 91 49 -242 13 127 -23 -237 -117 376 9 -531
5191 -531 99 350 -299 -249 131 131 -133 -160 311 -89 -399 170 162 -217 -109 46 150 -68 -194 297 8 -430
5213 -430 177 368 -184 -337 64 363 -118 -437 337 139 -331 134 125 -128 -115 43 279 -86 -259 364 123
5234 123 -291 188 189 -109 -185 150 425 -304 -406 611 193 -419 66 209 40 -115 85 276 -256 -215 528
5255 528 22 -398 155 208 91 -148 -94 370 -259 -342 607 76 -648 -8 344 102 -451 -87 442 -228 -272
5276 -272 377 -116 -342 201 184 -65 -238 -59 355 -204 -203 280 -96 -262 113 246 -7 -492 42 557 -275
5297 -275 -399 298 -23 -163 97 48 -82 -222 153 362 -403 -215 307 -89 -109 30 65 5 -206 116 400
5318 400 -377 -241 440 66 -176 -99 44 130 -102 88 184 -320 68 336 -208 -67 -30 -24 104 -182 -18 208
5340 208 -227 -40 301 -89 -154 -129 142 192 -377 -55 178 -151 59 189 -320 -30 141 -31 -36 -218 56 82
5362 82 -129 70 41 -154 83 -86 -8 120 -318 4 272 -69 -40 4 -22 150 6 -38 64 -91 159 40
5384 40 -244 130 102 -40 94 -103 -50 131 -98 86 39 -113 81 -41 43 120 -173 0 173 -104 68 -89
5406 -89 -118 269 -54 -117 51 -49 12 95 -110 11 20 -75 40 -37 99 -10 -184 130 166 -205 19 122 -69
5429 -69 113 -115 -70 29 60 128 -36 -88 125 41 -77 20 -64 79 35 -155 93 95 -96 -51 148 76 -40 -26 100
5454 100 -3 -105 99 -41 -47 213 14 -131 0 136 61 -81 -47 116 -14 -81 50 117 17 -122 33 74
5476 74 -89 -88 138 19 -84 119 31 -141 -81 225 60 -222 34 267 -66 -202 150 185 -106 -197 124 162 -128
5499 -128 -108 211 16 -217 136 98 -139 -98 259 -17 -255 52 212 -251 -257 208 76 -232 -59 211 15 -237
5521 -237 -31 187 -30 -205 34 85 -143 -128 163 142 -186 2 207 -215 -297 239 131 -334 -119 249 29
5542 29 -359 45 274 -140 -242 42 57 -203 -125 69 3 -178 -23 183 -195 -203 195 64 -272 -110 249 0
5564 0 -289 57 272 -212 -209 219 136 -254 -112 100 51 -269 6 229 -62 -171 132 17 -213 -73 253 -6
5586 -6 -369 96 368 -248 -188 257 128 -257 -120 225 14 -255 -27 185 -52 -93 25 101 -67 -134 135 63
5608 63 -242 8 213 -56 -189 139 182 -159 -209 284 99 -250 32 161 -99 -24 50 124 39 -88 87 52 -119
5631 -119 44 69 -37 -120 70 235 -58 -223 239 149 -317 16 171 -79 -135 24 166 -6 -221 121 151 -132
5653 -132 -56 21 77 -56 -111 188 -68 -277 224 187 -267 -131 161 126 -211 -149 227 -101 -267 159 143 -108 -115
5676 -115 19 172 -85 -261 198 48 -208 81 160 -157 -95 239 184 -312 -157 470 -50 -372 190 157 -93
5697 -93 -23 155 183 -156 -215 342 58 -246 -4 132 54 -108 25 179 -194 -147 437 -91 -457 136 286 -85
5719 -85 -247 118 279 -263 -155 371 -102 -358 122 125 6 -287 -107 337 -172 -200 281 -71 -281 140 169 -147
5741 -147 -348 86 413 -361 -216 356 -57 -248 114 47 -92 -290 35 339 -273 -220 284 25 -119 -17 19
5762 19 24 -226 193 388 -391 -101 492 -15 -254 55 93 19 -175 118 167 -314 25 267 -30 -61 -112 42 131
5785 131 -201 -50 173 -275 24 312 -65 -209 2 293 25 -356 24 231 -282 9 144 -195 -27 72
5805 72 105 49 -190 -3 156 -159 -10 72 -121 34 68 137 -11 -309 149 310 -246 -110 151 -27 41 -128
5827 -128 35 80 -167 114 111 -145 -54 17 56 95 -140 32 62 -199 80 165 -229 -23 140 84 10 -176 113 130
5851 130 -110 32 20 2 125 -118 40 95 -150 26 244 -90 -47 42 -16 -27 -5 49 -63 -160 174 122 -311 67
5875 67 134 -44 12 -124 17 63 -116 15 46 -82 -28 -31 50 -36 -97 51 -41 -136 89 32 -210 -10 159 -57 -153
5900 -153 -21 118 1 -136 -7 -12 -76 2 -36 -23 30 -110 109 -14 -166 59 1 -175 26 94 -94 -89 47 153
5924 153 -139 -194 160 -5 -150 -21 -4 -4 22 -37 72 4 -34 95 54 -89 3 19 15 -119 52 174 -130 -154 219
5949 219 18 -187 36 87 -13 -45 63 29 8 30 130 -80 -32 57 -54 -74 -60 69 61 -88 -17 149 -50 -152
5973 -152 136 115 -35 -90 171 55 -160 52 191 -63 -94 167 47 -121 48 119 -50 -124 74 172 -36 -123
5995 -123 129 96 -165 -108 125 83 -187 78 108 -52 -112 130 45 -163 7 111 -100 -126 166 72 -145 -82 131
6018 131 50 -157 -29 178 36 -188 -61 161 -74 -149 160 69 -217 24 150 -126 -185 107 45 -244 -65 166
6040 166 -6 -170 48 129 -22 -213 4 157 -86 -90 108 143 -98 -125 138 70 -204 115 192 -121 -58 116 19
6063 19 -191 54 91 -15 -130 47 60 -82 -119 27 116 -64 -118 125 45 -150 -53 64 -67 -20 78 42 -132 -24
6087 -24 132 -77 -150 65 110 -159 -68 44 83 -38 -158 122 130 -157 -100 29 37 -101 -70 94 -103 -165 141 25
6111 25 -192 75 86 15 -39 16 37 -127 -91 123 -1 -129 -41 93 155 -176 -191 183 34 -280 141 119 -166 -14
6135 -14 65 36 -195 -34 210 -82 -213 184 -11 -137 57 73 74 -159 -93 292 14 -221 63 82 -92 -188 55
6158 55 150 -178 -72 312 -146 -308 157 64 -207 -125 89 91 -228 -72 328 -89 -224 104 214 -53 -233 43
6180 43 265 -241 -129 288 -107 -203 140 47 -144 -145 174 67 -211 36 228 -121 -118 184 67 -111 -270 102
6202 102 268 -246 -189 273 6 -160 103 95 -85 -162 239 122 -397 -40 355 -133 -138 145 63 -11 -63 130 143
6225 143 -302 -111 272 19 -187 -25 195 77 -214 97 140 -258 56 250 -143 -172 122 136 -64 -156 148
6246 148 89 -228 83 120 -144 -108 -15 210 71 -210 7 270 -140 5 59 -118 -87 119 113 -84 -180 175 143
6269 143 -196 69 99 -107 -31 18 20 20 -207 83 157 -223 -85 42 -17 17 -152 19 -2 -80 239 68 -226 33
6293 33 153 -39 -35 -57 56 47 -46 104 62 -87 -3 55 86 48 -228 113 172 -160 -7 89 -35 45 80 -44 -55 6
6319 6 174 9 -189 57 47 -20 -13 14 93 34 -100 121 63 -209 -18 94 34 -60 -65 173 -25 -89 122 24 -159
6344 -159 82 85 -84 -41 -23 106 40 -112 41 85 -129 -11 54 25 -156 -72 190 -14 -111 154 52 -159 78
6367 78 70 -142 -55 97 92 -61 -57 69 39 -116 8 100 -10 -7 -72 154 -20 -145 99 142 -128 -6 88 -54 -90
6392 -90 15 92 -152 -48 223 -58 -141 92 135 -56 -98 -32 119 10 -60 75 96 -19 -4 104 41 -71 -85 126
6416 126 -67 -106 147 -30 -92 100 125 -90 -15 29 96 -90 -23 122 -44 -75 21 16 56 -40 1 51 -9 -34 89 -14
6442 -14 -106 135 105 -63 -53 206 61 -146 81 108 -84 -53 60 88 -31 1 62 83 -24 -30 -30 13 -48 14 15 11 -50
6469 -50 111 49 -203 86 96 -92 -76 90 46 -105 -55 73 -24 -95 64 -36 -97 -37 7 -62 -66 29 30 -24 -57 -6 75
6496 75 -81 -123 79 126 -154 -19 83 35 -115 36 68 -90 42 19 -30 -72 20 53 -34 -18 56 41 -69 -23 78
6521 78 1 -113 -39 103 -30 -161 45 122 -102 -37 25 -77 -56 43 -13 -61 5 60 -20 -68 55 97 18 -84 10 127
6547 127 -4 -109 -32 155 -103 -84 72 78 -79 -73 113 -19 -72 14 -31 -69 31 -12 -14 -8 -55 38 -15 -78 -18 13 40
6574 40 -102 28 116 11 -159 128 23 -106 -9 71 33 -107 -4 11 32 -8 91 -47 -96 0 46 -11 -139 33
6598 33 177 -81 -184 153 97 -148 0 69 -21 -136 -15 111 -84 -108 100 -40 -28 -39 -36 84 -121 16 183
6621 183 -127 -158 171 93 -108 -87 144 98 -227 -68 151 -93 -169 177 65 -81 -59 51 83 -93 -7 69 -82
6644 -82 -45 97 32 -88 -94 113 166 -248 -73 246 -87 -189 109 62 -81 -26 180 107 -196 37 152 -107 -38
6667 -38 50 32 -31 -8 193 76 -226 12 267 -92 -135 17 122 9 -112 121 126 -188 75 231 -139 -61 81
6690 81 9 38 -112 118 86 -102 100 203 -70 -158 100 143 -32 -210 157 159 -179 78 169 -86 -71 82 60 -76
6714 -76 -123 125 58 -93 62 19 -31 -33 24 44 -24 -170 124 163 -201 -69 150 74 -69 -19 79 -29 -131 133 43
6739 43 -188 34 58 -16 14 -34 8 17 -68 54 28 -144 -41 120 53 -51 -75 164 53 -178 -6 77 -96 40
6763 40 100 -9 -25 -51 117 65 -106 13 7 -69 68 38 -22 -64 -79 169 41 -200 21 119 -69 -64 -3 53 17 -99
6789 -99 117 3 -140 77 52 -42 -31 -30 55 3 -143 94 66 -177 110 148 -26 -128 31 170 -57 -126 151 68
6813 68 -46 116 24 17 -18 -35 90 -86 -138 99 17 -62 84 45 22 -50 34 145 -127 -154 184 106 -138 -10 61
6838 61 11 -82 -20 43 -113 -79 116 -29 -159 -18 75 14 -71 12 88 -87 -135 104 29 -227 -1 104 -48 -114 36
6863 36 98 -71 -14 110 -32 -29 51 61 -52 7 55 87 -16 -79 92 19 -130 11 170 1 -95 36 182 -111
6887 -111 -51 111 0 -151 56 27 -105 22 111 42 -69 -11 96 39 -39 29 35 1 -71 4 88 -21 -81 52 67
6912 67 -69 -28 16 -15 -75 61 44 -80 44 86 -117 17 87 -41 -83 27 -16 -14 -27 -14 51 2 0 -5 3 11 -57 6 15
6941 15 -49 24 66 -53 -31 118 -21 -76 -34 97 24 -80 36 1 -27 -57 -33 54 -13 -44 -44 42 -39 -23 35 1 -17 46
6969 46 11 -30 40 51 -49 -12 94 9 -68 2 30 -30 25 1 -20 6 4 18 -20 48 -4 -2 32 20 -5 34 15 -75 68 6
6999 6 -50 -1 78 11 7 44 76 0 -56 27 -20 5 -3 -58 15 -23 -24 -7 65 -44 -26 19 -45 -70 -1 101 -11 12 77 10 -22
7030 -22 5 39 -13 -47 -25 11 31 -58 32 38 19 1 12 39 -64 -30 135 -79 -78 149 -9 -21 68 119 11 -29 -23 87
7058 87 -1 -24 10 73 59 -43 27 58 -54 -47 83 23 -99 83 49 -54 -22 119 26 -99 32 91 -108 -102 41 31
7084 31 -36 5 51 105 -67 -97 61 -35 -14 63 -20 -76 -19 66 36 -200 92 163 -61 -58 107 15 -103 21 105 43 -123
7111 -123 -8 175 -16 -65 34 6 -51 -52 106 79 -166 19 205 -126 -92 158 99 -104 27 70 37 -123 50 161
7135 161 -45 -62 -7 50 36 -127 -7 86 -44 -7 152 -31 -27 100 85 -63 -117 179 57 -205 63 146 -220 -2
7159 -2 174 36 -80 -80 61 24 -111 -68 33 -5 28 97 31 -68 -149 199 66 -263 36 160 -96 -25 68 40 -65
7184 -65 -89 153 58 -184 2 100 16 -13 -38 24 15 -69 78 14 -142 24 90 -13 -66 7 112 -50 -73 140 14
7209 14 -167 21 10 -37 -56 -68 111 57 -137 37 67 -54 28 -10 -16 -83 -38 104 -31 -115 177 93 -96 34 -4
7234 -4 53 -83 -1 148 -48 -117 45 45 1 -42 -64 117 3 -71 79 -27 -118 143 99 -102 -47 103 82 -97 -73
7259 -73 98 -1 -67 84 32 -45 -25 13 90 20 -80 86 39 -60 51 51 -27 -65 102 91 -109 -110 129 -3 -136 43
7285 43 39 -58 -32 6 103 -51 -91 83 -24 -67 -48 72 25 -12 30 93 -86 -46 164 0 -174 1 69 -29 -126 72
7311 72 109 -103 2 66 -16 -88 40 21 32 -40 -81 79 -28 -62 99 21 -54 36 59 -71 -119 55 81 -123 -47 115
7337 115 29 -67 9 53 6 -40 9 22 -67 -10 87 26 -11 23 54 9 -95 27 98 -118 -77 83 17 -38 59 118 21 -61
7365 -61 0 47 -18 -40 32 -15 -27 25 10 46 -20 13 9 -90 -46 92 8 -38 18 84 -29 -39 25 25 -32 23 36 -17 -3 50
7395 50 -23 30 -7 37 34 -17 10 4 -8 -45 -25 73 -40 -74 47 60 -84 -24 49 -14 11 10 61 -24 -2 9 10 16 80 -29 -9
7426 -9 19 47 6 40 -9 72 74 -28 -6 47 47 -47 29 24 23 -23 56 54 8 37 -81 -66 31 32 -9 -33 13 66 39 -77 10 -17
7458 -17 59 -28 -19 27 -97 -7 22 -17 5 28 -29 29 16 -40 26 49 5 11 0 -35 -15 43 15 -30 -93 75 -6 -90 38 48
7488 48 -83 12 19 7 -19 32 30 -36 -8 -8 -41 -69 64 -13 1 35 33 31 -7 -6 -32 48 -46 -59 62 64 -50 2 98 -18 -12 41
7520 41 -47 -32 -23 9 -21 23 48 9 -65 -10 99 -4 -29 -29 46 35 -95 -55 110 -18 -56 79 33 -43 -60 12 26 -44
7548 -44 14 66 -28 27 55 -20 -74 26 54 13 -107 -74 142 -36 -103 82 77 -40 -81 94 20 -116 47 53 -112 -1
7574 -1 89 -2 -4 53 8 -33 -81 33 63 -79 -36 92 101 19 -76 60 86 -120 43 99 -74 -55 86 52 -88 -9 124
7601 124 9 -125 15 26 -139 -20 54 29 -77 -88 55 40 -101 3 53 -96 -21 40 54 -15 -79 116 46 -140
7625 -140 60 18 -115 -11 48 -17 -56 4 158 71 -116 -13 111 -10 -3 -24 54 -24 -78 93 -13 -67 78 48 -71
7650 -71 -69 25 13 -17 -36 121 -92 -35 77 67 -26 -47 -7 97 -43 -108 39 70 -43 29 -20 -9 -49 -22 87 -122
7676 -122 -89 80 -12 -65 99 12 -37 34 92 56 -55 -102 87 15 -76 -22 -33 62 6 -58 45 -74 -73 93 -9 -102
7702 -102 -33 46 18 -42 -33 62 -33 -46 111 23 -109 -34 48 50 -57 -74 134 -15 -51 35 -8 -43 -12 58 47 -82 4 91
7730 91 -39 -47 35 4 -3 -15 -4 18 -121 -21 168 20 -154 58 92 12 -63 85 49 -136 -8 163 -18 -86 113
7755 113 43 -44 -44 15 39 -99 13 110 -35 -52 60 115 -30 -146 -49 95 -61 -67 107 4 -116 72 54 -68
7779 -68 -29 81 83 -78 -16 77 -50 -100 7 24 9 -25 62 114 -85 -41 148 19 -63 22 -6 -25 -41 64 8 -154
7805 -154 -12 121 -63 -156 -11 58 -13 -90 37 72 -130 -21 46 -26 -72 -1 87 -5 -102 31 81 -46 -12 80 -70
7830 -70 -88 48 36 -41 -67 104 38 -63 -8 35 4 -16 -13 75 -5 -53 -1 55 -39 -25 23 -48 -19 4 41 -17 -44 38 40 -20
7860 -20 56 32 -9 -51 34 35 1 -14 2 78 47 3 -11 34 22 22 -16 24 22 0 -1 -30 -6 93 -16 0 55 -10 4 -25 27 2
7892 2 -41 -21 -11 128 -27 -68 -15 91 -64 -8 10 42 -35 53 2 -3 56 61 -16 -20 25 0 -41 -34 -15 3 51 -15 -14 65 -13
7923 -13 -48 -35 19 -8 -31 44 -42 -13 -4 4 -15 27 17 -22 22 32 -24 11 -6 15 10 -18 5 26 42 -46 2 65 43 21 2 14
7955 14 -5 44 77 -6 -51 9 -11 14 10 60 0 -67 13 22 -13 -60 -36 5 22 -70 39 -18 -26 37 22 -65 -61 33 14 -38 17 -15
7987 -15 -50 -16 75 46 -17 39 51 -3 -4 -3 24 -39 -33 -17 -22 19 1 10 27 -50 -7 32 -81 -57 38 -10 -111 3 49 -25 -115
8018 -115 56 49 -60 -52 2 4 52 35 53 14 -113 45 29 -70 -34 61 27 -35 -46 59 -18 -76 24 30 -36 -55 54 17
8046 17 -36 -1 3 -26 -38 23 6 -60 -11 25 -34 -58 -14 81 41 -94 -23 51 -75 -17 58 4 -20 -26 72 62 -38 21 80 -32
8076 -32 -10 -8 38 -62 -6 15 -3 -75 29 118 17 -17 -3 29 -58 -18 90 -9 -99 58 49 -40 24 26 25 37 46 -20 -9 -80
8106 -80 83 22 -62 33 12 74 -21 -96 83 12 -46 87 37 -65 5 68 15 -27 -73 33 -38 -57 17 -30 -58 36 -8 13
8134 13 -16 -66 90 41 -52 -20 -12 19 -34 9 49 -4 -72 16 -18 -55 40 3 55 26 -14 -20 37 3 49 31 -55 -33 82 -3
8164 -3 -72 3 133 -6 -33 65 1 -21 62 9 -61 -56 -49 54 -36 31 28 -27 -2 -8 0 71 -145 -13 134 0 -95
8191i5
$$ Imaginary data points
##PAGE= N=2
##DATA TABLE= (X++(I..I)), XYDATA
0 0 0 0 0 0 0 0 0 0 0 0 8 -8 8 -8 8 -16 16 -17 24 -32 32 -40 48 -56 72 -80 93 -104 122 -141 160 -184 208
33 208 -233 264 -296 332 -372 415 -461 514 -570 631 -698 772 -851 939 -1036 1140 -1256 1384
51 1384 -1526 1682 -1858 2054 -2278 2531 -2824 3168 -3580 4074 -4688 5475 -6516 7966 -10126
66 -10126 13667 -20476 38135 -177350 -344925 110350 -19955 -171709 -71321 -43249 -126279
77 -126279 -108925 8762 -19977 -218902 -138044 -13818 -31172 -56059 -161763 -112741 27347
88 27347 -110165 -80254 66728 -131201 -167326 77485 20246 -170084 -127785 39607 -294
99 -294 -101250 27977 27901 -121743 -2037 50608 -83392 -42105 -14303 -7265 42106 -44002
111 -44002 -34192 54215 -10304 -37948 37357 35675 -48987 -36200 101065 10600 -144605 46714
123 46714 122984 -49204 -883 70845 -23133 -2737 43351 -545 -23572 -16848 35297 59449
135 59449 29088 -11337 -25090 49533 53398 -38403 24690 49210 -71879 25304 116013 -36257
147 -36257 -63318 52244 63921 18457 13302 11584 -21497 -4556 51249 -696 -21043 32010
159 32010 653 30440 72211 -30117 -41562 43416 921 -17379 40259 5077 -44764 8576
171 8576 65293 -6047 -50039 27191 27934 -19887 10959 -5891 -35705 6021 -11399 -10711 36608
184 36608 -4877 -28734 26812 12113 -47399 -21606 18300 -19915 -38714 33183 21139 -50249
196 -50249 2258 29712 -30339 -21970 11684 1463 -5568 -28611 -20045 22705 -1560 -28686 8457
209 8457 29695 -12710 -18334 27578 -9486 -64201 11486 41352 -37634 -275 47169 -20789
221 -20789 -25537 35059 10142 -42712 -16949 27107 11168 -17530 -4863 -1557 2326 5971 -3088
234 -3088 20119 3979 -41511 6565 36469 -41291 -36735 36824 10455 -28379 25222 41120
246 41120 -44883 -43111 41819 14187 -51458 -9873 29124 1672 -11931 145 12398 -8166
258 -8166 -22180 12478 23651 -20212 -30133 9378 7632 -20658 331 25909 -10993 -11878 32233
271 32233 1659 -40459 -8703 14166 -11534 -8145 15301 8038 -7439 1148 7092 -7041 -9257
284 -9257 -2790 3130 -2641 -9141 3171 4769 -15878 -2752 28695 291 -23169 12031 17609
297 17609 -31908 -25781 22480 4790 -22149 9401 26140 -5701 -10658 4143 -5389 -15644 -3482
310 -3482 7847 -2177 -6585 1198 6571 -2722 -6917 6281 6573 -10970 -8328 10802 -5450 -24177
324 -24177 -2945 16018 430 -2289 14448 1079 -14046 -134 2995 -20235 -11547 17233 6579
337 6579 -11900 7757 17943 -13712 -15177 14986 10693 -17489 -9842 14597 2546 -14657 398
350 398 13718 48 2066 13458 4364 -10983 -9177 5868 -1823 -12582 8502 22207 -1508
363 -1508 -4899 16318 8463 -19403 -11693 22376 3932 -21312 8849 19242 -10308 -5286 15356
376 15356 5680 -6272 1609 14081 -7038 -20825 5377 8683 -12335 -3438 19914 12602 -14359
389 -14359 -10664 17375 -9212 -33748 6688 12978 -15308 -6797 7886 -967 -10616 -9298 -214
402 -214 -8036 -11347 -2387 -15194 -12557 -6642 -14599 -1974 -4372 -16458 6627 -1602 -31090 -12950
416 -12950 -6819 -22145 -18819 -1932 -585 -19483 -8124 5949 -24066 -21498 1195 -26347 -17481
429 -17481 7180 -20240 -23115 -5834 -8585 -8028 -9083 -14730 -11273 -6030 -6628 -29013 -25373 5672
443 5672 -19117 -23045 16553 -5477 -27949 -3325 -7121 -16445 -17259 -24055 -5542 387 -12050 -14441
457 -14441 -8527 -1827 -15819 -13305 11969 -19082 -35056 19930 752 -43513 -3809 15614 -8169
470 -8169 -9407 5522 8443 -12384 -18210 7635 985 -13717 -4615 8767 26984 -2561 -21217
483 -21217 28659 13539 -26175 22683 20615 -24878 10419 35829 1709 -18566 19157 39449
495 39449 -4606 1334 34650 -4352 -9420 23920 6691 6957 5167 1050 40207 20138 -22585
508 -22585 10646 23284 -9176 -2372 24795 8914 -30095 17056 56880 -30060 -32986 50623
520 50623 11654 -28451 15001 11811 -14920 -13023 11104 23855 -14178 -14503 23287 17224 -6251
533 -6251 -20629 -1837 18134 -22219 -6261 42291 -23042 -30043 48262 12540 -41797 -2890
545 -2890 27125 -1497 -24583 8781 16998 -29165 -3948 28395 -4887 -8428 -3729 6178 19630
558 19630 -27495 -25283 28562 -9790 -24147 28491 9810 -29526 -5421 33847 -4359 -51900
570 -51900 10919 34073 -33644 -8532 24277 -18314 -7262 9671 1093 4457 -14572 -8199 17298
583 17298 -3016 -20310 -7616 11744 8424 -14627 16448 15681 -38032 8846 34513 -35819 -20432
596 -20432 28052 2094 -8686 5512 6314 -6461 -7245 15306 -95 -13727 4124 -6163 136
609 136 11082 -21775 -3364 23236 -13540 -1714 18849 -17811 -20693 11418 6590 -23569 -13804
622 -13804 22592 4482 -20019 7605 483 -15628 2166 -7264 -5074 6688 -18061 -7897 20340
635 20340 -8449 -20861 9633 13744 -12993 -11607 15220 -8167 -26565 14009 10616 -21425 4452
648 4452 15893 -1216 378 -9489 -4625 11302 -6685 -13474 12782 12516 -14588 -3554 25202
661 25202 -2145 -25351 19916 17341 -25592 2398 17933 -16783 -6335 19882 1745 -8537
673 -8537 7507 12729 -2637 -9483 -2221 387 3744 -3587 -4760 16434 5699 -19500 10043 18282
687 18282 -23809 -9057 24183 -4391 -21965 12528 13113 -20436 -4140 24491 -1098 -18774
699 -18774 8452 10597 -10463 -13104 -984 10471 -297 -12882 10526 20072 -16445 -14832 19179
712 19179 1602 -25192 4413 20339 -14848 -10872 22153 1497 -20969 9121 15301 -10883
724 -10883 -6695 6249 973 -7723 -6270 5754 11166 -4857 -6949 14996 8029 -18932 -6598
737 -6598 16160 -8520 -15097 19579 8849 -20327 6293 20609 -13866 -11926 14981 2845 -14455
750 -14455 2202 9756 -6326 -6677 4007 7332 4230 -3462 -4226 7649 -304 -14282 1354 6552
764 6552 -8611 566 15629 -3078 -10084 9195 2204 -15301 502 10599 -9945 -7009 10345
777 10345 1126 -8414 1324 3907 -1545 -440 -1744 -2881 -3073 -4704 -3479 1174 -941 -1799 7439
792 7439 1647 -10331 -1029 5434 -11586 -10121 8120 1443 -8422 1912 5805 -5410 -3729 1803
806 1803 -2458 -1961 494 -5887 -5000 3849 -2109 -5187 2219 2998 1012 1662 -3790 -6362 69 -2963
822 -2963 -6289 2241 5125 -4868 -446 9882 -3949 -10452 4430 1367 -11208 2587 7714 -9016
836 -9016 -7831 7905 5971 -8017 -3318 7077 1093 -6959 -3950 -978 -1151 -4196 -2952 8469
850 8469 3912 -6508 263 3657 -5115 -5963 139 -346 -3193 706 5909 -3316 -4238 6002 130
865 130 -4813 1544 1758 -2450 -3591 -2737 2875 192 -1398 4559 1589 1166 2274 -3226 -4475 -2144
881 -2144 -86 2875 -1931 848 7902 -2421 -2919 4605 -404 -3976 -2484 1071 4407 -3120 -4829
896 -4829 3239 562 2815 2201 -3731 3001 1095 -6104 -935 -1743 -3212 2345 964 4246 1714 -3629
912 -3629 3243 -2153 -5351 2606 -2612 -2280 4273 -1564 2281 920 -5965 6741 4774 -6550 -2389
927 -2389 3390 3453 -6901 -7547 10569 1972 -8073 12022 3627 -10423 2529 3217 -4433 -5943 -483
942 -483 7035 -2118 -2861 9471 -3814 -7926 4151 2659 496 -9878 -6973 14013 -1274 -17433
956 -17433 6735 7696 -8451 -596 7913 -1458 -17104 -1240 14323 -12767 -13268 14969 1425
969 1425 -9163 4788 1794 -4851 -10292 -605 12542 -8823 -15617 9720 8524 -8414 -7164 4690
983 4690 6811 -10841 -1201 13458 -15612 -13140 16522 -496 -13463 4664 6985 -758 -5921
996 -5921 1336 3923 -14603 -5390 12454 -1144 -9639 -3337 7386 9117 -15254 -7205 17079 -10418
1010 -10418 -12206 15964 -2808 -19922 2328 15946 -3431 -17291 9154 14047 -17262 -3036
1022 -3036 11095 -11446 -7677 4283 6608 5218 -12143 -3414 18762 -2754 -14710 3527 6899
1035 6899 -3662 -6210 10352 4098 -17794 7768 20483 -14054 -5719 14653 -2967 -4660 1669
1048 1669 449 -862 -3771 6990 9823 -4955 -3433 2622 3997 1514 -12428 1156 11050 -9552
1062 -9552 1976 11666 -12587 -4074 14103 -1489 -9322 -1351 5669 -2061 -9084 4996 742 -8241
1076 -8241 5358 3793 -942 1293 -12188 -527 12201 -12853 -8706 10894 505 -5048 3318
1089 3318 3961 -6734 -7137 10456 1266 -14755 5197 4468 -7161 4047 -1062 -2662 7150 -3385
1103 -3385 -2348 8338 -5129 -10585 2847 9017 -5369 -10176 13524 6958 -14288 5078 7623
1116 7623 -13880 -197 7747 -5215 -2972 1559 3265 162 -4457 593 3390 -252 -4200 -2927
1130 -2927 6304 -3712 -14694 10888 9746 -16812 526 15866 -6058 -10947 4721 2225 -9320
1143 -9320 -2988 8964 -1670 -7449 4769 3917 -2825 -5109 -2111 6597 -1641 -12488 6416 8316
1157 8316 -15033 -3835 16032 -685 -14295 6052 10418 -12293 -7544 10557 -3783 -10604 8542
1170 8542 5161 -5929 -212 3207 -229 -4098 -4340 3394 4175 -7947 -4138 11115 2329 -13929
1184 -13929 3561 15594 -9952 -10191 15207 1698 -17709 4555 12629 -8287 -4754 12060 3475
1197 3475 -7858 1599 5718 -2573 -6266 459 7972 2645 -7724 715 12920 -2795 -10784 8964
1211 8964 8335 -12332 -2504 13123 -4056 -9902 7443 5728 -6347 1910 6592 -3949 -4620 2006
1225 2006 62 -4042 -1888 718 3984 161 -5553 2218 4193 -8311 -5135 7478 -3031 -9377
1239 -9377 4141 3333 -8907 -913 7478 -5498 -5809 6148 -796 -9301 -53 1506 -4665 -1543
1253 -1543 448 1342 2284 -2955 -5112 3108 1300 -8961 -2056 6692 -3187 -5573 6587 597 -7195
1268 -7195 3083 3422 -5534 -656 3350 -4928 -3113 3613 -1105 -3431 3234 1037 -2433 3465 -1440
1283 -1440 -7531 784 2816 -5206 -1613 3968 -751 -1938 1101 -472 -2972 -344 -1956 -2664 2408
1298 2408 -1408 -5754 1621 2393 -4172 797 2200 -3857 -1327 1963 -3922 -5744 2329 1564 -4363
1313 -4363 705 4632 -2327 -2637 300 -1936 -362 -1698 -3013 2139 1606 -3716 55 3207 -2056
1328 -2056 -2588 3050 1020 -6089 679 3491 -6689 -1810 7332 -1384 -4137 4310 1981 -2648 -2222
1343 -2222 -796 -666 -736 1269 -201 138 2852 -868 -1446 3304 -1700 -2088 3220 -1995 -968 3632
1359 3632 -1678 -2531 4245 4098 -1758 -1865 4518 1431 -5719 1625 2348 -3138 2840 3905 -905 1114
1375 1114 1252 328 139 -2658 1135 1317 -1873 1063 982 61 -405 -1385 3170 1357 -5576 682 1490
1392 1490 -4039 -192 -1687 -2516 2492 1364 -1571 -2699 -1681 1974 -4069 -5726 2660 -1848 -3942
1407 -3942 1651 345 -1470 -3905 -2750 4545 -2190 -8004 1953 117 -4685 -566 500 -1180 -4438
1422 -4438 1266 7500 -6852 -9454 6720 462 -7873 -829 2205 807 -4006 206 5817 -6371
1436 -6371 -6925 5720 -104 -4654 -1885 -1447 2440 -2588 -2096 3981 -5414 -3723 7509 -1458 -8496
1451 -8496 -2727 2878 2006 -8037 -524 7946 -6965 -3573 8621 -4194 -9292 971 3829 -739
1465 -739 -6983 1279 5460 -6593 -103 6303 -5431 -4698 3164 3914 -1192 -9924 1372 10445 -5839
1480 -5839 -4282 7356 771 -3929 394 4369 -1511 -9312 4459 9701 -6978 -1682 6596 -1020
1494 -1020 -429 1535 834 -843 -4569 4696 7348 -7874 -3602 7454 3659 -1718 -2853 4461 2828
1509 2828 -6498 3699 5724 -9348 -163 9376 478 -1235 -117 2271 2102 -2443 2364 1790 -4841
1524 -4841 2440 5618 1570 -1069 -4610 6404 8089 -7353 -585 7382 -3099 -1515 4771 1093
1538 1093 -1886 -504 7211 3322 -4856 2414 1617 -2405 3574 -375 -2031 3944 -732 2338 4803
1553 4803 -5299 -1555 5802 1315 -3874 -2146 4335 827 -5290 4237 3037 -6262 3330 4399 -3498
1568 -3498 -1136 -949 -261 1421 -2604 515 2911 -2058 713 2826 -101 -4284 -3031 7359 1288
1583 1288 -10073 3261 7772 -5663 -1355 4840 18 -2472 -506 4514 134 -6250 746 4499
1597 4499 -488 -1646 510 4732 -481 -5853 6529 2713 -11631 1725 10551 -4562 -6415 5527
1611 5527 4901 -5127 -2968 6672 -1130 -6389 3285 2040 -2984 -1186 -601 2520 974 -4130 3222
1626 3222 2798 -6833 -953 5521 -2788 -7477 4232 7448 -7045 -4628 10194 -835 -10068 4118
1640 4118 4785 -5536 -2715 3912 1435 -3915 -937 4525 120 -4352 907 3949 -1605 -6624 2043
1655 2043 6345 -6767 -4597 10390 1462 -10235 2376 7203 -5541 -6229 4635 2301 -5748 -48
1669 -48 4180 -1393 -3012 657 1577 -634 -3513 60 3489 -4173 -4487 5542 2262 -7599 676 8399
1685 8399 -3495 -7105 4958 2654 -7474 209 5770 -2226 -2417 3441 1435 -1743 337 412 136
1700 136 0 -685 1585 2317 -2998 -1358 6874 947 -5574 3402 5619 -4798 -2658 5971 -253 -4529
1716 -4529 3566 4171 -2190 926 2474 -1762 226 1754 -1179 -385 1524 -49 1234 1570 -1689 21
1732 21 3700 -533 -3248 3186 1542 -4424 528 3767 -1833 -915 3128 151 -530 1237 -590 -1920
1748 -1920 1096 300 -1382 1675 760 -1223 2272 1031 -3800 1361 3474 -3565 -2345 3778 442
1763 442 -3931 1018 2567 -1345 -315 971 -1002 411 -554 -3766 1250 2123 -3688 -788 4078 -1315
1779 -1315 -3562 2720 403 -5669 327 4232 -4324 -3176 3876 -417 -3041 698 789 -1044 -785 -974
1795 -974 -111 83 -1952 -2247 1597 2142 -2944 -44 3004 -2791 -1464 3055 -2895 -3163 3856 889
1811 889 -3284 503 3521 -1285 -2863 2826 1288 -2987 130 1322 -470 285 -1332 858 2708
1826 2708 -1787 -90 2965 -1564 -2569 2205 940 -3436 -451 5196 -567 -4825 3882 2750 -4426
1841 -4426 -280 1959 -1225 -306 -140 223 778 -1282 311 1302 118 -501 -869 911 -388 -2070 2080
1858 2080 -199 -3567 4565 2744 -4763 413 3052 -1345 -1750 1071 975 -1787 430 3990 -1858 -1938
1874 -1938 3602 -635 -862 1812 -982 -326 95 -598 2544 -444 -2617 2609 2513 -460 -2373 -363
1890 -363 2709 -2029 -1569 3580 -1872 -1838 4724 -539 -2857 766 853 56 -1855 314 1967 -3060 -816
1907 -816 4290 -1048 -2594 445 2249 1849 -4169 -1438 3918 -2388 -1773 4073 -1189 -2203 2347 2210
1923 2210 -888 -4206 1319 3691 -3764 -675 3483 -2115 -1094 1978 914 199 -3848 531 4875
1938 4875 -3042 -3149 1832 -151 -51 483 316 5 -3015 2797 3197 -6711 -1119 4453 -1856 -1417 1490
1955 1490 722 -932 -2313 3656 2222 -6309 403 4226 -1036 -962 -864 1028 2053 -1619 2456 2196
1971 2196 -4613 1696 4418 -1387 -2267 -282 4368 2103 -3560 3082 3650 -3946 1493 4010 -876
1986 -876 -1338 -189 4283 2352 -3481 1271 3182 -474 2113 589 -987 1233 -194 2344 936
2001 936 -3485 2246 3932 -885 208 376 327 895 -1328 2001 802 -3184 2333 3062 -846 -287 -771
2018 -771 1297 2494 -2025 320 968 -2013 2242 2056 -1737 -645 1464 3138 30 -3468 2482 1756
2034 1756 -3201 1870 2307 -1015 -140 872 3168 926 -3944 1324 3892 -1093 -744 960 1789 -151
2050 -151 -750 4348 499 -4576 4132 4849 -4284 -1248 3756 1265 -2001 247 4667 -4 -3044 3453
2066 3453 3072 -2524 -1152 1524 2920 -277 -2627 3574 2111 -3388 2054 3852 -2934 -1940 4001
2081 4001 2514 -4210 -1726 6058 -103 -4729 3430 3562 -3196 -1574 2641 1704 -3043 -2701 4355 1606
2097 1606 -4371 689 3596 -1652 -3020 2295 2331 -4555 -2114 6061 -948 -6267 2807 3643 -3327 -2224
2113 -2224 2747 1220 -3527 -1933 3172 -337 -3980 384 2596 -326 -3057 602 2726 -3568 -2837
2128 -2837 4502 -710 -5801 2678 3928 -4175 -3124 4354 1472 -5264 -43 4284 -2108 -3525 1982
2143 1982 1577 -1355 -1591 1256 2639 -1816 -1987 2870 852 -3779 488 4067 -1437 -3328 3943 3401
2159 3401 -4725 -527 5264 -634 -3443 2004 2761 -1244 -1192 1582 2004 -346 -361 1353 1563 -634 -991
2176 -991 2005 665 -1933 1410 2793 -1707 -448 3305 -92 -2520 1240 2229 -1703 -734 1772 288
2192 288 -489 264 -2 605 577 -1317 259 1123 -1388 -934 1623 -456 -1885 2056 1321 -2774 -40
2209 -40 2777 -2098 -2604 1997 567 -1960 -326 871 -96 -161 -873 -657 1237 -206 -2542 581 1999
2226 1999 -2662 -1300 2838 -653 -2518 2029 1303 -3038 -328 2081 -1305 -2117 1529 1050 -1121 -368
2242 -368 342 881 -146 -1747 113 2145 -1216 -1983 2200 1176 -2500 194 2788 -1525 -1347 2631
2258 2631 -159 -2571 1180 1622 -1576 -625 1642 1000 -976 -545 1061 906 -1030 -1718 1819 1886 -2525
2275 -2525 -516 3579 -997 -2463 2711 1042 -2693 387 2781 -1546 -2146 2522 1165 -2393 747
2290 747 2152 -783 -379 -157 521 931 -1721 -464 2655 134 -1832 1155 1780 -1215 -1152 2538 -192
2307 -192 -2958 3003 1709 -3698 705 3339 -1372 -1283 1645 1218 -1333 -1202 1930 315 -1541 142
2323 142 841 1167 -219 -1674 1643 701 -2647 1577 1144 -2749 488 2503 -563 -2002 807 2234
2339 2234 -1353 -1335 2555 -738 -1692 1707 48 -148 309 -636 1484 1082 -1190 645 115 -367 1408
2356 1408 216 -457 -182 1714 2139 -2154 -464 3726 -1215 -1441 3288 -431 -1585 1481 1446 223
2372 223 -839 748 1741 -634 448 1073 -1494 639 812 163 1282 -1942 -116 3838 -1204 -2650
2388 -2650 1677 672 -795 -435 766 337 -2245 1425 2129 -2788 -117 1651 -1525 448 575 -1609
2404 -1609 -132 -286 1371 948 -2525 -48 2021 -172 -621 -1079 281 1387 -1343 1263 1383 -2762
2420 -2762 1172 2679 -1314 -495 519 489 739 -528 1281 442 -1920 2250 2189 -975 -526 -8 2084
2437 2084 1377 -2824 557 2432 -1259 1145 1409 -1106 3 716 1258 -126 -1871 1409 976 -1472
2453 -1472 1613 -171 -1514 1320 294 571 -24 -2489 1011 1959 -1630 -835 -269 728 1111 -1413 480
2470 480 -7 -2032 1687 756 -2397 325 193 43 862 -1304 148 146 -1101 1432 117 -1779 -106
2487 -106 -24 1428 353 -3035 1123 2278 -1278 -131 12 -216 311 -563 1121 333 -2120 1670 1669 -1401
2505 -1401 116 230 198 417 -282 1215 -206 -2029 2393 1850 -2087 -234 1319 1339 -315 -1324 1574
2522 1574 517 -1561 1813 1296 -1703 369 1536 897 -1077 -962 2373 57 -2108 2194 1607 -2384
2538 -2384 -160 2580 1311 -2580 -1192 3999 284 -3422 1510 2278 -1777 -571 2121 1113 -2165
2553 -2165 -496 3573 -650 -2976 1898 1775 -1723 -492 1867 1002 -2060 -739 3451 -208 -3330
2568 -3330 1154 2592 -1156 -2047 1228 1887 -1877 -1065 3108 -665 -2937 1860 1557 -2429 -1150 2172
2584 2172 597 -2452 76 2865 -1504 -2583 1989 1454 -1961 -1563 1794 1542 -2297 -1011 2779 -166
2600 -166 -2529 1466 1704 -1831 -1422 2289 954 -2826 64 3338 -822 -2374 2021 1710 -1730 -1357
2616 -1357 1925 1646 -2172 -828 2861 568 -2317 599 2125 -685 -1528 1552 1362 -2102 -131 2387
2632 2387 -721 -1721 1646 1289 -1321 -805 1329 720 -1675 -514 1488 430 -1406 -284 1701 175
2648 175 -1941 296 1841 -1427 -1137 1798 104 -1770 574 1471 -1206 -985 1523 508 -1644 -104
2664 -104 1051 -126 -749 -318 943 612 -1159 -492 1641 106 -1839 400 1543 -767 -1127 1447
2680 1447 391 -1322 446 1083 -818 -555 904 278 -730 -411 886 481 -852 -285 1407 558 -1628
2697 -1628 -51 1842 -605 -1813 1340 1221 -1550 -188 1583 -211 -1232 849 786 -1000 -474 1063
2713 1063 372 -1075 -386 1309 627 -1761 -358 2368 -243 -2749 948 2428 -2126 -1661 2543 785
2729 785 -2499 305 2101 -1171 -1375 1315 572 -1398 -27 1192 -14 -972 -146 1420 144 -1810
2745 -1810 224 2190 -1052 -1996 1775 1330 -2094 -499 2455 -474 -1892 1319 1000 -1921 -108 1557
2761 1557 -782 -942 790 750 -872 -905 1019 747 -1472 -891 1426 564 -1748 -693 2092 -200 -2194
2778 -2194 1342 1299 -2137 -328 1818 -673 -1383 595 1125 -738 -733 1393 206 -1168 309 1015 309
2795 309 -899 -493 2168 758 -2104 1154 1900 -954 -71 1578 256 -787 812 1696 -635 -371
2811 -371 2335 -113 -511 2061 257 -503 817 679 975 208 -601 1367 1059 58 162 264 1319
2828 1319 42 -13 1618 -585 -535 2527 -252 -1008 1762 457 -257 510 787 322 -1008 759 1730
2845 1730 -865 -25 975 -181 1247 114 -961 1009 180 238 1115 -1047 -122 1597 3 -149 -104
2862 -104 544 554 -934 1085 803 -2012 584 1678 -787 182 -121 -402 1202 -199 -351 -84 -678 963
2880 963 606 -788 -113 -393 841 922 -1938 421 1049 -1580 666 963 -1403 -199 500 380 281 -932
2898 -932 280 -42 -342 1377 -1150 -1392 1698 148 -257 284 -1189 789 1027 -1208 187 64 -198
2915 -198 476 -184 446 -336 -1091 1611 465 -1450 620 -438 -203 1165 -783 -623 210 -204 1047
2932 1047 -55 -1427 258 175 550 -169 -1708 742 719 -1114 540 28 -999 438 -186 336 274 -1734
2950 -1734 225 1232 -438 -461 -503 392 802 -731 252 -6 -1553 1421 958 -1645 7 644 202 195
2968 195 -589 356 259 -909 1000 502 -943 38 47 948 324 -1408 709 1070 -1049 888 499 -1388
2986 -1388 400 1267 372 -1153 -485 2152 64 -1873 1301 776 -1328 377 840 438 -886 -744 1994
3003 1994 361 -1774 672 913 -698 17 492 364 -1167 -216 2371 -584 -2149 1499 1422 -1235 -696
3020 -696 788 963 -1167 -564 2122 -400 -1890 1103 1322 -942 -827 807 868 -1204 -236 1997 -1045
3037 -1045 -1581 1992 1158 -1778 -663 1628 779 -1762 -358 2133 -588 -1478 1320 1037 -1007 -746
3053 -746 1122 1001 -1279 -503 1822 -350 -1324 1259 928 -1159 -644 1629 749 -1917 -183 2238 -547
3070 -547 -1674 1141 1004 -883 -715 1178 543 -1414 -104 1386 -584 -965 955 332 -798 -362 975
3087 975 130 -1376 154 1453 -739 -1496 884 994 -900 -1162 1068 872 -1528 -352 1459 -272
3103 -272 -1375 606 880 -674 -663 917 511 -1186 -6 1126 -357 -1049 486 953 -538 -992 694
3120 694 1087 -998 -756 1073 546 -1003 -337 915 66 -856 60 846 -450 -416 492 194 -550 -124 618
3139 618 -85 -737 213 914 -586 -791 900 580 -912 -420 1158 226 -1074 157 1011 -348 -491 619
3157 619 358 -250 -187 573 181 -570 97 920 -115 -848 683 1136 -741 -918 1514 874 -1650 -81
3175 -81 1956 -75 -1508 734 1414 -701 -824 1224 696 -969 42 1015 10 -798 427 1205 -311
3192 -311 -955 1128 1191 -1392 -401 1798 355 -1729 393 1972 -611 -1260 1268 1127 -1295 -179 1256
3209 1256 141 -884 273 1050 -530 -796 1120 865 -1352 -224 1638 30 -1724 364 1856 -998
3225 -998 -1516 1524 1000 -1749 -271 1515 -97 -1183 212 1030 -584 -715 778 440 -958 -79 1115
3242 1115 98 -1271 29 1620 -675 -1616 1279 1034 -1630 -367 1609 -224 -1480 354 1227 -879
3258 -879 -836 973 -71 -795 347 316 -501 -399 178 715 -648 -1128 975 560 -1203 -496 910 111
3276 111 -1178 -7 1273 -825 -1291 1215 199 -1073 50 323 -57 -243 -65 341 -438 -356 940
3293 940 -31 -831 -41 520 583 -659 -463 1152 -188 -735 951 -32 -591 385 87 317 -31 -247 348
3312 348 93 293 270 -868 343 779 -429 364 -328 -399 1135 -117 -622 553 -96 25 396 -84 158
3331 158 -461 207 883 -668 238 503 -791 780 674 -1040 244 430 165 578 -562 -13 498 232
3349 232 591 -583 -393 1356 -170 -266 849 -543 328 581 -290 722 -119 -553 1005 364 -114 -59
3367 -59 -351 1100 207 -622 674 -439 -51 1360 -572 -597 624 -35 652 -147 -686 719 -76 -34 582
3386 582 -466 3 122 -71 899 -585 -853 997 -103 -52 468 -1088 87 1042 -247 -318 -426 278
3404 278 780 -756 119 280 -875 727 348 -834 269 -194 -262 822 -417 -276 107 -363 775 143
3422 143 -732 -96 -35 736 276 -1430 475 890 -854 487 151 -791 246 392 118 -401 -594 833
3440 833 88 -748 740 -83 -757 418 312 188 -651 -788 1303 455 -1479 215 558 -327 0 -66 116
3459 116 -486 -192 1124 -354 -1153 796 237 -584 124 8 70 -466 -220 1062 -331 -1354 719 881
3477 881 -595 -589 168 696 -677 -362 1124 -689 -1022 1378 340 -1283 86 726 154 -905 27 1087
3495 1087 -799 -874 1123 480 -1003 -510 760 882 -1023 -628 1489 -141 -1039 847 498 -878 -221
3512 -221 934 370 -1303 -13 1540 -613 -991 965 391 -853 -311 796 407 -1157 -264 1354 -304
3529 -304 -953 472 442 -402 -348 557 124 -875 251 985 -813 -627 933 320 -712 -305 789 218 -997
3548 -997 42 1141 -486 -907 633 669 -445 -617 667 475 -861 65 897 -542 -578 819 272 -711
3566 -711 -249 855 247 -861 135 912 -176 -678 315 655 -160 -684 414 783 -546 -393 586 186
3584 186 -524 80 468 -132 -418 410 391 -663 -77 729 21 -705 192 695 -205 -753 321 713 -533
3603 -533 -501 548 356 -550 -296 526 132 -547 -35 558 -314 -483 423 215 -574 -279 724 40 -896 91
3623 91 1006 -463 -939 583 621 -775 -670 845 258 -860 -175 757 -151 -748 267 454 -509 -427 625
3642 625 151 -798 6 823 -308 -843 587 742 -688 -675 959 456 -1074 -161 1108 -64 -967 344
3660 344 802 -448 -632 824 419 -985 125 1032 -340 -918 721 852 -902 -711 1227 452 -1375
3677 -1375 111 1280 -225 -1136 337 1046 -526 -854 760 622 -933 -205 863 -1 -950 157 1032
3694 1032 -628 -880 1083 485 -1376 5 1189 -292 -1158 443 1081 -839 -826 853 338 -839 16
3711 16 585 -142 -472 206 694 -561 -496 903 159 -904 153 868 -334 -832 479 960 -949 -753
3729 -753 1264 265 -940 -17 794 27 -584 237 738 -554 -453 903 53 -769 84 719 -80 -692 281
3748 281 777 -685 -511 1013 -51 -796 42 649 119 -562 -127 672 -62 -338 277 -142 -81 6 67 164
3768 164 -471 -132 657 -282 -535 523 -45 -434 39 305 3 -708 88 737 -496 -471 305 -146 154 5
3788 5 -463 275 -120 -112 311 -335 -340 300 36 65 -257 -87 558 -398 -95 658 -467 -267 431 190 79 -458
3810 -458 -192 841 -69 -418 186 -98 298 151 -151 150 -245 0 790 -494 -312 537 -219 168 226 -230
3830 -230 174 -262 93 762 -563 -481 554 203 230 -459 -258 793 -270 -89 615 -751 -138 897 -154
3849 -154 -248 -204 196 515 -589 89 478 -781 57 685 -231 -94 -537 172 1013 -764 -409 570 -140 136
3869 136 137 -361 124 -158 391 426 -1023 235 797 -543 217 230 -375 184 -8 391 192 -908 399 659
3889 659 -368 143 -144 -181 433 36 69 -136 -572 937 341 -981 280 329 -214 16 -56 197 -198 -516
3909 -516 742 174 -854 150 111 125 139 -571 177 68 -357 678 -177 -923 589 449 -337 -447 -50
3928 -50 480 -373 -395 654 -396 -696 729 24 -439 -69 -148 217 -222 -194 265 -527 -294 774 -190 -707
3948 -707 -92 341 417 -802 -378 840 -349 -609 602 -16 -562 -81 312 236 -741 -167 675 -444 -337
3967 -337 514 -129 -476 105 381 56 -895 67 990 -538 -697 519 223 -461 -98 280 21 -597 98
3986 98 605 -616 -312 468 -134 -344 28 219 -49 -568 219 720 -666 -508 640 361 -548 -419 554
4005 554 259 -743 27 667 -518 -292 485 -9 -466 -67 337 -8 -460 167 413 -461 -206 494 68
4024 68 -391 -317 507 266 -690 -91 683 -152 -355 220 132 -197 -304 260 74 -425 130 360 -300 -188 346
4045 346 90 -270 -217 495 195 -681 30 645 -145 -563 150 343 -110 -452 231 289 -384 -119 238 -28 -270
4066 -270 40 243 -64 -410 183 385 -490 -346 596 181 -730 -162 669 -89 -857 141 623 -436 -547 332
4086 332 310 -437 -296 282 117 -425 -41 369 -233 -400 291 302 -461 -248 581 65 -731 46 774 -434
4106 -434 -641 407 470 -521 -481 591 194 -727 -35 607 -267 -526 399 326 -609 -268 777 -43 -898 220
4126 220 861 -480 -812 627 527 -732 -547 796 187 -905 -94 772 -198 -749 299 568 -527 -487
4144 -487 635 188 -963 130 792 -415 -795 596 626 -784 -471 800 239 -1018 126 784 -237
4161 -237 -669 311 571 -469 -470 566 214 -643 126 578 -240 -547 450 575 -665 -434 880 201 -916
4180 -916 155 812 -173 -706 332 720 -563 -428 735 234 -628 99 626 -60 -429 247 507 -483 -206
4199 -206 775 -106 -641 263 599 -181 -545 263 626 -435 -316 605 96 -289 82 310 39 -471 81 625
4219 625 -287 -251 496 -10 -389 204 436 -224 -542 311 667 -631 -378 626 -30 -278 -97 175 83 -430
4239 -430 -22 419 -324 -340 198 5 -48 -288 18 169 -382 -13 408 -494 -366 465 133 -214 -472 138 496
4260 496 -519 -283 301 -136 -211 23 -62 25 -387 -75 525 -366 -253 202 -193 -49 148 -198 -85 -224 197
4281 197 384 -653 -244 487 15 -180 -190 58 274 -359 15 505 -537 -184 536 -52 -188 -148 107 158
4301 158 -338 133 291 -762 95 639 -333 -449 -158 397 266 -709 -133 520 -410 -118 245 -168 -233 -273
4321 -273 344 272 -766 -82 533 -443 -8 245 -428 -137 -34 389 -35 -939 274 643 -568 -198 117
4340 117 -105 105 -186 169 -1 -739 393 372 -619 -39 164 -135 125 -104 138 -173 -579 642 258 -865
4360 -865 -51 310 172 -91 -468 292 215 -530 396 94 -668 212 266 -97 -115 -204 389 -1 -422 553 -193
4381 -193 -641 527 286 -199 -284 -216 574 35 -568 297 -63 -288 458 -153 -193 -22 -24 393 -279 -400 484
4402 484 -160 -381 388 -127 -277 -187 76 466 -540 -484 559 -75 -423 134 -301 -127 -4 -46 105 -575
4422 -575 -98 527 -415 -378 299 -227 -205 -67 -36 33 -510 -42 420 -421 -342 112 -111 -22 -126 -211 57 -305
4444 -305 104 237 -614 -151 419 -122 -383 -178 166 42 -518 128 334 -556 -183 338 15 -293 -246 109
4464 109 129 -374 2 90 -322 16 241 -139 -242 -69 230 -5 -449 73 296 -279 -99 88 22 -117 -154
4485 -154 130 130 -285 -118 155 -94 18 37 -92 -66 9 227 -99 -327 203 249 -355 -151 228 28 -179 -135
4507 -135 222 53 -270 -9 212 -126 -164 -15 102 31 -230 21 144 -216 -84 254 -145 -284 189 188 -214
4528 -214 -304 294 264 -404 -129 282 47 -345 -42 234 64 -345 39 279 -192 -101 177 57 -145 -49 241
4549 241 18 -237 224 305 -318 -135 354 130 -304 -115 394 64 -485 89 490 -203 -321 283 303 -357 -130
4570 -130 413 -73 -450 216 390 -377 -186 474 141 -555 -84 513 -62 -589 74 529 -268 -475 250 361
4590 361 -385 -350 473 46 -607 34 378 -346 -425 403 185 -598 -191 600 -136 -746 297 469 -510 -487 415
4611 415 330 -540 -319 563 51 -619 51 479 -348 -471 410 184 -568 -181 614 -150 -752 362 477 -467
4631 -467 -508 455 384 -586 -317 714 137 -734 57 544 -214 -548 232 341 -479 -173 574 -15 -508 271
4651 271 423 -294 -353 332 295 -507 -190 533 -29 -485 89 390 -10 -516 87 486 -302 -336 361 109 -408
4672 -408 81 348 -258 -269 344 352 -597 -104 604 -133 -427 163 320 -152 -416 154 444 -305 -347 316 142
4693 142 -275 -169 162 127 -328 -8 373 -466 -234 392 -47 -345 -79 234 88 -439 -13 411 -317 -314 238
4714 238 77 -184 -402 154 401 -360 -160 332 -158 -147 204 -133 -115 -115 211 173 -464 16 348 -162 -131 58
4736 58 32 37 -347 112 449 -495 -216 522 42 -264 -138 205 103 -335 203 228 -527 152 440 -249 -272 55
4758 55 227 60 -466 46 333 -444 -104 339 25 -261 -197 386 212 -701 -10 446 -362 -67 212 -271 -193
4779 -193 -23 283 -170 -657 189 347 -563 -132 193 -158 -146 -170 315 -78 -781 250 469 -585 -318 140
4799 140 -56 -78 -215 66 -189 -489 390 114 -768 -167 257 -13 -191 -324 258 49 -572 291 186 -596
4819 -596 -173 247 132 -224 -325 383 80 -391 327 -97 -511 302 239 -253 -231 -75 349 19 -441 231 -5
4840 -5 -245 194 6 -106 -158 -142 390 38 -494 275 28 -199 257 -59 -228 -76 123 286 -365 -463 605
4861 605 29 -357 121 -16 19 -100 -46 256 -273 -278 412 26 -221 81 -109 105 51 -104 155 -319 -113 479
4883 479 -193 -372 225 62 116 -125 -244 206 -141 -30 241 -209 -113 214 -60 145 -78 -77 137 -240 7
4904 7 277 -407 -147 342 22 -157 -169 100 239 -317 -48 174 -253 65 102 -161 14 -53 -86 139 -184 26
4926 26 36 -252 115 100 -101 -87 -95 127 189 -395 1 262 -116 -62 -55 -90 -12 -46 14 14 -199 123 49 -215 43 -33
4952 -33 -117 11 6 85 -24 -248 98 158 -183 -75 -59 75 24 -230 -44 66 -101 -29 -2 -64 -13 -100 -50 -8 -147
4977 -147 113 26 -113 -30 77 -107 -129 -22 111 -41 -213 102 123 -86 -105 4 0 15 -37 -21 44 -166 20 11
5001 11 -111 -5 30 75 -138 -52 162 -20 -272 95 208 -275 -236 214 149 -275 -92 279 14 -237 30 156
5023 156 -203 -132 80 -46 -202 -28 232 -20 -252 75 286 -216 -234 230 210 -367 -123 372 47 -397 18
5044 18 359 -246 -211 177 77 -239 -62 239 -73 -244 191 262 -343 -176 262 98 -366 -60 412 -56 -408
5065 -408 131 351 -279 -245 239 111 -300 -108 307 -95 -295 194 252 -293 -131 302 70 -379 -101 493 -36
5086 -36 -492 241 451 -348 -364 356 178 -390 -115 436 -101 -356 287 238 -236 -71 294 46 -282 15 429
5107 429 -141 -315 322 328 -220 -238 360 284 -446 -152 439 0 -378 223 253 -184 -141 220 141 -277 30 370
5129 370 -166 -269 279 174 -153 -115 361 257 -432 -147 371 -10 -363 33 262 -98 -194 173 180 -343 -38
5150 -38 294 -123 -203 45 99 -165 -182 133 146 -387 -81 289 -25 -350 -125 264 4 -361 65 256 -334 -165
5172 -165 212 -97 -201 -41 35 -77 -260 19 98 -256 -75 90 -68 -217 -189 264 38 -555 -27 445 -236
5193 -236 -334 153 174 -165 -238 235 23 -468 76 254 -199 -149 45 55 10 -218 129 142 -461 64 350 -248
5215 -248 -342 121 405 -115 -453 236 321 -355 65 247 -223 -94 114 183 21 -314 194 258 -409 7 194
5236 194 -167 -135 32 302 -263 -498 482 360 -581 -41 284 -159 -194 -66 178 -217 -264 387 134 -498 53
5257 53 180 -96 -178 -170 256 -156 -416 432 213 -648 -36 482 44 -401 -151 450 -40 -392 359 93 -400
5278 -400 168 218 -158 -164 -126 303 -80 -368 280 39 -267 117 287 -74 -270 -59 586 -142 -513 292 130
5299 130 -226 90 82 -99 -32 20 312 -275 -322 382 33 -224 48 31 0 -122 25 388 -309 -366 498 121 -270
5322 -270 -96 90 148 -95 -138 211 -193 -44 366 -209 -149 128 -51 110 -117 -101 168 -121 -88 282 -126 -220
5344 -220 26 83 183 -310 -126 326 -110 -95 157 -163 -27 193 -54 -89 -126 17 176 -129 2 117 -155
5365 -155 56 112 -82 144 -214 -46 315 -25 -203 162 43 100 9 -136 45 -37 61 135 -194 93 209 -115
5387 -115 29 -29 -140 85 -39 -59 118 -191 43 35 -62 45 -144 -112 143 -88 -90 11 -161 149 35 -216 57
5410 57 6 -93 -21 -147 -64 83 -161 74 -7 -18 16 -151 76 149 -191 -89 91 -84 24 -12 -105 101 -44 75
5434 75 -51 -140 167 72 -167 -53 -40 -8 73 -166 59 125 -163 -98 131 -18 -108 -47 49 32 -133 47 41 -89 85
5459 85 24 -164 -5 71 33 -151 -106 109 67 -140 72 92 -58 -166 42 99 -70 -118 102 20 -177 28 53 -121
5483 -121 -82 160 8 -196 -6 213 -35 -222 118 188 -63 -153 64 161 -173 -139 185 88 -219 102 191 -131
5505 -131 -121 142 24 -275 67 268 -143 -244 179 193 -202 -29 218 58 -201 -78 176 -13 -229 12 199
5526 199 -109 -98 198 99 -250 -6 308 -128 -318 231 262 -324 -69 326 40 -298 70 263 -45 -263 127
5547 127 113 -125 -88 135 66 -140 -34 162 -52 -224 147 168 -280 -117 259 -28 -337 29 336 -174 -248 146
5569 146 182 -223 -125 128 55 -200 -68 267 -30 -188 102 31 -204 -98 226 41 -331 26 333 -204 -297 211
5591 211 124 -275 -154 135 72 -267 -23 243 -3 -192 -26 61 -36 -145 67 121 -207 12 293 -95 -278 179
5613 179 199 -112 -214 206 117 -324 12 207 -47 -87 47 66 51 -98 15 78 -153 -31 96 -35 -102 16
5635 16 158 -52 -255 157 151 -334 -95 242 -87 -152 45 176 -13 -238 78 215 -176 -117 32 41 -20 -166 144
5658 144 17 -269 165 269 -293 -126 216 58 -238 -128 277 71 -272 120 206 -102 -101 40 160 -32 -263
5679 -263 153 223 -199 16 159 -100 -87 167 183 -205 -219 416 83 -383 167 246 -132 -97 111 86 -128 -214 286
5702 286 139 -307 27 204 23 -28 -59 110 -51 -194 348 21 -535 124 358 -165 -299 45 261 -203 -249
5723 -249 360 -6 -343 165 202 -94 -190 -90 242 -59 -236 222 -22 -348 248 177 -204 -175 162 395 -313
5744 -313 -268 348 13 -317 139 89 -91 -116 18 300 -123 -289 302 116 -233 71 68 -12 -109 135 370 -355
5766 -355 -285 489 25 -414 63 134 -20 -173 3 265 -205 -175 257 -70 -131 -67 82 141 -89 -122 167 -146
5788 -146 -84 293 -124 -279 53 188 -40 -324 2 288 -212 -99 234 -141 -78 113 -20 14 -147 -75 154
5809 154 -110 -26 159 -74 28 110 68 32 -259 109 313 -257 -229 234 11 -8 35 -18 152 -125 22 165 -99
5832 -99 -74 95 -4 39 -36 -107 186 -124 -13 150 -237 -109 176 -20 -114 -123 68 153 -136 -38 1 -98 76 5 -96
5857 -96 84 -112 -74 214 -97 -122 131 -1 18 -11 25 -76 -106 151 159 -268 -44 189 -110 -30 -20 5 88 -73
5881 -73 -38 73 -93 -39 57 -52 33 -89 15 133 -147 21 216 -210 -6 276 -34 -143 46 124 44 -197
5903 -197 72 107 -54 -2 40 3 43 -11 62 51 -149 26 92 -101 20 179 -1 -49 110 161 -81 -194 161 69
5927 69 -121 -9 67 3 25 12 -11 56 -107 55 7 -107 1 69 45 -112 -5 104 -100 -132 178 50 -218 31
5951 31 145 -91 -102 15 67 -71 30 53 -70 -114 120 -46 -51 -14 36 75 -57 -27 138 12 -222 45 162 -80
5975 -80 -120 134 122 -120 -54 148 -24 -136 138 30 -150 -11 144 -31 -141 50 189 -29 -155 78 166 -166
5997 -166 -114 115 71 -170 -21 174 11 -153 119 69 -109 -1 50 -89 -133 82 110 -137 -78 145 123 -140 -103
6020 -103 102 39 -99 -6 150 -63 -149 119 139 -150 -51 136 -63 -186 96 140 -196 -33 227 34 -144 87
6042 87 187 -43 -157 18 192 0 -106 106 160 -30 -76 117 80 -134 67 174 -89 -122 209 64 -82 -15
6064 -15 121 -15 -164 77 176 -130 -88 119 142 9 -100 71 151 -120 -66 113 -66 -56 100 73 -126 -67 157
6087 157 29 -146 76 119 -135 -77 97 48 -20 -159 118 195 -156 -100 84 47 -76 -91 62 -1 -159 111 111 -135
6111 -135 21 130 -84 -89 64 31 -78 -131 128 98 -159 -11 101 107 -66 -176 160 93 -248 17 204 -103 -43
6134 -43 133 14 -127 -44 224 -88 -182 163 83 -158 5 126 48 -138 -115 267 60 -346 30 200 -54 -124
6156 -124 57 161 -62 -111 276 -29 -336 142 181 -118 -71 95 59 -123 -138 216 18 -295 102 232 -58 -242
6178 -242 61 238 -78 -214 240 47 -229 214 132 -142 -108 148 128 -171 -135 253 -36 -202 181 107 -142 -146
6200 -146 46 241 -232 -238 317 118 -205 31 92 -54 -159 123 151 -268 -125 364 -78 -222 209 116 -111 -40
6222 -40 76 141 -211 -100 250 55 -175 -30 181 118 -172 -92 175 -196 -67 236 -134 -214 137 138 -51 -177
6244 -177 18 151 -221 -58 166 -158 -108 58 80 29 -183 -48 276 -75 -147 125 -84 -64 60 20 -84 -132
6266 -132 128 154 -248 -46 182 -102 -2 35 51 34 -153 34 263 -151 -165 119 29 -22 -114 24 111 -130 57
6289 57 183 -217 -16 203 -97 -83 -28 39 112 -101 51 131 -96 -2 70 17 7 -155 3 211 -122 -103 125 -20
6313 -20 -28 67 -41 -59 -45 87 19 -221 9 114 -56 20 -8 15 -12 -122 14 100 -171 -56 113 35 -99 -58 79
6338 79 49 -98 -6 18 -181 77 172 -117 -55 67 82 66 -155 49 143 -116 -37 147 13 -89 -54 181 37 -220
6362 -220 21 126 -137 10 112 -155 -10 73 39 -101 -63 167 96 -128 -26 72 -26 -22 -79 128 21 -127 108
6385 108 155 -108 -96 142 9 -91 3 103 -105 -88 219 17 -179 33 133 -52 -115 9 29 4 -91 112 84
6408 84 -26 -21 21 66 -27 -47 92 14 -101 129 -5 -96 84 109 -67 -109 29 94 -72 -13 122 -6 -113 -16 93
6433 93 41 -38 -38 95 20 -86 71 -17 -64 115 83 -53 -33 153 51 -150 28 156 -49 -89 79 94 0 14 -23
6458 -23 20 0 -114 31 -7 -41 97 13 -41 -60 84 68 -121 0 136 -114 -90 70 73 -105 -16 67 -72 -98 43
6483 43 -23 -87 9 77 -33 -59 113 61 -40 1 -23 56 -54 -80 85 79 -28 30 136 48 -85 52 97 -66 18 16
6509 16 -2 -21 10 -8 44 22 108 34 -92 -13 81 45 -121 2 80 -14 -140 52 129 -119 -39 99 27 -84 43 51
6535 51 -8 5 80 1 -91 27 34 10 -52 -75 110 52 -108 -46 133 -93 -137 53 71 -69 -102 113 24 -66 -19 61 -30
6562 -30 6 10 -71 -11 -42 26 8 -88 -1 100 45 -96 -62 146 -34 -140 69 104 -176 34 94 -13 -120 49 77
6587 77 -35 -17 29 0 -130 53 79 19 -126 12 215 -3 -207 108 109 -164 -53 81 11 -129 -36 194 -68
6610 -68 -119 79 78 -90 -10 10 2 -38 -34 191 -41 -170 69 181 -157 -132 123 93 -144 -102 220 -61 -242 130 84
6635 84 -165 -55 -13 84 -109 -70 108 -81 -93 117 30 -132 -94 118 140 -150 -165 304 -17 -211 75 145 -37
6658 -37 -56 87 113 -152 -77 229 -75 -110 124 36 -6 -53 101 31 -147 -48 252 -46 -269 90 176 -9 -175 109
6682 109 141 -202 -42 232 -133 -167 73 40 -4 -79 59 87 -112 50 128 -131 -169 81 159 -19 -182 87 226
6705 226 -172 -73 172 -88 -120 111 29 -69 -56 95 139 -194 -26 81 -45 -21 71 -8 -32 -144 113 164 -276 -90
6729 -90 162 63 -132 -2 39 -33 -136 64 77 -169 13 100 -31 7 -38 -25 54 -56 4 52 -95 26 165 2
6753 2 -15 -83 102 102 -188 -41 109 -82 38 103 -38 -7 -9 76 82 -143 36 61 -48 -1 35 -2 -32 -28 119 76 -192
6780 -192 -53 213 -65 -82 39 57 41 -40 76 72 -135 69 74 -100 -35 64 30 85 -119 89 83 -114 -7 127 -66
6805 -66 -141 -17 142 1 -174 115 86 -184 -27 45 -77 26 -66 5 -17 -51 56 111 -66 -6 77 -32 -80 29
6829 29 147 -64 -158 102 167 -200 -29 143 -17 -75 -11 48 -72 -123 140 25 -91 8 77 3 16 -10 129 -55
6853 -55 -158 146 55 -114 31 143 7 -136 -43 108 4 -131 107 48 -51 106 40 -34 1 39 46 -43 -67 49
6877 49 54 -54 16 114 -22 -80 -10 132 -26 -108 123 70 -134 43 59 -70 -6 63 1 -88 28 55 -52 -90 50
6902 50 8 -54 -38 25 94 -4 -89 84 51 -94 -17 98 31 -48 56 -31 -103 -17 59 -49 -78 41 -6 -72 -15 49 5
6929 5 -110 -37 27 7 -79 -8 0 19 -132 20 33 -49 9 59 -13 -29 100 -17 -92 21 62 -7 -16 35 64 39 -44 24 25
6958 25 32 7 6 60 -11 -23 88 -32 -19 31 -30 -32 -30 5 -55 -84 31 54 -59 -15 27 -20 15 30 1 42 -29 -54 25 38
6988 38 39 -1 28 -8 -54 55 -7 -120 -6 17 -153 5 85 24 -69 32 32 9 9 -24 8 3 18 -39 -24 59 -60 -19 20
7017 20 -52 -29 19 -21 -2 33 11 -54 -28 51 -35 -33 -4 6 -54 -21 -44 11 19 -60 33 72 2 -17 80 37 -22 22 80 -9 -15 48
7049 48 26 -57 47 82 -58 -70 15 32 -12 -60 18 104 -38 -68 -25 7 -29 -69 28 -33 -98 70 78 -130 -26 128 -58
7076 -58 -156 5 132 -84 -127 118 91 -102 -50 38 61 -58 -109 25 -18 -45 31 18 -44 0 95 52 -111 -17 178 -70
7102 -70 -130 90 17 -149 -3 104 24 -96 7 160 -54 -90 5 50 8 -65 77 59 -53 6 216 -99 -194 119
7126 119 44 -76 -37 126 13 -97 3 168 -27 -114 52 11 39 -17 -21 90 -36 -11 181 -47 -133 104 47 -55
7150 -55 -61 161 72 -154 49 237 -129 -63 183 27 -109 -52 63 93 -106 16 79 -46 -19 42 49 -40 -124 113 83
7175 83 -218 14 149 -42 -96 42 44 -24 -57 135 79 -203 -14 125 -65 -45 -17 -13 103 -100 13 72 -72 53
7199 53 139 -106 -26 -15 97 29 -85 80 97 -139 25 20 -28 -40 -44 56 52 -91 18 66 -98 48 32 -49 -56 10 137
7226 137 -1 -159 112 145 -90 12 56 -11 -67 -8 95 6 -100 45 130 -89 4 -27 50 47 -25 68 58 -118 86
7251 86 163 -110 -51 76 88 -59 -144 55 16 -105 65 129 -50 24 22 23 5 -121 76 84 -112 -16 5 8 -48 27 42
7278 42 -97 -85 133 -1 -141 54 96 -18 26 -1 57 -105 -58 107 44 -98 12 86 -3 -2 -10 47 -9 -104 131 17
7304 17 -202 52 110 -54 -76 9 135 -18 -24 103 13 -62 17 50 -7 -15 -18 140 -11 -70 90 16 -54 12 136 -87
7330 -87 -108 123 145 -101 -25 117 12 -22 42 1 -23 -32 -48 81 -36 -66 62 1 -13 19 59 -20 -58 43 95 -96
7356 -96 -118 124 -8 -131 4 57 -8 -86 22 95 -33 -14 41 5 -34 15 -79 -28 -58 -48 26 -16 -24 86 17 -148 30
7383 30 82 -30 -83 26 44 -68 -54 41 -1 -25 -4 10 -1 -3 -15 -22 -8 -24 52 -62 -26 -8 44 -8 -57 12 37 -87 -51
7412 -51 23 -22 -37 36 24 -14 61 38 -18 19 34 -59 15 11 24 -72 28 7 12 47 -37 -94 88 36 -53 -16 72 19 -69 6
7442 6 32 7 41 -7 -57 65 23 -9 -14 -16 30 40 18 13 8 1 -39 -14 14 61 -75 86 38 -6 2 -11 -38 0 19 8 28 23 -17
7475 -17 -18 -35 27 15 -6 -31 -61 66 22 -69 6 64 -28 -9 4 -35 -6 -43 18 -66 -13 -2 -9 6 64 52 23 6 52 19 -26
7506 -26 -87 21 23 -62 -74 56 70 -25 -32 81 -23 -148 26 -41 -59 -13 45 -83 -40 -19 37 2 4 10 31 -76 -65 39
7534 39 80 -21 -13 61 28 -86 66 -4 -47 -11 80 54 -64 27 26 -8 -36 44 -36 -38 49 79 8 -106 -20 88 18 -81 65
7563 65 57 -67 -10 73 69 -57 -20 140 36 -81 54 19 -77 46 38 -30 -54 40 49 -78 -79 47 85 -25 -40 91 122
7590 122 -56 -10 101 24 -60 116 27 -44 -16 56 3 -79 15 99 -79 41 117 -6 8 -25 24 94 -82 -68 69 -50
7616 -50 -73 31 -46 -44 -70 84 49 -115 32 109 -114 3 67 -38 14 -3 59 20 -64 31 124 -22 -24 19 71 37 -31
7643 -31 73 53 -147 30 77 -109 -39 38 47 -15 -47 66 10 -51 91 79 -127 -47 39 56 47 -72 9 101 -83 10 32
7670 32 -67 -64 8 122 -36 -96 112 72 -78 34 59 -26 7 69 40 -18 -96 51 43 -2 -49 33 5 31 -42 106 -39
7697 -39 -88 95 74 -99 34 40 -2 17 -66 6 -14 -47 60 17 -69 -8 43 72 -41 -114 108 54 -56 45 39 -78 -35
7724 -35 94 59 -98 -30 142 -37 -84 111 7 -41 4 47 40 -79 -69 102 5 -116 -18 64 -17 -58 -59 59 -8 -47
7750 -47 137 -17 -110 67 84 -89 -31 35 28 -70 -16 112 19 -79 30 57 -12 -107 9 91 -34 -58 80 32 -64 78
7776 78 54 -82 -47 25 88 -111 32 57 -17 -115 90 -5 -27 -1 -37 68 -76 -72 97 103 -32 -51 66 -22 -78 8 28
7803 28 -74 -27 80 -36 -58 35 69 -18 -40 7 3 -56 -16 79 46 -80 -2 61 4 -6 -2 72 -70 -13 72 -35 -44 98
7831 98 24 -83 -7 50 2 -46 -31 18 -28 -44 4 87 -8 -78 5 80 -13 -62 40 22 -63 69 43 -19 -50 59 17 -112
7859 -112 -44 30 -1 -35 3 14 -32 -26 -30 42 35 -24 90 59 -4 -92 32 38 -52 -10 51 -34 5 61 -16 -45 -8 46 -2 -25 8
7890 8 68 -70 -15 -15 80 31 -19 -2 32 -13 -11 9 -30 11 18 10 -35 31 33 -47 -45 86 46 -77 -53 -23 -2 47 -32 30 42 -62
7922 -62 -108 32 20 -27 -16 48 10 20 38 -19 -57 22 75 -14 40 3 0 -5 98 85 2 4 -31 -3 35 -16 -48 15 21 -54 15
7953 15 12 -26 -32 34 -28 -79 73 -5 19 -39 38 -45 -20 54 28 -60 -47 -1 -3 61 -5 37 84 -62 29 9 -20 28 4 7 -54
7984 -54 16 66 -5 -41 107 -16 76 4 -9 -13 3 29 56 31 -31 12 -5 -3 17 18 37 -27 0 118 -20 -55 69 32 -19
8013 -19 1 87 26 -62 50 66 -45 -14 86 7 7 17 -18 7 -9 48 35 -23 6 52 59 -44 -59 10 2 -88 1 75 -27
8042 -27 -56 88 41 -20 26 56 43 -18 52 32 -108 78 58 -9 -5 -28 43 79 -43 19 110 -80 -50 81 34 -71 14
8069 14 58 20 -77 -10 96 -13 -18 52 1 -3 -14 64 -1 -84 -5 130 -3 -93 54 71 -26 -43 106 11 -33 60 112 -62
8097 -62 3 35 -36 3 14 -11 -28 -14 77 41 -64 3 5 24 -49 -90 36 7 -95 -14 47 -70 -29 44 8 -41 -40 1 -9
8126 -9 -32 88 -55 -41 17 57 32 -22 -130 67 59 -91 -13 26 12 -1 -23 -8 -11 -15 55 15 -80 8 81 22 40 -10 25 54
8156 54 -33 86 -18 -63 36 40 35 -55 -49 62 1 -33 87 40 -59 8 61 -4 -49 -4 136 -12 -1 41 20 -38 33 13 -15
8185 -15 13 -25 115 3 -107 78
8191G8
##END NTUPLES=NMR FID
##END=
