##TITLE=1H_CA-8771
 CDCl3, 8 sc, 
 1.10.2020
##JCAMPDX= 6.0         $$ Bruker NMR JCAMP-DX V2.0
##DATA TYPE= NMR FID
##DATA CLASS= NTUPLES
##ORIGIN= UXNMR, Bruker Analytische Messtechnik GmbH
##OWNER= root
$$ XWIN-NMR		Version 3.5
$$ Thu Oct  1 11:41:43 2020 Russian Standard Time (UT+4h)  she@DPX200
##.OBSERVE FREQUENCY= 200.1315066352
##.OBSERVE NUCLEUS= ^1H
##.DELAY= (6, 6)
##.ACQUISITION MODE= SIMULTANEOUS
##.ACQUISITION SCHEME= undefined
##.AVERAGES= 8
##.DIGITISER RES= 18
##SPECTROMETER/DATA SYSTEM= spect
##.PULSE SEQUENCE= zg30
##.SOLVENT NAME= CDCl3
##.SHIFT REFERENCE= (INTERNAL, CDCl3, 0, 15.7039)
##AUDIT TRAIL= $$ (NUMBER, WHEN, WHO, WHERE, WHAT)
$$ ##TITLE= Audit trail, XWIN-NMR		Version 3.5
$$ ##JCAMPDX= 5.01
$$ ##ORIGIN= Bruker BioSpin GmbH
$$ ##OWNER= she
$$ F:/spectra/data/she/nmr/H-F/1/audita.txt
$$ ##AUDIT TRAIL=  $$ (NUMBER, WHEN, WHO, WHERE, WHAT)
(   1,<2020-10-01 11:40:46.25 +0400>,<she>,<DPX200>,
      <created by zg, POWCHK disabled, PULCHK disabled
       configuration hash MD5:
       00 E9 B6 7A A2 85 ED C7 34 08 36 98 17 FE 4E 26
       data hash MD5: 16K
       84 33 E1 7F E6 57 37 98 D8 63 97 66 F1 E1 D3 06>)
$$ ##END=
$$ 
$$ hash MD5
$$ D1 BA 3F EA A0 FF B4 C7 0A FF 8D 75 14 46 EC 66
##$RELAX= 
##$RELAX= 
##$RELAX= 
##$RELAX= 
##$RELAX= 
##$RELAX= 
$$ Bruker specific parameters
$$ --------------------------
##$DU= <F:/spectra>
##$EXPNO= 1
##$NAME= <H-F>
##$PROCNO= 1
##$TYPE= <nmr>
##$USER= <she>
##$AMP= (0..31)
100 100 100 100 100 100 100 100 100 100 100 100 100 100 100 100 100 100 
100 100 100 100 100 100 100 100 100 100 100 100 100 100 
##$AQSEQ= 0
##$AQ_mod= 1
##$AUNM= <au_zg>
##$AUTOPOS= <>
##$BF1= 200.13
##$BF2= 200.13
##$BF3= 200.13
##$BF4= 200.13
##$BF5= 200.13
##$BF6= 200.13
##$BF7= 200.13
##$BF8= 200.13
##$BYTORDA= 1
##$CFDGTYP= 0
##$CFRGTYP= 5
##$CHEMSTR= <none>
##$CNST= (0..31)
1 1 145 1 1 1 1 1 1 1 1 1 1 1 1 1 1 1 1 1 1 1 1 1 1 1 1 1 1 1 1 1 
##$CPDPRG= <>
##$CPDPRG1= <>
##$CPDPRG2= <>
##$CPDPRG3= <>
##$CPDPRG4= <mlev>
##$CPDPRG5= <mlev>
##$CPDPRG6= <mlev>
##$CPDPRG7= <mlev>
##$CPDPRG8= <mlev>
##$CPDPRGB= <>
##$CPDPRGT= <>
##$D= (0..31)
0 1.2 0 0 0 0 0 0 0 0.06 0 0.03 0 0 0 0 0.0002 0 0 0 0 0 0 0 0 0 0 0 0 
0 0 0 
##$DATE= 1601538045
##$DBL= (0..7)
120 120 120 120 120 120 120 120 
##$DBP= (0..7)
150 150 150 150 150 150 150 150 
##$DBP07= 0
##$DBPNAM0= <>
##$DBPNAM1= <>
##$DBPNAM2= <>
##$DBPNAM3= <>
##$DBPNAM4= <>
##$DBPNAM5= <>
##$DBPNAM6= <>
##$DBPNAM7= <>
##$DBPOAL= (0..7)
0.5 0.5 0.5 0.5 0.5 0.5 0.5 0.5 
##$DBPOFFS= (0..7)
0 0 0 0 0 0 0 0 
##$DE= 6
##$DECBNUC= <off>
##$DECIM= 32
##$DECNUC= <off>
##$DECSTAT= 4
##$DIGMOD= 1
##$DIGTYP= 9
##$DL= (0..7)
0 120 120 120 120 120 120 120 
##$DP= (0..7)
150 150 150 150 150 150 150 150 
##$DP07= 0
##$DPNAME0= <>
##$DPNAME1= <>
##$DPNAME2= <>
##$DPNAME3= <>
##$DPNAME4= <>
##$DPNAME5= <>
##$DPNAME6= <>
##$DPNAME7= <>
##$DPOAL= (0..7)
0.5 0.5 0.5 0.5 0.5 0.5 0.5 0.5 
##$DPOFFS= (0..7)
0 0 0 0 0 0 0 0 
##$DQDMODE= 0
##$DR= 18
##$DS= 0
##$DSLIST= <SSSSSSSSSSSSSSS>
$$ [...]
##$SUBNAM2= <"">
##$SUBNAM3= <"">
##$SUBNAM4= <"">
##$SUBNAM5= <"">
##$SUBNAM6= <"">
##$SUBNAM7= <"">
##$SUBNAM8= <"">
##$SUBNAM9= <"">
##$SW= 16.880792210976
##$SWIBOX= (0..15)
0 0 2 0 0 0 0 0 0 0 0 0 0 0 0 0 
##$SW_h= 3378.37837837838
##$TD= 16384
##$TD0= 1
##$TE= 0
##$TE2= 300
##$TE3= 300
##$TEG= 300
##$TL= (0..7)
0 120 120 120 120 120 120 120 
##$TP= (0..7)
150 150 150 150 150 150 150 150 
##$TP07= 0
##$TPNAME0= <>
##$TPNAME1= <>
##$TPNAME2= <>
##$TPNAME3= <>
##$TPNAME4= <>
##$TPNAME5= <>
##$TPNAME6= <>
##$TPNAME7= <>
##$TPOAL= (0..7)
0.5 0.5 0.5 0.5 0.5 0.5 0.5 0.5 
##$TPOFFS= (0..7)
0 0 0 0 0 0 0 0 
##$TUNHIN= 0
##$TUNHOUT= 0
##$TUNXOUT= 0
##$USERA1= <user>
##$USERA2= <user>
##$USERA3= <user>
##$USERA4= <user>
##$USERA5= <user>
##$V9= 5
##$VALIST= <valist>
##$VCLIST= <CCCCCCCCCCCCCCC>
##$VD= 0
##$VDLIST= <DDDDDDDDDDDDDDD>
##$VPLIST= <PPPPPPPPPPPPPPP>
##$VTLIST= <TTTTTTTTTTTTTTT>
##$WBST= 1024
##$WBSW= 4
##$XGAIN= (0..3)
0 0 0 0 
##$XL= 0
##$YL= 0
##$YMAX_a= 320508
##$YMIN_a= -317835
##$ZGOPTNS= <>
##$ZL1= 120
##$ZL2= 120
##$ZL3= 120
##$ZL4= 120
##$ABSF1= 10
##$ABSF2= 0
##$ABSG= 5
##$ABSL= 3
##$ALPHA= 0
##$AQORDER= 0
##$ASSFAC= 0
##$ASSFACI= 0
##$ASSFACX= 0
##$ASSWID= 0
##$AUNMP= <proc_1d>
##$AZFE= 0.1
##$AZFW= 0.1
##$BCFW= 1
##$BC_mod= 2
##$BYTORDP= 1
##$COROFFS= 0
##$CY= 11.3945322036743
##$DATMOD= 1
##$DC= 2
##$DFILT= <>
##$DTYPP= 0
##$F1P= 16.9975609425685
##$F2P= -3.02152046262296
##$FCOR= 0.5
##$FTSIZE= 0
##$FT_mod= 4
##$GAMMA= 1
##$GB= 0.15
##$INTBC= 1
##$INTSCL= 1
##$ISEN= 128
##$LB= 0.24
##$LEV0= 0
##$LPBIN= 0
##$MAXI= 10000
##$MC2= 0
##$MEAN= 0
##$ME_mod= 0
##$MI= 1.114404
##$NCOEF= 0
##$NC_proc= 0
##$NLEV= 6
##$NOISF1= 3.799351
##$NOISF2= 2.8
##$NSP= 1
##$NTH_PI= 0
##$NZP= 0
##$OFFSET= 15.70392
##$PC= 1
##$PHC0= -9974.981
##$PHC1= 19.60089
##$PH_mod= 1
##$PKNL= yes
##$PPARMOD= 0
##$PSCAL= 0
##$PSIGN= 0
##$REVERSE= no
##$SF= 200.130013532006
##$SI= 16384
##$SIGF1= 3
##$SIGF2= 2
##$SINO= 400
##$SIOLD= 16384
##$SREGLST= <1H.CDCl3>
##$SSB= 0
##$STSI= 0
##$STSR= 0
##$SW_p= 3612.71676300578
##$SYMM= 0
##$S_DEV= 0
##$TDeff= 0
##$TDoff= 0
##$TI= <>
##$TILT= no
##$TM1= 0
##$TM2= 0
##$TOPLEV= 0
##$USERP1= <user>
##$USERP2= <user>
##$USERP3= <user>
##$USERP4= <user>
##$USERP5= <user>
##$WDW= 1
##$XDIM= 8192
##$YMAX_p= 0
##$YMIN_p= 0
$$ End of Bruker specific parameters
$$ ---------------------------------
##NTUPLES= NMR FID
##VAR_NAME=  TIME,          FID/REAL,        FID/IMAG
##SYMBOL=    X,             R,               I
##VAR_TYPE=  INDEPENDENT,   DEPENDENT,       DEPENDENT
##VAR_FORM=  AFFN,          ASDF,            ASDF
##VAR_DIM=   8192,          8192,            8192
##UNITS=     SECONDS,       ARBITRARY UNITS, ARBITRARY UNITS
##FACTOR=    0.000296,      1,               1
##FIRST=     0,             0,               0
##LAST=      2.424536,      0,               0
##MIN=       0,             -317835,         0
##MAX=       2.424536,      320508,          0
$$ Real data points
##PAGE= N=1
##DATA TABLE= (X++(R..R)), XYDATA
0@%%%%%%%%%%%%%qJ6j6K4l2L2m0N6o8P6q8J08j30J50j74K03k35K74l13L53m06
$$ 0 0 0 0 0 0 0 0 0 0 0 0 0 0 -8 8 -8 16 -16 16 -24 32 -36 40 -48 60 -70 80 -94 109 -126 148 -165 188 -218
34b18M63n22N90o65P46q33R32j041J158j286J427j581J747j929K128k346K585
$$ -218 245 -277 313 -352 394 -439 493 -548 610 -676 751 -830 917 -1012 1116 -1230 1355
51A355k847L136l456L810m202M641n139N704o353P108p994R057j0360J1992j4106
$$ 1355 -1492 1644 -1812 1998 -2204 2437 -2702 3002 -3351 3757 -4237 4820 -5540 6452 -7654
66g654J6954k0971K6937n0732L55974l86424j38680M90539l83920m0071M34545
$$ -7654 9300 -11671 15266 -35466 320508 -65916 -204596 285943 -97977 -138048 296497
77B96497l86809j36635M57949k76836r2169K70736j81421o4225K86612j62490
$$ 296497 -90312 -226947 231002 -45834 -138003 132733 -48688 -112913 173699 11209
87A1209j24897J94735m3624o0547L6137j4218m6653M4185O6218r0163n2279J37577
$$ 11209 -113688 81047 37423 -23124 13013 -1205 -47858 -3673 62545 -27618 -79897 57680
99E7680J3791j54455J41658k4298j45423K11434l6785k39446K21146N9429k57113
$$ 57680 71471 -82984 58674 34376 -111047 100387 63602 -175844 45302 104731 -152382
110a52382K21746k137k39565K79883N794k87578K20034N9826k52114K18984j2009
$$ -152382 69364 67227 -172338 107545 113339 -174239 45795 105621 -146493 72491 60482
121F0482k33671K41973K5617k23015J55094M2124j65435J65825k1549j57981J45883
$$ 60482 -173189 68784 94401 -128614 26480 68604 -96831 68994 47445 -110536 35347
132C5347J5204j04744N7306M232n1464Q4380k6821m8998L9425L595J7313k7570
$$ 35347 50551 -54193 3113 7345 -44119 40261 13440 -35558 3867 7462 24775 -2795
144b795k4420L3078M358k2943L4623n2051l438J02971q3803k3164P9422n8306
$$ -2795 -27215 5863 10221 -12722 21901 -30150 -33588 69383 -14420 -37584 41838 -16468
156a6468J670Q2718j14855q9J29034j11766n37Q1300r6061L3056R5750j33848
$$ -16468 -14798 67920 -46935 -47024 82010 -29756 -30293 51007 -45054 -11998 83752 -50096
168e0096J3473J12300j12747L2826N3974j11054N5843P7337j19159K6729O9851
$$ -50096 -36623 75677 -37070 -4244 49730 -61324 -5481 71856 -47303 -20574 49277
179D9277r0257N9006K2282r4828N6126M6808p7204K4482K2207n4471O0628l159
$$ 49277 -40980 18026 40308 -54520 1606 48414 -28790 -4308 17899 -36572 24056 20897
191B0897n5185L3370J7145j7682Q427j2772j1872L6198j6064n261o393n765L6402
$$ 20897 -34288 -918 16227 -1455 6972 -5800 -17672 18526 2462 -2799 -9192 -14957 21445
204B1445j5763k7065K6140p84j6820M4670m5767k2450P6818m0418k9592N5083
$$ 21445 5682 -21383 4757 3973 -12847 31823 -13944 -36394 40424 6 -29586 25497
216B5497l7965j5260Q1981o9444l0597R3793n2568k2559O5755n7760j5965R2897
$$ 25497 -12468 -27728 54253 -15191 -45788 48005 -4563 -27122 38633 -19127 -35092 57805
228E7805o8180l2718Q3114m7882j1085N6394n3373j6133P5870m2970k8653M8015
$$ 57805 -10375 -43093 40021 -7861 -18946 37448 -15925 -32058 43812 842 -27811 20204
240B0204k6618j316L0059k7756j7797L9422n044j8739N974n89O799k712O112j6002
$$ 20204 -6414 -7730 22329 -5427 -23224 16198 11154 -7585 -1611 -2200 4599 1887 7999 -8003
254h003m980K8918l918l2481K2304J1207l0842L6323j1461m0845N0404P468n4142
$$ -8003 -12983 15935 12017 -20464 1840 13047 -17795 18528 7067 -33778 16626 24094 -30048
267c0048L4780J2463m8708N3044l466n9943N2965J6089n5486L4127J0683n0163
$$ -30048 4732 17195 -31513 21531 18065 -41878 11087 27176 -28310 5817 16500 -33663
279c3663N2114K855n6195L7520J8180l8866K2613P320l7900L6406Q094l6124J2820
$$ -33663 18451 21306 -34889 2631 20811 -18055 4558 11878 -26022 10384 18478 -17646 -4826
292d826J3830j2912N601M247j9136J2763J0645p808j2011P098J1402j0793L014
$$ -4826 9004 -3908 1693 5940 -13196 -433 10212 2404 -9607 -2509 8893 -1900 1114
305A114N08j0723R607J7395k8936k60K7502k2077L963J4903k6809O530L2637l4116
$$ 1114 1622 -9101 506 17901 -11035 -11295 16207 -5870 -1907 12996 -13813 -7283 25354 -8762
319h762n091L1555k6691O014K1381l2450J934L6490k9585o617K5925k3575O999
$$ -8762 -13853 17702 -8989 -2975 18406 -14044 -12110 24380 -5205 -11822 14103 -9472 -2473
332b473K0204k7480k950K8753j6972n575J4800j6493O598J3439j4322p681J5161
$$ -2473 17731 -9749 -12699 16054 -918 -6493 8307 -8186 -1588 11851 -2471 -10152 5009
345E009k355l890K868o413L222N123J277j0640O47J0234k416n646K767j179l259
$$ 5009 2654 -1236 1632 -4781 -1559 3564 4841 -5799 -5152 5082 2666 -2980 -213 -1392 -4651
360d651J4777j1530j0284J7704j913r407R564n178r300K2817j0076j5624J8427
$$ -4651 10126 -1404 -11688 6016 4103 -5304 4260 -918 -10218 12599 2523 -13101 5326
373E326k269q896J2908p406j2460K3747o145j4886J3697k401n723J2124o552j2315
$$ 5326 3057 -5839 7069 -337 -12797 10950 4805 -10081 3616 1215 -4508 7616 1064 -11251
387a1251J7993j598j0384O378j740k199P942k254j0417Q426L466m229p62r13J047
$$ -11251 6742 5144 -5240 1138 -602 -2801 5141 2887 -7530 896 4362 133 -629 -1542 -495
402d95J809K927o967j004N926K106o444O52K360l600P668l120q471O589O355r089
$$ -495 1314 4241 -2726 -3730 2196 4302 -2142 -1490 870 -2730 4938 1818 -6653 -64 6291 -2798
418b798K114K764q333J0463R56j2018M785P707q407L298J902r749R692L633j0518
$$ -2798 -684 2080 -6253 4210 5166 -6852 -2067 5640 -2767 531 2433 -7316 2376 6009 -4509
433d509J422O429n099K896J681r308O464N225o454j992M324k114J896K243p154
$$ -4509 -3087 3342 -1757 1139 2820 -6488 -24 5201 -1253 -3245 1079 -1035 861 3104 -4050
448d050K247M404n01m277J071J393OK365l280k562L070M554n182j362L028j681
$$ -4050 -1803 2601 2100 -2177 -1106 287 293 2658 -622 -3184 -114 4440 -742 -2104 924 -757
464g57K564M51n181K49P572m648k304L347k928K178L263n305k384P862k956k442
$$ -757 1807 2258 -2923 -2674 4898 250 -2054 1293 -1635 543 3806 -1499 -3883 3979 1023 -1419
480a419K712l382J546M426l688m422O278r20j650J739l421Q08L951j157m640L191
$$ -1419 1293 -2089 -543 3883 195 -4227 2051 1131 -519 1220 -2201 -1393 2558 1401 -3239 -48
496d8Q25m78Q66k167r76K671J997m626L35J672L23L56r28j579L30M318k633j912
$$ -48 777 299 1165 -1002 -1978 693 2690 -1936 -1601 71 394 750 -178 -1757 -1427 2891 258 -1654
514a654J361R74k87N16j905j650M916r15k794N97J136m42J700j414l290M377N07
$$ -1654 -293 681 394 910 -995 -2645 2271 1356 -1438 -841 295 -147 1553 139 -3151 1226 1733
531A733k097l70L43j53K223m10m025K850J427j103q21L5l03J440J220l532O04
$$ 1733 -364 -734 -391 -544 1679 1269 -2756 94 1521 418 -403 -368 -671 769 1989 -1543 -939
548i39J713L18j004l67o14O10K423k510j135J240J717j248k87n08m98K479m95
$$ -939 774 1092 88 -279 -893 -283 2140 -370 -1505 -265 1452 204 -83 -591 -1089 1390 895
565H95j950Q9J950l94k70l21j377K166K64j358j104J732j96N12k76k054J508J369
$$ 895 -1055 -966 984 590 320 -1 -1378 788 1052 -306 -1410 322 126 638 362 -1692 -184 1185
583A185q84j797J278K74O58j10j851N62J427M56k205M69L38N16P39j627o03R55
$$ 1185 301 -1496 -218 56 714 604 -1247 -685 742 1198 -1007 -538 -200 316 1055 -572 -1175 -220
601b20J499j557j90p8M23R68n84j018j62K034q20m17m06J06J314k33q75r60J769
$$ -220 1279 -278 -468 -546 -123 845 261 -757 -919 1115 295 -122 -528 -422 892 659 -216 -1176 593
620E93r7l77n20j61O92N76m41j350J250N31k29o56k80J43J138M58k077K80O47
$$ 593 496 119 -401 -562 130 706 265 -1085 165 696 467 -189 -469 -326 812 1270 -807 -527 120
639A20O34n66m50k84N76J006j399n89P38O31l00m39l19L78J144p24q10p2J059
$$ 120 754 188 -262 -546 30 1036 -363 -952 -214 417 117 -322 -641 -263 881 157 -653 -725 334
658C34l9qo35l86J310j90m88p86P70M88j61k1r00P49P28m57j029P87O8L57j66
$$ 334 295 287 -348 -734 576 386 -102 -888 -118 370 209 188 -712 37 765 308 -721 66 134 491 325
679C25r10K59Q20L92j284N9K51M11L15j082pP12N36n95m12j54M92M30n49l18j54
$$ 325 -585 -326 494 886 -398 -339 -88 323 638 -444 -451 261 797 202 -210 -364 128 558 9 -309 -463
700d63J159n87l9n00L62M82j62l36m49J060k07l47j49j10K30O66n42q36Q36K53
$$ -463 696 109 70 -430 -68 414 252 -84 -533 527 320 -27 -176 -286 -56 610 68 -768 68 321
720C21j77l32n6j41R11k28j170O12L58J59j68j75l36N18P03j140m5N1N46J08m89
$$ 321 144 -188 -244 -385 526 298 -872 -260 98 257 89 -86 -422 96 799 -341 -386 -335 211 319 -170
741a70l63K82P67m98l44r7N44k34J74k27k78P17l6k71O4j36M33r2k51l92M93K04
$$ -170 -533 -251 516 18 -326 -423 121 -113 61 -166 -444 273 237 -34 30 -106 327 235 -16 -408 85 289
763B89l44j53K5P3L35Q5r62N70M77l01j81K7o2L71L38p71L1J48N50l30n34L1L49
$$ 289 -55 -208 -183 -110 225 310 -652 -82 395 94 -87 -60 -122 249 587 -184 -153 -5 545 215 -319 -288 61
786F1N16p63k5Q9K53j88L11l37j62L83N2o00m6Q03k98q8j44k39N56L42l73o72
$$ 61 577 -186 -211 -122 131 -57 254 -83 -245 138 190 -410 -456 347 49 -39 -183 -422 134 476 103 -569
808e69Q46k13j3R6n56L03M07%o56N70j70j50N03o44K4O09m0p54M14l14K30L99
$$ -569 277 64 51 147 -409 -106 301 301 -355 215 45 -105 398 -246 -222 387 347 -407 7 -307 -77 322
830C22j93l48M24L21o25K52k35K11L39o62k0m4N37J44m71l40M35J95O5o18p5N88
$$ 322 129 -219 205 526 -99 153 -82 129 468 -194 -214 -258 279 423 -48 -388 47 242 307 -311 -386 202
852B02Pj58k50K61k08L91J29p87N13J82k72j12j32N6J15M91p68K55L66j64p1n8
$$ 202 209 51 -199 62 -146 245 374 -413 100 282 10 -102 -234 -178 -63 428 -340 -85 281 117 46 -12
874a2l07L30K92m92j0Q8M77m98J58l19L46K05j55m1n5j98J02K76k56q5L08k9k67
$$ -12 -319 11 303 -189 -199 -111 366 -132 26 -293 53 258 103 62 7 -191 -89 187 -69 -154 154 125 -142
897a42J5K64k55M27q5n07L39j3K24k76K64j99O8j03m60L67L02m1l47j9L9K21K00
$$ -142 -127 137 -118 309 224 -283 56 43 267 -9 255 56 124 21 -439 -72 230 189 -158 -177 -138 83 283
920B83m64J09J23K9j99J53k58Q0L00j83j96J47J70J15k63j74K67K4J0j01Oj87
$$ 283 -181 -72 51 80 -119 34 -224 -144 156 -27 -223 -76 94 209 -54 -228 39 63 73 -28 -22 -209
942b09L14J1kk37J03P4J07k54J47J0j54K17k57q3M60k83k22L65Q2J53k49J4l75
$$ -209 105 116 114 -123 -20 54 161 -93 54 64 -90 127 -130 -213 247 -36 -258 107 189 342 93 107 -268
965b68L64L6r6j85J18l5J23L1k90J43M03n20p9R9K57J2n8k70L12M8q7j82O5n2
$$ -268 96 132 36 -149 -31 -66 57 88 -202 -59 344 -176 -255 -156 101 113 55 -215 97 145 58 -124 -59 -111
989a11L54k96j95L4J62J60J35n70J88M42k48k62J87J29j54J54j40J33j53J62j99
$$ -111 243 -53 -248 -214 -52 108 243 -327 -139 303 55 -207 -20 109 -45 109 -31 102 -51 111 -88
1010h8j13J32P9O4n3J12k38J28J14l99Q2Q4k5O2K18k19N5J50j28j48L30q5l5k05
$$ -88 -201 -69 10 74 21 133 -105 23 137 -262 -180 -96 -121 -59 159 -60 -5 145 17 -131 199 114 79 -126
1034a26r7K67l21J65J18p8l3L37j1l82K58P5k87J70l9lo2J27j48l0K98j71J11
$$ -126 -223 44 -277 -112 6 -72 -105 232 221 -161 97 172 -115 55 16 13 -49 78 -70 -100 198 27 138
1057A38k01M5j95K88Oj29K24r8p0o6o9j3M61k38j71J21k7k09l1J82k78K09M07
$$ 138 -63 -18 -213 75 81 -48 176 78 8 -58 -127 -140 321 83 -88 33 6 -203 -234 -52 -330 -121 286
1080B86n13J68N0O1J25l37J00P6L4l09M19J14l21J92M4Ol76m5N3L64k64NQ8k5
$$ 286 -227 -59 -9 52 177 -160 -60 16 50 -259 160 274 -47 145 189 195 -181 -226 -173 191 -73 -68 20 -5
1104eR6j75r6K18j15j72L28k73J69L00k36o4l4J73k07K41j42m6K16l31J41k26
$$ -5 91 -84 -180 38 -77 -249 79 -194 -25 275 39 -25 -59 114 -93 148 6 -40 176 -155 -14 -240
1126b40K07K69k55j95J24J70j87qJ57K67m68J34J49j38J25p3k30J01k00L97j50
$$ -240 -33 236 -19 -214 -90 80 -107 -115 42 309 -159 -25 124 -14 111 38 -192 -91 -291 106 -44
1147d4j10J58j77L33o5K72l66J6m0p9J60j10K08j11R7k13P3J28j01l7j30K05k08
$$ -44 -154 4 -173 160 95 367 1 17 -23 -102 58 -52 156 45 142 -71 2 130 29 -8 -138 67 -141
1170a41J88j15j28L40l2J17m30L34k04O7j55L2K30Q3J11m21J34j48J58%O1M2k28
$$ -141 47 -68 -196 144 112 229 -201 133 -71 -4 -159 -127 103 186 297 -124 10 -138 20 20 81 123 -105
1193a05J1L51k41r7Q8L6n3O3n5k6R0l90M31O1O3K3l26N5K13j8l12PL54o9m68M94
$$ -105 -94 257 16 -81 7 43 -10 53 -2 -28 62 -328 103 164 227 250 -76 -21 192 174 -138 -131 223 154 -314 180
1219A80k34N9R6j51j57K35p7K14k66K3k7J03l7j86M31l56J09M35j52k85j14J06
$$ 180 -54 5 101 -50 -207 28 -49 165 -101 -78 -105 -2 -39 -225 206 -150 -41 394 242 -43 -157 -51
1241e1K49n07L53O0q2j08n4m3L17k47J57l9o2K01m3j80J30Nk4p8j55L46j08j25
$$ -51 198 -309 44 104 22 -86 -140 -183 134 -113 44 5 -57 144 101 -79 51 56 32 -46 -201 145 37 -88
1265h8J65k05P9j84J92k87K45J11K7k05L19k10J57j15j0P0j1j32K4j05K07k8r4
$$ -88 77 -128 -49 -233 -41 -328 -83 28 55 -150 169 -41 116 1 -9 61 50 -82 -58 -163 44 16 -78
1288g8K85l16p9L36O8j67j72j40n5L15j65L38j07No9mn4r7R1J69j25r8K76k60
$$ -78 207 -109 -188 148 216 49 -123 -263 -318 -3 -168 170 63 68 -1 -5 -59 -156 -65 104 -21 -119 157 -103
1312a03K2Q3J62j87J02r9o5K16l0qmr9j6K3k79L39j9OPJ21q4rj90J04J61k22k5
$$ -103 -81 2 164 -23 79 -20 -85 131 101 93 89 -10 -26 -3 -282 57 38 44 51 172 88 79 -111 -7 154 -68 -93
1339i3N5J24j56O1J88m1l67K52m7j7j42K14R9k9o5k62K65j73m5K43p9O5k39N61
$$ -93 -38 86 -70 -9 179 138 -229 23 -24 -41 -183 31 130 101 36 -226 39 -134 -179 64 -15 50 -189 372
1363C72l92j45J74l6M18K41q10p4M1O02n84M84q47R35r08Q89q4p09N96l20P3J86
$$ 372 -20 -165 9 -27 391 632 -178 -252 -211 391 -193 291 -556 379 -529 360 276 -433 163 -157 -84 102
1385A02j20N5l1M0J97j05l57M59O6n55M62k77n0O5rK94k89J34N2k21k2K1J94k61
$$ 102 -18 37 6 46 243 138 -219 240 306 -249 213 -64 -114 -49 -58 236 -53 81 133 -88 -110 -89 105 -156
1409a56L35j31R1k66J52o1J4QQQpO8P1j82j28K59q2n2r7J82o2j11j40L99j86J9
$$ -156 179 48 139 -127 25 -36 -22 -14 -6 2 -5 63 134 -48 -176 83 1 -51 -148 34 -28 -139 -279 120 -66 -47
1435d7L18l49M65m65j15J88j20RL3Qj65J37K93K0k31Q5PN8l04J08o9Q2J39P0k30
$$ -47 271 -78 387 -78 -193 -5 -125 -116 -83 -75 -240 -103 190 210 -21 64 71 129 -175 -67 -136 -54 85 155 -75
1460g5J30j75J57l4J68q6j16K44n87L34NL0k26K32K36l38J41k5n6n3K52qjj67
$$ -75 55 -120 37 3 171 85 -31 213 -374 -40 -35 -5 -231 1 237 -101 40 15 -41 -94 158 150 149 -18
1484a8J96l69K83j96K40J28l03P2m10K22J43RQ1Q4j73K5Q2k01K61q0l12P8r0M36
$$ -18 178 -191 92 -104 136 264 -39 33 -377 -155 -12 -3 78 162 -11 14 96 -105 156 76 -236 -158 -248 188
1508A88n0m5L4j34Q8j69K1J52J7R0j97J42Mm0j82R5P6j26p5J91k41J91j31R1J15
$$ 188 138 93 127 -7 81 -88 -67 85 102 192 -5 137 141 101 -81 14 90 -36 -111 80 -161 30 -101 -10 105
1533A05j60O6j32j14L78k35K23j49M4j72J53l5j37J84k08O1R0J54M6j47J57j65
$$ 105 -55 11 -121 -235 143 -92 131 -18 26 -146 7 -28 -165 19 -189 -128 -38 116 162 15 172 7
1555Go5qm3J24J57k4l37J85p2O3L0q8j10J09OP3j67K15L2j75L02j62J63l46M5
$$ 7 -58 -66 -109 15 172 148 -189 -4 -76 -13 17 -71 -181 -72 -66 7 -160 55 87 -88 214 52 215 -131 -86
1580h6O9N2o3L55k21m1J05k27J52p9o6p3K87j88l22L03n9J70p1o1q5L22j66j67
$$ -86 -17 35 -28 327 106 65 170 -57 95 16 -50 -123 164 -24 -346 -43 -102 68 -3 -64 -149 173 7 -160
1604a60L00Rl18L4J88j22J45k44K55j17J7K0RM6l48K23o5J11k9J17Km0k46Q1J15
$$ -160 140 149 -169 -135 53 -69 76 -168 87 -30 -13 7 16 62 -286 -63 -128 -17 -46 71 73 33 -213 -132 -17
1629a7L5j73l5J60J86P5l73k3K56j15J51j24r3k4K0J22j88M0K5M54l02k81L59
$$ -17 18 -155 -190 -30 156 231 -142 -165 91 -24 127 3 -90 -114 -94 28 -160 -120 -95 359 57 -224 135
1652A35k29J59j65L47q9k33L21k62N5j26j29L15j56K14k89R9J21O2R9j56j65M6
$$ 135 -94 65 -100 247 158 -75 246 -16 39 -87 -216 99 -57 157 -132 -33 88 150 249 93 -72 -26
1674b6k14K04nj30K00r7j22L77n0k25K3o3k9j7Q2K96k06n4M7J47m6l8m27L59q9
$$ -26 -240 -36 -41 -171 29 -68 -190 187 137 -88 -65 -128 -157 -174 -92 204 -2 -56 -9 138 92 54 -373 -14 -103
1699a03R8J02j30o9j0m0J28o6K48J20m20L44l23K95j56J16l02Q7j1j28N2R9J55
$$ -103 -5 97 -33 -102 -112 -152 -24 -90 158 278 -142 202 -121 174 18 134 -168 -81 -92 -220 -168 -69 86
1722H6k32Q8J89p4P7Nj70Ml0j10K35j34K54l20Q1R6j88J57M9P8k74j06J36J15
$$ 86 -146 -58 131 57 134 139 -31 -27 -57 -167 68 -66 188 -132 -51 45 -143 14 63 141 -133 -239 -103 12
1746A2lp5K7L6k02J87m4M3OLJ56j39M8j66J32j67L6J86Jj75K60l12O5P7j0P3n2
$$ 12 9 -66 -39 -3 -205 -18 -62 -19 -13 -10 146 7 55 -111 21 -146 -110 76 77 -98 162 -150 -85 -8 -18 55 3
1773CJ47j84P0J1J49N3m27L35r5l59K22j62K7J88J23q9r6K8K8pj01K19J69m81
$$ 3 150 -34 36 47 196 249 -178 157 62 -297 -75 -237 -210 -22 101 12 -84 -56 -28 -35 -136 83 252 -229
1797b29L38N3N6r3j2j58o5M7J62j78N6j7J76j83J22O7k80L77m07M4M7K06j63K89
$$ -229 109 162 218 125 113 -45 -110 -63 99 -79 -23 -40 136 -47 75 142 -138 239 -168 -124 -77 129 -34 255
1821B55J0k58j96K67j21J89j5j6k53K53j24J95j68k7M7q2K6J26J04k32K3J42j60
$$ 255 265 7 -189 78 -43 146 131 115 -138 115 -9 186 18 -9 38 -44 -18 108 212 -20 3 145 -15
1844a5K36m5k33n2M5RL6j65L2J80R7kk20j6J44O4R5j03j49P2j6K9k08J64j11o1
$$ -15 221 176 -57 -109 -64 -55 -19 -184 -152 28 125 123 -97 -113 31 95 190 87 -62 10 -6 23 -185 -21 -132 -193
1870a93J63L74k28j40J48k87K46O6k16K87j69j17L97o8j29j01M6j37J60L4j63
$$ -193 -30 344 116 -24 124 -163 83 149 -67 220 51 -66 331 263 134 33 79 -58 102 136 -27
1891b7KQ3n7r2O0r6J21J09l66J19o4J15K92l58M9J80M3j96Q6j57K24L6k82K47
$$ -27 -25 58 1 -91 -31 -127 -6 103 -263 -144 -208 -93 199 -159 -110 70 113 -83 3 -154 70 106 -176 71
1915G1j09J74k88L7K72k03l6J51O0j44L50n44J04K03J1k1O2J5K0k68J28j78M44
$$ 71 -38 136 -152 -115 157 -46 -82 69 129 -15 335 -209 -105 98 109 88 150 165 185 -83 45 -133 311
1938C11l51L3J98Mj31j30K15Mj59M9r6k64K81j83K47J08k03J58j62R3K9l1RM7
$$ 311 -40 -7 191 195 64 -66 149 153 -6 43 -53 -317 -36 -219 28 136 -67 91 -71 22 51 20 29 76
1962G6n3j97M6K01L6j67J12p5J35k01O1k00L09M1j40J4O0o6l3N4J83k36J07j77
$$ 76 23 -174 -128 73 109 -58 54 -21 114 -87 -26 -226 83 124 -16 -2 58 -8 -41 13 196 -40 67 -110
1986a10mM3M0J05lOl4q3J2K5k33N1p6M07j28J26j43j03P2K60j62j12N21l83o0
$$ -110 -114 -71 -31 74 71 77 43 -40 -28 -3 -236 -185 -261 146 18 144 1 -102 -30 230 68 -44 477 94 34
2011C4n7j35K01R9k15J86j94M3k1Q2k95J92J80k55j2J50n7k58N88o1m63J79K65
$$ 34 -23 -158 43 142 -73 113 -81 -38 -59 23 -272 -80 100 -155 -167 -17 -74 -332 256 195 -268 -89 176
2034A76l09K18L4j44k9K01p4j05N9j6L0K25k05j81K45k91L4O0J7j8l4J64m4j88
$$ 176 -133 85 119 -25 -54 147 73 -32 27 11 41 266 61 -120 125 -166 -132 -72 -55 -73 -107 57 13 -175
2058a75K12J60k23qn9J32J7k15M76k14O7J0L0q1k51K4K32K0m06J27lj52K57n8
$$ -175 37 197 -26 -34 -93 39 56 -159 317 103 170 180 210 129 -122 -98 134 154 -252 -125 -128 -280 -23 -81
2082h1L17m24L88j44j46J80k49K11R8k56J02l08K18K2K82l33k74M50K8O8J3l17
$$ -81 236 -188 200 56 -90 90 -159 52 150 -106 -4 -312 -94 -72 210 -123 -397 53 81 149 162 -155
2104a55J58k66K12j9J33k91K31LJ46j02l3j23J67K1p4j26j6J24l3J92l53L56j42
$$ -155 3 -263 -51 -70 63 -228 3 6 152 50 17 -106 61 82 8 -118 -134 -10 -43 149 -204 152 10
2127A0k7l07Q6J84J5J6P9l43M01j33j3j28J89k36J36J91j50j4J27kj0K11l83R6
$$ 10 -17 -324 -238 -54 -39 -23 56 -287 114 -19 -32 -160 29 -207 -71 120 -30 -44 83 81 71 282 -101 -5
2151el5K27j52L6j89J84qj8k19O6O7r3Q0J29K1j33J95j26j08M9K12l34J97PN8
$$ -5 -40 187 35 71 -118 66 58 40 -179 -113 -46 -139 -59 70 91 -42 153 27 -81 -32 180 -154 43 50 108
2176A08n5j60o0L5J65kK74l75J4q9K86lj71k4j01K85l33N0K72j43J03j35l4J11
$$ 108 53 -107 -167 -132 33 31 305 -70 -56 -145 141 138 -33 -57 -158 127 -206 -156 116 -27 76 -59 -93 18
2200A8Ln0k18L18m5J6M4k28L65j06l6J0j60K62l62L74m42N04j7l19K67n3j00n3
$$ 18 21 -29 -247 71 26 42 86 -142 223 117 81 91 -69 193 -169 205 -237 267 250 -69 198 145 45 -8
2224hJ65j81J06o8RJ93k34Kj63P3m1L57r1j49J56k20j09K84k9J71n7k08J17L8
$$ -8 157 -24 82 14 23 216 -18 -16 -179 -106 -147 210 119 -30 126 -94 -203 81 52 223 166 -42 75 113
2248A13l7j01M3l3j46L19j78J14J7O0j93OQ2N7J02l63K49p7ol26L88k9k64J91
$$ 113 76 -25 18 -15 -161 158 -20 94 111 171 -22 -16 66 123 225 -138 111 34 28 -298 90 61 -203 -12
2272a2k61R1k7J93J07j29j66R8L70m45J39j99K37J08j01j57L46l54K54O8o0k05
$$ -12 -273 -182 -209 -16 91 -38 -204 -106 264 -181 -42 -241 -4 104 3 -154 192 -162 92 160 100 -105
2294a05r4K18k16K37R4j80r5N2OO1J85k94J62J25j02k43J9L02k05j65P3o5K57
$$ -105 -199 19 -197 40 134 -46 -141 -89 -83 -22 163 -131 31 156 54 -189 -170 132 -73 -238 -165 -230 27
2317B7k7J17o6R0l71J99J3L7J56l53O4K09k78J90J4n2P9Kj19J04j06j07J6j38
$$ 27 0 117 51 141 -230 -31 -18 19 175 -178 -114 95 -183 7 21 -31 48 50 -69 35 -71 -178 -162 -300
2341c00L14j2N2R3j56O1P6R8m35J20R0j78K90j03R8l0n4P3P0J34j78o9L6R0k04
$$ -300 14 2 54 147 -9 52 128 226 -209 -89 1 -177 113 10 108 78 24 97 167 301 123 54 90 180 -24
2366b4J62J5m2k4j14K33l61J48Q7n7n6k83K74R8M8j76K96k86K18m7k46J75n5j81
$$ -24 138 153 111 87 -27 206 -155 -7 80 23 -33 -316 -42 56 104 -72 224 -62 156 109 -137 38 -17 -198
2390a98L91j22p7n1j17J66n5L6J06k4k80J42Q1m5O3j03K29j85q7K00k36J42n5
$$ -198 193 71 -6 -57 -174 -8 -63 -27 79 55 -225 -83 -2 -47 16 -87 142 -43 -130 70 -166 -24 -79
2413g9K7K22j13j38J49j03l2J27k41J54k4R8p4Q4k57L03J13j93m1jR8j15rJ11
$$ -79 -52 170 57 -81 68 -35 -67 60 -181 -27 -51 47 -27 57 -200 103 216 23 -18 -19 79 -36 -45 66
2437F6o7n5P6r0K35Q4m00J24o5P1O4j2J86j32l01K55J11k86Q2L1R1M2J50j33l2
$$ 66 -1 -56 20 -70 165 249 -151 -27 -92 -21 43 31 217 85 -216 39 150 -136 -54 -23 68 110 260 127 95
2462I5k49J77q0J13k79J17O7N8K75k13N3l69L91k65J86j85L7O2kJ93j12k70L40
$$ 95 -154 23 -57 56 -223 -106 -39 19 294 81 134 -235 156 -109 77 -108 -71 -9 -11 182 70 -200 140
2485A40k92J62p6K01m3j6j11O0R0j57J67k10L53k40j08J80j65J34O3j07K60l22
$$ 140 -152 10 -66 135 92 76 -35 25 115 -42 125 -85 268 28 -80 100 -65 69 132 25 285 -37
2507c7j40K64J4k4n3j1J63n40L18Q5n9Mj10k9J54m28M20m9Ml5J30j08k5J00q8
$$ -37 -177 87 101 77 24 13 176 -364 -46 39 -20 -16 -126 -155 -1 -429 -9 -58 -54 -89 41 -67 -92 8 -80
2532h0j62K62j9q1P3r5K04N8j31r8j37L87j14j79Q5j8J35J51k49J10j85J39m3
$$ -80 -242 20 1 -80 -7 -102 102 160 29 -69 -206 181 67 -112 -27 -45 90 241 -8 102 -83 56 13
2555A3k11J51j3j74J80J77q1j40K19k16Lj38k6L79j28k63M51j23n5j98L99j34
$$ 13 -198 -47 -60 -234 -54 123 42 -98 121 -95 -92 -230 -256 123 -5 -268 183 60 5 -193 206 72
2577G2m0j5R2k58J54Q1k39L13L3j92o9KM6Q4RN2n7l0k20P1q6K56j27O4r1K55j31
$$ 72 32 17 109 -149 5 86 -153 160 193 1 -68 -66 -20 64 73 125 68 38 -182 -111 -197 59 -68 -4 -95 160 29
2604B9J06j0l3J1j87k0Q8J02rk2l17L71m7j84J41k3J19j13J50j88J36k69K23N
$$ 29 135 125 92 103 -84 -104 -16 86 77 55 -262 109 62 -122 19 -4 115 2 152 -36 100 -169 54 59
2628E9j39n1k6K98l35K43J63k33j11J44p8K85j24k13j71L70j68r9M95j50j22k21
$$ 59 -80 -131 -157 141 -194 49 212 -21 -132 12 -66 219 95 -118 -289 81 -87 -186 309 159 37 -184
2650a84K68r0o0l13L33j92K76n9J40r7K42l36K00J23k14k69K19J24j99j23J7K19
$$ -184 84 -6 -66 -379 -46 -238 38 -21 119 22 264 -72 128 251 37 -232 -13 111 -88 -211 -194 25
2672B5j02K90j3j83J01j94L9k37J87j00p3M50l69j38M00j28N2P9k94L42j36K58
$$ 25 -77 213 200 17 118 -76 -37 -274 -87 -187 -260 190 -179 -317 83 -45 7 86 -208 134 -2 256
2694B56m1o6k84K83j41j86m0L27r9N8R1P7l16P6J17j28J33j33k6O7j17R3m7j6
$$ 256 215 149 -135 148 7 -179 -219 108 9 67 158 235 -81 -5 112 -16 117 -16 -42 25 -92 1 -46 -62
2718f2L7L8j62J89m6p3P5Jk2J75j07l14K59J14mj06j11K0K55j8p6L1k32K11J4
$$ -62 -25 13 -149 40 -6 -79 -4 -3 -25 150 43 -271 -12 102 98 -8 -119 -99 156 138 62 93 -139 72 86
2743H6j20m3L27j33k39M1Q6R5j05n5Q3J11j5qk12N8L0J87j54n7J00J6j10o2PJ59
$$ 86 -34 -77 250 117 -122 -81 5 100 -5 -60 23 134 119 111 -101 -43 -13 174 20 -37 63 79 -31 -93 -86 73
2769G3L9n5J00l71K01J63mj94n5o8K74j54j58J67R8r2J09o6k49J68j3K26j53k2
$$ 73 112 57 157 -214 -13 150 146 -48 -103 -171 103 -51 -209 -42 56 -36 73 7 -242 -74 -87 139 -14 -36
2793c6R6j05K29k97M6R9P5j71k41M09o5k49M65k65R5l27L70l85J63J11R0n8K4
$$ -36 60 -45 184 -113 -67 32 107 -64 -305 104 39 -210 255 -10 85 -242 128 -257 -94 17 107 49 73
2816G3j32K00j77m9J35M3l5K48l05L1N4q1l3M1o7P1J00k13L5K5J92o5N7j46m5
$$ 73 -59 141 -36 -85 50 93 58 306 1 32 86 5 -28 13 -54 17 117 -96 -61 -36 156 91 148 2 -43
2841d3N4j33L51j9j82J6k88M04l59L63j97j2J52n1m6Mn3n4L19j44j0k69R2K02
$$ -43 11 -122 229 210 28 44 -244 160 -199 164 -33 -45 107 56 10 14 -39 -93 226 82 72 -197 -105 97
2865I7L3p3N3j68J10q0J92j69L24k31pp3r4J81j0j90J94J14m07m7L06j76P5P7
$$ 97 130 57 110 -58 52 -28 164 -5 319 88 81 8 -86 95 85 -105 89 203 -204 -251 55 -121 -46 31
2889C1j0j43m9OJ46J45j61p3K3j67N3K10n0J0j83J79Q7N3L4l63k3K65j16R8k7
$$ 31 21 -122 -171 -165 -19 126 -35 -108 -85 -252 -199 11 -39 -29 -212 -33 54 107 141 -222 -245 20 -96 2 -25
2914b5K55m02L6K42K31l77J16K96k81j52K6J21k23J15o6r0L05l8Q6k83J48j10
$$ -25 230 -172 -136 106 337 -40 76 372 91 -61 -35 86 -137 -22 -88 -178 127 89 175 -108 40 -70
2936g0Q9pJ0n5o7K26K6k86P7M6r5J94k4m3p3Q3om4j72K33j25J69j29j63L13J08
$$ -70 19 12 22 -33 -100 126 152 -134 -57 -11 -106 88 64 21 -52 31 25 -19 -191 42 -83 86 -43 -206 107 215
2962B15l06QK24q5j03j25J54n4J36n7MK72p7K40o59K77N5k27j0K94k65R5r1K8
$$ 215 -91 -83 141 56 -47 -172 -18 -72 64 7 11 283 206 446 -213 64 119 -108 -118 176 -89 6 -85 -57
2986e7O5O2J37q1LL8N2j46P7j68p7J16j7j6rJ31l39J99J28M5k42j2J11r0Q7Q3
$$ -57 8 70 207 126 129 167 219 73 150 -18 -95 21 4 -12 -21 110 -229 -30 98 143 -99 -111 0 -90 -3 80
3012H0j42n8J55j01p2K40j72j8J06M3n1N0q9j47J81K3l5LJ80l12M6p7L03j4l08
$$ 80 -62 -120 35 -66 -138 102 -70 -88 18 61 10 60 -29 -176 5 28 -7 -4 176 -136 -90 -167 136 122 -186
3037a86L39k88qK55n5N6l02K16KJ48j7l09L53l98J46K4J52l1J4j31K88j69j88
$$ -186 153 -135 -143 112 57 113 -189 27 29 177 160 -149 204 -194 -48 -24 128 97 111 -20 268 99 -89
3060h9M74l38J96k26r5K71J04j83j60J3K6J27j4k03J77j78q9J13L0P7J42m30Q2
$$ -89 385 47 243 17 -78 193 297 114 -46 -33 -7 120 106 -97 80 -98 -187 -74 -44 33 175 -255 -173
3083a73pJ35P2p0K0j63M2K39j4j55R3j24J44J13l11J40m0j6J74l6J94r5r0P0j65
$$ -173 -180 -45 27 -43 -23 -186 -144 95 81 -74 19 -105 39 152 -159 -19 -59 -75 99 63 257 162 72 142 -23
3108b3K05j25j30N3j29K13j68O8J02K11k06J57j54k09j9L53j27j6j00o0J14N2
$$ -23 182 57 -73 -20 -149 64 -104 -36 66 277 71 228 74 -135 -154 199 72 56 -44 -104 10 62
3130F2J0k30M9J16p4O0K01Nk39K14k80M3K2k54K46R3n2L25j47k55j62L86L2j68
$$ 62 72 -158 -109 7 -67 -7 194 199 -40 174 -106 -63 -41 -295 -49 44 -8 317 170 -85 -247 139 171 3
3154Cq5K3m6j86J77J88j87P1n3M4m4R1J28k89J04L19n14L26r2j09K1N0l6J47k35
$$ 3 -82 -59 -105 -291 -114 74 -113 -42 -95 -51 -95 -4 124 -165 -61 258 -256 70 -22 -131 -110 -60 -96 51 -184
3179a84L71j59m00K26J90k39J76j4N4j15J05k41K56j12N1Q4j16J76q2j27K0K22
$$ -184 187 28 -372 -146 44 -195 -19 -33 21 -94 11 -230 26 -86 -35 49 -67 109 27 -100 -80 142
3201A42j73J69j18P8L0o2k61m4J29K71k44J27n3p7K05k16K16j30Q8k68K43q1k22
$$ 142 -31 138 20 98 128 66 -195 -239 -110 161 -83 44 -9 -86 119 -97 119 -11 77 -191 52 -29 -251
3224b51K73j79k5M12p5j36k3L9m4R6N9k70R9P0k1N9j90K00m6Q8j15l6j42K04k37
$$ -251 22 -157 -182 230 155 19 -4 35 -9 87 146 -124 -25 45 24 83 -107 93 47 135 20 -16 -158 46 -191
3249a91R5J96j91J48p2q3J32J79k97Q5j64J57n0M4p9J73p5j0N6j44l0n8O2O8J6
$$ -191 -96 100 -91 57 -15 -98 34 213 -84 1 -163 -6 -56 -12 -91 82 7 -3 53 -91 -121 -179 -117 -49 -33
3274c3m6K02Kl7l08L03l7M8n2Lr3n1k8J9O4J03r6J77J80k57j95R0J98L9q7j87
$$ -33 -79 123 125 88 -220 83 46 94 42 45 -48 -99 -127 -108 -44 59 -37 140 320 63 -132 -42 156 195 108 -79
3300g9P7K8l8J34l24J13K34K6j17j23M10m25k96L90j25O7K9j30J52Q6j47Q8K5
$$ -79 -2 26 -12 122 -202 -89 145 171 54 -69 341 -84 -380 10 -115 -48 -19 -149 3 89 -58 30 55
3323E5j02q3J61J81k89O7P3k3L57l89J27l66J13J23K18o0j07J35m28J89L6J5n5
$$ 55 -47 -130 31 212 -77 -10 63 40 397 8 135 -231 -118 5 223 163 56 191 -237 -48 -12 3 -52
3346e2P5N6j60J6L3n7J69m69M75k80K97l2j74M34k11j18k03L50k47J77l94K18
$$ -52 23 79 -81 -65 -32 -89 80 -389 86 -194 103 71 -103 331 120 2 -201 149 -98 79 -315 -97
3368i7K0K01j73O6j38M3J16k9n2N0j17m2R3J75k76P8l3J07l7j95K50p6j03J6K02
$$ -97 -77 124 -49 17 -121 -78 38 9 -43 7 -110 -152 -59 116 -160 -82 -115 -8 -45 -240 10 -66 -169 -153 49
3393D9j26J81n5K72m56L78k67M5K1n4P7j14N5j31L91m34K59q1J87j92K6k9k7J19
$$ 49 -77 104 49 321 -135 243 -24 21 42 -12 65 -49 6 -125 266 -168 91 10 197 5 31 2 -25 94
3417I4j27J54l6l2j57O9k38K43L4k35J59O7q8j17J02K37q9K5m6L9n6K1o6J3J47
$$ 94 -33 121 85 53 -104 -35 -273 -30 4 -231 -72 -5 -93 -210 -108 129 40 65 19 58 2 23 -43 -30 117
3442A17K7j21P7K32n23m6L17P5o6k16J23O8l1j4j44n1L3K98m9p6J32N7j19J93
$$ 117 144 23 100 332 -191 -237 80 155 89 -127 -4 64 33 19 -125 -176 -143 155 106 30 162 219 100 293
3466B93j26m8p2k9j30n1J91n1p1J21O2r8J86l87J68o6k59O14k33j51J10j22p0
$$ 293 167 119 47 18 -112 -163 28 -23 -94 27 89 -9 177 -210 -42 -108 -367 247 14 -137 -27 -149 -219
3489b19K39o9R0k43J75R2N7k11k3J63K6q3k0m2j16J19K6N5J28NjJ1J14k84j49
$$ -219 20 -49 41 -202 -27 65 122 -89 -112 51 77 -6 -26 -68 -184 -65 -39 16 144 149 148 159 273 -11 -160
3514a60J04Q5j10K67j58l42L00j45QQ9m7J40K7j99L66j71k78L79j44J36Jk34j42
$$ -160 -56 29 -81 186 28 -314 -14 -159 -151 -62 -109 31 58 -141 225 54 -224 155 11 147 148 -86 -228
3537b28K78k58J51PJ60l7k16L17R7j98k66j6J80P9O9m35K73n8K69j24l01J96J13
$$ -228 50 -208 -57 -50 110 73 -143 174 271 73 -193 -209 -29 50 119 -316 -43 -101 168 44 -257 -61 52
3560E2j11j67M12l28J38J6PP6k3j26J24l87L20j37M6L10j22m6q5O2Q9r2N3P0j79
$$ 52 -59 -226 186 -142 -4 12 19 95 72 -54 70 -317 3 -134 -88 222 100 54 -31 31 120 28 81 151 -28
3585b8j97Q8M15l32k11K40m8M6k7l8J61j76p5J38J46j43J08j91R9J99j92J38k22
$$ -28 -225 -137 278 -54 -265 -25 -73 -27 -54 -92 69 -107 -182 -44 102 -41 67 -124 -25 174 -18 120 -102
3608a02J97N6r1j93N9J72j21k31K54n8J94j42r4J23q0l0J11r9K56kq6j16J06k08
$$ -102 95 151 60 -133 -74 98 -23 -254 0 -58 136 -6 -100 23 -57 -87 24 -75 181 179 93 -23 83 -125
3632a25L6J44l2J75k21M5l6o9J98j81j74J72q7P7j2J58j87J29Q2l09K67n2j85
$$ -125 -89 55 23 198 -23 22 -14 -83 115 -66 -240 -68 -155 -78 -90 68 -119 10 92 -217 50 -2 -187
3655a87L36q1j84J02J41k86K62r9o8K84k60qqK28k86J08k4k53J35K97k43K50M3
$$ -187 149 68 -116 -14 127 -159 103 4 -64 220 -40 -48 -56 172 -114 -6 -30 -283 -148 149 -94 156 199
3678A99k41K8j5MJ69j63J5j14Q2j19J57k32K33J0j22K3j48M58j81l4M4%j02O5
$$ 199 -42 -14 -29 -25 144 -19 -4 -118 -36 -155 2 -230 3 13 -109 -86 -234 224 43 9 53 53 -49 16
3702A6n8K48k43J89j60K0k0m5L84m62MM8j28J97j83k4K77L03l94P7J75j46M6k34
$$ 16 -42 206 -37 152 -8 12 -8 -53 331 -131 -127 -79 -207 -10 -193 -217 60 363 -31 46 221 75 121 -113
3726a13R6j0J13k22K08P9j59J05N3k47j3M12l04n9K50j92j14K17k11J46L6P3k7
$$ -113 -17 -27 86 -136 72 151 -8 97 150 -97 -110 302 -2 -61 189 -3 -117 100 -111 35 71 144 117
3749A17p9j13O7j9L1l2L5J64j24p3n7K14P6l28J04RQ6J88m31J19L02l38J52j71
$$ 117 38 -75 -8 -27 4 -28 7 171 47 -26 -83 131 207 -121 -17 -8 78 266 -165 -46 256 -82 70 -101
3773a01L4k53K32m0O7R0k2M9M1j83rO8K16j64J9k17J64L03k47J06q6j6Q8k64J88
$$ -101 -67 -320 -88 -128 -61 29 7 56 97 -86 -95 -27 189 25 44 -173 -9 294 47 153 67 51 139 -125 63
3798F3J5k51L21k10J1J15O6j93P8J08q8j07M3l8J43k32J68q7K52l83Q6J76P7J16
$$ 63 78 -173 148 -62 -51 64 130 -63 15 123 35 -72 -29 -67 76 -156 12 -75 177 -206 -120 56 133 249
3822B49k37L2P5j18J04J8j20%j39L09m2j98J09K9k76j00L94N0j81K06k45R2K23
$$ 249 12 44 119 1 105 123 3 3 -136 173 131 -67 42 71 -205 -305 89 139 -42 164 -81 11 234
3845B34k73K86k88jL3J22J27l59K75k21K82j63k24J41N6l32L25Ok8L9j23k7J51
$$ 234 -39 247 -41 -42 -9 113 240 -119 156 -65 217 54 -170 -29 27 -305 20 26 -2 37 -86 -113 38
3868C8j58Q5K2L56l19j15J60k09L17j93o2J27m5n25N78N5k43j4NL5q4J49p7J25
$$ 38 -120 -35 -13 343 24 -91 69 -140 177 -16 -78 49 4 -521 57 112 -131 -145 -140 -105 -189 -40 -117 8
3892HJ5k67M6KJ18J70K31l18K02K5j34j70J23j80J76L6m8J18L3j07R2j11q3M7
$$ 8 23 -244 -198 -196 -78 92 323 5 207 232 98 -72 51 -129 47 83 35 153 186 79 171 60 -23 24
3916B4k96N12j44j20j26K79jq9j33N6J02%p2j93K94j83k08nK97J9J92l50P2J44
$$ 24 -272 240 96 -24 -150 129 128 39 -94 -38 64 64 -8 -201 93 -90 -298 -303 -6 13 205 -145 -73 71
3940G1l27L20J51j0r6k65PL30k57J0L4q5L62k96L18m46N6J04Q2k77N06l21J0m8
$$ 71 -256 64 215 205 109 -156 -149 181 -76 -66 -32 -117 245 -51 267 -179 -123 -19 63 -214 292 -29 -19 -67
3964f7k7Q5J16K0l29J62j06J89j03R4j84K75k26J54j16Q9o0J31k69J30J68N5q5
$$ -67 -94 -9 107 127 -202 -40 -146 43 -60 34 -150 125 -101 53 -63 26 -34 97 -172 -42 126 181 96
3987I6j59j06J6lK18Rq0j49R8j77M55j31k6l58J91J70m68M43o2J08l1j03l18J72
$$ 96 -63 -169 -153 -156 62 71 -9 -158 -60 -237 218 87 61 -297 -106 64 -404 39 -23 85 54 -49 -367 -195
4011a95M25k74q9J80q5J7p7j57L53L8k01Nr4P2r4K52p2j1Kk0j74J2J86K94m54
$$ -195 230 -44 -133 47 -38 -21 -98 -255 98 136 -65 -60 -154 -82 -176 76 4 -7 -5 -25 -199 -187 -1 293 -161
4036a61J68r2m7M3J52k3j51K6J28o2o1J56p9j08O3j42K68k30J40K3j64J64k14
$$ -161 7 -85 -132 -89 63 40 -111 -85 43 -19 -80 76 -3 -111 -48 -190 78 -152 -12 11 -153 11 -203
4059b03R6M10m36J37j32J16K47j90q3MJ50j84l4J88OO0j33p2j8O2q9K30k65J44
$$ -203 -107 303 -133 4 -128 -12 235 45 -38 -34 116 -68 -102 86 92 152 19 -53 -71 -9 -98 132 -133 11
4083A1NJ36j03k73K91l07j6J15p7K87p6K24k16M5J29k83o4K28l6k11J37L12l02
$$ 11 16 152 49 -224 67 -240 -256 -141 -218 69 -7 217 1 46 175 -108 -172 56 20 -191 -54 258 -44
4106d4P2J65l8Rk41J81j69j1R6J9J43N2j84p8J3N8j72k7J15K75n53L21o8q9N1
$$ -44 28 193 155 164 -77 104 -65 -76 20 39 182 234 50 -28 -15 43 -129 -156 -41 234 -319 2 -66 -155 -104
4131a04M2J01M0n9J83m9k09J91j48O8J29k29m9K94j13n9p3l0J87L2m1k07J68j90
$$ -104 -62 39 79 20 203 154 -55 136 -12 56 185 -44 -93 201 88 29 -44 -74 113 145 104 -103 65 -125
4155a25k1J21J53Lj61J44j92N2K14l30J81o5O5k4P4k6l61J43K03J06k40L2K49
$$ -125 -146 -25 128 131 -30 114 -78 -26 188 -142 39 -26 39 15 89 63 -298 -155 48 154 -86 -54 195
4178A95k3j38j31J27L2k7QR0m89L13O4Pl2r6qJ54p9J6K08j24r7J0o5n8J35o1J45
$$ 195 172 34 -97 30 62 35 43 133 -356 -43 21 28 -4 -100 -108 46 -33 -17 191 67 -30 -20 -85 -143 -8 -69 76
4205G6L6l9l9%MK45j31l88L08j33o9R9P9Qj9k11P7K81k29j54K10j97p8M23k73
$$ 76 112 73 34 34 38 283 152 -236 72 -61 -130 -31 48 56 37 -174 -97 184 -45 -199 11 -186 -264 159 -114
4230a14K55q9P8nr2P7l9l1mqj00M5P8j56Q6K4R0j3N7mk64n1K37J3j46K4K79k9
$$ -114 141 52 130 125 33 110 71 40 36 28 -72 -27 51 -105 -19 5 95 82 139 135 -129 -180 57 70 -76 -52 227 198
4258A98j76r9J43L0p5j42OJ88m4J10l10R3R7J32j70J18j26k5J5pj43m0J94J51
$$ 198 22 -77 66 96 21 -121 -115 73 29 139 -171 -78 19 151 -19 99 -27 -52 -37 -44 -187 -227 -33 118
4282A18J35k02q5K51k29J09l28J17O5l4J2Q4k07J08J14p2%J21j19J18j37O6O5
$$ 118 253 51 -34 217 -12 97 -231 -114 -49 -83 -71 13 -194 -86 28 -44 -44 77 -42 76 -61 5 70
4305G0j12j42J97j38l6L42l85L58k56J95k42l7K99k25J26l5rL00m59l1J06R7p7
$$ 70 -42 -184 13 -125 -161 181 -204 154 -102 93 -149 -186 113 -112 14 -21 -30 270 -189 -220 -114 -17 -94
4328i4r9K13l3P5J8m5J01k51N09m72r4J62N3R3K28m01J09L06k59j3j00R6m9n8
$$ -94 -193 20 -13 62 80 35 136 -115 394 -78 -172 -10 43 136 364 -37 72 378 119 106 6 102 53 -5
4352ek5J60l09J57r0K55q0r5q7L4J67n1j5J8k35O7K66k76L17k9j81J85m4p7p6
$$ -5 -30 130 -179 -22 -112 143 63 -32 -119 -85 82 31 16 34 -201 -134 132 -144 173 144 -37 148 104 27 -49
4377d9J04N4l18J18L5J76j91k6MK47k46J18m8OO8j6j69O4J54j36n4K49ll22L49
$$ -49 55 109 -209 -91 -56 120 -71 -97 -93 154 -92 26 -22 -16 52 36 -133 -69 85 -51 -105 144 141 -181 168
4402A68j59J78l62R5K47k19m8K17l21L64k72N3N5j18P5K71k18P5O2j11J54k84
$$ 168 9 187 -175 -80 167 -52 -100 117 -204 160 -112 -59 -4 -122 -47 224 6 81 143 32 186 -98
4424i8N9o1K54k23p8N0OO1j9J8K10j76P8Qj41k6J18j07J86n6k81J31k22L37J9
$$ -98 -39 -100 154 -69 -147 -97 -91 -30 -49 -31 179 3 81 89 -52 -78 40 -67 119 63 -218 -87 -309 28 47
4449D7J24j13j56Q2oL11k30L1j82P1j84K47J91j12j45n7J69r5j68j2K07o2J02
$$ 47 171 58 -98 -16 -22 289 59 90 -92 -21 -205 42 233 121 -24 -81 88 -7 -175 -187 20 -42 60
4472F0k79J93Oo6K81k27k6o5M6L9N9L25l02j94K89l61L38J66j40j66K10j30J42
$$ 60 -219 -26 -20 -86 195 -32 -58 -123 -77 -38 21 346 44 -150 139 -222 116 282 142 -24 186 56 198
4495A98q7k23K55j31n8R0m9q8o9k5K70L5j20K2m1j34MK58J16l45J20J31k72J56
$$ 198 111 -112 143 12 -46 44 -5 -93 -162 -187 83 118 -2 20 -21 -155 -151 107 223 -122 -2 129 -143 13
4519A3k4k61J88LL10k48J10P5k47NM6j0j24P0J7N1K47k37q4K17m11L82o7J97k33
$$ 13 -11 -272 -84 -81 229 -19 91 166 -81 -76 -30 -40 -164 -94 -77 -26 221 -16 -100 117 -294 88 21 218 -15
4544a5m00M19q2K3L0k2J39JnJ47k08j10J23J44j01j36r5K04M6r0j79J64O6q5j3
$$ -15 -415 4 -78 -55 -25 -47 92 93 88 235 27 -83 40 184 83 -53 -148 56 102 12 -167 -3 63 -22 -35
4569c5o6J73j76j23K77j51P9oq7J06R6o0q9J56j5J33j04k72K75q0j88J22K65k39
$$ -35 -101 72 -104 -227 50 -101 -22 -28 -115 -9 87 27 -62 94 79 212 108 -164 111 31 -157 -35 230 -9
4593iQ1O2Pj73P7M4o4j22j17Q9J48J66k96J20j31M5J2k8R4p3k8N8J48q1n7n8K76
$$ -9 72 134 141 -32 45 89 25 -97 -214 -125 23 189 -107 13 -118 -73 -61 -89 5 -68 -96 -38 110 29 -28 -86 190
4620A90k23J09p8l48K63J82l48L56LR5j32M9N5j48l2oj47oJ93p1K22m83J99K00
$$ 190 -33 76 -2 -350 -87 95 -253 103 106 201 69 118 173 25 -7 -13 -160 -166 27 -44 178 -305 -106 94
4644I4j76M5K18j05J53l4n0O0k03L45k24p5O1j92J48l03M47j66j88J85M8m5p1
$$ 94 -82 -37 181 76 229 195 145 205 2 347 123 48 109 -83 65 -238 209 43 -145 40 88 43 -28
4667b8mL2l1K22p8k59K15K0P8k31J26Nm9j97K47J00k16J32O3j6j17j08K56j43
$$ -28 -32 0 -31 191 113 -146 69 89 167 -64 62 67 18 -179 68 168 -48 84 147 131 14 -94 162 19
4691A9L5%O5k67J08j84M62j53lN9p5r1J08q1j12L22j80j29rJ53k22L3K78k64J58
$$ 19 54 54 119 -148 -40 -224 238 85 82 141 66 -25 83 2 -110 212 32 -97 -106 47 -175 -142 136 -128 30
4716C0o8M5K22j82J35l19N7m4K43j45kL5j39K44j74j1j00J11K3O6l26K55J70j90
$$ 30 -38 7 229 47 182 -137 -80 -124 119 -26 -28 7 -132 112 -62 -73 -173 -62 -39 27 -299 -44 126 -64
4740f4K44k05J65j27N2j3m0k45L07%K7j4J11j92J36j40Jj02N4k00L45L2k16J50
$$ -64 180 -25 140 13 65 52 12 -233 74 74 101 87 198 6 142 2 3 -99 -45 -245 100 132 -84 66
4764F6J28J02k31L4n8l51L43J2J47j36n6j3J3R2k43L91l90K16p8R1j86K28m23
$$ 66 194 296 65 99 41 -310 33 45 192 56 0 -13 0 92 -151 240 -150 66 -12 79 -107 121 -302
4787c02K79J22k95M09k19k7j1K19k65N3K9jQ5R0k09p4Q5K9n8M0p9j87M22r4J23
$$ -302 -23 99 -196 213 -6 -33 -44 175 -90 -37 -8 -9 76 166 -43 -117 -32 -3 -61 -21 -100 -287 135 41 164
4812A64L1j8k39j55M14l76L40j3r2j6R1r6J93q1j61n6j3N2k68M47k53L11k57K9
$$ 164 195 177 -62 -217 197 -179 161 148 56 40 131 35 228 147 -14 -70 -83 -31 -299 148 -105 206 -51 -22
4836b2K80l41J81M2j21q8R6j06J38Km0j48o2K15j05Q4J04j80q0O2K8J03o2l8k32
$$ -22 258 -83 98 140 19 -69 27 -79 59 61 21 -127 -189 26 -79 5 109 -71 -151 -89 -61 42 -20 -58 -290
4861b90M14j67j32J33j72L33l12L59j39O8q1k78L43J8No5J69o4k73R4Q2K8O4k02
$$ -290 124 -43 -175 -42 -214 119 -193 166 27 95 14 -264 79 97 102 37 206 142 -131 -37 45 73 137 -65
4885f5J30J84l64J76L9p3k6o8J61m9J08k55L54j87j90J0J31K49l59J63j90K3J77
$$ -65 65 249 -115 61 100 27 1 -67 94 45 153 -102 252 65 -125 -115 16 265 -94 69 -121 -98 79
4908G9K47k90j77J26j19p0M4L89k20o6j8j6p0K03Q5K7k21j4Qm3p9K87n0K0j05
$$ 79 326 36 -141 -15 -134 -204 -160 229 9 -57 -75 -91 -161 42 127 154 -67 -81 -73 -116 -195 92 42 62 -43
4933d3Q7j58J29j99L82J21m27J14l6n6K11j3j59J31k06K87j05J4j73j11L08J82
$$ -43 44 -114 15 -184 198 319 -108 6 -30 -86 125 112 -47 84 -122 165 60 74 -99 -210 98 280
4955B80l28J43j94o9L23o2J83j74k48J77N8o5k26K79j81J99l08N18l82o1J85M0
$$ 280 -48 95 -99 -168 155 93 276 102 -146 31 89 24 -202 77 -104 95 -213 305 -77 -138 47 87
4977H7J27k5r5m5p3K4o0K29k93K41r0p5J7j00J74J03m4J54l73p3K31Qm9j78J76
$$ 87 214 189 94 49 -24 0 -60 169 -124 117 27 -48 -31 -131 43 146 102 256 -117 -190 41 49 0 -178 -2
5002bJ41j09j06j33K66j77Q9J97p2r8j31L05k03Q4K23k73J29l07L75J31k74M8
$$ -2 139 30 -76 -209 57 -120 -31 166 94 -4 -135 170 -33 51 274 1 130 -177 198 329 55 103
5024A03j08m9J69J83k09p1p7J15J02l66J23O0k8L42l66j91Q6J58k23K33o7P3J59
$$ 103 -5 -54 115 298 89 18 -59 56 158 -208 -85 -25 -53 289 -77 -268 -182 -24 -247 -14 -81 -8 151
5047A51k10k07L51l03K99J33j92O4j03l09K93R3j74L9J44j20j7J08N8j22J23j30
$$ 151 -59 -266 85 -218 81 214 22 86 -17 -326 -33 60 -114 -75 69 -51 -68 40 98 -24 99 -31
5069c1J42k90Q8j03J22R5jL0m3r0J22N3r8J52l53P4K74K3k83J33r4Q6O7n8o6m2
$$ -31 111 -179 -91 -194 -72 23 22 52 9 -81 41 94 -4 148 -205 -131 143 166 -117 16 -78 8 75 17 -49 -91
5095i1M2J05J79k77J36j1M4j59N5j38R4J33j49L8J26j13N6l61L39m4j39Q3Qj33
$$ -91 -49 56 235 -42 94 83 127 -32 23 -115 -21 112 -37 1 127 14 70 -291 48 4 -135 -52 -44 -177
5119a77M82k92r8K46j93P9j68N9L9J23Mk6j35OJ50r7J78n1j61O6k8Q7k82J08M1
$$ -177 305 13 -85 161 -32 47 -121 -62 -23 100 104 78 -57 -51 99 2 180 129 -32 34 6 93 -189 -81 -40
5144d0J31o5m5nm6p9J17M6p7JK08k20j25K20Pj76Q5j2J67J55j64j10o5J73l38
$$ -40 91 26 -19 -24 -70 -149 -32 14 -63 -62 146 -74 -199 21 28 -148 -63 -75 92 247 83 -27 -92 81 -257
5169b57K98M5q7J57j47J0j85L67r0l7o6K0R2k21N0p2n8L45j85j7n5l2Q6J00j62
$$ -257 41 86 -1 156 9 19 -166 201 111 74 8 28 120 -101 -51 -123 -181 164 -21 -38 -93 -125 -39 61 -101
5194a01Q7K33j38r8P8j85J7K88k05K19k20J3p0J17K4J7j38n3K58j92N6J39L5k40
$$ -101 -14 219 81 -17 61 -124 -107 181 -24 195 -25 -12 -82 35 59 76 -62 -115 143 -49 7 146 181 -59
5218e9J31j84J59J42k0j55j49K04J11j74j57K13j4j73r4Q8J85j76m4L40k44M3
$$ -59 72 -112 47 189 169 14 -135 69 180 6 -151 62 48 -125 -219 -131 54 -122 -166 174 -70 -27
5240b7J38p9L1o0J10N5j30o1L4p9L82k56Nr7J18o0J09j10p6M8j77J29k57J64J76
$$ -27 111 32 63 3 113 168 38 -23 11 -68 314 58 63 -34 84 24 133 23 -53 -5 -182 -53 -310 -146 30
5265C0j6j17j20J18M1J82j24j26n4K72j71O5L7m1J19j29J10K32k31m3M04o72L10
$$ 30 14 -103 -223 -105 -64 118 -6 -132 -186 86 -85 -20 17 -24 95 -34 76 308 77 34 438 -234 76
5288G6K1JM9k51J51k01j7J12L7J47k22J55m3j8J0J7k8J58m02L72j75N2k0r5R4
$$ 76 97 98 147 -104 47 -154 -171 -59 -22 125 -97 58 15 -3 7 24 -4 154 -248 124 -51 1 -19 -114 -20
5313b0K6L0Kj34R9j89J65J29mJ47m50K73m5m1L62l29P7R3j13j14r4j65K02J36
$$ -20 6 36 38 -96 3 -186 -21 108 104 251 -199 74 29 -12 350 21 98 191 78 -36 -130 -295 -93 43
5337D3r9Jj74O5K27J03j29P6j34P4k3l1L29j17j12o1J95n7j97J12N3k43J94j01
$$ 43 -56 -55 -229 -164 63 166 37 113 -21 53 30 -1 328 211 99 38 233 176 -21 91 144 -99 95 -6
5361fJ71m3J20j61j00j73m9L77JR8j03p3j08n0j58L35p3J58l3j66L31k92K0q6
$$ -6 165 122 242 81 -19 -192 -241 136 137 235 132 59 -49 -99 -257 78 5 163 130 -36 295 3 23 -63
5385f3R3J0n3J20p1j6p6J51k62K85q2P0m3k50K85j85J40j91o5K84L4q1j54O3K46
$$ -63 30 40 -13 107 36 20 -56 95 -167 118 36 106 63 -187 98 -87 53 -138 -203 81 115 34 -120 -57 189
5410A89k65L04l33J69k10K57q3K58j72k15K82j61J49K5j11l04J15j26K34J69j94
$$ 189 -76 228 -105 64 -146 111 28 286 114 -101 181 20 169 194 83 -221 -106 -232 2 171 -23
5431b3J19M0j31Q8k72K89k80J31p9J32P6Rk7o1R2j97p0J09J29r7K0j61O5j33K39
$$ -23 96 136 5 93 -179 110 -170 -39 -118 14 90 99 72 11 103 -94 -164 -55 74 -23 -3 -164 -99 -232 7
5456Gj74K06M5NPj04j20K05M8m6Lj77J65j31Q5n4J57K8j30K10l07M5j7M9p3j46
$$ 7 -167 39 84 89 96 -8 -128 77 125 79 82 -95 70 -61 24 -30 127 155 25 235 -72 -27 -44 5 -68 -214
5482b14J49N4J7j10P1K53j08l7M5P2j57j05J13o4j01J03j5k3o8J64k75K99n4L0
$$ -214 -65 -11 6 -104 -33 220 112 75 120 192 35 -70 43 -21 -122 -19 -34 -57 -125 39 -236 63 9 39
5506C9j46p5J27J77k33K24j31n4J40r3l8m7J4K10j10J39k61K1M04l39J03M3K25
$$ 39 -107 -182 -55 122 -111 113 -18 -72 68 -25 -63 -110 -96 114 4 143 -118 -97 307 -32 71 114 339
5529C39j92l09L07k07j66O4o0L27j46J82j53k0J2K18j67n7m1qM4M8rR1ok72K40
$$ 339 147 -162 145 -62 -228 -164 -224 103 -43 139 -14 -34 -22 196 29 -28 -69 -77 -33 15 6 97 91 -181 59
5554E9j81L22k7j37N4j34Q2j98K99l16K94o1p6M4k56J90n1j50L46j14jj01J24
$$ 59 -122 200 173 36 90 -44 38 -160 139 -177 117 56 -20 24 -232 -42 -93 -243 103 -11 -12 -113 11
5577A1R8k00j32J88K5M6n7j77J16j42L68k22L8Qj90M63k34k24J82j63J59N9m9
$$ 11 109 -91 -223 -35 -10 36 -21 -198 -82 -224 144 -78 -40 -32 -222 241 7 -217 -35 -198 -39 20 -29
5600b9r6N3m0K18j21L5n3jP8n9J02M5m0Q6q5j01k6j92J43J63Qj78K91m54K59J18
$$ -29 -125 -72 -112 106 -15 20 -33 -34 44 -15 87 132 92 178 93 -8 -34 -226 -83 80 88 -90 201 -253 6 124
5626A24o9j14M1j15R6J74j14J18m1q4J51Rk19l0J72j48l3L5N6o9K65Jk21P6p8
$$ 124 55 -59 -18 -133 -37 137 23 141 100 16 167 176 -43 -73 99 -49 -82 -47 9 -60 205 206 -15 61 -17
5651a7j02R9K39l14O3K25l15k3J01O5J79j75j5j40K89j18K4k53P3K90j08j76j91
$$ -17 -119 -20 219 -95 -32 193 -122 -145 -44 21 200 25 10 -130 159 41 65 -188 -115 175 67 -109 -300
5674c00J14K67j49J48K5j13j43p9J64O4K56k49p6K33k04K19l15o5L05j85L83k53
$$ -300 -186 81 -68 80 105 -8 -151 -230 -66 -2 254 5 -71 162 -42 177 -138 -203 102 -83 300 47
5696D7k07K71j66K40n6k58J26R2k6N9J08k90J41r1K7L4l15L30j59J06j42L16l98
$$ 47 -160 111 -55 185 129 -129 -3 89 63 122 230 -60 81 -10 17 51 -264 66 -93 13 -129 187 -211
5719b11K27J82k89N9r8L51j30Lk21L52k24J28K3k89K39l3o6R7M0k07J61j65J75
$$ -211 16 198 -91 -32 -130 221 91 94 -127 225 1 129 152 -137 102 69 3 100 140 -67 94 -71 104
5742A04J43ql03pL0N9j6K6j07J4Q4j14J66p2m1J80k86J89q7QP2J5M1k58O1j7L12
$$ 104 247 239 -64 -71 -41 18 2 28 -79 -65 19 -95 71 -1 -42 138 -148 41 -46 -38 34 49 90 -168 -107 -124 188
5769A88k81K7J08J29J9j01j55J70j92K30l38K03j58K52k1j97O2M5j1r2J73J83
$$ 188 -93 -66 42 171 190 89 -66 104 -88 142 -196 7 -151 101 80 -117 -55 -10 -21 -113 60 243
5791B43k18J33k38l1K86P4l12N2K4J21RJ4k04L25n29Q5M7J30lJ61j33R9j28R9
$$ 243 25 158 -80 -111 175 249 -63 -11 13 134 143 157 -47 278 -251 -166 -119 11 8 169 36 135 7 106
5815A06j63j78L55k05J84l6j26L8K40k20O2r7p6k2J11l8Q4K41k13n8Q7o6P5k59
$$ 106 -57 -235 120 -85 99 63 -63 -25 215 -5 57 -40 -116 -138 -27 -65 19 260 47 -11 76 10 85 -174
5839a74K53j93K14m0l2J36r0j51J74j25J24j90O4j85L49m5p3P6j05n3J11K95l34
$$ -174 79 -114 100 60 28 164 74 -77 97 -28 96 -94 -30 -215 134 89 16 92 -13 -66 45 340 6
5862FM0L25l93r7K08pJ2p8j24J97K02l29R9j11p4J14j59J12K01j55L5j23J93q
$$ 6 46 371 -22 -119 89 82 94 16 -108 89 291 -38 61 -50 -124 -10 -169 -57 144 -11 24 -99 94 86
5886H6n0R6k07J10J38j00JRj64K0J86j34n0J3Q5L2O7J03m02J88L8k31L74k89q5
$$ 86 36 132 -75 35 173 73 74 83 -81 -61 125 -9 -59 -46 39 71 138 241 -161 27 65 -166 208 -81 -166
5911a66j41K06Q4MK02p7m31N31k23k5J53j00q2j08J4l5J20R6k46oJ45J36N5k0
$$ -166 -307 -101 -17 -13 189 112 -319 212 -11 -36 117 17 -65 -173 -159 -194 -74 22 -224 -230 -85 51 106 86
5935H6n3j74Q9K63k68LqJ13Q4M4k72k3J55j60O6J42j6mL1j53J33K03k36k20J21
$$ 86 33 -141 -52 211 -57 -54 -62 51 135 179 -93 -116 39 -121 -55 87 71 67 98 -55 78 281 45 -175 -54
5960e4m2j34L87j40j58n2K50l49J57N8p1K49p2p7o1j63O9K68k60L97j62p6O4j45
$$ -54 -96 -230 157 17 -141 -193 57 -292 -135 -77 -148 101 29 -48 -109 -272 -203 65 -195 202 40 -36 28 -117
5984a17K02j39j14M1J37j8l04L47L3O9l06J28K57k81L04k14n7l2J79Q3k68p5K86
$$ -117 85 -54 -168 -127 10 -8 -312 35 68 137 -169 -41 216 -65 239 25 -32 -64 115 198 -70 -145 141
6007A41k21J51k4j01r1K08nj26J5N4j09J23J4R7j69O1q8L5j4l4J31j47L60k46
$$ 141 -80 71 47 -54 -145 63 58 -68 -53 1 -108 15 29 126 -43 18 -70 -35 -49 -83 48 -99 261 15
6031A5j27J89kj69p6R5l3J16N4J7J26k73J86lj48j59K02k60J97J19l4%J20r2j61
$$ 15 -112 77 75 -94 -170 -75 -108 8 62 79 205 -68 118 115 -33 -192 10 -250 -53 66 32 32 152 60 -101
6056a01j23M00k77J21p0N5L7j4j5M7j20j20J0M0J47l8k22O8J86m2J78j41Q7p2
$$ -101 -224 176 -101 20 -50 5 42 28 13 60 -60 -180 -170 -130 17 -21 -243 -175 11 -31 147 6 93 21
6080B1J21j40j6J61r0nj52N4J33l54K22l1M6K63j92k3j13J68j61o1K31m5J74l11
$$ 21 142 2 -14 147 57 52 -100 -46 87 -267 -45 -76 -30 233 41 18 -95 73 -88 -149 82 37 211 -100
6104a00nr4M64n08K55j2j63J85J79j36k12K22l3J3M0o5k0o0Q6J97m52M6L19k63
$$ -100 -105 -199 265 -243 12 0 -163 22 201 65 -147 75 42 55 95 30 10 -50 36 233 -219 -173 146 -117
6128a17J3K6K80m34K50K3j04M3J21k88l7Q6k3J20rQ2k24mL85j83k27K86q1K73
$$ -117 -104 -78 202 -232 18 41 -63 -20 101 -187 -224 -138 -161 -41 -50 32 -192 -196 189 6 -221 65 -16 257
6152B57r3k18J2R8k26N00k05J43rk04l03L02J36o3k53L66p5l68J41q6N5j8J18
$$ 257 164 -54 -42 56 -170 330 125 268 259 55 -248 54 190 127 -126 240 165 -203 -62 -148 -93 -111 7
6175GJ09j90O9L07k49m9Q4J2l3n0jm8N7K3j18J90Q0k57m2P6jj32K44Nj08M6j8
$$ 7 116 -74 -5 302 53 4 88 100 67 17 16 -32 25 48 -70 120 200 -57 -99 -23 -24 -156 88 93 -15 31 13
6202A3Q8Q8k41J5L0O8j03m1n3J79r3J07J35j59j27L81k29M6k20K19K90l49L4J9
$$ 13 101 189 -52 -37 -7 61 -42 -83 -136 43 -50 57 192 33 -94 287 58 104 -116 103 393 44 78 97
6226I7j03N7k3J1J77l28K46j19j32R0M2l5J28L39k61j19k24K37k81J77j30K77
$$ 97 -6 51 28 39 216 -112 134 15 -117 -27 15 -20 108 447 186 67 -157 80 -201 -24 -154 123
6248A23k98J77j4p6J49n3N3k80NK58N6k22K02k64K42p7L2j13L3K36l04m9K61j8
$$ 123 -175 2 -12 -88 61 8 61 -219 -214 44 100 -122 80 -184 58 -19 13 -100 -67 169 -135 -184 77 59
6272E9J7k83J52J32o4p2J78j46Q1j64j83L50pJ68k22j61J55J28k41P9K05r4n2
$$ 59 76 -207 -55 77 13 -59 119 -27 54 -110 -293 57 50 218 -4 -165 -10 118 -123 -44 161 67 15
6295A5K9m9j2j67M4J74lJ3k06L65k11K14j55j25l2K17n1K22k73q8j21K67k18K30
$$ 15 44 -5 -17 -184 -140 34 31 44 -162 203 -8 206 51 -74 -106 111 60 282 9 -79 -200 67 -151 79
6319G9N2k53K46J6l07J23J02R8k18l0J24K48l07J70k18J62j41k6P2k10J92j52
$$ 79 131 -122 124 140 -167 -44 58 156 -62 -92 32 280 -27 143 -75 87 -54 -80 -8 -218 -26 -178
6341a78J86j05J02q9K32j8j41j29O4J91k34L49l61P1K66n6k44l5J1n8L07nj27
$$ -178 8 -97 5 -84 148 130 -11 -140 -76 115 -119 230 -131 -60 206 150 -94 -129 -118 -176 131 126 -1
6364aJ42k83K50j6j36J46q4r6K1Q9m7J39l37L21M1l27J95pJ1O0L8j83K02J87m29
$$ -1 141 -142 108 92 -44 102 18 -78 -57 32 -15 124 -213 108 149 -178 17 10 21 81 119 -64 138 325 -104
6389a04J84m5R1k9k97K68j68J15Lj34L37M9n35K01P5j69K00M6M7K31l41j23K65
$$ -104 80 35 126 97 -200 68 -100 15 18 -116 221 270 -265 -64 11 -158 42 88 135 366 25 -98 167
6412A67k43k3J57l4k91K50j25Q4%N5O9j13K42k42K9J48q3l9R1k81K43Nm4j0j18
$$ 167 -76 -99 58 24 -267 -17 -142 -58 -58 -3 66 -47 195 -47 -18 130 47 8 99 -182 61 66 22 12 -106
6437a06J70k82M80m34K72k26J10N0j87L17j35J25j00j6l5j18O1j1O8n8j7O6k02
$$ -106 64 -218 262 -172 100 -126 -16 34 -153 164 29 154 54 38 3 -115 -54 -65 3 -55 -72 -6 -208
6460b08J62J41k23K89j96p3kK80j25k18M69m38N3K49j55k20N1lK17q3N5l42M61
$$ -208 -46 95 -128 161 -35 -108 -110 170 45 -173 296 -142 -89 160 5 -215 -164 -167 50 -33 22 -320 141
6483A41j09l4J0J29n8j20J75m27M83k85K24l65M34l5k84j23M01k48J70l22K60
$$ 141 32 -2 8 137 79 -41 134 -293 190 -95 129 -236 198 163 -121 -244 157 -91 79 -243 17
6504A7pkq5J88n2N1j1r6K8r3Kn4L12kj77o0R6l1Q1P4j19n9n7p0K18j62J37j97
$$ 17 10 8 -77 111 59 110 99 3 31 -62 -60 -114 198 196 19 -41 55 24 105 179 60 1 -56 -126 92 -70 67 -130
6532a30J77Q8k14P3k20J93Q8k66K32O3Mj18pK49j31q4J81l25J34j89J64j11J85
$$ -130 47 135 -79 -6 -226 -33 55 -211 21 84 88 -30 -37 212 81 -3 178 -147 -13 -202 -38 -149 36
6555C6j33J32k9M5J86n7j2j15N5k21J44L0N6J17n7m14J96J41j36o8J22nQ3k33
$$ 36 -97 35 6 51 237 180 168 53 108 -113 31 61 117 234 177 -237 -41 100 -36 -104 18 13 96 -137
6579a37J31M3j2M6l01L09r8O8J83j48l4q3j14J03n8J96L8k24K74j11l7L57m79
$$ -137 -6 37 25 71 -230 79 -19 49 232 84 50 -33 -147 -44 -102 94 132 -92 182 71 34 391 -88
6602h8M3j52K12k19O0J31N8M6j14o7q7N53k91k56J1J88l5j08K84l7n4l1j44K07
$$ -88 -45 -197 15 -204 -144 -13 45 91 -23 -90 -177 376 85 -171 -160 28 -7 -115 169 132 78 47 -97 110
6626A10m7k0K04o37N40k07O9J54k65O8J67j12J30j56j54J0J47j1o6R6KJ14k12
$$ 110 63 43 247 -390 150 -57 12 166 -99 -31 136 24 154 -2 -156 -146 1 -10 -76 20 22 136 -76
6649g6r6O8J02R9k2N7k09J36q4P1k03J90p4k27K68J54j10J41o4k1K10l64p6R6
$$ -76 -172 -104 -2 97 75 132 -77 59 -25 46 -157 33 -41 -268 0 154 44 185 121 100 310 -54 -130 -34
6673c4J80j10o8q0J08J14j77J53j08n0L3J29j67J02j07J72j79J75r1j25K49p1
$$ -34 146 36 -32 -112 -4 110 -67 86 -22 -72 -39 90 -77 25 -82 90 -89 86 -5 -130 119 48
6695D8lJ2j52J93j84M2q3K3P7k54L35l5M0k31K23k47Q5K17J17j70Kl8J1J11j97
$$ 48 45 57 -95 98 -86 -44 -127 -104 -27 -281 54 19 59 -172 51 -196 -111 106 223 53 55 17 28 139 -58
6720e8M5j01J22j04o3J71J4J07k4k21J21P3l6J67k79K0K51k80J93k14K6j33K60
$$ -58 -13 -114 8 -96 -159 12 26 133 109 -112 9 82 46 213 -66 -46 205 -75 118 -96 -70 -203 57
6743E7j63k04O44k40j06n3K4Q3JM7K9j20j31K92j48L2N4q9K1q0J20N3n3j87k5
$$ 57 -106 -310 334 94 -12 -65 -41 42 43 90 119 -1 -132 160 12 44 98 9 30 -50 70 123 70 -117 -142
6768a42K8k0J60j1j1L0k30J57Qj99L16rj91p2K88l86K89O8j58m4K04o4j0K0L64
$$ -142 -114 -134 26 15 4 34 -196 -39 -31 -230 86 77 -114 -186 102 -284 5 73 -85 -129 75 11 1 21 385
6793C85m66K39J35n20Q7J15L6q6k21N05l8j31R8l26J71m3o5L0K85n4M6q0n7r3
$$ 385 -81 158 293 -227 -140 -25 11 -75 -296 209 171 40 138 -188 -17 -60 -125 -95 190 136 182 102 45 -48
6817d8N7J02l06K52q8K77j17k1m6j0L8L9P5J5j46l1p5n0Q6N8P9k36K0Q0J57j79
$$ -48 9 111 -195 57 -31 246 129 108 62 52 90 129 204 219 73 42 -33 -83 3 61 140 -96 -76 4 161 -18
6843a8J86l39K74%m2J29J17k97J38rk94P7o7L37k02N3o2K96j86M6j72J68l25J42
$$ -18 168 -171 103 103 61 190 307 10 148 139 -155 -78 -145 192 -10 43 -19 277 91 137 -35 133 -192 -50
6867e0R5k59K87j13l3J03rQ2q5j91N2K08j11p2M01j96j14K89l15J09r2o2Q1J33
$$ -50 45 -214 73 -40 -73 30 21 103 18 -173 -121 87 -24 -96 305 109 -5 284 -31 78 -14 -76 5 138
6891A38j79K25k44N3K25j70P7o1k87j59O51k21j9J04k38r2K49j81J80j45K05K71
$$ 138 -41 184 -60 -7 218 48 125 64 -223 -382 269 48 29 133 -105 -197 52 -129 51 -94 111 382
6913C82l43p3k32J75R4Q4k95M11k40j91L87j82PJ94m0j33k6K7k22J51J92M7n3
$$ 382 39 -34 -266 -91 3 87 -208 203 -37 -228 159 -23 -16 178 138 5 -21 6 -216 -65 127 174 121
6936A21l4o8r3m2j51K25m5J0J8L7J50j02j72qJ70k83J80L5n9J11j59K26J27m02
$$ 121 87 19 -74 -116 -267 -42 -87 -77 -59 -22 128 26 -146 -154 16 -267 -87 -52 -111 0 -159 67 194 -208
6960b08L87m24Q1J14K43m1j21k9L0n0k31O8K18j67j54J13K85j71N0P1k51K38j2
$$ -208 179 -245 -164 -50 193 152 31 2 32 -18 -249 -181 37 -130 -284 -171 114 -57 -7 64 -187 51 39
6983C9j03m0J92m36K74l4J46k48K06R5k00J11J42k26KL2om9P9M21n32J07Q9l8
$$ 39 -64 -104 88 -348 -74 -108 38 -210 -4 91 -109 2 144 -82 -80 -48 -54 -103 -24 397 -135 -28 61 23
7007B3JJ08J14j81l18K48j37J11R0j9J8LJ35n00M34k28J15k0j2j43J60K03O3k60
$$ 23 24 132 246 65 -253 -5 -142 -31 59 40 58 61 196 -304 130 -98 17 -3 -15 -158 2 205 268 8
7031Hk24K82l1l2q0K02j08J98o5p3j27K01k21m0L83l77k21K34J42m0J22j86K6
$$ 8 -216 66 35 3 -77 125 17 215 150 77 -50 151 -70 -110 273 -104 -325 -91 51 11 133 -53 -27
7054b7n1L84k82j2P2L2J31q6J53n94L03r6m3K6M3n5m5M18j27l09K18Pj77J86N6
$$ -27 -78 306 24 12 84 116 247 161 314 -280 23 -73 -116 -90 -47 -102 -147 271 144 -165 53 60 -117 69 125
7079A25m9k95K98j46J6J3L2j56J40M7J49j74J95l13L5K16j55J27k9J2k11J55p4
$$ 125 76 -219 79 -67 -51 -38 -6 -162 -22 25 174 0 195 -118 -83 133 -22 105 76 88 -123 32 -42
7102d2J46j93K02J27r0j71M3J36m8j39J3J6j78J49j42L40k3l32J24kj62J90J14
$$ -42 104 -89 113 240 150 -21 22 158 110 -29 -16 0 -178 -29 -171 169 146 -186 -62 -64 -226 -36 78
7125G8l87M14k04R8L4K19k39nO1l53L82J44l58M5P0J20M3n05L21K3K1O0J0l21
$$ 78 -309 105 -99 -1 33 252 13 8 69 -284 98 242 -116 -71 -1 119 162 -343 -22 1 22 82 92 -229
7149b29J60j3J30P4j44j48O1j27J67J50l73J75L24l04J44M1k5q7J91j0n9oj20
$$ -229 -69 -82 48 122 -22 -170 -109 -236 -69 81 -292 -117 207 -97 47 88 63 -24 167 157 98 92 -28
7172b8J68o0Pj22j62J93j00JKm8L0J51j21J66k09J59m9j5J49M5j05J09p5j66Q9
$$ -28 140 80 87 -35 -197 -4 -104 -103 -101 -149 -119 32 -89 77 -132 27 -22 -37 112 157 52 161 86 -80 9
7197IJ28P5k29j45K36pL6n5N8J40j09L1n0j3M1k21J19P0k67J05N2m8K24j74l8
$$ 9 137 212 -17 -162 74 67 103 48 106 246 137 168 118 105 146 -75 44 114 -153 -48 4 -44 180 6 -32
7222c2m3j41J63m0J10j2q6l7K65j34P3l6J35j80k57K67J89j88K1J92l23Q0N8K57
$$ -32 -75 -216 -53 -93 17 5 -81 -118 147 13 86 50 185 5 -252 15 204 16 37 229 -94 -14 44 301
7246C01l00j8j24j0N3O9J82l22J34J05j2o4R7j44P3m9J07j05j76R4j55J09N05
$$ 301 1 -17 -141 -151 -98 -29 153 -169 -35 70 58 -6 91 -53 20 -29 78 -27 -203 -109 -264 -155 350
7269C50j89k19J69r9o9p6J96Q7Nj23r8N9R4j5j69K26j16L1qJ53j06k08J60o0M1
$$ 350 161 -58 111 12 -57 -133 63 150 155 32 -66 -7 87 72 -97 129 13 44 36 189 83 -125 35 -25 16
7294A6k1J20o7k71J76q1J34oJ92j50j22N2L7j28L8P1Pn9n7K11q9qj19J69o5K24
$$ 16 -5 115 48 -223 -47 -128 6 0 192 42 -80 -28 9 -119 -81 -10 -3 -62 -119 92 3 -5 -124 45 -20 204
7320B04j74J09m2J19l20m4L25k51L16l34J20o3K60k52j20J12K05K3j31P2j37R4
$$ 204 30 139 97 216 -104 -148 177 -74 242 -92 28 -35 225 -27 -147 -35 170 193 62 134 -3 91
7342I1J25k34K2j78J94k86J67J37j65J43l27O59m23kj69M13o5k65J37n0j07K94
$$ 91 216 -18 4 -174 20 -266 -99 38 -127 16 -311 348 -75 -77 -246 167 102 -163 -26 -76 -183 111
7364A11j27p7o2L9J51k9K24k6k26k04L51k35K24j77p2K49j51k3K51J33l13J06
$$ 111 -16 -93 -155 -116 35 6 230 204 -22 -226 125 -110 114 -63 -135 114 -37 -60 191 324 11 117
7386A17j97R3J53j41p0R8M5j82J04k00K40o8m3o9J15rk5k6j58K09j80L52j28k09
$$ 117 -80 13 166 25 -45 53 98 -84 20 -180 60 -8 -51 -120 -5 -14 -39 -65 -223 -14 -194 158 30 -179
7410a79N27l72M5n4k63L95J70l64J56J57l98K96m16K74q5k6J22j4k3o3N5J60M2
$$ -179 348 -24 21 -33 -296 99 269 -95 61 218 -180 116 -300 -26 -111 -137 -15 -29 -52 -115 -60 100 142
7433A42J86l64J28j64j40o0L67j67N5Lj52Q6K41kj15oN1n5L7p5mj97J88j58K15
$$ 142 328 -36 92 -72 -212 -272 95 -72 -17 -14 -166 -80 161 159 44 38 89 34 71 -4 -8 -205 -17 -175 40
7458D0k23O3j11J51MJ76j80J10M8m1J49j81P3k95K79j96J82O6j07O4L7o1N8k1
$$ 40 -183 -120 -231 -80 -76 100 -80 30 78 37 186 5 78 -217 62 -134 48 114 7 71 108 47 105 84
7482H4l46N40l70K8J43N9j13j29MJ09N8J25j38k15K1j2K79j11j67J37p3K00n5
$$ 84 -262 278 -92 -64 79 138 25 -104 -100 9 67 192 54 -161 -140 -152 127 16 -151 -14 -87 113 58
7505E8L3LM0N5l51K14k23L53k29R3lj84L45j78j30L29j18p6k71J71K65j63k11
$$ 58 91 94 134 189 -162 52 -171 182 -47 46 43 -141 204 26 -104 225 107 31 -240 -69 196 33 -178
7528a78J91P8j03J29l00N81m30L1J49oj51L0J10j62k9nJ83P5k45J21M7k12k9n0
$$ -178 13 91 -12 117 -183 398 -32 -1 148 142 -9 21 131 -31 -60 -65 118 193 -52 69 116 -96 -125 -175
7552a75o2J88k1j52R9J92M3q5Mq5J76k28N3j3K30l88K25J27R2k07R0j16J03j00
$$ -175 -237 -49 -70 -222 -123 69 112 27 31 -54 122 -106 -53 -66 164 -224 1 128 220 13 103 -13 90 -10
7576a0J48j02N2l5n2J8q3J94k70p9L61m1k45K71m1J00m17J22J48J62l30J68J06
$$ -10 138 36 88 53 1 19 -64 130 -140 -219 142 101 -144 127 86 186 -231 -109 39 201 -129 39 145
7599A45j81R1p1Q0k02J03N8N1J90k45K1r0N9N4K3k72L60j52j12j7J3L01J6p5k36
$$ 145 -36 55 -16 64 -138 -35 23 74 264 19 40 -50 9 63 86 -186 174 22 -90 -107 -94 207 223 148 -88
7624h8j07Q5j62L64k17J39M9o3k4J52j74L10l35J34K12l21K14k86J94j86J70J46
$$ -88 -195 -110 -272 92 -125 14 63 0 -24 128 -46 264 -71 63 275 -46 168 -118 76 -110 60 206
7646B06l03R7o8o1J54j29L65k50J3m4jj68K32k13J90J28j71J89o0j95J26K41k04
$$ 206 -97 0 -68 -129 25 -104 261 11 24 -20 -21 -189 43 -170 20 148 -23 166 106 -89 37 278 74
7669G4q0K05k23lN9KK9j71j17M46j47P0j82N3M6k48J15J15O0N2n5r5j61J74K00
$$ 74 -6 199 -24 -27 32 34 63 -108 -225 221 74 144 -38 15 61 -187 -72 43 103 155 100 5 -156 18 218
7694B18l50P8L5J2N5p5k1M1j28M13j29l07L16k4j24k05j3N95l23p5L69m66K29
$$ 218 -132 -54 -19 -7 48 -27 -48 -7 -135 278 149 -158 158 134 10 -195 -208 387 64 -11 358 -108 121
7717A21l2N6k31J43L8j20j8O1J69o4j57K48j12j42n3o0J06K48l26K78j32q6K97
$$ 121 89 145 -86 57 95 -25 -43 18 187 123 -34 214 102 -40 -93 -153 -47 201 -125 153 21 -65 232
7740B32k37Oo8J2J04q2J02J07k22J66m25J66jJ48J6l33M24k07J01J46k75K26j04
$$ 232 -5 1 -67 -55 49 -33 69 176 -46 120 -305 -139 -140 8 24 -309 115 -92 9 155 -120 106 2
7763BL4j28RJ48p8P1J69k05l4n7O1N7j22J11l9J6k04L37m6m8k2j40J05p8qJ99
$$ 2 36 -92 -83 65 -13 58 227 22 -12 -69 -8 49 -73 38 -1 15 -189 148 102 54 32 -108 -3 -81 -89 110
7789A10q1m3O5n9m0J9K74o6j18M3j95N0P3J33j40l18J05K50j60M2J70j94J94j48
$$ 110 29 -14 51 -8 -48 -29 245 179 61 104 -91 -41 32 165 25 -293 -188 62 -98 -56 114 -80 114 -34
7813c4K10k14k1j93L07m3P8q1J35J3j48n7J08p6J01n3n9j25L11j85q1p8J34M5
$$ -34 176 -38 -59 -252 55 12 90 9 144 157 9 -48 60 -16 85 32 -27 -152 159 -26 -107 -185 -51 -6
7837fJ53p0P7k71p6LM45J8m63K6Q1j09J11n9j44J64k6K0J35Q1j09qj18K78l07
$$ -6 147 77 154 -117 -193 -190 255 273 -190 -164 -83 -192 -81 -140 -284 -120 -146 -126 9 90 -19 -27 -145 133 -174
7862a74L77k69K61j56j35K70q5j39J08p2j30n5K13L2J17o2j66N8l5k3L6L9o4l9
$$ -174 203 -66 195 39 -96 174 89 -50 58 -14 -144 -199 14 46 163 101 -65 -7 -42 -65 -29 10 -54 -93
7886i3O5J98j41k4J53j61LO9k15K07Or3J09J31k15M2p3l8J67L09l54k46J84j70
$$ -93 -28 170 29 5 158 -3 0 69 -146 61 67 -26 83 214 -1 41 -32 -70 97 406 52 -194 -10 -180
7910a80K54M4k73o0K21j00R6j06J03k4j69J78k11P5K06j72J02J16l09L69j08Q8
$$ -180 74 118 -155 -215 6 -94 2 -104 -1 -25 -194 -16 -227 -152 54 -118 -16 100 -209 160 52 140
7932A40l57N6J69J75k13J27q7k4J09J09l84R6J52Oj50J95k89J33L26l47J9M44
$$ 140 -217 -161 8 183 -30 97 10 -14 95 204 -180 -84 68 74 -76 119 -170 -37 289 -58 -39 405
7954D05l41p1K64k62OJ97l77MM0K04k9p4j48K50j38K08k69Q6K5K61l38K19J46
$$ 405 64 -7 257 -5 1 198 -179 -175 -135 69 40 -34 -182 68 -70 138 -131 -45 -20 241 -97 122 268
7977B68k94j47J49k69M36j62K6Q7j89J1j34K89%l5K6q5j84J43m2K90j8k49k44
$$ 268 -26 -173 -24 -293 143 -19 7 94 -95 -84 -218 71 71 36 62 -23 -207 -64 -106 184 166 -83 -327
8000c27M75l24J32K8n1M9j06J25L08j40k04j22Q4q3R6R3m25M71O0j26j95K10J72
$$ -327 148 -176 -44 -16 -67 -18 -124 1 309 169 -35 -157 -73 -156 -60 33 -392 79 139 13 -182 28 200
8023B00m45J62r0LK9J70J05p8j81Q9J21r3p6k9M6J41J90j11j53j19J29j6J45k06
$$ 200 -245 -83 -173 -170 -141 29 134 56 -125 -36 85 -8 -84 -113 -67 74 264 153 0 -119 10 -6 139 -67
8047f7J51m3n0%J41M1k24K0nl9M2kJ04p7rP3K69j68j62Q7j04Q0j28J67j6j35K3
$$ -67 84 41 -9 -9 132 173 -51 -31 -36 -75 -33 -35 69 -8 -17 56 325 157 -5 82 -22 58 -70 97 81 -54 -31
8074c1K1p5K86q1o8n7P1k17K90k46P1Q4k29Q9K28q0k48L80l31K33k13J64k3J68
$$ -31 -10 -85 201 120 52 -5 66 -151 139 -107 -36 48 -181 -92 136 56 -192 188 -143 90 -123 41 18 186
8098A86j59j12j29O0J41J18L1j35J5N7mp4l2%J6q6m2j43Q8J48J02R1k00%q4J07
$$ 186 27 -85 -214 -154 -13 105 136 1 16 73 69 -5 -37 -37 -21 -107 -149 -292 -204 -56 46 137 -63 -63 -147 -40
8124d0J46r2j60Q4n9k3N0o9K11l6m7J52%j39P0j54k9J87K39m21l7K07l8J38p2
$$ -40 106 14 -146 -62 -121 -144 -94 -163 48 12 -35 117 117 -22 48 -106 -135 52 291 -130 -167 40 2 140 68
8149F8j2L1n1j84K28k01M2L21k0l20J39j20O1J0K42j25R1m52L06Oj3P9j41Lo2
$$ 68 56 87 36 -148 80 -121 -79 242 222 -98 41 -79 -18 -8 234 109 200 -252 54 60 47 126 -15 -12 -74
8174g4j8J68k14N2K82k96j02L00k60o2K52r8J8j84J35o6K63
$$ -74 -92 76 -138 -86 196 -100 -202 98 -162 -224 28 -70 -52 -236 -101 -167 96
8191I6
$$ Imaginary data points
##PAGE= N=2
##DATA TABLE= (X++(I..I)), XYDATA
0@%%%%%%%%%Qj6J6j6K4l2M0m8N6p2Q8j04J21j45J76k08K40k80L25l73M27m86N55
$$ 0 0 0 0 0 0 0 0 0 0 8 -8 8 -8 16 -16 24 -24 32 -40 48 -56 65 -80 96 -112 128 -152 173 -200 227 -259 296
32B96o33P16q06R10j022J143j280J430j591J769j963K172k403K655k930L231l560
$$ 296 -337 379 -427 483 -539 604 -676 754 -837 932 -1031 1141 -1262 1393 -1537 1694 -1866
49a866L920m316M755n242N782o385P064p835Q720r746J0950j2387J4141j6334
$$ -1866 2054 -2262 2493 -2749 3033 -3352 3712 -4123 4597 -5149 5801 -6586 7555 -8779
63h779J9163k2968K8379l6705N1233q3438K70075q4499m50296N64438k01732k68535
$$ -8779 10384 -12584 15795 -20910 30323 -53115 216960 132461 -317835 246603 44871 -223664
75b23664M37105j76811l46732N06665j13636k82764L14445n9754j83806K67788
$$ -223664 213441 36630 -310102 196563 82927 -199837 114608 54854 -128952 138836
85A38836o4536k28858K06648K1774j36895N5691N462k7794K2972O7348p1569n4215
$$ 138836 74300 -154558 52090 73864 -63031 -7340 -1878 -29672 -6700 60648 -10921 -65136
97f5136J07458M9765j65979O2128Q4574j76263J32763O4215k48435J36326J76982
$$ -65136 42322 92087 -73892 -11764 72810 -103453 29310 93525 -154910 -18584 158398
108A58398k71844R1243J58509k77287J66432J34696l18796J18248J96778k74392
$$ 158398 -113446 -22203 136306 -140981 25451 160147 -158649 -40401 156377 -118015
118a18015R4933J44613k68787J56584J39332k59301P8389J47800j89534P5098
$$ -118015 -23082 121531 -147256 9328 148660 -110641 -32252 115548 -73986 1112
128A112Q4506j94778J08000Q5002j38553L1915N8986o5371N0482J5580q1443M9772
$$ 1112 85618 -109160 -1160 83842 -54711 -22796 36190 -29181 21301 36881 -44562 5210
140E210J4843r073j3417k7491L3279J7076l1450J5281n023l4474R3741m4343p3146
$$ 5210 20053 10980 -2437 -29928 3351 20427 -11023 4258 -765 -35239 58502 14159 -58987
153e8987R5265k4109m5362P9432n9362n6210J44525o6994p2368J15572n9789k6821
$$ -58987 36278 12169 -33193 46239 -13123 -69333 75192 8198 -64170 51402 -8387 -35208
165c5208J08345q9910n3383J45298p8985m3522J00877q8449L361J05291r6475
$$ -35208 73137 -16773 -70156 75142 -3843 -47365 53512 -34937 -31576 73715 -22760
176b2760l0327J12195p4115l252O7517r2939K3523P5152p3799j2499O0580n1652
$$ -22760 -53087 59108 -15007 -18259 49258 -43681 -20158 54994 -18805 -31304 29276 -22376
188b2376K4695L1418o9496K7662L3943k7554m113N398j6649L0263l045k5335J2549
$$ -22376 2319 33737 -35759 -8097 25846 -1708 -5821 -423 -17072 13191 10146 -15189 -2640
201b640p558K7031n177l4485K1689J6858k7121K5095r955m5159P2793j1990n8939
$$ -2640 -10198 16833 11656 -22829 -1140 15718 -11403 13692 3737 -41422 31371 19381 -39558
214c9558N4547l593m2478O7986k5704o9200R6800j6632o4678O8613k0328m8157
$$ -39558 14989 11396 -31082 36904 11200 -58000 38800 22168 -42510 26103 5775 -42382
226d2382Q5212k7019p3875R0500j4086n1254O0592k5181m1157P2045j4851o0131
$$ -42382 42830 15811 -58064 32436 18350 -32904 27688 2507 -38650 33395 18544 -41587
238d1587N6138m978k5354L2403j5319k5438L5996O957l3210J0535M573K979j826
$$ -41587 14551 9573 -15781 16622 1303 -24135 11861 18818 -14392 -3857 716 3695 1869
251A869j472m349q516K4764J6l0922J1040K7449l2107J3617J4206m6077L5065
$$ 1869 397 -3952 -12468 12296 12312 -18610 -7570 19879 -12228 1389 15595 -30482 4583
264D583K6289n6421J3265M0148n0124K3179K8512o6113L3384M0760n9960J0225
$$ 4583 30872 -25549 -12284 27864 -22260 919 29431 -36682 -3298 37462 -22498 -12273
276a2273L8746n0416K3889L1838o3082K2217L9194m2063K668K7518l6447J7747
$$ -12273 26473 -23943 -54 31784 -31298 -9081 30113 -11950 -9282 18236 -18211 -464
288d64K6059m2400O531K4078j3523m396J0784j5108N810J5913j2837q886M837
$$ -464 25595 -16805 -10274 13804 281 -4115 6669 -8439 -2629 13284 447 -8439 -3602
301c602J4618j1054l973O744p656L941J5267j8732j2230L3188j3916j2689K1400
$$ -3602 11016 -38 -4011 2733 -4923 -982 14285 -4447 -16677 16511 2595 -10094 11306
314A1306j7515n282L2852k1311k2895L9154j4532j3993K8194k2057j1169L8249
$$ 11306 -6209 -11491 21361 50 -22845 16309 1777 -12216 15978 -6079 -17248 21001
326B1001j6930k5505L4110j2439j0300K5547k0019j2609L0965p689k0095K0602
$$ 21001 4071 -21434 12676 237 -10063 15484 -4535 -17144 13821 6132 -13963 6639
338F639q707l661J7171j2347j0982J5598L109j1239M641l192J491N609j378p040
$$ 6639 -2068 -5729 11442 -905 -11887 3711 6820 -4419 222 -2970 -1479 4130 2752 -4288
352d288j686J2177k729p464K083L470m630Q730l248j4999J7020L615j4058O003
$$ -4288 -5974 6203 3474 -3990 -1907 1563 -3067 5663 2415 -12584 4436 8051 -6007 -4
366dL357j1623J5577P36k2725J7199N947j4364Q078K104j5404J7340L919k2757
$$ -4 3353 -8270 7307 8043 -14682 2517 8464 -5900 2178 4282 -11122 6218 10137 -12620
380a2620J3325N544j0678P766N24j4622J3811O327j6418N704L412m170M989M95
$$ -12620 705 6249 -4429 3337 3861 -10761 3050 9377 -7041 -1337 2075 -2095 2894 3389
394C389j0363O159P270p756j026R03J904O02J507m757k495P247J219n558k187
$$ 3389 -6974 -815 6455 -1301 -2327 -1424 480 1082 2589 -2168 -4663 2584 3803 -1755 -3942
409c942O129l385K941Q72r050N123P683p518l080P509o959M771N008j2625K853
$$ -3942 2187 -1198 1743 2615 -6435 -1312 6371 -1147 -4227 3282 -3677 1094 6102 -6523 -3670
424c670J0449p219k902P020q510M662P459j1478p74R520l820k571N228p658K654
$$ -3670 6779 -440 -3342 3678 -4832 -170 7289 -4189 -4963 4557 737 -1834 3394 -4264 -1610
439a610Q149p454l067N355j14j744L254n462M08O066j801m211K82L649j128J260
$$ -1610 6539 -915 -3982 1373 1259 -485 2769 -2693 -2285 3781 1980 -2231 -1949 1700 572 1832
455A832k495j986L122L575l964l846N438j154K01P48l856k04O423j996o114N306
$$ 1832 -663 -2649 473 4048 84 -3762 1676 522 723 1471 -2385 -2589 3834 1838 -4276 1030
471A030r10n58L091l863k879O876j17n942M119j670l24M206k624n114N509K115
$$ 1030 120 -438 2653 -1210 -4089 2787 2670 -3272 847 -823 -1147 3059 435 -4679 830 2945
487B945m752K318j725k18L447l30m962K313L201k555P33j563l50K180J803l864
$$ 2945 -1807 511 -1214 -1432 2015 1685 -3277 -964 2237 -318 415 -1148 -1498 682 2485 -1379
503a379r61L431k03l84q71n59K60L374j883l439K560J497q46m82n08j570L799
$$ -1379 -2340 1091 888 504 -367 -926 -666 2708 825 -2614 -54 1443 597 115 -393 -1963 1836
520A836M72m421J339J605m20K80o3l274L437K168m137M3J421J24J68Q08l642J909
$$ 1836 2308 -2113 -774 831 411 691 628 -2646 791 2959 -1178 -1135 286 410 578 1386 -2256 -347
538c47K623k440r73M68O99L17J324l048m5K652p7j263q17N44L77J640k074j454
$$ -347 2276 -164 -1137 -669 30 347 1671 -1377 -1422 1230 1153 -110 -927 -383 -6 1634 -440 -1894
556a894J600J464j075j149P01n54K021n95k161M92K200l66j569Q12j125J604Q76
$$ -1894 -294 1170 95 -1054 -353 -907 1114 519 -1642 -1150 1050 684 -885 -73 -1198 406 1282
573A282j741j092J785R36j150M34j725J258J397r46j811Q73J755r20L41j544J35
$$ 1282 -459 -1551 234 1170 20 454 -1271 -13 1384 438 -1373 -500 1255 335 676 -868 -733
590g33J563K92j919j47J271o3O00j251l43R28J479j875p40J033L8P25r38p11J08
$$ -733 830 1122 -797 -944 327 264 864 -387 -730 198 1677 -198 -938 95 133 858 -80 -791 -683
609f83J817o00j237M59J69Q55l06o12j023J772O35j530j48p2R91K20n43j270P09
$$ -683 1134 534 -703 -244 -75 780 474 -138 -1161 611 1246 -284 -432 -504 487 707 164 -1106 -397
628c97J305o86m47l88O14N81k68j137J36J467m36k17p71M84J06P22j115p90R58
$$ -397 908 222 -225 -613 1 582 314 -823 -687 780 344 127 -644 -160 -54 668 -447 -1237 -279
647b79Q25l33p42J83K05J023o31r94M53P55K81r96Pj91J241k44r30j87O42O69
$$ -279 546 213 -529 -346 -141 882 251 -743 -290 465 746 -250 -243 -434 807 563 -367 -554 88 757
667G57o23k32o70R58O61o93p74M77O08J58n40q29M92J029q3j002o0M84M2L52j064
$$ 757 134 -98 -768 190 851 158 -616 -139 469 627 87 -742 -250 779 696 -306 -366 118 160 512 -552
688e52J21O80M14r09l79L84L82M13o68l84L36P50l64n35K39j60M03j77k97k74
$$ -552 -431 249 663 -246 -625 -241 141 554 -114 -498 -162 588 224 -311 -72 -232 171 -6 -303 -577
708e77Q18K28o11k74K20N00K6j47q04O51L40m05j56K11J11K98j63q48K49O64k07
$$ -577 241 469 -142 -416 -196 304 330 183 -621 30 370 -35 -191 20 131 429 266 -582 -333 331 124
729A24m21O0J45M48J68n30m92N49L49k89l22j20J94Q42n80m51J96K73L08n79q1
$$ 124 -297 -237 -92 356 524 -6 -498 51 400 111 -211 -331 -137 705 125 -326 -130 143 451 -128 -209
750b09j29N57K12n76k76O93L14q26N41q92O18M78l65n86J73N34r4K16r57L68O23
$$ -209 -338 219 431 -145 -421 272 586 -240 301 -591 27 505 140 -446 -273 261 167 383 -574 -206 417
771D17k48l93l5K23L29M7n26l97P89J73n46p3J10j4M93n12k22M35J46l5l15p5
$$ 417 169 -224 -259 -36 293 340 -186 -583 206 379 -167 -240 -130 -144 349 -163 -385 50 196 161 -154 -229
793b29J57M61r7m83QM43K82q66J90k05L40L61l24o81P80L56n68Oj88Q4N96k54
$$ -229 -72 389 292 -191 -183 260 542 -324 -134 -339 1 362 38 -643 137 493 -75 -69 -257 -173 423 169
815A69p27M86L27k39M06n70l29N85K65m37p6K90j86L78n09L2m7L90m12j20K72
$$ 169 -558 -72 255 16 422 -148 -477 108 373 -64 -140 150 -36 342 -167 -135 -182 208 -204 -324 -52
836e2J97N23p24J45l88N42lm55j75K28K82j17qj85K29L93p09J51j4j7M44K7p26
$$ -52 145 668 -56 89 -299 243 240 -215 -390 -162 120 3 -5 -190 39 432 -277 -126 -140 -157 287 314 -412
859d12M59K01k41k02K1M42l45N39p61L14J84j62Q6l37J8K38K27l43NK52j07J29
$$ -412 47 248 7 -195 -174 268 -77 462 -299 15 199 37 123 -214 -196 42 269 -74 -69 183 76 205
881B05k02k24J69K93k57j74K4K17k1j48R7p1N50n03J5n5R5K62k21L9k08J30m2
$$ 205 3 -221 -52 241 -16 -190 -166 51 30 -118 -21 -92 458 -45 -30 -85 10 272 51 90 -118 12 -30
904c0o9k81N39Jj93M43q94N05R4l5k13P2J67mM51n17k94N34k65J1k87M75j26K23
$$ -30 -99 -380 159 160 -33 410 -484 21 115 80 -133 -61 106 102 553 36 -258 276 11 22 -265 210 84 307
928C07k89l87L66O9m0N2l00J82K00l01K19j57J30j93J37m7p5L57j43p4l3P5M0
$$ 307 18 -369 -3 66 26 78 -222 -40 160 -141 78 -79 51 -142 -5 -52 -127 230 87 13 -20 55 95
951I5m2j72%J65N3j10j93RL27m0n8k28J68j69M41l20j85L64k47Q7J6j87M16N5
$$ 95 53 -119 -119 46 99 -11 -204 -195 132 92 34 -194 -26 -195 246 -74 -259 105 -142 -55 -39 -226 190 245
975B45l16j08K03j13L09k90j40N64n87M74l05J11j01JJ82l8l49M12j4j66J11k34
$$ 245 -71 -179 24 -89 220 -70 -210 354 -233 241 -64 47 -54 -53 129 91 -258 154 140 -26 85 -149
997a49QR8j12j31K75J28l23OP5j79M88l35nJ44K54j42l8k12K1l1M33m05o8L36
$$ -149 -141 -43 -155 -286 -11 117 -206 -200 -125 -304 184 -151 -156 -12 242 100 62 -150 -129 -160 273 -132 -200 136
1021A36p4p5j0k38J08K89k58K94k9k65L53j12k30J02M5l20K46j37J94J00K1j42
$$ 136 62 -13 -23 -261 -153 136 -122 172 143 -122 231 119 -111 -9 36 -284 -38 -175 19 119 140 -2
1043bl40L38j13K41k60J73m4K77l51J46o1n0J71m97M39j59R4J37j78l05L97j12
$$ -2 -342 -4 -117 124 -136 37 -7 270 -81 65 4 -46 125 -372 67 -92 2 139 -39 -344 53 -59
1065e9rj41J02L99l14n7J79j57j5N1J97l72M86L8m57P4J33J18q2j21k91K15J16
$$ -59 -68 -209 -107 292 -22 -79 100 -57 -72 -21 176 -196 290 328 -129 -55 78 196 114 -7 -298 -83 33
1088C3J18k42q7K44k56R6O7j97M01l47K27k36J59Q4j20J9Lj48J00K30j65N6N9
$$ 33 151 -91 -178 66 -190 -94 -27 -224 177 -170 57 -179 -20 64 -56 -37 -34 -182 -82 148 -17 39 98
1111I8o6j35K26k76K75rj43L80l17r7M3j46p0L61Ml39K83j88K18j81j34O8Q0q9
$$ 98 32 -103 123 -153 122 113 -30 350 33 -64 -21 -167 -237 124 128 -211 72 -116 102 -79 -213 -145 -65 -154
1135a54K17L2r4o5K58k29n0NJ63J9j85m7M9J44j8k46J84J24k19R0k55K48M6n9
$$ -154 63 95 1 -64 194 -35 -85 -80 83 102 -83 -130 -81 63 45 -201 -17 107 -112 -22 -277 -29 17 -42
1159d2K78l59p5L27J66k47O0j22Q7j99k2nJ29J8o2K00l16J92J52l54N7J03r0J19
$$ -42 236 -123 -198 129 295 48 108 -14 73 -126 -148 -153 -24 -6 -68 132 -184 8 160 -194 -137 -34 -124 -5
1183eR9l1k74O5J08k9l3j5O2J22j51j76M10j45L4k08J73k19N00j66q0Q9p6J73
$$ -5 94 63 -211 -146 -38 -67 -100 -115 -53 69 -82 -258 152 7 41 -167 6 -213 287 121 41 130 54 227
1207B27k48j50m8J51J07r3n0J21m1j34K30jq9j39J70k68J95J51j04l4J31Jk67
$$ 227 -21 -171 -219 -68 39 -54 -104 17 -24 -158 72 71 -18 -157 13 -255 -60 91 -13 -47 84 85 -182
1230a82O9q4K67Jmj20O5j91N7J43j11k07L63L9J23k74O9n1J31l56K63K3j96J58
$$ -182 -113 -197 70 71 67 -53 12 -179 -122 21 -90 -297 66 105 228 -46 23 -28 103 -253 10 33 -163 -5
1254ej84J04N1J08j57J11J24j43o6l7J25j92K01j08J01J44k97Q6K71j50l06J36
$$ -5 -189 -85 -34 74 -83 28 152 9 -57 -94 31 -161 40 -68 33 177 -120 -34 237 87 -219 -83
1276h3L4K8%j62K74l3j72J44L0j43j56M38l56J70m2j2o6J06J26j73J30r3J44p5
$$ -83 -49 -21 -21 -183 91 58 -114 30 60 -83 -239 199 -157 13 -29 -41 -107 -1 125 -48 82 -11 133 58
1300E8o2p0j1l3J44J08r3l2j68R9j58J95M0J6N6k03O6J81J1q5J94k28l10M19k09
$$ 58 -4 -74 -85 -118 26 134 41 9 -159 -60 -218 -23 17 33 89 -114 -48 133 144 59 253 25 -285 134 -75
1325g5j01J93J95k77J06j50J35J48l03M41l84K42k66p9J06N9M1k5j31K96k62K74
$$ -75 -176 17 212 -65 41 -109 26 174 -129 312 -72 170 -96 -175 -69 -10 31 6 -125 171 -91 183
1347A83k93m0K70k48J3J58J8J13r8k91j30L45K05N7k26k29O28J8l38P3o05J183
$$ 183 -110 -150 120 -128 -115 43 61 174 76 -215 -345 0 205 262 36 -193 435 453 115 188 -417 766
1369G66o60k75K10q7q3N7j81K7j07N72p32M07N8o2J2J26l0j29P5J61n04N33l54
$$ 766 106 -169 41 -46 -129 -72 -253 -226 -333 239 -493 -86 -28 -90 -78 48 18 -111 -36 125 -379 154 -200
1392b00K41k16R5J43j94o6oK04N2j13J65j9l86K72k46L42Qj60q3K48j42K27n4
$$ -200 41 -175 -80 63 -131 -197 -203 1 53 -60 105 86 -300 -28 -274 68 76 -84 -167 81 -61 166 112
1415A12J46k16k07K66k73J18q4K09l1j24m2q6J85J45j47J05j23q2K31Pj4j34K37
$$ 112 258 42 -165 101 -172 -54 -138 71 40 -84 -126 -212 -27 118 -29 76 -47 -129 102 109 95 -39 198
1438A98l08K42r3K8L4j86J84j40M5k5K3j87l0K32J01L9k73K60k37R8N3k24K37
$$ 198 -110 132 39 67 101 -85 99 -41 4 -21 2 -185 -215 17 118 157 -116 144 -93 5 58 -166 71
1461G1J17j77M6k47J49O5j05N0j85K00J61k42qJ43J10j51j63J35l1J09j57K33
$$ 71 188 11 57 -190 -41 24 -81 -31 -216 -16 145 -97 -105 38 148 -3 -166 -31 -62 47 -110 123
1483A23l7K3k95L65k2k45J84j18R6k6k14M0L0j50K01J75j42jk07j8J08L33r3j63
$$ 123 86 109 -186 179 157 -88 96 -22 74 48 -166 -126 -96 -246 -45 130 -12 -13 -220 -238 -130 203 110 -53
1507e3J77j02K69m62L05J13l47M9N3M9J58j92o1K54K5k70j25N2j8L50l69J58J72
$$ -53 124 22 291 -171 134 247 -100 -51 2 51 209 17 -44 210 235 -35 -160 -108 -126 224 -145 13 185
1530A85k78K44m02K56J10r9j67P6J48j04J70l88J78R0mR7k07P3k31L20M1k78J20
$$ 185 -93 151 -251 5 115 16 -151 -75 73 -31 139 -249 -71 19 15 112 -95 -22 -253 67 108 -170 -50
1553e0m0n5K87j15k11J0K13J18m0k58NJ43J7j13l2M8J10k0l83N27L7j23J6m5j67
$$ -50 -90 -145 142 27 -184 -174 39 157 117 -141 -136 7 24 -89 -121 -73 37 17 -366 161 198 75 91 46 -121
1578a21Q2K17l59K50j43P7l64M23n3KN1j75q7N22n32L05j52K28l15P7J79j36r
$$ -121 -39 178 -181 69 -74 3 -361 62 9 11 62 -113 -200 322 -210 95 -57 171 -144 -67 112 -24 -33
1601c3p1N7L03k78j44K15j73K28J23r1j88J24o1l1L23j94k39J63lN3j65P1L5j9
$$ -33 -104 -47 256 -22 -166 49 -124 104 227 136 -52 72 11 -20 303 109 -130 33 30 83 -82 -11 24 5
1625Ek54L14p1O3J85k39k46J67p0J20Q9j66J67P5k38M68m28j36L46k27j2J98j87
$$ 5 -249 65 -6 57 242 3 -243 -76 -146 -26 63 -103 64 139 -99 369 -59 -195 151 -76 -88 110 -77
1648g7J19k9K3P4Q1l15r1K0L94j68j22k5J15k24K0J68K17k05J80M9l58J51o8J95
$$ -77 42 13 36 110 191 -124 -215 -195 199 31 -91 -116 -1 -225 -205 -37 180 -25 155 204 -154 -3 -71 124
1672A24m1p1M9j52J72M03k30k46J68j48k61K15j32l8J30r5J34j4K51k83j11O4
$$ 124 83 12 61 -91 81 484 254 8 176 28 -233 -18 -150 -188 -58 -153 -19 -33 218 -65 -176 -112
1694a12K15J52l56j65L34j53j41M60j93P1L2m38K59P7j45O4rJ25j6P6j6k75R1
$$ -112 103 255 -101 -266 68 -85 -226 234 41 112 144 -294 -35 42 -103 -39 -48 77 61 137 121 -154 -63
1717f3J95j45Rr0J2O1K59j52j53p1K69j67R6j23Q2k33K05j7jK03k19J44j67K31
$$ -63 132 -13 -4 -94 -82 -21 238 86 -67 -138 131 -36 60 -63 19 -214 -9 -26 -27 176 -43 101 -66 165
1741A65l46K90k12L18m20L20o4j66J86m9q3n6N0J1J16o6K01j73K2J77P7l49K09
$$ 165 -181 109 -103 215 -205 115 51 -115 71 22 -61 -117 -67 -56 60 -6 195 22 44 221 298 -51 158
1764A58l16R3j2K53m2j92K3j77R9J86j25J10R5k53j59L97K2k07l9J33l2k65K68
$$ 158 -158 -65 -77 176 134 -58 -35 -212 -113 73 -52 58 153 -100 -259 138 160 -47 -86 47 15 -250 18
1787A8k30J81K76l41J69k9n1J96l43Q4k8K38j18K19l12M9lJ18l32L87k25J58j46
$$ 18 -212 -31 245 -96 73 44 -7 189 -154 -70 -98 140 22 241 -71 -22 -25 93 -239 148 -77 81 -65
1810f5j7P4J26j79q3P8L2N9k31K91k50K23j90K75M1k70m3J05j04J68k06L18J62
$$ -65 -82 -8 118 -61 -144 -66 -34 25 -206 85 -165 58 -132 143 184 -86 -129 -24 -128 40 -166 152 314
1833C14j31N1k31N2Rl7P6R7m25j1K19J0k1K4l07M12k71L0K92k70K6r8K29J29k96
$$ 314 183 234 3 55 64 27 103 200 -225 -236 -17 -7 -28 -4 -311 101 -170 -140 152 -118 -92 -190 39 168 -128
1858a28K58l5k23L94l53J56k63J53J61j06J88j07P5p3J35m15m6L19n9k48R2m7
$$ -128 130 95 -128 266 -87 69 -194 -41 120 14 202 95 170 97 232 -183 -229 90 31 -217 -125 -172
1880a72L53l74K02K1PJj08K10o9jr6J73K1k76L01j05p1J80l16K35j01j4P9k15
$$ -172 181 -193 9 30 37 38 -70 140 71 70 -26 147 168 -108 193 88 17 197 -119 116 15 1 80 -135
1904a35n2J57p7J59j53K36m24L54J94k18nm5j20P0L15l15m0o6K49j31P6L0Ok00
$$ -135 -187 -30 -107 52 -101 135 -289 65 259 41 36 -9 -129 -59 256 -59 -99 -165 84 -47 29 59 65 -135
1928a35K30mj23j13J11N5N5J16o2j63l6l3L86n0j61k07J93j00J60P6l50K98l29
$$ -135 95 91 -32 -145 -34 21 76 192 130 -33 -69 -102 284 234 73 -134 59 -41 119 195 -155 143 -186
1951a86K29J3R5L0J9k84J01P3j1q7J72j3j80k7M1j01K69k26q8K91j16J2J86k41
$$ -186 43 56 151 181 200 -84 17 90 79 -8 164 151 -29 -56 -15 -116 153 -73 -161 130 14 26 212 -29
1975b9J2J42j5j80Lk62M01N2m60M14m5lJ50k99l7Q9Q7k8OJ40l17L2l2J80j5km0
$$ -29 -17 125 110 -70 -67 -329 72 124 -336 78 33 30 180 -119 -156 -67 20 -8 -2 138 -179 -147 -179 1 -14 -16 -56
2002e6K5O5q9P0o8M7J71j61Qk74j77L38J0p8K15M5j95P4J58o8K5p3q4M30k65o3
$$ -56 -31 34 -55 15 -53 -6 165 4 12 -262 -439 -101 -91 -169 46 91 -104 -30 128 60 85 12 -72 358 93 30
2028C0j62n9L7K28o3j49J04J1L6o9K3O9k16M7J24k08J97P9l05O1J03L76j05j66
$$ 30 -132 -191 -154 74 11 -138 -34 -23 13 -56 -33 36 -180 -133 -9 -217 -20 59 -246 -185 -82 294 189 23
2052B3O0k09J70J29j64k73Q4J78j05J25R0r8K66l06J54o6j02K40m4p5K5j37L46
$$ 23 83 -126 44 173 9 -264 -180 -2 -107 18 108 10 276 -30 124 58 -44 196 152 77 102 -35 311
2075C11n34K60M5nl09K77j41J46n8J13k9j37J11J8k48P1J72m03J60N6J6j06L42
$$ 311 -223 37 82 77 -232 45 -96 50 -8 105 76 -61 50 68 -180 -109 63 -340 -180 -124 -108 -214 128
2098A28q0J76k46L6N4L6k07J55l15K50K09l07j2m0j39K59N8m8j6j05N1J59K49
$$ 128 48 224 -22 14 68 104 -103 52 -263 -13 196 -111 -123 -163 -302 -43 15 -33 -49 -154 -103 56 305
2121C05r2k45o9J22j25J23j65L91j78l8m05L65k1L0Q6r9j57M38m35J07J45k7M3
$$ 305 213 -32 -101 21 -104 19 -146 245 67 29 -376 -11 -32 -2 84 -15 -172 266 -169 -62 83 56 99
2144I9k44J29l6J23j32J00P5m03L33j68J68J05l44J09N6J90j16k85K78K8q0k67
$$ 99 -145 -16 -52 71 -61 39 114 -289 44 -124 44 149 -195 -86 -30 160 44 -241 37 65 -15 -282
2166b82L33j12j0P9P3j70J54j50J36j4k05K33k36J91P5K03l56J73n3k64j5L27
$$ -282 51 -61 -71 8 81 -89 65 -85 51 37 -168 65 -171 20 95 298 -58 115 62 -202 -217 110
2188A10j16j7k09L01o9j24J92k74J03J20j1k4j0R5j03L24k77k7O5l44K26l5J36
$$ 110 -6 -23 -232 69 0 -124 68 -206 -103 17 6 -18 -28 67 -36 288 11 -16 49 -295 -69 -104 32
2211C2J91l78K29j10K6o4J76J75j20j40k93J5L66j88J52L97l18lj29j6Ol4k20
$$ 32 223 -155 74 -36 -10 -74 102 277 157 17 -276 -261 105 -83 69 466 148 145 16 0 6 -28 -248
2234b48K96l5o2p9P4l8L0OJ29K8k19J29%L7j1j27m1J7n0R0J79j25m7oq7J04J28
$$ -248 48 13 -49 -128 -54 -92 -62 -56 73 101 -118 11 11 48 37 -90 -131 -114 -164 -74 105 -20 -67 -73 -160 -56 72
2261G2q5p6J19j46KK40j50K23o4o5j37J52j56j26K75o8q1N6J43j2j07n9J40J07
$$ 72 -13 -89 30 -116 -114 126 -24 199 135 70 -67 85 -71 -197 78 10 -71 -15 128 116 9 -50 90 197
2285A97j75J31l10R8K51k31L13j06Pr1j12K08l01R0J17j55L84k08l00J48j92M03
$$ 197 22 153 -157 -59 192 -39 274 168 175 84 -28 180 -121 -31 86 -69 315 107 -193 -45 -237 166
2307A66k01P2r8J46j34o7K19k05J58j50J03o4J82q9j30J65qk1j57J69P4P6l95
$$ 166 -35 37 -61 85 -49 -116 103 -102 56 -94 9 -55 127 38 -92 73 65 44 -113 56 130 206 -189
2330a89O5Q4k02L88j02r5J47m5Nk66J21Q3M8O1j57K22j55j20J50J77k14lL53l47
$$ -189 -124 -40 -242 146 44 -51 96 51 56 -210 -89 -6 42 103 -54 168 13 -107 43 220 6 3 356 9
2354Ij07J07jk6l4j34J54J27j88K93l59L30j17K02l77R1J98j76k1R9j08K42m20
$$ 9 -98 9 8 -18 -52 -186 -32 95 -93 200 -159 171 54 256 -121 -30 168 -8 -29 70 -38 204 -216
2377b16N3J59j31J56j78J22q0R4K28k93L59l34L47k79j46Q0P8k13J92J03J04j98
$$ -216 -163 -4 -135 21 -157 -35 -115 -21 207 -86 273 -61 286 7 -139 -59 19 -194 -2 101 205 7
2399Gq7J14q8K41j72j40O3J89q9j11J11M8p2J45M4j10L5n3k13qL6K15j3k68K82
$$ 7 -80 34 -54 187 15 -125 -62 127 38 -73 38 86 14 159 203 93 128 75 -138 -146 -110 105 92 -176 106
2424A06j44m1j41L53q5m3R5j97K5M5l5m0N06p25L30j70j0R6J90j81m2J61M4k09
$$ 106 -38 -79 -220 133 48 5 100 -97 -72 -27 -62 -102 404 -321 9 -161 -171 -75 115 -66 -108 53 97 -112
2448a12K01m2r0m9j03K85r9J00O2q7R4l94J99J48j18j14J64L8n7L0k07J22K41
$$ -112 89 47 -43 -92 -195 90 -9 91 153 66 160 -234 -35 113 -5 -119 45 83 26 56 -151 -29 212
2471B12l46K68n5ml6k20lK38R4j98j1j08M67j23l4J90l31J60j88Q1lJ33k21J6
$$ 212 -134 134 79 75 39 -181 -184 54 148 -50 -61 -169 298 175 141 331 0 160 -28 53 50 183 -38 -22
2495b2J40l31K52j60J08q6R2j61M6J47j7J1j05J91j31j77L57j34K08k27k2q8J6
$$ -22 118 -213 39 -121 -13 -99 -7 -168 -122 25 8 19 -86 105 -26 -203 154 20 228 1 -21 -109 -93
2518i3J25O4k36M93k21j07o2R6L7j20J65k15J43j44q6m2M6J01J0q1K37j59j54
$$ -93 32 96 -140 353 132 25 -37 59 96 -24 141 -74 69 -75 -161 -203 -157 -56 -46 -127 110 -49 -203
2541b03K78j01j96N10j92O3l84L46m1k19P7L1L2p9j83K45j65J61J89l22L27k69
$$ -203 75 -26 -222 288 96 159 -225 121 80 -139 -62 -31 1 -78 -261 -16 -181 -20 169 -153 174 -95
2563i5j9P3K76j40k84K38j7r3K32j52J45k97L74l77K0K23k03K17k67K95k13O5
$$ -95 -114 -41 235 95 -189 49 32 -61 171 19 164 -133 241 -136 -116 107 -96 121 -146 149 -64 1
2585Aj91J71J41k09K26rk31J93k07J40L03l04J13k60J90k05K15j0j26K03j65k
$$ 1 -190 -19 122 -87 139 130 -101 92 -115 25 328 24 137 -123 67 -138 77 67 -59 144 -21 -23
2607b3j74M68m01O7K82j60j05J76R8j61r4K58j70j29p5n7J02J68J13k40R8j61
$$ -23 -197 271 -130 -63 219 59 -46 130 228 67 -27 231 61 -68 -143 -200 -98 70 183 -57 41 -120
2629a20J30l0n9M2P3j08l1L13m82M51m73K28J26J54k13j37P1Q4L04m24r3J75J06
$$ -120 10 -20 -79 -37 36 -72 -103 210 -272 179 -294 -66 60 214 1 -136 -65 19 323 -101 -194 -19 87
2652H7l25L78l62K07J46m75L59J43q3l42K01R5J75j59j60k7K33J5k02K57j56j30
$$ 87 -238 140 -222 -15 131 -344 15 158 75 -267 -66 29 204 45 -115 -142 91 106 -96 161 5 -125
2674a25K05L2j28o3K3R9J06r1k4k8J50k84L6J78J53j47R8j65j18K15k48k5L3J23
$$ -125 80 112 -16 -79 -56 43 149 58 34 6 156 -128 -92 86 239 92 190 25 -93 122 -126 -151 -118 5
2698EO3Q4rn5R3k85j36K47j5R6o2mo8k9L31k95j10L88l18J4Q3m5J97j06j41j19
$$ 5 68 152 143 88 181 -104 -240 7 -8 88 26 22 -46 -75 256 -39 -149 239 -79 -65 18 -27 170 64 -77 -196
2724a96L86r9Njj39J73j00l9K4M0j74J18J12kq8k45J51N4j3Q8j0Q2k03L0K78k53
$$ -196 190 91 96 95 -44 129 29 -10 14 54 -120 -2 110 108 20 -225 -74 -20 -33 55 45 127 -76 -46 232 -21
2750b1k9l22N84M9l95o6J89P5nj93J38j55J35Pr0K33o3R7k36J6K0j7k1M9J79j89
$$ -21 -50 -372 212 261 -134 -200 -11 64 59 -134 4 -151 -16 -9 -99 134 71 168 -68 -52 -32 -49 -70 -21 158 -31
2776c1k17J93J13j27K6Q3k23L54k47J2N2J31j88K01k95N37k48M6q8l52L74k64
$$ -31 -248 -55 58 -69 -43 40 -183 171 -76 -64 -12 119 -69 132 -163 374 126 172 84 -268 106 -158
2798a58N4K49j97q2J60p5J05k86K76p0j4q1O4l1J21j17j27K29k9J37l36L07k93
$$ -158 -104 145 -52 -134 26 -49 56 -230 46 -24 -38 -119 -55 -86 35 -82 -209 20 -9 128 -208 99 -194
2821a94J76J02l24r8L14j64J48J1j40K91Mk84L4L45k5k60L4M01m53n3M2R8J12
$$ -194 -18 84 -240 -338 -24 -188 -40 -29 -169 122 126 -158 -124 221 196 -64 -30 371 -82 -135 -93 5 117
2844A17J8J81n28K69O4j2K2j27J51k89J26k6j41L56p7l9j72K51j81k2K68n4j26
$$ 117 135 316 -212 57 121 109 131 4 155 -134 -8 -34 -175 181 104 65 -107 144 -37 -59 209 155 29
2867B9j11j12J91q1j71M75k90O3M8j7p2l0p0K18j65r4L86j27n1j22J48P9%j4k9
$$ 29 -82 -194 -3 -84 -255 220 -70 -7 41 24 -48 -78 -148 70 -95 -189 197 70 19 -103 45 124 124 110 81
2892H1j23N6j65K1K03N8j81K8j72L02l44K48J03k82J82J19L4l08R2kj60K85k03
$$ 81 -42 14 -151 -130 73 131 -50 -22 -194 108 -236 12 115 -167 15 134 168 -140 -48 -50 -210 75 -128
2915a28Q4k62K90J56q1m4n0K41j66J32k24O1P5j0J64k72J8J23j58J29j11o7K49
$$ -128 -44 -306 -16 140 59 15 -35 206 40 172 -52 9 84 74 238 -34 -16 107 -51 78 -33 -100 149
2938A49j22m7l3J96O5k89p3J41O8k1Nj30K25j32J7j04j31Q8J67k64j09M56J3m36
$$ 149 27 -20 -53 143 208 -81 -154 -13 55 34 39 -91 134 2 19 -85 -216 -128 39 -225 -334 122 135 -301
2962c01K25K8K4J50r8R0J29l86L1L34k30MQ7lJR3j22o5P5q5k0j78K27r1m7K63
$$ -301 -76 -48 -24 126 28 118 247 -139 -108 226 -4 0 87 84 85 178 56 -9 66 -19 -39 -217 10 -81 -128 135
2988A35Q6n5r2q1P3k03j2K15k31M12j62K5J7M4k47p7K01q6J11k58K02J00j77Q5
$$ 135 221 166 74 -7 66 -137 -149 66 -165 247 85 110 127 171 -76 -153 48 -38 73 -185 17 117 -60 25
3012B5r4J16L2j21l36L43J79j60K07l5O4k34j45L6K60k83Q3J54j13M0M6l03K31
$$ 25 -69 47 79 -42 -378 -35 144 -16 191 156 220 -14 -159 -123 137 -146 -63 91 -22 18 64 -239 -8
3035hO3l9Q6k47q7J92J56n3j4Mo4J55j57p3m5L87m71L17K58k17j61M16p32J78
$$ -8 55 16 102 -145 -232 -40 116 63 49 53 -11 144 -13 -86 -131 256 -215 102 360 143 -18 398 -334 -156
3059a56L13k80R5j03J9R8q4J46r6j12K76l61K22J26o1o3j76K02m0q9N7K41l65
$$ -156 157 -123 -28 -131 -112 -14 -98 48 -48 -160 116 -245 -23 103 42 -21 -197 5 -35 -124 -67 174 -191
3082a91J58L02l99K65J9k76j0K98J98k25q1q1j01Q4k0J83J77l90K85j74p8K98
$$ -191 -33 269 -130 135 154 -122 -132 166 364 139 58 -23 -124 -40 -60 123 300 -90 195 21 -57 241
3104B41k52J51l21J59j07o0J97k2P5oj57N6Q3j48K79j93j34J84N3qj26L0Q9j67
$$ 241 -11 140 -181 -22 -129 -189 8 -14 61 55 -102 -46 37 -111 168 -25 -159 25 78 70 -56 -26 63 -104
3128a04J70j36P3K6j36q7K08K6J02k48PJ12K3J49m66J99J22L7j6K9MQR2m6q0m08
$$ -104 66 -70 3 29 -107 -194 14 40 142 -106 -99 13 36 185 -281 -82 40 77 61 90 94 102 194 148 68 -340
3154c40L03K06j79K21j51o7j45K1J18J02O8l84J56r4P7K8L4J6n7q7J46P5p2K0
$$ -340 -37 169 -10 211 60 -7 -152 -131 -13 89 157 -227 -71 -165 -88 -60 -26 -10 -67 -154 -8 67 -5 15
3178A5k68L22J20n9l21K83l2P8m16K03n9q9O2K75Q0k01P9J66j10k47j16M83l79
$$ 15 -253 69 189 130 -191 92 60 138 -278 -75 -134 -223 -161 114 194 -7 72 238 128 -119 -235 248 -131
3201a31P2r7K7P7m8jM1M8j83J78J7Nk03L26j76J8k1K09M8k62mR0O1j75j01KM74
$$ -131 -59 -156 -129 -52 -100 -101 -60 -12 -195 -17 0 5 -198 128 -48 -30 -51 158 206 -56 -60 30 91 -84 -185 -183 291
3228B91l07K11l4j45Nj95m2K17j87J47K85J5j3k84m8J26j68K15j21R5k01P9J52
$$ 291 -16 195 161 16 21 -174 -216 1 -186 -39 246 261 248 -36 -84 42 -126 89 -32 63 -138 -59 93
3251I3j72P5p1J84j46n8j6J67m5R8k26J63o0R9rK10l02Np6O0j9j2Q7j10K38l07
$$ 93 -79 -4 -75 109 -37 -95 -111 56 11 109 -117 46 -14 85 76 286 -16 -11 -87 -27 -46 -58 29 -81 157 -150
3277a50J04p1j6J65j12l13N06l06K01Q5j79L3j57L94j63o3l6J26pM8P2j29oK05
$$ -150 -46 -117 -133 32 -80 -393 113 -193 8 93 -86 -53 -210 184 21 -42 -78 48 41 89 161 32 26 231
3301B31k10No7O7k3j86J47l1J36l16K13J07k35L43j97J50m2j12o2J52k90J85K24
$$ 231 21 26 -41 26 3 -183 -36 -67 69 -247 -34 73 -162 181 -16 134 92 -20 -82 70 -220 -35 189
3324A89j73No8O4p5J82l09J29N3J58j47O5j35N0j73L34j31j73J12M3L5K57k01
$$ 189 16 21 -47 17 -58 124 -185 -56 -3 155 8 73 -62 -12 -185 149 18 -155 -43 0 35 292 91
3347I1j55N6J02n7j31L24m16J24L3J11j79n3J28kJ49k42P9j59K57o4j62L10l1
$$ 91 -64 -8 94 37 -94 230 -186 -62 -29 82 -97 -150 -22 -24 125 -117 -38 -197 60 -4 -166 144 113
3370A13j64P2j40J28K9j00Q1j22j29M54k13m4Q5mJ01N2J9n37L13Q0j12k3P4k5
$$ 113 -51 21 -119 9 38 -62 19 -103 -232 222 9 -35 50 46 147 199 218 -319 -6 74 -38 -61 13 -12
3394a2J06k6K43l68j20L4J2J80j99J42l8J04q4K5j95J5M54m80K22Lk40N6L3J23
$$ -12 94 68 311 -57 -177 -143 -131 49 -150 -8 -46 58 -26 -1 -196 -181 273 -207 15 18 -222 -166 -133 -10
3418a0J19r6j04N8R3L21k67Jo1j71M1n0K58j4r4o3j29J25J59J41k77K91l92jJ14
$$ -10 109 13 -91 -33 60 381 114 115 54 -117 -76 -126 132 118 24 -39 -168 -43 116 257 -20 271 -121 -122 -8
3443hJ16M2kj85K9N3M3P2j79J55j93J53m1o8M5j76L42j58M9q9J79k2o8R9j47r1
$$ -8 108 150 148 -37 -8 45 88 160 -19 136 -57 96 55 -13 32 -144 198 40 89 0 179 157 89 188 41 -50
3469e0l9O5j04J40j25N6r9Q7J14J40N3j51j20K37k58K12j89O4J1qk52J86R2L2
$$ -50 -89 -24 -128 12 -113 -57 -156 -69 45 185 238 87 -33 204 -54 158 -31 33 44 36 -216 -30 62 94
3493I4j9o7J55k52Q1j54L31k31N4J08j79J05J21m2r5r2K32p4j0k23J68Q1k7L8
$$ 94 75 8 163 -89 -8 -162 169 -62 -8 100 -79 26 147 105 10 -82 150 76 66 -157 11 92 65 103
3517A03k16j3M6K17j93J53j28P6j40K6k93L08j45J63Lj15j6K74j25k15j3K63M8
$$ 103 -113 -126 -80 137 -56 97 -31 45 -95 -69 -362 -54 -199 -36 -33 -148 -164 110 -15 -230 -243 20 68
3540F8j18J02O9k30R7l4J59k28J97J80l53J58k64R5J7M1p3K45l42L10j86K21k94
$$ 68 -50 52 121 -109 -12 -46 113 -115 82 262 -91 67 -197 -102 -85 -44 -117 128 -214 96 -90 131 -163
3563a63l2M23l53J0K36n1l8j85J40J49k52J42p9m0K89l04J55LO6l12K21r3M8N2
$$ -163 -195 228 -125 -115 121 70 32 -153 -13 136 -116 26 -53 -93 196 -108 47 50 116 -196 25 -68 -20 32
3587C2K82l76k17L71k31J88k05L27l05J19Q6K13k35j49o5K49j6q8J06j96J29J56
$$ 32 314 -62 -279 92 -139 49 -156 171 -134 -15 71 284 49 -100 -165 84 68 -20 86 -110 19 175
3609A75p5k08J87l0j42L07l30n3J54J46j21J32j33P6j20L7J00j08l6L42m31K45
$$ 175 100 -108 79 49 -93 214 -116 -169 -15 131 10 142 9 85 -35 2 102 -6 -42 300 -131 114
3631A14L7j66l8J01j53p2J8K83o9K30o64K95K17k7J73l71J06j13J34k50L75k52
$$ 114 151 -15 -53 48 -105 -177 -159 124 55 285 -379 -84 133 106 279 -92 14 -99 35 -215 160 -92
3653i2p0O2L17j41j76J09K6k43K94J6j07l9p3J68j3j34K54j03j68L16m02K04q
$$ -92 -162 -100 217 76 -100 9 35 -208 86 102 -5 -44 -117 51 38 -96 158 55 -113 203 -199 5 -3
3676cko2J73J05j53l0j83J16J60j15l4J33j19J95j36q0J01k9Qj22K13k39kJ54
$$ -3 -5 -67 106 211 58 28 -155 -39 121 6 -28 105 -14 181 45 -35 66 37 45 -77 136 -103 -105 49
3700D9r2j9q0P9J76m2r1O5P0j80J04O2O7o04K75N8L0K96l50L52n58M38j05k19
$$ 49 -43 -62 -142 -63 113 71 -20 45 115 -65 39 101 168 -436 -161 -103 -73 223 -127 225 -333 105 0 -219
3724b19M06q5j37K04j99J10k4q7j2m4j93L92k61J47j10K79q9j69p3K96j88m3p
$$ -219 187 102 -35 169 -30 80 56 -31 -43 -87 -280 112 -149 -2 -112 167 78 -91 -164 132 -56 -99 -106
3747a06J24o3o1K7J84j2J51j9j61k1l33J83j49J42K35j32j30J69l9J06k61Q0k6
$$ -106 18 -45 -106 -79 105 93 244 225 64 43 -290 -107 -256 -114 121 -11 -141 28 -11 95 -166 -86 -112
3770a12L14j51j9m15K97j8K16j2k12J20j99R8J70j57O0l8N6O8r2k69M09k03k5
$$ -112 202 51 32 -383 -86 -104 112 100 -112 8 -191 -93 77 -80 -20 -58 -2 66 -26 -295 114 -89 -114
3793a14J77J6k50K07p1r1K80k00J95k35J25j6Q7J2jn3L2K8k25K23r9p9j4Q5N2
$$ -114 63 79 -171 36 -35 -126 154 -46 149 -86 39 23 110 122 121 68 100 128 -97 126 27 -52 -66 19 71
3818G1m0O3k71KJ40j87K99kr8l2J52j57J91k16J28l2J74j42j46K50k24r3K90J48
$$ 71 31 94 -177 -175 -35 -222 77 75 -23 -55 97 -60 131 -85 43 11 185 43 -103 147 -77 -170 120 268
3842B68m16P9O9j92K25Ok45J89J09j70K67l40P6l2K01j81lO9J9K08l35K05j11
$$ 268 -148 -69 0 -192 33 39 -206 -17 92 -78 189 -151 -75 -107 94 -87 -90 -21 -2 206 -129 76 -35
3865c5M2nk86J20l9K19nk9J38r8j84K31KJ02r7n6jj62K94k52K39j60j22j13M63
$$ -35 7 2 -284 -164 -203 16 11 -18 120 22 -162 69 71 173 76 20 19 -143 151 -101 138 -22 -144 -257 206
3890B06l06O4m8K51j61J01m9JJ49j42l3j39J23q3J36l4m49M54M6j37R6J2n5J41
$$ 206 -100 -36 -84 167 6 107 58 59 208 66 33 -106 17 -66 70 36 -413 41 87 -50 46 58 3 144
3914A44k08J45j19J76l30L17l66k09N02m5P3j07K4j59L30k88K01P1j07n6K12k67
$$ 144 -64 81 -38 138 -192 125 -241 -450 52 7 80 -27 -3 -162 168 -120 81 152 45 -11 201 -66
3936f6J82k96P5K42o1k3k09K87j62Pj01K22N2l7nk0j94O8J40J38l25N5P1r9O0
$$ -66 116 -180 -105 137 76 53 -156 131 -31 -24 -125 97 149 112 107 87 -107 -39 101 239 -86 -31 40 -59 1
3961Aj94J25p2J78j57K56q2j11K15j64L3J03j39j33J65o1J35Q5j48j74J39q3J62
$$ 1 -193 -68 -140 38 -119 137 55 -56 159 -5 28 131 -8 -141 24 -37 98 183 35 -139 0 -83 79
3984G9K3M2k8j83K20k51j7L43m31O5K0r3K30n4j25J13j28J75m5o1k6R1J79l47
$$ 79 102 144 116 -67 153 -98 -115 228 -203 -138 -118 -211 19 -35 -160 -47 -175 0 -45 -106 -132 -41 138 -209
4008b09K12K9k4J33J7k94J16J32k33j04j21M22m7j99L70k42J99m17Q0q8L90m4
$$ -209 3 32 8 141 158 -136 -20 112 -121 -225 -346 76 29 -170 200 -42 157 -260 -180 -268 122 78
4030G8P6j18po3J33Kq1R7j95l0m3J77L8J43j19K0L2n1k70J51J42m5N7M1k24J71
$$ 78 154 36 29 -34 99 101 20 117 -78 -108 -151 26 64 207 88 108 140 89 -181 -30 112 67 124 165 -59 112
4056A12j13k47O0K02j64J28j10M3O9j27J27O2k03L10k71q2J1K50P9Ok57J30J4
$$ 112 -1 -248 -188 14 -150 -22 -132 -89 -20 -147 -20 42 -161 149 -122 -204 -193 57 136 142 -115 15 29
4079B9j0N9k07L16j14j64K39j56n9O1J4M7k50P4M0Pj87M60k12R5N0J8O0rj59J14
$$ 29 19 78 -129 187 73 -91 148 -8 -67 -6 8 55 -195 -121 -81 -74 -261 199 -13 82 132 150 210 201 42 156
4105A56k03J73j23j53N1J14K85n33J30k2K14l8j89pK03q6l6J45k05K45j81j7j38
$$ 156 -47 126 3 -150 -99 15 300 -233 -103 -125 89 51 -138 -145 58 -28 -64 81 -124 121 -60 -77 -215
4128b15M01j09j02p%o2L06k28j28J1J55M0p2J9N0J1k6M6Q2j50O2j60K18k41L1
$$ -215 186 77 -25 -32 -32 -94 212 -16 -144 -133 22 62 -10 9 59 70 44 90 172 22 84 -76 142 -99 -68
4153f8J02J64k07L46k26q7L9m0j55J57m4k4J08j8j51J06K26k68R1R3p1Q6j52J03
$$ -68 34 198 -9 337 111 24 63 23 -132 25 -19 -43 65 47 -104 2 228 -40 51 144 73 159 7 110
4177A10j15K9l7n3N5P6j68L21k57J90j40OQ5j15L69l82m1l09K17J67j24J96k7
$$ 110 -5 24 -13 -66 -11 65 -103 218 -39 151 11 17 102 -13 356 -26 -67 -376 -159 8 -116 80 53
4200E3j3K4m5k5j3J0r0p2J83k39J28J71N4j90p4o3Q3J16Qp9o4J48j82J69M3K24
$$ 53 40 64 19 -6 -19 -9 -99 -171 12 -227 -99 72 126 -64 -138 -201 -118 -2 6 -73 -137 11 -171 -2 41 265
4226B65m13K68k11J53p8K2q4j55J68J33k80J73qJ18k17j3R5M4L14j42j78J61k77
$$ 265 -148 120 -91 62 -16 6 -78 -233 -65 68 -212 -39 -47 71 -146 -159 -64 -20 294 152 -26 135 -142
4249a42J47Q6k41K16j57PL23m07K63J07mk70N1Qj53P2K20J8j07j59J93R5j32k53
$$ -142 5 91 -150 66 -91 -84 239 -168 95 202 198 -72 -21 -13 -166 -94 126 144 37 -122 71 166 34 -219
4273b19K96k76K97k12J98R7l16J46n5J56k29J45L19k80k57K08r8J23k97J49J30
$$ -219 77 -199 98 -114 84 181 -135 11 -44 112 -117 28 347 67 -190 18 -80 43 -254 -105 25
$$ [...]
8191A49
##END NTUPLES=NMR FID
##END=
