##TITLE=1H_CA-8769x
 DMSO, 8 sc, 
 1.10.2020
##JCAMPDX= 6.0         $$ Bruker NMR JCAMP-DX V2.0
##DATA TYPE= NMR FID
##DATA CLASS= NTUPLES
##ORIGIN= UXNMR, Bruker Analytische Messtechnik GmbH
##OWNER= root
$$ XWIN-NMR		Version 3.5
$$ Thu Oct  1 11:06:14 2020 Russian Standard Time (UT+4h)  she@DPX200
##.OBSERVE FREQUENCY= 200.1315066352
##.OBSERVE NUCLEUS= ^1H
##.DELAY= (6, 6)
##.ACQUISITION MODE= SIMULTANEOUS
##.ACQUISITION SCHEME= undefined
##.AVERAGES= 8
##.DIGITISER RES= 18
##SPECTROMETER/DATA SYSTEM= spect
##.PULSE SEQUENCE= zg30
##.SOLVENT NAME= DMSO
##.SHIFT REFERENCE= (INTERNAL, DMSO, 0, 15.7039)
##AUDIT TRAIL= $$ (NUMBER, WHEN, WHO, WHERE, WHAT)
$$ ##TITLE= Audit trail, XWIN-NMR		Version 3.5
$$ ##JCAMPDX= 5.01
$$ ##ORIGIN= Bruker BioSpin GmbH
$$ ##OWNER= she
$$ F:/spectra/data/she/nmr/H-F/1/audita.txt
$$ ##AUDIT TRAIL=  $$ (NUMBER, WHEN, WHO, WHERE, WHAT)
(   1,<2020-10-01 11:05:26.54 +0400>,<she>,<DPX200>,
      <created by zg, POWCHK disabled, PULCHK disabled
       configuration hash MD5:
       00 E9 B6 7A A2 85 ED C7 34 08 36 98 17 FE 4E 26
       data hash MD5: 16K
       81 20 FB 0F A9 91 86 09 32 74 11 AF C3 A0 BB EE>)
$$ ##END=
$$ 
$$ hash MD5
$$ 9A 19 C5 42 FD A6 90 30 72 7F 14 B3 E0 CD 5E FE
##$RELAX= 
##$RELAX= 
##$RELAX= 
##$RELAX= 
##$RELAX= 
##$RELAX= 
$$ Bruker specific parameters
$$ --------------------------
##$DU= <F:/spectra>
##$EXPNO= 1
##$NAME= <H-F>
##$PROCNO= 1
##$TYPE= <nmr>
##$USER= <she>
##$AMP= (0..31)
100 100 100 100 100 100 100 100 100 100 100 100 100 100 100 100 100 100 
100 100 100 100 100 100 100 100 100 100 100 100 100 100 
##$AQSEQ= 0
##$AQ_mod= 1
##$AUNM= <au_zg>
##$AUTOPOS= <>
##$BF1= 200.13
##$BF2= 200.13
##$BF3= 200.13
##$BF4= 200.13
##$BF5= 200.13
##$BF6= 200.13
##$BF7= 200.13
##$BF8= 200.13
##$BYTORDA= 1
##$CFDGTYP= 0
##$CFRGTYP= 5
##$CHEMSTR= <none>
##$CNST= (0..31)
1 1 145 1 1 1 1 1 1 1 1 1 1 1 1 1 1 1 1 1 1 1 1 1 1 1 1 1 1 1 1 1 
##$CPDPRG= <>
##$CPDPRG1= <>
##$CPDPRG2= <>
##$CPDPRG3= <>
##$CPDPRG4= <mlev>
##$CPDPRG5= <mlev>
##$CPDPRG6= <mlev>
##$CPDPRG7= <mlev>
##$CPDPRG8= <mlev>
##$CPDPRGB= <>
##$CPDPRGT= <>
##$D= (0..31)
0 1.2 0 0 0 0 0 0 0 0.06 0 0.03 0 0 0 0 0.0002 0 0 0 0 0 0 0 0 0 0 0 0 
0 0 0 
##$DATE= 1601535926
##$DBL= (0..7)
120 120 120 120 120 120 120 120 
##$DBP= (0..7)
150 150 150 150 150 150 150 150 
##$DBP07= 0
##$DBPNAM0= <>
##$DBPNAM1= <>
##$DBPNAM2= <>
##$DBPNAM3= <>
##$DBPNAM4= <>
##$DBPNAM5= <>
##$DBPNAM6= <>
##$DBPNAM7= <>
##$DBPOAL= (0..7)
0.5 0.5 0.5 0.5 0.5 0.5 0.5 0.5 
##$DBPOFFS= (0..7)
0 0 0 0 0 0 0 0 
##$DE= 6
##$DECBNUC= <off>
##$DECIM= 32
##$DECNUC= <off>
##$DECSTAT= 4
##$DIGMOD= 1
##$DIGTYP= 9
##$DL= (0..7)
0 120 120 120 120 120 120 120 
##$DP= (0..7)
150 150 150 150 150 150 150 150 
##$DP07= 0
##$DPNAME0= <>
##$DPNAME1= <>
##$DPNAME2= <>
##$DPNAME3= <>
##$DPNAME4= <>
##$DPNAME5= <>
##$DPNAME6= <>
##$DPNAME7= <>
##$DPOAL= (0..7)
0.5 0.5 0.5 0.5 0.5 0.5 0.5 0.5 
##$DPOFFS= (0..7)
0 0 0 0 0 0 0 0 
##$DQDMODE= 0
##$DR= 18
##$DS= 0
##$DSLIST= <SSSSSSSSSSSSSSS>
$$ [...]
##$SUBNAM2= <"">
##$SUBNAM3= <"">
##$SUBNAM4= <"">
##$SUBNAM5= <"">
##$SUBNAM6= <"">
##$SUBNAM7= <"">
##$SUBNAM8= <"">
##$SUBNAM9= <"">
##$SW= 16.880792210976
##$SWIBOX= (0..15)
0 0 2 0 0 0 0 0 0 0 0 0 0 0 0 0 
##$SW_h= 3378.37837837838
##$TD= 16384
##$TD0= 1
##$TE= 0
##$TE2= 300
##$TE3= 300
##$TEG= 300
##$TL= (0..7)
0 120 120 120 120 120 120 120 
##$TP= (0..7)
150 150 150 150 150 150 150 150 
##$TP07= 0
##$TPNAME0= <>
##$TPNAME1= <>
##$TPNAME2= <>
##$TPNAME3= <>
##$TPNAME4= <>
##$TPNAME5= <>
##$TPNAME6= <>
##$TPNAME7= <>
##$TPOAL= (0..7)
0.5 0.5 0.5 0.5 0.5 0.5 0.5 0.5 
##$TPOFFS= (0..7)
0 0 0 0 0 0 0 0 
##$TUNHIN= 0
##$TUNHOUT= 0
##$TUNXOUT= 0
##$USERA1= <user>
##$USERA2= <user>
##$USERA3= <user>
##$USERA4= <user>
##$USERA5= <user>
##$V9= 5
##$VALIST= <valist>
##$VCLIST= <CCCCCCCCCCCCCCC>
##$VD= 0
##$VDLIST= <DDDDDDDDDDDDDDD>
##$VPLIST= <PPPPPPPPPPPPPPP>
##$VTLIST= <TTTTTTTTTTTTTTT>
##$WBST= 1024
##$WBSW= 4
##$XGAIN= (0..3)
0 0 0 0 
##$XL= 0
##$YL= 0
##$YMAX_a= 451594
##$YMIN_a= -425511
##$ZGOPTNS= <>
##$ZL1= 120
##$ZL2= 120
##$ZL3= 120
##$ZL4= 120
##$ABSF1= 10
##$ABSF2= 0
##$ABSG= 5
##$ABSL= 3
##$ALPHA= 0
##$AQORDER= 0
##$ASSFAC= 0
##$ASSFACI= 0
##$ASSFACX= 0
##$ASSWID= 0
##$AUNMP= <proc_1d>
##$AZFE= 0.1
##$AZFW= 0.1
##$BCFW= 1
##$BC_mod= 2
##$BYTORDP= 1
##$COROFFS= 0
##$CY= 11.3945322036743
##$DATMOD= 1
##$DC= 2
##$DFILT= <>
##$DTYPP= 0
##$F1P= 16.9975609425685
##$F2P= -3.02152046262296
##$FCOR= 0.5
##$FTSIZE= 0
##$FT_mod= 4
##$GAMMA= 1
##$GB= 0.15
##$INTBC= 1
##$INTSCL= 1
##$ISEN= 128
##$LB= 0.24
##$LEV0= 0
##$LPBIN= 0
##$MAXI= 10000
##$MC2= 0
##$MEAN= 0
##$ME_mod= 0
##$MI= 1.114404
##$NCOEF= 0
##$NC_proc= 0
##$NLEV= 6
##$NOISF1= 3.799351
##$NOISF2= 2.8
##$NSP= 1
##$NTH_PI= 0
##$NZP= 0
##$OFFSET= 15.70392
##$PC= 1
##$PHC0= -9970.916
##$PHC1= 10.40089
##$PH_mod= 1
##$PKNL= yes
##$PPARMOD= 0
##$PSCAL= 0
##$PSIGN= 0
##$REVERSE= no
##$SF= 200.130013532006
##$SI= 16384
##$SIGF1= 3
##$SIGF2= 2
##$SINO= 400
##$SIOLD= 16384
##$SREGLST= <1H.CDCl3>
##$SSB= 0
##$STSI= 0
##$STSR= 0
##$SW_p= 3612.71676300578
##$SYMM= 0
##$S_DEV= 0
##$TDeff= 0
##$TDoff= 0
##$TI= <>
##$TILT= no
##$TM1= 0
##$TM2= 0
##$TOPLEV= 0
##$USERP1= <user>
##$USERP2= <user>
##$USERP3= <user>
##$USERP4= <user>
##$USERP5= <user>
##$WDW= 1
##$XDIM= 8192
##$YMAX_p= 0
##$YMIN_p= 0
$$ End of Bruker specific parameters
$$ ---------------------------------
##NTUPLES= NMR FID
##VAR_NAME=  TIME,          FID/REAL,        FID/IMAG
##SYMBOL=    X,             R,               I
##VAR_TYPE=  INDEPENDENT,   DEPENDENT,       DEPENDENT
##VAR_FORM=  AFFN,          ASDF,            ASDF
##VAR_DIM=   8192,          8192,            8192
##UNITS=     SECONDS,       ARBITRARY UNITS, ARBITRARY UNITS
##FACTOR=    0.000296,      1,               1
##FIRST=     0,             0,               0
##LAST=      2.424536,      0,               0
##MIN=       0,             -425511,         0
##MAX=       2.424536,      451594,          0
$$ Real data points
##PAGE= N=1
##DATA TABLE= (X++(R..R)), XYDATA
0 0 0 0 0 0 0 0 0 0 0 0 0 -8 8 -8 8 -16 16 -24 24 -32 40 -48 56 -69 80 -94 110 -132 149 -173 200 -228 262
33 262 -298 338 -380 429 -481 543 -606 677 -755 837 -930 1030 -1139 1260 -1389 1534 -1688
50 -1688 1861 -2049 2257 -2487 2741 -3025 3344 -3705 4118 -4592 5148 -5805 6599 -7576 8818
65 8818 -10446 12673 -15881 20801 -49025 451594 29386 -275575 -21301 -13678 191045 -144338
77 -144338 -114296 175665 73222 -58376 -118647 90494 228734 -30127 -128161 5547 219055
88 219055 19363 -137138 64679 68906 41573 -53448 -79197 119672 71045 -57608 -113104
99 -113104 73637 155027 -116001 -71485 85644 91578 -46096 -174740 147084 111790 -144756
110 -144756 -6954 -24253 58803 45323 -128622 33458 52785 -23375 -56738 -14303 126849
121 126849 -19721 -100893 2724 58759 55347 -72683 -39079 26281 25000 -12929 -111905 93451
133 93451 51182 -159974 24462 27153 30102 10519 -126064 73063 69093 -66151 2827 15255
145 15255 54529 -18564 -60608 51561 37807 -8377 -48048 2624 39329 -23964 6118 -29010
157 -29010 2296 54803 -59740 -33893 51047 36636 -39171 -59719 40268 39383 -25404 -52703
169 -52703 18525 58188 -83748 -17348 50273 -24042 32642 -72149 -26976 119166 -47836
180 -47836 -40895 39036 15181 10037 -35885 37223 36332 -29709 10000 -10053 16675 31752 -14236
193 -14236 -22077 -7126 56858 -16495 -48335 57018 8626 -22068 -8248 12808 45617 -22468
205 -22468 -17191 12487 11012 18360 -33672 -947 30163 -15324 -23991 -10146 39993 -7511 -47085
218 -47085 21581 370 201 1489 -16320 14874 -7967 -349 -5590 -12833 33943 -18546 -41364
231 -41364 15127 21546 -17282 -33796 18727 -529 -18535 8352 -18721 29267 1020 -44114
243 -44114 36819 8649 -500 5552 -21934 36162 -505 -20634 27562 -3103 609 -904 -5723
256 -5723 14072 4173 5043 -16828 5024 23257 -14554 4837 857 2145 10701 -24467 5265
269 5265 20381 -12144 -18153 -3593 14033 -6602 -14341 -2420 5190 2319 -25724 12351 18633
282 18633 -22273 8919 -4729 -508 19721 -15561 3133 1410 -3724 7930 -16581 8093 7009
295 7009 -17154 -1183 -925 7529 -1752 -6996 1409 -2314 16484 -9254 -7113 26299 -8838 -8017
309 -8017 6249 11430 8010 -20589 10496 11563 -13689 11188 803 -2124 6557 -2912 1637 1366
323 1366 11029 -3133 -10702 11340 -1879 275 -2241 -7417 6963 -9748 -4672 2058 -6141 4333
337 4333 -9674 -9823 9862 4014 -10005 -4544 15456 -4591 -8236 14580 -1611 2104 -2232 -4162
351 -4162 12956 -8388 2295 3371 -13365 10753 -2026 -8199 7703 -2729 -1778 -2930 2408
364 2408 3367 -3351 3773 -8254 3601 8326 -11513 3573 2065 -2537 -1072 -6034 10060 -918
378 -918 -9126 5180 308 1447 -296 -200 3500 -1943 1001 -1328 2964 1992 -6629 2067 -3970 -688
394 -688 2644 -7516 1015 -2545 -1255 2549 -5675 5118 2113 -4730 2460 4558 5966 -3969 1369
409 1369 7773 -2804 3594 895 1843 3897 -5826 4518 1039 -656 4385 -7193 4338 3475 -6318
424 -6318 5493 197 -2767 1116 147 -128 -2475 3633 -3692 -5909 4759 -2297 -2037 -2006 -839 2641
440 2641 -6670 1769 4079 -4534 663 -1087 -29 2155 -1725 -717 -1150 839 -2864 -1956 3145 -4568
456 -4568 -1129 -1442 -1757 2229 -4056 1805 131 -4235 5458 -50 -1674 3287 1262 -76 -1646 5297
472 5297 1855 -3793 3390 -354 704 1051 -1331 3343 -1962 544 1275 -1259 4740 -2437 -1677 4558
488 4558 -1965 445 1345 -498 -340 -1451 1639 -1653 -388 1432 -2643 85 -451 1391 350 -2558
504 -2558 3268 -533 -711 2431 -579 1648 -1165 -1147 1922 -521 -94 -1693 49 340 -2355 1083
520 1083 -849 107 -368 -1894 3196 -1452 -495 3143 -3234 976 1698 -1359 677 -474 624 -1403
536 -1403 -738 1605 -1856 178 -863 -714 1591 -1489 438 -581 -71 886 -2443 2697 660 -3315
552 -3315 1534 -92 -951 84 -184 -22 -1772 354 383 -855 898 -594 658 -344 663 2327
568 2327 -1340 956 865 -146 1440 -494 789 698 -673 329 -513 1128 -242 -1016 1873 76 -76
585 -76 296 697 1059 -2132 2002 805 -1808 2164 -892 -1129 842 -583 102 -852 -240 -3 -1538 754
603 754 -802 -235 341 -1105 606 104 517 -625 -589 1694 -1468 -464 1701 -1318 -331 -294 -7 212
621 212 -827 668 -537 58 290 -84 751 -625 710 92 -533 1305 -617 -15 531 -1108 1036
638 1036 -147 -575 324 -639 695 -858 44 1390 -1133 411 690 502 -144 137 1405 -1449 -60
655 -60 1125 -1453 462 -258 -994 524 -683 35 -346 -433 211 -864 849 389 -391 771 -232 -3
673 -3 7 721 303 -1183 817 118 -662 582 -304 206 -450 -394 844 -226 49 117 -15 519 -333 865
693 865 -312 -377 510 -782 531 30 -667 679 -637 -456 28 57 294 -771 829 172 -860 1158
711 1158 229 -51 -15 53 486 -919 88 -147 -748 499 -704 -218 203 -844 121 -333 306 313 -274 671
731 671 -386 128 474 -171 17 -244 9 -113 -235 880 -470 -234 194 -224 372 -472 292 357 -629 585
751 585 307 -101 345 -329 72 -375 -222 -85 -531 434 -743 97 457 -771 119 132 -20 -3 42 818 -420
772 -420 6 811 -234 146 -146 33 -281 -397 233 -232 -78 111 -553 505 26 -375 725 -106 158
791 158 66 467 655 -351 463 132 -302 318 -42 289 -399 -163 165 -672 48 194 -159 130 -118 501
811 501 86 -51 512 -327 73 -168 -545 38 -386 -69 -446 -260 7 -485 306 13 -636 658 -87 -244
831 -244 -104 346 142 -231 390 254 -758 331 -202 -321 -252 -122 110 -148 30 -200 1 364 -281 80
851 80 412 36 209 -58 11 -88 -157 294 55 -167 327 -142 -61 -107 350 251 -20 92 -45 348 179 27 181
874 181 -167 131 294 -305 393 -100 -253 115 -247 175 70 -139 -217 -90 493 -287 189 269 -218 150 150 209
896 209 248 78 -51 -40 122 289 -433 -18 44 -167 45 98 77 -134 142 157 -26 218 147 -27 -127 -140 -5
919 -5 77 -219 -191 -407 -92 74 -129 89 -178 67 -153 19 183 -109 63 -50 -351 224 -38 -131 -203 115
941 115 52 -377 -60 71 -277 143 23 180 68 217 158 -153 160 8 114 59 -180 -99 56 -156 183 -246
963 -246 -87 -12 -153 27 -47 100 -72 130 62 410 346 -210 31 138 -233 211 125 -1 252 -219 16 -2
985 -2 -115 73 -88 -8 -41 95 101 29 249 76 206 25 155 -61 -165 -66 -98 -95 14 -177 -118 286 41 -73
1009 -73 91 -111 -11 34 -124 7 -82 177 -96 199 293 1 -115 -83 14 26 -51 17 67 326 169 -96 -32 -218
1033 -218 172 326 -72 -120 -52 46 139 -106 -215 -98 -36 93 27 18 -155 -76 -67 15 -57 -10 73 18 63 -144 -181 -115
1059 -115 13 -35 168 20 56 322 9 43 135 129 -11 -112 -8 92 -48 250 56 277 -116 67 193 -9
1081 -9 70 -8 -343 37 110 -23 102 -30 38 -62 250 -66 -53 48 132 -54 226 29 85 76 -34 -2 -135 50
1105 50 -169 -356 65 -203 -150 55 176 43 146 129 7 -78 77 -62 -162 232 -123 -113 32 188 -208 -268
1127 -268 -88 -81 -127 -31 -12 30 64 232 -127 -22 146 -109 20 85 -290 -71 23 -88 223 -46 149 -218 150
1150 150 29 14 -109 18 -17 75 -64 -94 193 -208 18 51 42 40 185 12 -69 74 -115 6 111 -67 96
1173 96 -43 163 70 -45 19 192 108 -15 4 97 20 -112 -10 18 -248 -338 -204 11 85 -1 3 54 -189 97 259
1198 259 16 -25 85 -75 98 -16 -183 5 108 75 -159 23 -173 -168 64 101 189 -87 202 -267 0 60
1220 60 174 88 -205 162 1 -54 -245 153 4 19 68 -110 -39 110 -34 -174 -16 98 30 123 170 138 -113
1243 -113 -92 -265 -50 -48 47 -181 73 60 -57 280 174 224 -27 -51 -26 232 44 152 53 -62 -4 -9 164 -3
1267 -3 87 -56 -74 -11 92 -167 37 -7 -56 -43 85 -105 9 -275 -333 -69 206 -41 -41 -26 83 63 61 -9 -73 85
1293 85 -196 -1 -49 -62 2 -56 156 -109 78 -51 -104 -88 -165 -148 157 -24 134 -79 -9 116 50 -338 -122 164
1317 164 -30 -44 23 -74 -22 185 -66 62 2 71 49 -98 -124 111 76 -197 114 -13 76 54 110 93 105 -128 85
1342 85 -9 144 92 -13 157 -85 68 -226 -100 20 169 228 -116 82 166 20 -26 58 31 -256 70 -72 277
1365 277 236 31 -21 125 -97 112 277 93 100 -189 24 164 -37 -2 -22 11 125 -88 -229 -138 -5 82 18
1388 18 -65 71 -47 -38 91 -160 39 119 -185 124 -31 23 2 21 -13 -25 64 27 -27 -123 -122 -135 -67 90 -14 45
1414 45 -39 36 -38 53 -177 35 112 161 -122 375 9 -265 10 1 55 -120 -57 73 240 -56 96 -166 312 116
1438 116 99 5 -10 320 -28 158 7 -4 -65 -27 -72 -26 254 110 -110 -60 94 -48 84 70 -123 -191 94 25
1462 25 -72 110 -51 -47 67 21 -61 -175 156 35 -36 -38 -4 119 305 -129 55 167 -189 -67 -12 195 250 27
1486 27 95 -187 -4 89 86 -237 69 -88 -182 26 -87 -62 -177 132 -48 -95 130 -75 -39 -83 91 292 225 95
1510 95 8 -22 92 -18 -132 -278 76 -37 -72 246 -175 68 -17 133 -77 59 191 239 -52 -182 -99 196
1532 196 -171 15 -43 48 204 108 -57 51 -50 11 51 78 -41 -135 -213 -11 174 -27 70 175 -45 145 -105
1555 -105 -217 -208 -92 -157 26 168 -38 -125 -38 -34 -64 -29 -117 -21 -196 17 48 109 144 39 -190 96 -285 -80 -17
1580 -17 29 -81 19 20 80 122 -64 -75 -107 98 147 -111 -30 -85 167 22 -10 97 21 314 -25 -120 266 -71 56
1605 56 -143 -12 -5 -193 16 -268 -61 -38 41 -40 5 53 -34 -48 151 -67 -92 139 -149 83 -120 -224 113 30
1629 30 122 447 118 191 -251 -31 -162 108 13 266 159 -279 66 54 250 -97 -40 36 26 -96 -82 -74 -129 -118
1653 -118 -27 106 -39 154 -159 293 102 4 44 188 96 40 -48 75 267 126 100 115 134 176 -5 -74 -92 -23
1677 -23 84 -68 80 33 -221 -45 84 -122 30 -56 6 73 -59 -185 40 -59 82 -28 229 141 23 76 88
1700 88 151 -177 60 25 -87 42 42 -65 79 113 0 71 93 -40 -238 -43 -75 -28 60 143 -49 21 42 -159 -42
1725 -42 -81 -25 -209 30 -121 -255 -182 238 -107 103 -115 -165 314 -166 79 -133 3 325 -192 247 34 -1
1747 -1 -146 -209 27 22 51 -271 320 58 57 10 -72 -12 187 62 3 31 35 -189 -71 92 -19 -11 -154 78 -198 162
1773 162 -66 126 12 -200 -9 -57 -176 -168 -133 111 70 -52 -47 69 -106 65 -343 89 -42 24 -107 -31 -290
1796 -290 -18 -140 74 237 52 85 9 29 168 169 -122 2 118 20 -18 -12 -2 -182 -88 92 60 75 -20 95 213
1821 213 -140 -9 68 -147 90 -54 -90 47 -44 -117 -90 51 55 208 -88 -113 280 -110 205 103 156 15 -20
1844 -20 86 86 -33 -19 -85 -174 -100 92 -187 73 -136 -100 39 47 131 110 -7 -104 -212 -78 -131 -176 84 -35 -166
1869 -166 7 -13 -62 -111 -48 98 76 39 199 50 -17 108 -54 -130 -79 -236 -162 -183 26 -88 151 338 -90 9
1893 9 -3 26 52 -101 -37 -282 59 97 -105 191 99 126 -44 137 172 -134 -166 -68 119 234 -59 -111 -114 -13 134
1918 134 -151 56 -115 29 88 -168 -94 13 -72 -51 15 311 176 -56 -21 -268 309 -110 63 187 75 233
1940 233 21 -208 231 140 -3 77 -16 101 -146 135 20 209 68 -214 192 4 -6 25 48 82 -201 15
1962 15 73 41 -39 -255 210 -127 -175 -2 103 -30 -19 9 40 290 -107 90 5 -253 181 -6 94 242 -181
1985 -181 -43 -76 -80 -55 -107 -14 -159 1 -28 87 55 -341 -66 -197 15 57 -3 -70 91 109 -38 3 88 116 -261
2010 -261 -42 -153 -89 -63 -182 -38 -175 118 150 -30 45 14 -70 158 -81 21 13 65 -438 18 -110 137 145 -152
2034 -152 40 -27 -110 1 185 332 102 -268 48 -185 69 55 -89 49 304 -255 -240 -171 2 -51 -230 85
2056 85 -11 97 -18 31 15 143 44 -63 137 85 -78 36 9 32 -158 -154 -7 227 -163 -4 55 -22 -20 -30 177
2081 177 184 -65 134 -113 -147 -34 21 131 172 132 8 128 50 18 -158 27 92 70 28 287 169 -2 -239 -341
2105 -341 -51 4 5 -209 277 81 -144 7 188 -23 -192 -81 156 -121 -52 167 71 1 -71 129 -12 -184
2127 -184 -126 -79 144 234 -252 113 -121 -19 51 -209 134 -53 26 5 207 10 -42 31 -144 99 -99 -45 79
2150 79 88 -132 70 -175 11 53 -27 -31 -4 -92 113 -187 56 -115 -89 0 -91 -103 35 -50 129 71 -112 64 18
2175 18 40 -246 286 -184 219 -266 -101 -38 18 -74 -13 -85 4 -35 138 53 -27 -28 155 214 -160 -105 -75 51 34 150
2201 150 64 79 183 -155 -129 -91 -136 -37 -83 -75 -168 141 -230 -60 -104 -130 -6 118 152 275 16 177 29 -73
2225 -73 -124 68 103 -12 251 -87 0 178 43 -7 62 165 -81 182 -183 -54 264 -81 110 40 106 42 -28
2248 -28 215 -30 -11 -192 169 -50 127 -120 -33 137 228 148 -238 170 75 160 170 63 46 204 29 51 -36 -223
2272 -223 -59 -80 129 121 235 129 148 43 2 -38 122 7 112 -4 196 -126 51 12 -121 -74 7 162 4
2295 4 -276 -150 -32 94 85 -9 63 -89 177 42 -203 -10 -17 45 211 173 -73 43 38 9 -47 -110 -105 80 14 94
2321 94 74 -159 270 52 -106 132 23 -137 124 126 -43 120 131 118 3 -28 -139 98 32 270 463 62 -180
2344 -180 -118 -96 -153 93 88 -120 4 115 1 -9 213 -24 -75 -44 -6 141 80 -24 22 59 92 66 5 209 -168
2369 -168 -125 -284 95 74 199 79 63 -36 144 33 -59 114 9 -68 -57 -69 -72 -69 -26 -209 -59 -234 42 -158
2393 -158 52 3 30 -3 28 -129 11 8 -37 -66 96 69 -37 -130 19 9 8 -125 65 -22 -125 300 49 22 61
2418 61 112 -100 56 -50 -138 351 125 -103 -30 5 -208 -41 -110 -122 -168 81 243 -149 24 -160 -89 -110 11
2441 11 -4 -34 37 29 93 257 33 -41 -58 388 -14 213 116 188 10 266 251 260 -176 99 70 -83 -270 36 -100
2466 -100 -9 60 -112 -73 2 47 -2 99 15 -134 -5 -11 -137 -23 264 52 -176 -2 140 95 -55 -244 -25
2489 -25 -104 -84 115 122 -11 -132 -120 211 105 78 254 -161 116 -59 -115 -76 -122 -43 -8 -27 226 -49 -1 -139 -11
2514 -11 -182 17 70 102 -65 -246 -82 -115 -42 -98 83 -19 -213 129 30 44 -114 -157 -75 -35 -153 -119 95 139
2538 139 59 -2 1 -93 -96 31 74 -327 -57 -13 175 -28 29 42 -2 -151 -130 8 54 -130 14 -12 -75 -32 -32 47 12
2565 12 225 152 177 7 -144 235 71 -151 -63 -130 5 255 101 -41 -146 -80 131 -41 78 -164 137 -219
2587 -219 -168 -96 101 190 -47 163 67 -29 -88 305 -86 -59 -8 -262 -239 173 -237 -130 -119 -155 199 190 95 -184 102
2612 102 99 229 35 -243 -155 26 109 65 227 96 -43 164 -80 88 229 -35 -203 29 146 8 -80 95
2634 95 -26 -94 78 119 -140 -70 374 4 -171 -87 69 17 169 -43 -44 -69 120 232 -18 278 21 266 141
2657 141 116 166 78 -74 -158 -73 -162 25 4 31 -64 -440 1 153 162 93 -189 106 -54 77 -70 174 -194 -182
2681 -182 123 170 -109 -93 56 64 80 138 87 -1 239 208 -51 -82 -59 105 -28 -1 16 238 -58 -65 -113 -138 58 -125
2707 -125 134 54 -65 25 -137 -278 -250 -7 -54 124 118 -99 112 -218 -287 -64 70 113 9 -166 -216 -229 -150 -41
2731 -41 -224 -53 236 103 54 -20 40 -163 47 50 54 -77 -107 -90 158 196 13 76 13 -267 0 206 87 23 -26
2756 -26 -206 -51 123 85 177 24 -11 -56 -40 -21 -1 45 108 126 16 -97 -112 -72 170 40 -24 211 -206 149 185
2781 185 87 86 -13 34 -102 107 21 172 151 -166 229 96 -65 63 -166 33 -106 126 -78 46 -188 21
2803 21 121 -49 -44 61 -210 -104 102 -90 -262 -209 -21 254 -159 -112 91 -49 85 159 -178 137 -146 -144 26
2826 26 -52 26 -18 148 -151 70 42 -59 5 103 -73 61 66 155 52 -48 176 61 17 47 395 0 55 -5 -244
2851 -244 -232 -214 -132 -80 71 -98 -72 -42 255 99 39 -43 12 -156 -151 -57 -32 -189 -130 115 -192 -30 51 8 118
2876 118 -149 66 -91 89 90 128 386 7 151 -143 110 35 -72 130 -45 -314 -4 108 -74 -111 -14 45
2898 45 19 44 -69 8 -32 212 -48 123 17 46 61 63 -85 -73 -197 158 182 -23 -165 143 136 66 81 -33 -39 -68
2924 -68 -128 -271 267 -111 17 108 -63 92 -64 133 -9 -205 231 67 90 -69 -113 85 71 -24 87 65 -43
2947 -43 -5 156 -11 46 32 107 -32 -256 -152 74 45 42 -131 -272 32 -298 51 83 -312 -68 -41 -43 -85 -82 44
2972 44 -185 24 103 40 -59 -99 2 -116 -110 43 33 -2 -201 -15 -38 -96 52 -8 -150 179 35 153 -37 297
2996 297 -74 -134 15 12 -95 36 -6 29 -151 4 -12 50 180 -186 247 148 -138 -248 71 56 -102 -37 44 -76
3020 -76 178 -63 43 136 44 144 -209 147 21 -166 -86 -161 -3 120 -133 33 -273 27 79 -22 -197 9
3042 9 -85 -225 -118 -172 99 -248 -53 -139 -284 -92 -370 3 19 42 -364 -213 56 -177 130 -108 67 -318
3064 -318 69 101 -79 152 80 70 -157 -291 245 101 104 12 122 38 118 60 -37 -69 117 -116 25 -46 68 -23
3088 -23 -52 -268 92 -57 40 19 -186 38 228 -180 42 -134 1 88 -141 -27 -113 74 116 -269 -90 39
3110 39 31 133 -20 34 -65 -1 6 125 11 86 -20 137 -200 -86 170 -90 -248 -69 92 -157 -16 13 60 7
3134 7 88 -69 -22 43 105 -161 -271 108 -86 125 -20 11 -29 -200 143 5 176 -50 144 141 -53 -135 -71 85
3158 85 -10 -3 178 -87 53 -306 49 -4 179 77 -229 -213 40 -52 61 -214 -127 38 -2 1 -3 21 104 -46 -216
3183 -216 78 219 9 -46 101 68 -162 227 132 78 -153 -243 -245 -74 22 60 -249 -28 134 -107 77 19 24 -88
3207 -88 -35 78 89 82 112 197 10 61 -52 246 188 -5 200 -134 -4 -116 268 -63 80 -78 -149 146 -4
3230 -4 -59 -126 59 -43 -319 -246 -4 64 -155 -152 -118 -175 -120 -128 67 76 53 -63 58 143 86 158 249 -182 -59 72 160
3257 160 -43 -144 31 160 -3 -217 -153 24 299 258 -155 219 168 122 -74 -31 172 -5 -120 148 55 31
3279 31 96 -21 -197 -162 -67 -34 -54 -35 28 -85 186 274 138 -118 140 133 -94 -21 175 132 56 56 109 77 48 247
3305 247 32 -75 166 -125 -14 -22 -157 80 146 -58 -139 38 16 -63 286 -210 45 -38 -204 -22 -135 53
3327 53 39 -92 -26 193 -100 173 -165 -25 101 92 251 -74 -200 59 -211 -149 75 182 -188 417 215 -66
3349 -66 -6 -13 56 -72 82 -111 22 -372 -75 -77 93 139 96 41 108 159 122 182 -200 205 22 82 223 -33 -56
3374 -56 163 -36 155 272 -245 63 -286 -49 -118 30 -26 45 14 24 -49 -182 -150 -118 83 -37 -49 -135 93 -7
3398 -7 -15 -22 186 43 -294 -86 53 9 175 102 -243 -139 48 -8 123 -307 128 64 24 -33 -91 -63 -134 128 -42
3423 -42 302 317 -137 14 154 38 -162 0 228 178 -25 43 -79 -37 92 152 39 31 298 -43 121 -160 74
3446 74 21 25 -60 -189 -178 142 59 -79 -54 22 101 -53 -27 -54 -181 66 -36 -9 13 146 154 101 307 -54 306 238
3472 238 -15 -67 -34 5 16 57 161 84 -10 142 109 88 15 -63 -75 -84 56 -19 -97 -22 12 114 -3 -25 -126 90
3498 90 -186 -36 -153 225 83 -40 -147 -276 -28 47 202 -36 203 9 -23 -246 117 358 -300 39 -41
3519 -41 108 -43 -83 -120 119 -173 -146 -15 -68 -67 -81 -12 71 -163 155 -211 41 -62 95 234 -168 -146 -13 308
3543 308 147 32 -32 36 16 -40 -86 -207 -40 76 53 -22 -220 -142 -14 -53 195 228 -141 85 22 84 -40 -190
3567 -190 0 123 113 -393 -269 -5 13 -254 -37 185 -124 130 149 -45 26 -276 -208 107 -111 -39 -166 -3
3589 -3 162 -114 -35 149 -51 -68 -84 185 135 108 -108 -44 -141 20 -87 -100 -78 -33 60 -179 26 -194 114 -122
3613 -122 90 -78 -75 138 -126 68 -100 289 -237 -39 69 -94 -52 -150 208 -80 -118 -99 27 -19 -62 37 267
3636 267 124 120 -380 98 -272 54 88 174 -181 186 8 22 134 54 -45 15 -201 -271 -83 -54 113 105 194 35
3660 35 72 240 109 146 88 -104 106 39 191 -146 -179 -37 22 67 -146 -31 -91 -158 99 165 283 207 164 -54
3684 -54 -98 52 162 -55 86 59 208 -84 -215 -2 -91 56 -78 50 -74 -105 27 -64 68 73 -245 100 9
3707 9 -83 31 141 -31 134 86 -94 -74 -177 -70 -38 3 -77 68 -58 -6 -25 -37 277 85 83 234 131 133 -153
3732 -153 153 116 -54 -25 -227 -161 -39 174 27 -50 155 164 -125 85 96 161 -61 162 106 -149 -76 96 156 -22
3756 -22 -127 52 99 121 -1 155 -176 56 -14 -102 13 86 265 -220 63 -149 152 -51 39 -121 99 -149
3778 -149 29 -129 102 -22 -20 -195 267 9 -13 174 50 -69 272 -200 -107 -30 231 -183 -239 26 -330 61
3800 61 53 164 -225 -115 78 -75 -82 -82 -190 66 -149 -27 -52 -112 160 -141 -6 217 47 39 -76 -117 -149 179
3824 179 185 230 25 9 -146 -115 -227 -135 69 66 -127 156 82 -215 119 29 -30 -108 205 -37 37 -73 16 90 -199
3849 -199 -141 -34 124 304 86 15 187 -128 110 -88 -43 -148 -149 131 11 -33 62 269 -62 37 88 204 -41
3872 -41 -3 -67 -175 -79 78 163 212 130 92 199 79 -50 243 -149 -14 269 -28 149 154 133 -134 11 66 199
3896 199 -182 7 -56 -50 -170 -3 -214 15 -34 -25 83 22 -171 -99 -116 181 13 -217 4 -20 118 50 180 -124
3920 -124 -131 -9 94 -46 32 28 -83 113 -50 88 -94 -7 48 -52 -94 -11 -29 -16 215 -56 149 125 -165 29
3944 29 35 147 -196 -82 2 166 11 -83 171 -71 33 -105 -5 121 -50 -45 -37 -29 -63 124 106 215 260 279 54
3969 54 157 -40 23 27 43 -64 126 285 -167 -101 94 167 -147 212 59 -151 134 135 -141 -75 85 114 -95 91
3993 91 140 -108 48 99 90 -190 29 159 -2 -79 132 -110 -194 199 139 -117 -69 -90 128 20 73 40 21 9 217
4018 217 -20 -8 -42 -318 40 10 47 11 -41 49 -129 -132 -93 -32 170 16 -98 -43 80 -184 -68 -158 27 -97
4042 -97 129 77 152 104 1 11 -89 52 161 82 176 47 -153 251 -29 -261 -63 242 -20 90 -41 33 -140
4065 -140 62 66 198 -31 153 55 -129 -83 -25 56 10 0 -111 -108 -114 84 -115 76 -55 213 232 -167 84 -176
4089 -176 -95 162 132 -229 61 95 -14 -4 -45 6 -50 -190 -40 137 -107 88 75 -204 -223 110 10 227 134
4112 134 0 34 -105 -20 106 -64 -45 89 89 -14 125 86 -59 -37 -326 -31 30 -6 -155 126 -115 -87 -120 -22
4136 -22 -18 -18 -176 -62 1 15 105 -96 -99 -159 58 93 106 101 -100 -354 113 -149 231 -162 269 -20 -184 -280 -148
4161 -148 138 -168 143 7 -41 5 -184 -54 132 -121 86 265 46 -75 289 -50 36 -12 -87 130 112 -69
4183 -69 -220 -108 19 -11 -15 -143 42 -226 -132 0 -74 146 50 55 191 31 -135 330 -106 -158 -169 -99 -59 -203
4207 -203 82 183 159 -122 109 26 38 -305 -38 -151 58 -178 -147 50 -74 -23 162 -283 -117 87 -65 47
4229 47 172 -51 -1 -55 -184 -96 123 37 -118 -190 -52 -40 7 -6 95 67 -80 -228 -250 -162 58 -303 58 90
4253 90 1 124 -36 -192 381 -16 -211 -44 132 -4 171 79 22 205 6 -231 -15 -40 -229 -60 29 -272
4275 -272 26 68 77 191 -26 -11 -44 -111 90 195 -155 110 13 48 -262 -43 -63 -257 71 -103 -84 20 142
4298 142 218 311 49 136 -41 -293 80 93 -171 -13 -138 -20 -55 55 -164 112 47 106 81 224 60 -146 -86
4321 -86 -57 351 -73 -39 -104 45 81 -85 -55 124 72 -56 131 26 148 3 29 -203 37 -69 189 -62 300
4344 300 52 -19 50 -64 8 -104 191 7 39 -228 102 -239 -52 -30 106 -35 -216 -143 -18 -35 128 29 49
4367 49 61 -50 85 131 102 70 -45 -152 135 -87 -58 -135 -18 31 -109 -103 -126 215 78 -113 -22 -54 19 -98 22
4392 22 -451 -171 68 30 333 133 -34 -225 -97 166 -17 235 60 70 -163 -214 106 -13 -41 90 154 -57
4414 -57 148 172 -75 33 173 166 -285 6 -34 -112 40 -59 51 -111 -144 -34 -39 14 64 79 -62 38 19 205 -131
4439 -131 123 75 75 -5 259 127 -114 18 42 207 -42 25 -209 -12 -110 55 49 94 164 2 20 166 -248 67
4463 67 -26 -38 42 -316 -39 -82 74 4 -9 -103 -75 -150 -76 -25 -225 -33 24 -55 57 106 -72 -71 89 -101 88 138
4489 138 -339 34 191 -61 -246 -81 52 63 69 65 -55 45 -207 5 -194 -125 104 -18 49 -129 194 -186
4511 -186 -48 5 265 27 21 4 -7 38 -171 -29 126 -87 60 -95 -82 245 -23 174 -40 -28 21 273 1
4534 1 122 32 99 -229 29 -3 160 -281 107 58 -8 -40 178 44 -269 74 177 267 140 119 -242 47 -133
4557 -133 -67 131 -44 -36 86 4 -37 -24 -150 82 39 -138 -41 -113 28 11 10 85 -90 77 -7 -24 139 -67 -249
4582 -249 -216 59 248 3 -83 71 65 114 -25 302 37 -152 -154 101 -254 74 -54 -172 4 72 47 -42 -32 -43
4606 -43 72 150 -120 175 -63 -93 -25 -119 -224 -132 -292 85 -32 60 -81 -125 -45 -132 36 -251 75 261 50
4629 50 171 54 -124 -44 -118 152 20 -55 -93 -95 234 185 -132 -71 20 196 -69 199 -76 -3 44 233 -59 -61 -185
4654 -185 -112 106 -198 271 99 -47 135 -82 -244 -168 -103 261 -14 -50 -171 -68 53 -11 183 -106 71 189
4676 189 -6 -130 -64 -158 -188 -43 -255 202 -230 -155 133 -159 -119 -86 -208 205 -32 -35 -49 213 265 24 -46 109
4700 109 11 130 -189 -121 20 -80 117 153 40 -125 -69 -90 253 -67 153 -42 84 -20 109 65 52 -68
4722 -68 -112 -42 109 -44 80 -59 27 215 -191 77 -113 207 331 247 2 -40 11 179 187 -82 -127 73 19 -186
4746 -186 -138 333 47 149 11 -74 74 -67 69 -70 74 -189 180 133 -98 7 -42 41 75 133 46 103 34
4769 34 -69 -110 -20 81 314 15 70 -51 -63 -94 -132 -165 164 40 26 216 -246 176 32 143 17 -175 78
4792 78 -157 -96 128 317 60 -62 -29 -271 15 -297 6 16 129 27 237 147 100 125 151 -135 -206 53 67
4815 67 -277 -110 -15 -341 52 -156 -1 -47 -71 -125 -24 -110 -60 85 135 24 260 -12 51 35 -65 -270 -46
4838 -46 -18 -7 -43 -66 -35 -205 31 43 12 -121 29 -60 94 65 69 44 -56 -13 181 116 -64 -49 -228 66 122 -85
4864 -85 118 90 -71 -179 -32 -19 -32 238 31 -197 205 232 -106 137 81 -94 -37 -92 -86 -35 45 245 -69 99
4888 99 162 0 -77 -82 158 -37 49 -104 76 99 -9 223 -12 48 177 -222 -250 -131 -68 119 68 67 43 101 -57
4913 -57 -75 -113 96 24 -41 136 176 -48 -5 -35 -41 268 84 27 -210 39 -86 -209 -205 -161 -174 -29 205 -123 -120 58
4939 58 24 -314 192 109 -242 4 -80 96 -52 175 109 -153 -119 -5 30 82 -58 -120 44 -74 1 -46 234 -257
4963 -257 -80 24 214 225 265 104 -129 -252 152 -59 64 149 142 13 198 195 -103 -58 -98 16 119 44 -47 93
4987 93 90 -86 174 13 -26 -2 -131 -22 -138 67 118 38 -30 211 -131 -374 -14 49 -30 -104 -112 -87 32 120 -195
5012 -195 5 -190 76 8 82 70 104 103 -96 12 -40 52 205 -18 16 -59 -71 116 -30 37 -389 67 -65 -188
5036 -188 -78 181 -127 54 56 34 -162 87 -259 114 -323 -39 -62 -85 62 225 -243 -97 -120 -144 134 -77
5058 -77 148 -70 -44 140 154 -83 57 57 -267 -187 283 -249 -51 28 66 12 23 -276 10 -100 55 112 -83 79
5082 79 53 -81 35 139 66 -76 162 93 -145 41 -66 -89 39 -13 90 -28 -178 -6 -124 -39 49 211 82
5105 82 -44 43 -218 89 -145 215 81 118 96 240 -279 -42 -2 18 117 156 98 -147 -280 -86 207 -8 2
5128 2 -58 -89 -43 -27 25 -236 -7 55 -104 221 142 -109 15 -58 111 -280 -65 91 -50 93 -96 -47 -18 -132
5152 -132 253 56 -6 -209 -42 148 19 -21 -59 105 -4 14 -77 17 -165 38 -113 -26 303 20 5 -179 34
5175 34 -159 86 -39 -259 7 168 -154 -101 75 54 -21 163 140 -12 5 -273 -8 35 -82 -1 -51 257 -142
5198 -142 -376 299 -165 135 11 65 149 -70 186 130 -112 115 76 133 -178 71 219 108 -174 -53 -191 132
5220 132 -142 198 60 76 14 92 6 -66 -50 47 157 -88 218 -226 -11 56 -109 -187 55 -65 90 221 95
5243 95 246 19 -49 186 51 -23 -140 16 -59 2 51 237 38 201 128 -118 -157 -3 280 -99 72 -55 87
5266 87 111 -181 -93 41 23 -292 21 16 -50 -174 -87 101 34 44 44 -26 53 -75 129 -184 31 -16 53 231 -116
5291 -116 -170 198 67 79 73 81 13 -31 222 -12 -88 -50 100 1 -22 -79 31 2 104 -244 94 116 64 -172 112
5316 112 102 -134 214 120 -132 177 -4 -155 -12 -38 53 -87 192 25 -111 -85 -265 90 177 -292 -69 52
5338 52 215 -82 -139 9 -70 -146 -135 37 17 -142 -28 41 27 -52 -46 268 35 -147 70 0 -45 -128 -155 -98 -94 59
5364 59 -7 -26 85 52 95 -184 36 25 214 85 -75 196 26 3 60 253 -114 41 196 146 35 96 21 123
5388 123 86 -248 8 -160 -19 36 -21 -170 -70 156 -28 -15 -30 -135 -72 69 -48 143 -19 -257 146 -140
5410 -140 -125 -12 114 19 157 -3 -24 177 8 -83 -8 -213 -15 62 -111 154 -31 234 -7 -158 2 -149
5432 -149 -31 -96 -37 45 -27 -127 17 -130 -174 108 -248 -61 -124 109 -110 150 101 -189 27 187 -230 -103
5454 -103 56 -2 216 151 -106 -137 160 -241 -130 43 -45 -243 0 -156 207 109 34 -71 296 -48 -21 -61 -213
5477 -213 -91 -29 29 158 3 -33 158 123 -217 -138 -104 -14 131 191 -5 -66 51 -25 76 166 -91 -203 169 209
5501 209 -113 26 119 -62 -65 27 -108 180 37 52 92 164 -20 -97 -52 226 -78 -298 -149 -80 -80 32 216 149
5525 149 -85 -79 -63 39 52 102 -117 14 125 -117 -178 72 141 84 -73 -60 113 136 153 -157 8 92 17 54 -49
5550 -49 -9 -110 -159 114 -162 -194 9 152 4 17 79 -5 5 -15 -18 -30 -17 251 181 -32 3 -160 72 -87 158
5575 158 -164 6 22 -120 20 -353 -36 347 42 12 85 -147 -181 121 70 -230 175 -38 58 -227 -100 13
5597 13 64 -160 -152 19 -94 -76 205 25 -109 47 45 -89 71 135 -202 -115 111 -244 10 11 -74 -54 -101 -65 133
5622 133 118 57 -31 176 123 -330 -160 125 190 -115 139 -28 3 43 31 -11 -41 200 -106 80 352 -51 -4 129
5646 129 66 -21 -59 -3 -175 194 95 -52 341 119 250 196 -293 -54 29 -106 -101 -86 136 115 6 -90 4 -158
5670 -158 61 -164 23 -62 -78 -52 -18 67 -123 8 -54 156 177 17 24 177 27 48 -52 -42 75 -129 232 57
5694 57 -115 48 -77 222 56 186 -128 123 42 -71 311 -34 46 -110 71 -110 -1 2 50 -26 162 67 66
5717 66 95 -148 -222 58 -46 -157 59 -43 -52 -46 -37 -28 -108 136 -16 -234 5 -140 207 -51 284 24 -44 -30 -181
5742 -181 131 94 -164 -137 47 26 -127 -56 -79 66 -55 -138 65 16 33 -3 109 80 72 -147 5 46 18 251 -4
5767 -4 -38 -79 -202 -9 25 -103 182 91 161 118 -191 -57 -42 -192 -33 -13 -28 357 73 57 -13 -100 -195 -177 318
5792 318 -80 34 0 -17 -98 -1 104 -61 52 17 -16 -162 179 98 -34 97 -7 -88 82 -3 -24 -71 17 -63
5816 -63 -55 23 199 92 107 -43 -18 69 -113 -20 97 94 28 89 172 125 -51 -178 -24 -61 42 123 45 31 121 160 49
5843 49 -39 16 41 145 12 -40 45 61 42 77 -192 -67 199 -16 175 -53 -48 8 203 -155 34 -125 24 -186
5867 -186 3 66 -31 13 -24 54 -111 -41 34 34 -197 91 82 220 -85 202 -119 150 110 -9 67 -243 -178 -29 -96
5892 -96 51 41 -79 -140 -229 21 2 -108 -50 -6 154 -81 26 -84 48 -158 -41 77 -77 -52 113 45 -145
5915 -145 134 101 -181 1 52 -112 -45 -147 -98 72 -69 -28 183 -168 -79 4 -149 105 85 107 -42 165 -34
5938 -34 9 -26 -153 -48 47 166 -250 -195 -2 64 79 340 -27 34 -31 -43 -144 -4 56 -97 90 193 91 -102
5962 -102 92 322 99 -163 80 -63 104 205 -75 12 -181 34 -132 -243 239 40 -122 25 -235 20
5982 20 -97 184 183 105 188 -20 -23 -134 -102 -264 142 -69 35 -10 -151 303 265 -40 214 42 -143 12 139
6005 139 226 -51 -7 -85 119 -96 208 25 -2 -207 211 -219 84 0 21 -79 41 158 -157 41 -14 99
6027 99 71 -194 -22 239 248 68 -73 -197 -65 136 -81 85 124 303 162 -58 100 220 200 -70 111 -179
6049 -179 -206 -340 80 -133 17 -46 19 137 -52 -18 -60 27 134 -118 -258 104 219 -26 2 53 -47 145 39
6072 39 153 33 -63 -14 -119 -160 45 -335 -160 129 -49 60 51 -18 -195 -47 70 -55 -51 259 213 -91 124
6095 124 -232 3 14 -61 130 54 9 154 -46 47 -53 -117 97 -239 -225 127 125 -7 92 141 115 -183 8 102
6119 102 34 -129 -120 88 142 19 130 -95 -198 -139 -76 -15 132 -170 -84 -140 -23 -103 -81 -173 16 54 -108 101
6143 101 13 -60 -36 -166 -70 -47 -5 187 -82 -53 -21 -84 85 200 -122 62 -69 227 195 -116 -93 217 113 -161
6167 -161 -76 -43 -59 194 227 229 295 -49 -237 -59 -65 -33 -160 -73 7 212 71 196 -54 -46 229 76 27 -137 -113
6192 -113 -87 64 59 -135 165 144 -189 -168 242 136 -177 42 -120 -27 73 -133 68 -136 -432 -257 -99 -282
6214 -282 -214 -200 -14 3 140 -163 109 79 198 97 29 138 -193 183 -307 -133 -44 -65 -13 161 205 -87 97
6237 97 261 -69 -54 -271 20 -45 177 132 63 183 32 166 4 -86 108 61 -90 -154 33 -58 -213 -314 119
6260 119 -38 -127 86 -72 -242 86 93 146 -96 104 100 -95 -244 31 116 -222 21 98 -27 -218 -33 39 -317
6283 -317 -74 -2 -132 -73 -103 69 -71 137 -44 -31 346 -10 -224 -2 252 -23 214 111 172 98 6 9 -79
6306 -79 209 76 128 208 117 -61 -45 15 -95 95 -49 -103 -91 -105 95 36 35 67 63 -24 103 67 -179 -18 -72 -159
6332 -159 279 -89 -176 301 -127 -180 -31 -39 47 51 172 -34 -88 73 -80 135 -6 117 -52 47 103 -42 52 -45
6356 -45 81 246 42 27 -16 72 -15 -148 101 -83 -10 101 -153 -36 237 -65 190 57 -57 -260 272 72
6378 72 95 125 -41 -117 90 -71 -55 -11 -29 284 -2 -81 -45 216 -32 49 93 62 -55 -140 -133 2 -94 -55 201 -39
6404 -39 -234 -126 182 180 81 -64 -124 -160 -112 99 81 129 272 -366 -32 63 48 84 -168 68 94 -66 361 31
6428 31 -124 51 -74 247 28 161 -251 -110 173 1 -126 12 87 276 -75 295 -61 38 -117 10 57
6449 57 -23 -115 15 86 65 8 -205 227 -114 -88 142 7 -86 251 -64 167 -121 152 0 -99 78 190 27
6472 27 71 -153 86 -120 33 -85 -147 57 -52 -181 -70 86 -100 -28 140 -88 -157 -40 91 -72 95 -67
6494 -67 120 -45 11 126 -81 18 -94 14 -61 36 164 -124 232 -65 13 -49 -67 -151 -61 -7 -83 -139 -257 140
6518 140 -160 -147 10 -22 115 34 -75 134 -53 110 -26 -73 83 -6 143 -221 218 -134 -243 31 -160 117
6540 117 186 36 -110 69 221 171 -31 175 77 94 24 68 -53 50 -87 -46 -176 -56 140 214 197 56 216
6563 216 56 -29 47 139 -141 158 -145 34 181 61 114 -35 -112 192 -6 -99 -56 -136 -69 -34 -13 -43 -125 -13
6587 -13 -104 157 -193 -135 39 12 -85 -85 -17 -46 -49 45 -95 181 318 51 85 155 149 -92 40 3 -110 87 -170 -199
6613 -199 -99 -38 -52 57 39 -77 -83 79 165 14 -156 21 -133 -41 5 -199 37 115 52 -30 89 127 -80 -48
6637 -48 -33 19 -187 -123 -22 -314 -252 -210 115 -3 -65 63 83 -11 157 27 -25 -199 -114 151 79 -12 -26 -164 -29
6662 -29 -135 -54 227 -44 67 287 -138 146 16 -12 183 23 -67 236 -172 195 9 -179 -268 -17 -68 -75 126
6685 126 -48 110 -34 19 -50 -2 231 363 199 1 -246 -136 -222 -193 -92 206 109 370 47 118 -6 -190
6707 -190 78 -140 -15 -40 21 -145 126 3 -39 93 108 245 17 -352 -56 -247 208 27 65 84 -24 -113
6729 -113 -143 130 43 -219 -36 207 -83 75 -124 58 -19 79 251 -93 128 -60 -276 31 -77 107 8 -258
6751 -258 11 71 -30 -97 76 -25 -34 -156 20 93 -57 -78 165 -65 31 -257 -241 -207 -87 35 -42 -177 -88 -64
6775 -64 262 32 -151 -159 165 -14 -110 27 40 -197 134 31 -140 -141 40 95 80 -240 -52 72 37 -214 2
6798 2 132 -89 -51 -37 156 -28 54 -153 -153 148 80 60 80 -131 -19 45 -211 53 269 -26 96 225 112 105
6822 105 178 -28 118 -44 24 10 172 -152 89 -75 -109 -26 -126 187 30 -10 203 -40 -62 252 -188 -144 -69
6845 -69 0 21 31 -138 -225 -55 -184 66 327 245 -47 56 203 -13 129 56 -51 -120 80 -21 138 -119 -94
6868 -94 -120 125 -152 138 -188 -254 -102 -67 250 125 -82 -1 -61 -61 -36 -1 -67 139 69 133 108 -54 178 42 112
6893 112 -79 -98 21 47 42 -42 19 239 208 -97 -35 197 111 -30 164 126 107 67 141 98 39 -174 -18 236 23
6918 23 -45 73 -53 -44 -199 131 -10 -265 -18 -18 111 35 -22 10 -74 9 -105 -168 39 -177 15 -75 128 -137
6942 -137 -180 -117 -31 4 -185 206 -1 -43 80 -83 -105 -79 213 -71 -54 -313 -207 -75 -52 68 -101 -63 -41 194
6966 194 168 164 58 -289 -130 130 -108 -81 265 -340 -88 103 -116 -170 -31 152 -70 163 65 85 -89 139
6988 139 -121 13 56 -66 -130 -52 -27 120 -145 -11 98 218 69 -50 274 71 -93 -97 126 130 262 148 62
7011 62 125 -31 46 37 18 62 82 24 -18 197 -17 130 267 81 165 122 59 -117 -103 -127 43 -42 -270 123 -19
7036 -19 -82 -119 264 134 18 130 -125 -341 -26 20 46 -92 46 -114 71 86 -61 161 13 25 -77 77
7058 77 12 -9 -64 -82 320 102 -223 121 149 294 -14 -26 16 -120 42 -131 181 61 -192 18 -175 23 85
7081 85 -38 91 -30 175 103 56 122 -72 108 -88 -232 -26 201 148 142 -65 34 97 105 23 -11 33 -125 14 -39
7106 -39 97 21 64 -94 -96 147 -39 -123 -86 49 -170 -142 -464 -133 87 149 61 6 -176 -49 160 -15 -97 -39
7130 -39 79 358 -66 77 30 -381 148 51 61 2 -113 -72 274 -145 -76 11 118 157 -39 180 39 -101 -71
7153 -71 -74 -21 195 -67 -70 80 -105 130 -151 -156 167 62 127 170 129 -67 78 206 230 41 180 -135 -70 5 74
7178 74 320 176 80 210 113 -46 -18 177 -8 2 138 19 50 -36 85 238 43 257 -108 191 131 -163 25
7201 25 167 51 -270 -17 -86 -1 -20 -53 -87 -193 53 68 8 0 -81 75 123 -144 -211 44 100 44 35 314 20 -57
7227 -57 -48 96 22 -11 -65 -60 1 50 287 14 249 189 -26 -97 -212 -196 -3 -113 -5 -31 136 112 210 -184 102
7252 102 57 90 15 40 153 -162 19 -65 113 -36 -75 241 48 -56 11 155 142 -195 27 8 87 48 -100 106
7276 106 -198 151 -133 -89 1 -45 69 -48 27 -11 -97 85 -136 -43 -100 80 -59 93 -208 67 23 98 -68
7299 -68 -73 111 122 -28 34 -102 79 -220 -30 374 -51 202 65 -108 -182 -179 -66 -22 9 -117 109 15 115 -87
7323 -87 105 119 -43 -55 152 -128 -154 -72 7 70 -152 -36 -92 -48 -360 -214 183 80 -63 -137 -55 59 142 -11
7347 -11 0 -3 -46 62 -200 -288 -110 -177 191 -155 -226 -47 -77 -16 -128 47 132 -199 17 -73 -111 69 50 101 -224
7372 -224 127 24 -24 72 185 -7 -15 -98 -103 -111 -292 -11 -39 -131 -236 -13 216 211 270 -100 19 -90 60 -30 -15
7397 -15 -80 -31 135 30 -78 -86 44 253 171 27 48 -176 19 150 -163 -5 165 -14 -50 -90 88 -256 -226
7420 -226 -25 124 25 53 36 -8 -96 286 -11 238 2 -132 -43 53 21 -268 -19 -42 38 -124 87 115 -48 -54
7444 -54 -18 201 1 31 84 4 -51 162 47 -99 15 68 -79 17 -113 139 76 -88 87 61 -46 60 29 62
7468 62 14 -101 -38 272 -102 9 -305 166 133 138 -74 -284 65 -68 -134 239 -188 209 314 -164 98 -76
7490 -76 48 -117 88 92 -271 -99 47 173 -178 80 144 -100 -18 180 118 -51 54 -70 -145 148 95 12 -1
7513 -1 -95 -71 -113 14 51 -20 -12 20 -33 56 50 -236 287 79 -7 93 51 49 86 214 74 224 -93 103 -128 0
7539 0 -111 -13 -25 -48 177 173 293 -25 34 18 -48 53 -124 223 35 86 -105 157 146 -47 -52 -37 -225 -11 125
7564 125 63 -56 -66 -49 -120 94 186 -179 -172 -70 38 -164 53 -44 155 27 -9 -6 -159 -126 -101 8 11 -220 -62
7589 -62 -109 150 -114 -108 112 -21 -215 79 104 106 -154 -122 9 -172 -6 108 61 -24 -49 -331 106 2 -66 97
7613 97 78 106 -226 10 -118 11 156 243 -76 15 13 -9 96 58 3 -321 49 25 -3 139 -236 -176 -173 -29 -54
7638 -54 1 -75 53 -126 8 -5 57 -114 -2 -241 -120 15 47 92 -4 205 26 -227 46 -89 -71 212 243
7661 243 239 -222 -20 -224 -59 -7 -213 30 -326 -15 -147 174 64 -224 -174 -39 82 107 29 -143 -59 -110 90
7684 90 -106 -182 -9 -162 127 9 4 -229 90 34 -279 -77 -81 -1 -83 -30 -106 12 -99 -134 158 40 40 -102 -132
7709 -132 11 9 8 -40 -195 28 -65 111 17 13 327 -1 90 -11 -236 -148 -38 -90 56 -143 108 152 22 69 -143
7734 -143 72 -49 -33 91 126 -20 -156 -152 35 -129 108 59 -57 75 -248 243 -101 200 -111 -172 -43 7
7756 7 296 129 146 44 174 97 2 154 38 -206 4 -27 -270 -153 11 84 32 44 130 119 -82 -22 -3 88 -238
7781 -238 45 -32 6 -146 -15 -258 106 175 -64 -82 160 26 -135 117 -52 166 -303 -72 -109 67 93 235
7803 235 159 -119 -91 52 -14 74 -35 -128 -99 -69 -346 147 -68 -56 -70 -3 -225 -76 -45 106 -172 115 -188 -35
7827 -35 -151 -263 7 -188 -53 182 7 -36 73 -315 94 171 99 -1 -42 190 169 207 31 -141 56 26 89
7850 89 -96 242 -23 -3 -76 -128 124 -6 -151 202 -205 237 -45 -18 76 -104 -257 135 59 38 85 29 -69 -79
7874 -79 -91 -204 133 59 -52 101 -105 -274 148 109 -126 -55 -58 -112 -64 13 130 -94 108 68 -139 3 46 -22
7898 -22 228 -89 -202 -138 50 140 64 -265 -14 72 -145 163 -101 149 -74 102 -53 -121 -109 103 -188 52
7920 52 -224 135 132 -40 42 -140 23 -41 -119 156 79 218 131 102 -79 -65 42 -13 7 -73 153 -103 -128 -100 250
7945 250 -3 184 345 40 117 -11 -235 -215 -76 166 -119 -147 117 -26 3 14 74 -19 -49 -210 1 -28 -155
7968 -155 186 -109 -62 -121 -26 -210 37 107 278 -135 -119 -339 -15 -63 -160 72 -8 362 -131 -12 -94 -10 -112
7991 -112 -130 -299 43 27 -105 88 -92 81 70 70 147 154 161 101 27 149 21 -167 -167 -231 160 279 -53 -154 -194
8016 -194 -51 110 134 191 -63 -117 -80 -22 16 -53 21 135 57 44 -99 89 -42 126 117 19 197 17 -70 71 -42
8041 -42 -191 -113 -59 16 58 -2 -47 49 18 215 228 -197 -28 -48 -62 -41 -119 -55 31 158 -73 132 -130 -2 -121
8066 -121 -64 -76 45 107 -22 -160 32 4 2 -1 8 47 24 -31 -98 54 105 -258 89 219 71 -33 -290 152 -68
8091 -68 -80 -218 -30 151 192 -20 -143 -77 34 -171 -48 71 157 -104 234 68 -30 191 39 -162 -25 -7
8113 -7 93 61 149 -106 -64 -36 -19 -90 151 -201 -85 216 -260 -77 -40 -98 16 16 132 -81 39 78 -6 30 15
8138 15 -243 28 206 -111 -37 27 37 71 -8 -50 203 -40 121 222 67 -145 9 -107 -38 -50 -34 62 -69 -144
8162 -144 -5 237 354 -39 -220 -48 -91 70 227 87 112 -114 127 -72 104 -59 -100 121 -17 115 104
8183 104 -60 -172 -83 -75 67 -13 149 -58
8191e8
$$ Imaginary data points
##PAGE= N=2
##DATA TABLE= (X++(I..I)), XYDATA
0 0 0 0 0 0 0 0 0 8 -8 8 -8 16 -16 24 -24 32 -40 48 -64 72 -88 104 -128 147 -172 201 -233 270 -310 356
30 356 -407 463 -525 595 -671 754 -847 949 -1058 1181 -1312 1458 -1616 1789 -1977 2183
46 2183 -2408 2656 -2924 3221 -3547 3909 -4308 4754 -5253 5819 -6461 7203 -8065 9086
60 9086 -10313 11823 -13732 16231 -19650 24629 -32559 47140 -82578 343163 275559 -425511
72 -425511 93832 96845 177399 -44764 -162326 181754 89796 -119950 -80549 45982 193701
83 193701 -78930 -169953 9233 169404 20691 -189294 35019 102563 -26365 -40823 -78195
94 -78195 97324 68577 -96680 -85978 50297 147261 -99343 -117019 117699 64581 -44230
105 -44230 -136421 93189 167732 -174930 -49119 55363 2318 48015 -130509 -23642 73951
116 73951 -67780 -60589 -28251 75833 -16756 -139921 15749 68747 33648 -58545 -46141
127 -46141 71953 34029 10179 -53541 57442 116019 -137995 7453 110461 -13373 17290
138 17290 -92918 27296 110669 -90472 -22829 32449 14748 -10749 -72741 39090 43034
149 43034 -37925 -43106 -9068 46465 -25149 -22295 -2838 -19777 46263 -38278 -47992 62724
161 62724 31349 -36166 -44733 49922 62499 -23898 -27976 24976 71814 -41687 -38143 88007
173 88007 -14895 -5647 -16506 -52045 108489 -21231 -93521 50619 9435 -10185 -26708
184 -26708 8243 46565 -40090 -3568 16953 5358 34909 -15884 -17232 6039 41533 6193
196 6193 -60458 43777 26105 -46450 -1632 7927 28927 -20546 -38962 20776 5044 3695
208 3695 -25344 -18720 31973 -18620 -30332 -4666 21225 -1625 -59513 10667 16345 -21530 2897
221 2897 -18201 7706 5006 -9430 11601 -6114 28085 5790 -34456 28638 36534 -8079 -23734
234 -23734 20515 23109 -23062 11324 -2300 4961 16563 -47207 21836 27915 -26432 7566 -16516
247 -16516 17728 17502 -33715 22900 7865 -14568 6360 -7210 11189 2569 -6387 -9903 -5827
260 -5827 23417 -13772 -10160 9757 -6873 9564 -14133 -3051 26191 -11739 -17528 2793 15085
273 15085 -2024 -18281 804 3513 -179 -18942 -1842 23612 -25239 -6125 10742 -10002
285 -10002 19342 -8200 -6160 15725 -3676 12260 -2956 3109 19061 -13269 1134 9974 4623
298 4623 2890 -9868 4286 691 7342 -484 -16041 22034 -1774 -17864 11997 6797 4176
311 4176 -16856 -1093 18924 -16955 -63 5733 -12417 2777 -5388 -3986 162 1505 -1591
324 -1591 -14673 8914 4895 -6003 4029 -5524 7527 351 -6409 9413 -3111 1214 -2021
337 -2021 -10083 9668 3879 -11424 -7187 10803 301 -15377 11758 2231 -7208 3399 -5201
350 -5201 11620 -831 -6387 10617 -10193 5567 7568 -12179 7374 1032 -5244 555 484 5191
364 5191 -4141 1305 -1552 -1067 12137 -8655 -1002 8553 -5009 535 -3509 4823 2573 -13392
378 -13392 2616 2440 -3987 -1024 -3471 1977 -1873 -1223 1700 726 4529 -4261 2813 4342 -284
393 -284 7368 -2991 866 5017 -1917 5004 -2445 1219 4821 -6634 1379 4165 1779 -3235 -3446
408 -3446 7477 -2799 -1181 3255 -2473 2960 -5314 -382 4102 -5483 1983 -5642 -2234 5856 -8044
423 -8044 874 2553 -5850 1202 406 250 -1016 1845 467 -5947 5574 1255 -4763 400 -1840
438 -1840 1828 -4747 -2692 4907 -5931 -2509 1147 -2037 1976 -1514 -809 1237 1559 970 -1154 5289
454 5289 -80 -1013 3369 -246 4134 -512 169 3823 -3605 3975 3092 -3705 3132 1697 -523 -678
470 -678 2923 3140 -5257 1822 2203 -1997 1581 -2611 1009 -982 -3225 1901 -2756 1444 -741 -4750
486 -4750 4560 -645 -2029 2995 -693 413 30 1908 665 -1228 2496 -1851 -855 816 -883 276
502 276 -3662 562 524 -3550 1190 -858 -941 -348 -1694 1982 234 -589 75 -283 1787 -1633 503
519 503 732 -1269 490 -1681 2080 319 -2599 3069 -1766 -940 3439 -1829 259 308 381 -192 -1432
536 -1432 2080 -1304 -1654 281 -1759 1190 -1391 -1185 730 -1128 1190 -1238 974 2364 -2887 1664
552 1664 2438 -838 1364 627 1013 -171 561 1717 -1126 645 -44 -179 297 -877 1564 -1322 -951
569 -951 1679 -908 943 -167 -686 1311 -808 243 329 141 278 -2118 786 242 -1338 235 -393
586 -393 705 -1487 430 1958 -2433 1133 740 -1934 1533 7 -373 -54 -1098 549 -1469 36
602 36 -289 -1420 351 -1406 74 527 -577 -62 -819 1617 148 -840 2505 -313 -77 1022 118
619 118 763 -694 254 174 -723 730 -128 197 -197 -164 1007 -816 1341 331 -970 1008 -654 551
637 551 733 -1091 412 -491 -199 -347 -636 1191 -951 -686 1006 -223 29 -610 866 -81 -931 1661
655 1661 -761 -91 920 -1075 738 117 -303 304 -881 390 -621 42 378 -1217 531 78 -377
672 -377 422 327 725 -950 292 972 -920 1033 357 -487 208 -667 821 -106 -569 462 -234 203 -102
691 -102 195 275 -460 517 -221 42 520 -812 607 -180 -754 529 -360 -350 -567 -250 452 -1303 319
710 319 366 -927 139 65 642 -381 159 580 -592 462 131 -512 667 -753 81 161 -241 60 -412
729 -412 154 -195 -171 968 -433 -214 257 -24 134 -543 806 -364 -625 481 -310 177 -103 -219 667
748 667 -611 92 569 -551 219 84 108 182 67 458 -84 625 33 -337 751 -342 -424 14 -478 23
768 23 -215 184 -136 -456 864 -141 16 671 8 139 -163 487 284 -133 411 -250 175 161 -414 322
788 322 -27 -527 110 -43 20 -216 -18 336 -525 243 363 -113 -157 -150 189 -440 -312 97 -649 -140 -477 -13
810 -13 137 -542 54 93 -43 287 -121 167 163 12 301 -104 168 -373 8 391 -888 127 92 -348 137
831 137 -150 63 -107 208 381 -414 165 77 -196 200 -190 225 -77 -79 268 -514 251 -123 63 683 -188
852 -188 92 65 133 521 -143 252 166 -275 366 -144 265 -79 -127 158 -628 54 71 -200 127 2 138 -323
874 -323 112 343 -109 211 323 -270 187 2 48 310 6 34 -29 213 -399 -234 200 -305 66 186 -140
895 -140 45 -84 -35 -114 -400 135 52 -239 162 43 184 -115 118 -387 -128 112 -238 13 210 1 142
916 142 -231 -248 167 97 166 -356 45 98 -200 84 -46 -5 -234 -296 423 -196 -118 231 281 215 -171 -3 408
939 408 -101 201 -72 191 216 39 311 141 -251 38 19 -69 -237 36 197 -151 137 270 10 -90 -70 48
961 48 41 -60 -109 -157 84 -313 -306 -76 -238 -74 163 -32 -135 -139 134 134 -149 128 -97 -116 -192 -104 283 56 134
986 134 -138 -115 35 -125 84 149 32 290 -396 -401 63 -61 188 47 -369 -142 76 38 -233 -22 -82 -113 -74
1009 -74 -162 -309 166 55 -155 -86 -102 -29 -195 140 136 92 224 -4 118 59 -193 -24 -150 91 -71 -182 -236
1032 -236 -45 116 169 -63 90 68 394 -19 -189 41 282 4 -33 217 -52 -104 137 -121 325 368 -85 -43
1054 -43 235 264 -94 25 176 51 -94 -8 -28 32 -7 108 51 184 -14 95 -429 102 -315 84 -52 64
1076 64 254 44 17 88 -30 4 76 152 -88 -336 -330 -350 -89 -28 21 26 -179 373 -28 42 23 -80 37 156 17
1101 17 -108 28 -177 -119 -115 225 12 -25 25 -143 78 -93 159 55 -216 -4 -128 222 90 139 260 -25
1123 -25 -34 175 -213 4 -137 -140 108 37 -75 -141 147 54 -59 214 100 -32 -38 62 34 -141 -38 41 -22 -62 47
1148 47 -73 173 14 129 196 216 384 -52 39 246 -303 94 95 112 -170 -72 -53 -167 -135 -110 27 -215 33 -73
1172 -73 -48 -40 -137 179 62 268 75 144 57 147 -4 -37 -36 -56 -83 -83 -27 215 77 57 41 -122 -63 -144 -241 -33 -15
1199 -15 85 20 -62 253 -79 -137 -60 18 33 -68 19 131 -2 131 -160 62 -65 -97 33 -7 -165 16 42 -171
1223 -171 -26 -97 309 -20 14 -149 -70 -38 -52 227 -76 -57 33 200 -146 7 295 -3 -58 24 -252 -101 9
1246 9 -50 -154 71 29 38 28 41 -80 106 -70 121 -193 -29 206 259 37 -52 -3 -12 240 124 -94 205 -90
1270 -90 -240 -28 258 -124 -150 128 -114 -129 -86 152 15 -53 212 89 146 83 -112 -87 -28 -62 119 -146 61
1293 61 -157 84 67 194 -9 201 119 -53 -210 31 -41 126 70 -75 -278 97 99 12 -11 62 -87 -31 -163 -150
1317 -150 -29 88 149 75 -377 -98 -73 18 41 -120 -66 97 56 -104 77 74 -88 -22 80 147 -35 -229 -47 43
1341 43 183 138 34 -247 248 -174 -101 -40 250 -215 61 158 133 98 -45 45 -155 36 -173 -232 30 -111 -242
1364 -242 -145 78 -207 -35 136 62 37 204 154 -83 -203 -181 134 78 26 -22 243 -80 176 200 -21 133 -36
1387 -36 -55 -89 -2 66 21 139 -43 -288 33 -168 38 134 61 99 -146 161 -82 -32 -122 132 52 -121 -232 83
1411 83 235 -18 121 78 -26 9 -9 157 -84 -61 -101 29 -152 -215 206 116 -4 157 -197 216 -26 -148 -83
1434 -83 -208 -49 -52 -14 -61 -86 -186 -78 -32 48 41 -182 84 -137 -49 49 25 -97 -66 113 168 -69 99 49 77 35
1460 35 43 -318 -44 146 -93 1 59 27 -311 -60 -40 173 -43 103 -1 -67 88 -60 38 72 33 -44 52 6 -48
1485 -48 -150 -200 -201 -192 -123 -53 16 -34 21 -59 -183 -11 -155 7 121 -123 90 13 126 -180 38 -90 -5 -101 181
1510 181 31 -121 72 229 48 86 21 -108 68 -246 141 106 72 39 -232 -48 290 -106 -128 24 -79 -45
1532 -45 -102 35 223 127 64 31 241 -3 -111 -218 99 -156 67 63 48 109 -68 268 -111 -50 -154 106 117 262
1556 262 -17 102 51 -105 210 -100 38 -133 -114 117 -55 180 -188 -207 98 123 -6 -1 2 -212 16 25 -51 113
1580 113 -110 133 -23 -217 -161 343 86 11 -54 79 41 -68 -27 124 -15 -16 269 15 137 -12 -85 -84 -184
1603 -184 170 -35 40 -59 -20 -232 -78 -93 -83 -41 -199 95 -388 -58 -129 -170 -22 410 152 -165 237 132 67
1626 67 263 72 -52 -68 28 12 -256 116 -22 -115 49 -115 161 -79 3 75 91 -39 -250 -49 -127 -13 -28
1649 -28 133 29 -127 -67 -44 55 -384 8 98 -182 158 -118 60 -166 32 -36 -21 112 -186 125 41 -83 -39
1672 -39 89 1 -236 204 142 80 141 43 -89 2 157 124 115 67 -1 59 12 -136 -69 121 22 -17 76 114 -51 -135 -225
1699 -225 -125 29 -116 -111 214 -180 117 -55 173 -72 179 48 38 -46 -184 169 77 -65 -83 155 113 -201
1721 -201 -75 -43 52 74 14 -92 -210 -119 -48 -62 -34 -52 -26 -280 -103 6 -156 -180 181 31 14 -73 -13 -239 -13
1746 -13 53 -18 -91 88 287 41 154 -171 42 -22 291 -20 -114 246 -115 -20 60 10 -21 35 -96 111 21 103
1770 103 -42 -60 92 -31 -42 -134 79 153 22 -147 -70 -113 246 -2 113 -23 -148 308 17 275 -109 57
1792 57 92 -42 53 91 20 157 21 79 82 -77 307 6 78 163 93 165 147 -20 -34 77 -1 166 -14 -12 85 31
1818 31 -123 -79 179 111 3 126 27 66 27 -99 -282 -198 125 88 73 255 -2 -106 -245 109 -165 -78 -72 -155
1842 -155 -5 46 197 -27 88 -128 -16 27 21 -85 -112 -43 254 -97 -169 244 -80 -16 -159 381 33 -39 79
1865 79 51 -219 -26 -130 -225 62 -126 110 146 52 -89 -47 -162 -92 17 -45 98 -138 -101 47 -146 -263 76
1888 76 111 73 71 -29 -282 17 -114 108 205 -45 335 32 8 82 166 -32 -46 111 161 43 -189 -125 119 70
1912 70 47 34 -7 -30 22 -282 128 103 121 -245 -62 -33 -33 -82 -12 73 -266 -69 125 12 -124 49 -92 -34 -147
1937 -147 34 90 172 -225 -248 52 -21 131 1 -113 111 -41 -85 37 -23 -132 -26 27 8 116 37 -56 255
1960 255 -18 -135 -47 127 -91 -54 -66 53 112 76 -106 99 51 51 53 -135 -105 147 97 -8 96 -37 -58 -76 -85
1985 -85 48 -38 64 -10 -261 -131 1 -60 -95 -37 47 218 -20 140 -57 21 -61 17 -31 -33 144 115 -106 32 -13
2010 -13 77 151 -115 -10 -123 206 -17 -207 113 259 137 -61 -145 319 26 -65 -34 68 -55 -143 131 -3
2032 -3 -127 -157 -110 59 155 -2 -83 141 -41 97 92 245 128 58 6 -84 17 -71 140 37 5 -91 -23 179 10
2057 10 21 -318 23 112 4 178 43 89 73 -59 112 -107 -216 -155 9 161 -157 5 164 -292 -189 90
2079 90 -29 -79 71 47 111 123 -238 80 -42 -7 -172 -141 117 103 19 -117 -203 -98 -161 56 79 -58 -102 -5 -188
2104 -188 150 264 -94 108 -99 -143 42 34 -59 46 -39 -228 98 213 16 -238 -40 189 2 46 -199 -196 12
2127 12 -18 -239 -176 -75 -62 -121 200 -118 194 24 5 20 -211 -69 22 -116 41 -222 -68 -152 69 -22 104
2150 104 23 -71 242 6 311 -272 54 -93 84 24 128 31 69 44 44 52 -30 96 -23 253 -133 -89 -105 139
2174 139 -71 -121 -128 -15 -66 -230 37 -201 22 11 -47 -73 -216 -9 95 31 73 -56 -170 -11 73 63 23 -2
2198 -2 -77 -70 116 -109 -44 103 63 -64 -202 69 34 6 75 -74 19 50 105 63 -121 -137 -1 -121 48 -50 119
2223 119 -74 -133 -68 -226 56 -152 94 -38 -196 108 8 -271 100 -60 34 90 -57 179 -74 -62 -111 -4
2245 -4 -137 47 132 52 -66 5 -27 254 68 -296 153 -222 83 -28 -2 -104 -15 166 -41 168 -58 37 271
2268 271 166 -136 136 16 -127 -46 -146 33 -116 209 -69 -67 170 -137 85 31 -115 288 119 171 -86 -113
2290 -113 137 126 -78 11 18 173 46 -124 82 66 -25 -232 43 -224 -183 144 208 -87 40 -114 120 120 -154
2313 -154 -238 95 122 187 126 118 248 -105 -141 51 6 -272 -139 -184 -65 -32 122 -44 13 -69 -129 122 89 105 -129
2338 -129 32 33 -56 200 142 -77 -181 -43 -27 197 184 100 96 135 172 -45 68 258 60 -27 171 285 -175 -64
2362 -64 -50 -123 26 -123 -203 -141 -8 100 -4 -128 113 32 -79 46 105 57 119 -64 -145 -231 95 -71 -78 60
2386 60 -58 40 108 48 193 153 -149 178 109 -80 94 90 -328 22 -117 338 -21 63 162 -127 158 -55 -92 53
2410 53 -179 -124 181 -20 -123 1 39 83 11 -128 -53 56 44 326 95 157 -200 -7 125 132 -23 126 -131
2433 -131 -68 75 111 6 -111 -77 113 120 -279 -106 130 189 100 13 244 -165 -121 27 41 -50 28 58 187 140 4
2458 4 57 -94 9 -169 71 16 -43 243 268 -1 -132 137 173 -61 85 -122 54 104 160 -1 -71 171 151 84
2482 84 20 -111 153 101 -9 -60 75 90 -18 271 9 51 156 -55 -212 256 -302 -95 93 -69 92 -261
2504 -261 61 -87 99 -114 85 -131 211 -157 27 -23 -107 -61 -214 103 98 -46 -65 -83 -59 117 -59 104 88
2527 88 -13 62 50 382 0 32 -168 108 -34 41 75 -18 11 77 -31 -49 285 132 135 -335 -62 271 164 -91
2551 -91 52 17 192 15 239 -45 -8 -127 -105 128 -112 126 -1 -31 -120 26 -61 -45 83 147 15 232 -27
2574 -27 30 -67 114 109 -349 48 -11 32 -63 -52 13 45 83 200 -34 -86 236 181 -81 98 -70 186 17 4 -27
2599 -27 28 -238 -149 -97 -17 -57 -12 -55 72 122 -97 -39 223 -15 79 -46 4 255 120 90 -50 164 78 117 130
2624 130 35 -45 26 -251 -48 3 183 -5 113 59 72 -248 -70 -72 126 213 -169 -4 -90 -74 -161 -56 20 40 -58
2649 -58 -96 85 188 88 95 -35 102 285 6 -34 -58 50 16 -38 160 -8 238 -206 -96 -26 18 -145 80
2672 80 -103 59 231 -98 -118 -9 25 -22 -75 -181 113 -48 88 -15 -65 -17 26 -120 -184 154 -39 21 -78 93
2696 93 -151 109 -80 -40 97 -42 35 -105 -199 -67 59 109 76 -149 -103 -55 -42 123 55 73 40 113 133 7 147
2721 147 70 -319 -127 -17 173 39 -3 -127 -96 -59 -114 12 99 122 187 -180 -223 146 179 58 -121 -188 -118 158
2745 158 39 -224 -72 -19 69 -10 -23 88 120 -66 223 95 -11 -269 -15 -82 31 274 46 -87 -48 -21 -34
2768 -34 69 51 30 -266 -165 51 101 -133 110 -29 -190 37 -24 75 57 -58 -63 124 76 -123 34 220 38
2791 38 122 8 -104 -106 169 -115 -206 97 25 128 -91 127 -17 98 -179 -145 -41 -146 78 290 95 -35
2813 -35 265 276 19 175 196 -296 118 -152 113 88 187 165 96 -58 -47 267 73 -44 -164 48 26 228 -197
2836 -197 63 162 -72 43 34 257 -114 -12 -66 -72 12 14 -192 -87 -19 -23 -165 84 35 -124 146 -107 -33 -151 -371
2861 -371 44 111 15 3 -135 54 233 79 -88 -77 81 73 -135 -71 89 177 187 -80 52 -27 -68 -18 -47 187
2885 187 53 236 -243 -158 14 -95 -180 28 164 166 180 78 177 -235 208 -58 -228 -36 -117 132 -136 -83 17
2908 17 219 187 -28 18 -269 62 -31 -108 -65 140 -77 -93 -36 153 -136 -88 -18 22 -54 -222 283 -22 -150 155
2932 155 0 -17 86 63 -72 63 -83 18 -74 -1 -23 140 110 96 60 -121 -24 332 47 204 -53 102 80
2955 80 0 -24 -147 -73 -81 -202 -70 -64 21 -159 41 122 -182 -86 231 -26 -101 101 -23 -57 -87 -185 65 70 87 69
2981 69 92 -76 -44 395 84 30 -28 160 130 111 131 -49 192 104 134 -41 286 -139 -59 207 -84 325 230 -148
3005 -148 180 -92 -31 126 -27 27 30 -181 -8 69 208 -1 -59 -73 50 65 -89 -171 70 -216 181 -107 19
3028 19 292 160 -65 97 -163 3 -116 254 -44 -12 160 -5 19 151 -81 82 38 106 -30 -246 -39 8
3050 8 -185 -117 -24 -261 -261 -208 86 -188 -51 -108 111 181 41 -91 63 279 -17 9 115 -34 -54 -274 175 -36
3074 -36 -25 280 -42 -302 -100 -89 33 -51 -7 110 118 175 116 -151 -111 82 93 315 248 -28 35 67 50 -179 -185 23
3100 23 125 -26 -98 -43 -146 -120 157 -36 -31 -359 -16 -77 71 247 87 37 -87 -178 -113 -5 -51 45 -4 40 -37
3125 -37 237 -1 -36 323 -25 10 -102 -22 -124 -139 314 23 302 -47 -102 -19 143 52 -141 177 -64 -44 35
3148 35 130 1 -11 296 -186 225 -5 -33 -47 216 112 -136 85 -101 -78 -121 -56 85 -78 -220 299 -270 103
3171 103 72 -126 -199 -23 -82 -81 -158 -133 102 -5 22 -134 -41 110 -25 -35 -86 89 51 -96 116 30 -36 -151 293
3196 293 -88 -79 20 -39 -132 7 -28 -110 -197 -241 33 19 -29 -135 71 71 -30 209 126 -33 -72 13 -57 -10 125 249
3222 249 25 23 -20 8 121 162 -50 135 190 239 60 -126 30 28 -16 19 8 -231 6 -188 84 -78 48 -63
3246 -63 -44 185 -64 2 -4 -69 -12 -46 175 170 -101 43 -30 82 -417 -145 -280 -119 -41 -48 -12 134 -43 -59 -77 -367
3272 -367 172 -111 -75 14 120 -140 359 242 -61 19 -90 -30 -146 -9 101 32 10 175 -56 -38 156 -80
3294 -80 -175 -197 -31 17 -20 162 99 -49 -90 28 90 0 86 -145 84 118 -259 131 126 -108 20 -141 -67 3 3 32
3320 32 7 -3 -138 -172 -22 15 -5 66 114 -60 -163 -146 32 47 44 -163 151 33 37 60 117 -167 -94 81 -44 91
3346 91 -72 -56 -80 7 -124 -32 -66 -82 60 113 149 62 124 -61 211 -168 34 -81 40 -49 130 102 -117 137
3370 137 38 9 -228 116 -153 176 277 34 -69 -276 33 109 -34 -31 149 -129 -21 194 3 -63 56 58 -167
3393 -167 -8 -85 402 59 50 -266 -9 -11 -162 63 -114 78 -63 5 -128 4 57 114 60 -191 -15 62 267
3416 267 107 -133 -22 105 140 4 -38 54 -15 -82 148 -222 -8 -15 102 219 -26 -207 -13 -47 138 -79 37
3439 37 30 -59 187 120 48 -54 -212 -115 -17 -103 -75 -60 -105 -24 -165 142 -43 43 -265 171 136 -182 187 65 -1
3464 -1 -143 -123 49 203 -147 -109 33 -231 49 -140 87 -36 -85 28 -98 146 14 -42 152 -64 -141 -156 -18
3487 -18 -188 23 -65 16 -156 -31 170 96 -45 72 -22 -243 -46 -221 -47 6 37 -59 178 178 -245 135 -41
3510 -41 291 -117 -19 123 -89 -31 181 -59 -58 -140 203 29 41 4 75 -79 263 201 -92 71 -29 156 58 22
3534 22 6 264 -115 -43 153 168 180 64 60 -44 -93 141 203 -262 -126 -12 250 -30 -19 -70 -12 24 13 49 63
3559 63 -88 208 -63 -8 -76 66 -85 124 82 38 -71 2 428 -16 -46 63 -60 -84 150 61 2 -259 171
3582 171 -51 -19 179 202 -87 291 -4 97 -61 -29 51 -201 40 -128 -2 -196 -75 12 37 186 71 -105
3604 -105 151 52 -71 -41 108 59 -186 -70 50 -71 -11 212 57 22 94 172 -229 28 45 223 -202 -17 26
3627 26 289 51 -162 76 -135 142 58 -54 -118 -160 181 -69 10 168 -50 52 36 -25 100 -92 -41 64 -88
3650 -88 38 128 13 -4 -49 -22 274 75 -12 282 164 104 5 -7 45 149 173 14 123 -222 -50 18 -53 -144 -75
3675 -75 7 152 94 -119 82 38 91 131 8 74 83 90 95 -11 252 110 13 204 -85 -219 -263 -84 26 111 -155
3700 -155 -104 -46 -2 234 12 210 -108 -42 -77 49 -64 -242 250 -36 198 -75 90 -64 -185 132 26 -41
3722 -41 -77 -1 172 216 16 -252 248 -33 -114 -83 -72 173 96 68 120 266 -235 -10 125 151 -96 154 -93 133
3746 133 14 -111 134 218 14 -44 -158 -22 70 14 133 30 86 139 -163 80 201 84 98 287 17 45 9
3769 9 111 -92 27 74 -117 93 53 163 -20 -9 -111 -44 -284 -68 164 -169 -50 23 28 -206 -155 -125 -5 1
3793 1 60 -48 -64 -168 -133 -141 99 15 -104 76 -173 120 5 -74 48 -40 -23 0 54 -105 -89 -22 170 -23 64
3818 64 -34 -188 12 -123 160 -56 122 107 -35 -13 319 -16 -30 -17 81 13 32 -153 -106 121 -222 -146 -31 -49
3842 -49 163 183 329 172 128 -105 85 30 94 -33 75 -112 -51 8 -33 142 108 -236 -33 16 25 114 2 -98
3866 -98 -130 -131 -129 -44 142 -84 -8 121 184 38 -42 74 -169 29 163 -75 154 -253 -11 -51 -155 39 -104 -9
3890 -9 40 -99 39 -92 -106 -14 -145 88 21 -297 83 66 -58 -93 104 125 -82 4 -193 -165 431 -18 -10 38 -16
3915 -16 -73 -67 -58 100 84 49 -5 -95 -173 -150 44 -17 -68 -222 38 -111 16 36 -43 -104 -30 14 91 -42 -66 -19 -71 -211
3943 -211 219 95 53 62 -128 -241 -168 -2 -184 133 84 -128 3 -20 82 134 -90 38 -77 103 164 172 -7
3966 -7 -19 45 113 255 -49 98 -212 -90 -17 -191 62 22 -161 35 327 -68 -206 -70 -144 -75 -143 21 25 -189
3990 -189 -32 -23 -2 152 25 -117 38 121 126 22 116 125 -138 188 -71 -1 -133 16 -2 11 -25 25 -75 204 -176
4015 -176 -75 50 38 116 79 18 43 188 27 -130 53 36 4 -49 100 -134 -51 169 138 191 -83 205 144 -61
4039 -61 132 205 -163 -235 -118 -49 -76 -201 36 162 -85 -210 177 -187 -25 64 -25 10 -209 -25 -163 138 -59
4062 -59 -170 181 -292 -7 -31 -38 171 -180 -17 -57 -68 84 -79 -109 32 -255 -86 -20 -100 -88 -176 160 269 -40
4086 -40 -56 169 -205 -50 88 208 -60 28 239 -86 149 194 -174 66 35 40 64 42 -103 -6 66 -149 -41 -93
4110 -93 5 -70 -228 17 155 -91 105 111 124 -188 -145 4 96 146 -50 6 -38 157 122 18 -88 10 160 88 116
4135 116 -341 84 24 12 -7 -246 180 29 77 -198 -63 -76 -157 83 -90 41 99 -52 2 80 -192 70 -154
4158 -154 -60 -119 -131 -171 -5 164 -116 -7 27 -29 -220 85 10 -12 -68 33 136 -21 90 61 78 -98 62 -281
4182 -281 -229 277 -116 249 -84 187 133 13 103 -58 -98 -34 116 -87 -127 128 -156 191 88 111 -213 47
4204 47 268 98 205 -113 48 14 25 -154 -86 -93 -36 -183 210 132 -255 92 -33 4 -44 -57 -28 -125 -96 -14 44
4229 44 -97 1 128 10 9 258 -10 -126 116 -127 33 -32 -32 -61 298 -117 -90 -75 -72 178 102 -125 -6 -145
4253 -145 63 249 78 -52 -114 134 83 -207 -41 143 50 29 13 -13 89 -22 181 -81 -12 230 -65 133
4275 133 31 -181 -331 -222 89 -184 -10 -85 -141 132 94 -132 126 -138 -165 -199 70 261 172 119 160 85 -46
4298 -46 -52 -169 -49 14 223 118 -206 35 -28 70 132 83 -137 -82 224 -84 156 2 87 89 -15 42 -86 -154 -26
4323 -26 -123 50 90 -94 -189 -124 315 212 -189 26 216 -29 2 144 -21 -126 -124 54 -46 115 47 1 161
4346 161 -9 -253 -45 197 -124 -126 138 -10 -22 81 7 -14 174 14 207 -52 88 -109 71 -74 -38 -24
4368 -24 -159 -75 -21 -129 -90 74 183 90 172 -302 -214 189 -25 36 -141 -202 193 -106 35 -60 119 -38 67
4391 67 23 -111 -71 -191 108 -134 -1 106 26 148 58 -25 -138 43 -143 68 49 -170 -154 169 259 -37 -210
4414 -210 76 -69 -200 3 80 -117 -73 -16 -2 -134 53 16 -209 -155 -226 197 165 457 -12 -101 -179 28 18 88
4438 88 -92 35 163 -273 259 232 88 -77 -13 -184 35 327 -27 117 -73 -42 65 -68 -179 -113 -12 -25
4460 -25 78 -88 113 -195 -117 21 -11 26 24 185 27 188 -100 140 -117 -176 63 -32 -41 -187 47 7 186 -52
4484 -52 -91 -14 261 -89 147 -169 46 191 -103 85 -56 104 -366 6 -3 50 -43 51 157 135 -152 -48 -42 -24
4508 -24 163 -219 -107 133 -171 148 153 -103 87 39 22 -103 99 -51 29 53 254 -18 188 -23 -16 -152 22
4531 22 -440 -297 -139 -68 -104 -103 -39 60 110 -248 -181 179 -270 47 -88 22 120 -175 -30 -173 -108 62 5 -77
4555 -77 -44 -18 -95 -77 -11 -105 -85 117 -107 21 -57 67 -117 -2 -44 -203 -170 74 -126 -90 75 -29 -47 104
4579 104 -116 61 11 -143 -10 -210 62 79 160 -37 -256 204 -159 -57 -89 98 -214 75 -86 28 -40 -160
4601 -160 -85 283 210 -136 8 -123 83 282 -52 17 -17 163 -171 38 210 -3 194 -40 77 -70 142
4622 142 -247 195 50 105 52 -75 87 4 128 -101 126 -151 25 -374 70 -226 -155 -194 -53 -392 -117 10
4644 10 -51 288 -205 -69 183 27 -109 -321 -59 -28 136 4 198 208 53 -124 82 -25 118 20 -33 132
4666 132 -5 49 205 19 -53 -24 -31 -28 155 -8 14 -97 -220 47 -41 110 30 95 125 119 9 35 101 8 111 -162
4692 -162 56 -68 -367 75 82 -315 148 111 -143 -64 41 -10 -116 -124 -18 17 -196 -166 32 12 129 -143 -140 150
4716 150 -165 -131 31 10 -67 -71 56 35 -12 -136 -199 266 -59 -106 103 68 -36 -18 50 -270 -67 88 35 -34 168
4741 168 -67 99 -199 29 68 -4 75 75 208 39 78 -125 52 207 -182 84 199 251 -43 32 -113 -17 16
4764 16 -200 30 -186 150 -26 295 73 75 74 11 35 54 -51 -35 7 -182 -66 144 96 -115 131 -87 39 -321
4788 -321 -184 2 -223 -35 140 -134 -83 141 84 -41 -226 -60 -78 158 62 41 11 136 58 -68 -278 49
4810 49 -7 58 235 85 -80 10 10 39 223 -273 -113 -173 173 257 -9 128 43 9 117 142 108 -142 250 -67
4834 -67 14 71 33 -59 55 -19 135 276 -165 28 -36 -50 -11 126 37 -46 -369 38 67 -184 54 -157 -15 9
4858 9 187 -64 -176 106 61 -40 22 -146 32 21 66 -129 -164 -120 -72 -169 18 -78 157 -50 184 -185 -65 -2
4882 -2 26 73 -101 -22 -248 133 31 -166 -106 93 -84 -162 59 8 -64 146 -67 40 -105 148 -50 46 150
4905 150 -67 -112 -125 -177 -12 -54 22 -117 -53 37 -257 -234 -169 -214 8 112 71 52 -69 -68 28 221 148 57 -199 27
4931 27 -75 98 -259 -88 242 -122 82 -25 6 -94 149 202 116 185 157 60 -135 -72 -127 75 -134 63 -438
4954 -438 -173 -38 247 155 -6 -183 -181 -135 -70 52 -73 38 140 169 13 135 -101 -269 160 38 110 228
4976 228 134 379 148 -20 155 6 -49 -229 -35 331 110 142 84 -197 -165 -67 12 36 -103 176 4 76 89
4999 89 -50 47 -225 -21 -66 67 46 -108 -136 -266 -84 -69 -128 -72 -33 -43 208 -61 -11 193 317 7 119 -20
5023 -20 115 -141 160 8 139 49 -73 -139 4 79 -13 173 -56 114 -3 120 -23 167 -71 26 -96 -36
5045 -36 -93 174 76 66 -69 100 109 -81 -101 274 11 -64 1 76 -35 42 61 -47 -94 160 -243 -33 296 -167
5069 -167 -62 82 57 -83 -226 -11 19 1 89 -31 121 141 -202 -42 45 -150 -37 -339 41 7 -56 -24 157
5092 157 40 -194 -252 73 -56 306 130 96 -122 -14 16 -20 -221 -47 150 289 33 116 -236 -91 -32 -58
5114 -58 11 1 -107 62 19 152 -13 87 -7 -155 -145 -2 -188 -170 78 7 -15 -22 170 -117 -7 -3 38 -5 3 -20
5140 -20 50 128 1 -130 400 -7 25 203 -264 174 100 63 13 206 132 -8 41 -64 23 -38 89 -68 57 -83
5164 -83 9 237 -147 57 -82 -6 208 -72 18 -61 69 142 21 111 122 136 196 -90 -198 137 -39 222 -59
5187 -59 -99 39 -129 -14 -323 89 -104 -35 156 -143 120 -83 127 32 -51 -143 101 216 -128 252 20 -71
5209 -71 9 143 148 68 -40 80 -192 -130 94 265 32 -141 56 34 27 44 62 -45 136 -81 18 12 174 188 -255
5234 -255 59 107 159 219 153 102 64 -22 -283 57 329 -12 -12 -173 -98 101 18 -198 -90 -148 44 14 -91 241
5258 241 -86 -109 43 -64 -55 81 -43 -115 14 150 214 -49 131 161 -26 -40 162 -114 173 1 -262 35
5280 35 -7 104 228 -75 -208 49 -272 -86 -5 52 251 -91 48 -134 -13 -75 22 138 169 124 252 187 -223
5303 -223 -67 -13 -9 -84 95 62 83 -97 144 -119 135 143 -101 164 -88 -126 -24 267 141 -36 226 1 36
5326 36 -33 165 -48 -321 -167 9 -76 211 53 -3 360 75 181 -75 7 46 -235 185 60 -31 -244 5
5348 5 172 68 27 68 121 189 145 162 188 -59 110 -130 182 181 73 -64 -226 311 179 -14 -20 -174 -259 -6 -199
5373 -199 106 -28 68 -95 90 3 50 -33 32 60 8 -109 -222 110 219 -22 -3 108 182 -43 88 -46 -302
5396 -302 -96 -20 15 70 141 3 -60 -75 270 -284 277 156 -3 103 108 -281 -85 238 32 -201 64 91 54
5419 54 -184 154 147 17 75 -148 163 41 12 -15 -165 -157 15 117 -19 271 -22 120 132 -132 146 52 34 -107
5443 -107 25 95 -223 -52 -100 -10 140 58 -60 192 168 -165 -37 -66 -56 66 -181 133 92 86 111 87 -58 70
5467 70 -128 -48 129 -85 6 -8 68 -56 60 -34 109 146 131 100 213 -159 -129 106 7 -1 30 -92 43 12 112
5492 112 -165 -270 98 -110 131 -69 61 -179 86 92 -34 -2 -54 61 176 20 65 -8 180 99 0 49 74
5515 74 137 -128 52 51 87 47 -64 9 -53 31 124 154 55 -16 210 -50 311 -174 -119 99 39 -272 -215 70 57 -33
5541 -33 -125 86 1 151 -21 -186 43 228 -29 0 -126 187 55 15 -77 14 -114 111 -207 -141 224 102 -204
5564 -204 -75 -217 -58 246 68 -77 25 79 81 82 11 218 33 23 86 -80 -96 98 -135 73 54 112 -63 -171
5588 -171 91 -57 57 -79 -161 51 -21 103 28 -89 -148 -56 -198 -214 -83 -147 90 -113 -118 112 -108 101 69
5611 69 -37 -104 90 -4 218 17 -78 -146 -90 -51 9 66 238 98 262 20 66 -371 -108 39 -92 -128 89 131
5635 131 -13 13 34 -75 64 -123 -168 -128 2 -41 -18 6 -116 -70 -4 17 84 97 3 -147 -151 92 -70 -27 -252
5660 -252 -170 121 270 -41 -171 99 24 -246 263 44 -78 36 97 8 -111 80 9 14 98 -54 -155 -94 22
5683 22 58 28 1 -93 -2 25 -122 -277 10 -71 149 46 0 203 27 275 -7 -18 258 98 58 -156 55 -40
5707 -40 182 -35 158 47 29 111 -141 -41 158 -78 -76 -31 50 -141 153 -104 -40 73 -15 -25 -179 -190 19 262
5731 262 -25 -60 -35 78 306 -121 -59 -85 -11 173 230 -44 -82 34 43 98 92 -65 91 150 121 -110 -78 303 -55
5756 -55 109 -2 104 -74 -50 148 65 -33 -186 214 92 -243 -71 -154 124 2 88 -25 -31 -9 35 108 -53 5
5780 5 -152 8 -227 -142 147 -123 -73 -60 51 -129 -77 63 91 -153 57 83 199 -225 -18 103 66 22 236
5803 236 -19 -18 -63 -33 295 267 -26 -231 -138 41 -84 116 -72 172 -229 -44 132 46 -58 60 194 -30
5825 -30 -232 66 -227 42 122 -185 242 186 57 141 -54 -85 150 -16 -38 90 23 -197 -122 -45 223 39 15
5848 15 -58 -113 -109 61 -6 -104 -29 -117 -246 118 -22 -9 -177 -34 15 -90 -131 -107 216 -46 98 71 211 -44 69
5873 69 -46 -132 -102 157 -50 -74 40 -27 63 -4 -16 85 203 22 -70 13 124 11 87 -24 31 -41 130 -112
5897 -112 49 91 0 68 -77 -159 -150 396 -251 133 21 306 103 199 -27 -61 -159 -67 -81 -64 38 82 98 260 1
5922 1 91 63 29 -347 -194 -102 19 -83 -230 92 94 317 253 -84 58 151 29 -7 -46 164 -167 137 -168 34
5946 34 85 111 18 -56 39 193 62 230 203 126 -27 -198 157 -183 62 64 -38 -81 117 20 70 -64 53 -80
5970 -80 -5 360 69 180 -113 103 -103 45 109 -94 -67 -33 176 -24 7 20 83 -66 -45 -47 -104 82 45 -126
5994 -126 -206 67 -115 -49 -54 -165 -130 204 -90 6 1 99 -81 42 -39 -27 130 81 210 -108 53 -139 -285 -100
6018 -100 143 -78 -86 -115 103 7 19 -2 -40 -17 63 -113 66 73 -75 243 274 247 -131 300 -10 100 133 -16 159
6043 159 145 -380 199 -52 206 81 117 2 322 222 117 158 -140 122 99 143 -71 151 -64 -63 -89 -30 -169
6066 -169 279 142 -90 -148 -5 184 141 -121 -35 7 55 89 -51 178 -151 -28 -51 -50 -162 -137 76 -108 12
6089 12 -116 55 256 19 -41 -224 12 6 36 152 -207 108 10 107 81 -32 -194 -227 167 80 -223 -96 -112 66
6113 66 100 -120 -35 143 147 142 96 -261 -87 -79 168 -2 -131 122 246 -205 16 -14 -68 -1 -5 117 -257 43 -236
6138 -236 -169 -116 231 7 -54 85 -125 -97 -45 -65 -12 -238 -62 13 58 91 51 43 -65 -94 -62 -210 -68 160 212
6163 212 -22 -64 28 103 -96 -5 -246 53 88 -82 29 -182 40 -29 -54 158 1 -39 -9 -126 -75 -37 -206 -146
6187 -146 -101 -248 -59 44 104 84 13 -64 -97 75 19 7 -150 -144 23 156 -195 -356 54 65 -149 -80 -159 81
6211 81 59 10 -46 227 34 -422 -65 61 294 -187 -161 -229 -30 -120 38 -13 -154 139 -158 -106 -254 -165 -170 -1
6235 -1 -83 -171 121 -148 -194 100 137 190 40 21 179 238 29 40 -28 -215 -44 77 148 99 -193 10 -49 24 -119
6260 -119 -136 -106 100 65 -230 36 -113 29 164 192 43 -14 -8 26 -10 -210 4 287 -84 61 -65 49 378
6283 378 150 66 65 109 -39 -42 54 -15 177 -77 -1 -64 -198 201 -288 -258 -166 7 33 -130 -29 -12 66 -63 -120
6308 -120 23 75 -115 -307 -88 7 173 -10 13 -17 108 -21 -124 -10 38 -24 55 83 105 195 -18 -33 -84 -69
6332 -69 79 -119 109 49 201 91 -52 -51 195 44 -103 -13 -84 90 -28 80 16 -60 4 -54 37 34 203 -30
6356 -30 -85 22 -65 -74 246 -219 131 -55 -45 177 49 202 176 163 8 -32 5 174 -155 -37 211 -72 40
6379 40 -83 -108 43 56 -91 -49 51 -223 107 -12 217 -54 -192 -27 -204 251 -104 81 -114 -107 301 -13
6401 -13 206 -51 -284 10 -38 204 -36 138 -60 158 -191 -82 -14 -52 125 197 49 -24 97 81 -295 9
6423 9 22 -64 276 -62 50 -20 98 -125 -116 -64 208 35 25 -103 194 -42 -164 -102 -103 190 123 -68 296 -249
6447 -249 -44 28 20 -18 -57 -107 164 -92 -103 -74 -123 97 -68 -6 -131 176 -20 -103 -147 -145 -36 96 -115 199 -26
6472 -26 179 -111 -213 -343 -64 -101 -104 41 17 21 -51 -63 64 232 24 117 200 -138 9 55 -9 74 21 92 130 -69
6498 -69 -82 71 15 -357 -75 -63 6 107 73 -8 12 -71 18 243 166 -48 202 -77 120 69 -130 -40 -79 -123 -69
6523 -69 -217 106 -50 -71 -36 -23 387 156 -29 -54 22 180 117 167 -68 -64 177 -270 29 236 20 -132 70
6546 70 -113 -162 135 8 21 -80 -25 -27 -181 -124 -147 -54 273 -108 88 -114 6 28 199 19 -111 42 -209
6569 -209 152 -261 12 -34 62 4 26 -9 -40 281 -14 108 23 -57 372 -79 106 -11 230 -248 -60 -150 124
6592 124 -175 -88 50 -181 246 -213 -35 -33 18 -90 -5 166 123 -47 110 35 88 -56 -7 -59 -109 130 48 -37
6616 -37 76 -308 -202 160 -112 -31 11 8 -287 -211 -40 -30 -257 267 68 -28 -23 121 -136 162 68 6 -150 200
6640 200 239 124 -97 143 152 17 -110 21 92 222 -308 -138 227 -161 -113 -32 -25 -62 -44 65 153 61 91 -212
6664 -212 -317 42 -158 143 -108 -1 -90 152 -201 -36 -203 193 264 401 116 -241 40 -175 2 -90 66
6685 66 -15 -78 59 180 1 83 -74 -164 196 184 -141 56 130 -288 94 131 184 -125 -67 10 4 -28 176 0 83
6710 83 -120 110 -9 1 -8 -83 -35 -23 59 -52 -226 111 37 7 -160 57 -34 -99 -126 81 -52 71 78 -45 123
6735 123 -105 -45 -173 -67 75 -221 -42 -208 -101 -89 -50 17 87 96 101 -158 -157 -207 145 -144 57 248 -109 -61
6759 -61 -74 -58 53 101 -64 -216 73 82 -98 -11 163 -62 -189 169 -98 189 -16 112 144 121 -171 -39 242
6782 242 72 48 -24 20 18 107 176 72 -43 23 -111 -191 -158 -89 -83 -87 46 55 41 -106 15 30 -102 -77 -115 157 -202
6809 -202 41 -172 78 -12 -138 182 -126 -67 30 6 59 33 -18 157 -72 269 13 -32 61 -47 71 107 -107
6832 -107 46 26 90 306 308 -57 460 133 137 30 -28 -79 -112 153 172 -65 -61 35 -82 57 22 149 -24 -28 -128
6857 -128 -137 101 62 -429 213 89 20 103 -251 63 68 -19 250 -177 92 -71 94 161 -94 -114 34 -126 -130 74
6881 74 128 21 8 107 -94 252 -99 193 -133 2 49 -47 238 67 130 47 -140 33 54 -80 23 45 -69
6904 -69 63 149 86 -90 69 47 -203 13 92 -16 170 21 -174 -17 284 251 26 -11 -59 22 228 51 -83
6927 -83 -136 125 114 -155 -29 -39 0 -374 81 187 -62 -313 -67 -100 -180 -160 -69 89 54 -71 -168 121 -9 -217
6951 -217 76 -59 8 130 298 106 -242 128 -156 138 87 -99 62 -171 -4 127 -132 -39 154 100 20 23
6973 23 189 -183 -76 -249 -299 -82 173 -170 0 -258 -25 49 39 -201 -118 3 -142 50 -121 26 128 44
6995 44 -7 -125 158 -414 173 23 -59 73 25 30 65 15 29 95 78 -25 -295 79 78 -110 223 215 57 17 94 142
7021 142 -52 -56 -23 76 -71 44 248 0 130 153 73 -16 -57 -158 11 141 67 219 -263 -80 -113 -246 -17
7044 -17 23 -10 286 60 57 -111 -147 -66 -90 -211 51 -233 49 -132 -89 46 -70 -99 147 -216 -88 -187 119 12
7068 12 130 -161 -45 58 -144 -30 -32 160 64 250 -56 -204 62 92 -150 -360 -276 -42 100 -60 -52 10 165
7091 165 119 127 -166 138 107 159 14 -50 4 41 -72 -98 -135 -204 72 47 47 195 18 -186 -12 -48 72 -28 175
7116 175 136 113 -4 -155 28 231 -114 -74 -102 -32 -100 60 0 54 132 -103 -84 -86 -3 -58 -60 -49 -87 144 59 -38 23
7143 23 -32 67 -213 -51 26 55 140 -57 -118 -65 -82 -19 -129 41 0 114 -43 -174 124 -22 -45 -61 45 45 -274
7168 -274 67 192 9 199 -40 -39 -29 39 31 7 76 175 108 -153 -191 -264 171 -9 -138 -12 121 69 35 17 122
7193 122 -81 -47 81 131 -9 65 31 -119 -143 -20 -296 57 221 -58 -304 -135 40 -106 -81 -141 43 2 -35
7216 -35 -49 140 -166 -124 -51 -91 -64 -203 132 109 -3 -68 317 -50 -189 -146 11 140 -171 -82 63 -287 61
7239 61 1 129 148 -90 -21 241 10 -214 -184 -26 -131 -72 -289 16 -60 166 7 -64 -150 -52 93 -46 -231
7262 -231 90 -91 118 -167 -132 -58 -51 10 39 184 194 -212 -18 116 147 153 -111 -112 -83 261 -358 -117 80 20 -116
7287 -116 -128 3 26 176 -22 -38 -10 -27 -85 12 -1 88 2 42 -121 195 215 100 -29 13 337 -65 16 -61 -102
7312 -102 -343 80 -44 61 -8 -12 -171 -132 178 -13 -23 -203 -25 44 47 20 -58 -315 113 -108 -93 3 -93 39
7336 39 49 -180 -292 84 97 -61 94 307 9 -231 194 -140 -73 138 -161 55 -64 242 -35 -217 39
7357 39 147 -93 64 -41 -85 153 56 -144 -37 162 -159 165 48 -110 16 -118 -54 37 153 -129 -10 57
7379 57 -111 98 104 17 139 184 -382 -9 6 -65 -114 -71 -110 -80 191 3 177 -82 153 41 125 171 170 39 -120
7404 -120 28 149 -116 -148 98 -36 14 163 -100 -150 -211 -151 -19 124 378 26 105 65 -66 180 114 -113 85
7427 85 -94 107 -120 69 -82 138 -228 125 45 36 -9 -30 153 -40 20 -146 -53 43 199 -292 89 182 -51
7450 -51 83 39 -51 -103 135 -114 -260 -72 24 74 -1 88 18 -3 52 37 -52 -29 162 97 276 -9 36 116 30 -180
7476 -180 -68 105 -178 -48 -177 -67 79 -48 190 103 -203 49 75 176 -34 -182 -119 259 177 -152 317
7497 317 70 181 -155 -133 -35 3 257 125 -128 85 258 16 107 232 176 37 56 -12 -47 -275 58 -155 66
7520 66 -153 194 -35 253 7 -24 82 118 -60 66 -168 68 94 113 4 100 -75 -32 57 -89 60 383 -28
7543 -28 252 31 -106 115 -102 49 -88 108 61 -72 77 43 -143 -24 -70 -25 -17 50 -5 182 -128 163 -202
7566 -202 -4 -176 184 -48 69 -11 -199 223 145 121 -72 284 14 89 -66 -69 -164 -37 146 -4 32 -120 -9
7589 -9 -238 -3 -33 -33 -179 -101 -135 -6 383 -153 -100 -56 25 77 16 234 61 -87 -127 -22 52 -58 -26 83 -45
7614 -45 83 -235 -29 -289 -198 -36 -145 -26 77 137 147 -152 17 97 -193 70 112 122 -64 143 -40 8 84
7637 84 194 12 -13 7 -127 58 84 137 148 185 65 220 41 176 -104 -170 26 158 -64 197 -110 12 -106
7660 -106 -11 17 -14 -20 246 333 -251 -79 30 136 -172 132 -84 -26 -4 -215 -81 -44 98 116 -137 -36 123
7683 123 -97 -39 0 358 -127 150 133 -158 85 -114 36 105 -173 -147 -17 -50 -23 -232 40 76 133 7 -52
7706 -52 12 266 -45 -184 -130 63 -39 49 36 21 23 -82 -57 93 63 40 33 44 126 -152 -207 153 -185 -62 49
7731 49 54 63 -158 106 -39 -30 -4 -151 -160 -155 89 89 -123 56 65 31 184 -108 -38 -74 -48 -48 -69 -55 -83 -34 -267 -55 5
7760 5 -80 -79 190 -65 -12 -23 77 -60 -92 37 88 -173 -118 -209 6 31 2 -123 -50 -110 115 53 115 261 291 -84
7786 -84 29 117 18 -131 65 392 103 -44 11 36 -93 -21 -57 27 2 10 -6 159 -68 -16 -62 77 32 103 -42
7811 -42 101 -201 -51 65 266 -44 -124 60 45 -173 31 -1 -22 18 -218 -154 198 15 -45 -156 -40 -66 104
7834 104 -102 277 25 -216 161 209 80 -85 118 17 -114 41 -46 -103 -76 -64 -82 -84 -38 -88 -119 -104 -123 -26 41
7859 41 -59 -52 -146 -62 275 -10 -79 -102 4 104 -205 -180 70 -32 -177 102 -81 210 68 -4 -38 -29 67 93 -24
7884 -24 -134 -157 194 -23 -250 -104 -52 36 170 181 -145 82 9 42 -12 -137 -72 56 72 203 -153 -20 -64 -87
7908 -87 -104 -139 5 30 -117 -83 -138 45 -7 153 -31 -46 -1 74 -134 -95 155 198 28 282 -116 103 22 1 -83
7933 -83 -79 260 -65 35 -272 -99 261 137 -79 259 5 -31 -47 75 -178 106 -123 49 37 -128 170 -6
7955 -6 62 31 154 -238 -100 -138 -35 54 175 -67 88 74 118 -1 128 -99 71 -24 -119 53 124 110 -106 38
7979 38 -39 -85 -86 334 124 -130 -108 383 -128 35 -138 144 -42 -47 0 -124 -122 166 264 354 -138 -37 231 -4
8003 -4 178 -32 31 40 -298 -92 202 196 264 -194 316 40 -156 67 49 -33 -84 -89 -174 75 -78 231 105 42 -35
8028 -35 -90 -149 163 423 81 184 -62 -20 -39 197 -249 14 -6 -113 -54 77 -47 152 56 -53 93 -105 -36
8051 -36 72 -56 119 21 -15 -144 188 -69 105 250 40 41 -177 -74 -265 -156 77 281 66 -90 45 -182
8073 -182 -27 155 -204 169 188 182 -81 -133 -70 1 -24 78 -144 108 90 -27 -137 -30 16 -32 -29 103 -110 -51
8097 -51 20 -267 -35 209 -57 70 -26 -89 -27 174 147 -42 -54 -8 -145 -4 -120 -71 2 108 150 57 54 12 -65
8122 -65 -204 -107 -154 -52 -67 132 178 319 -146 219 111 -20 -332 -30 -2 -52 51 -140 253 31 73 97 -167
8145 -167 -381 -70 -55 143 -172 200 -19 94 -208 -2 -118 -171 -71 -94 -113 -31 67 -73 27 89 88 148 -61
8168 -61 283 123 99 -148 96 -11 -37 -345 -68 66 -252 -16 -122 -106 178 174 -41 -211 -43 130 88 -158
8190 -158 -103
8191a03
##END NTUPLES=NMR FID
##END=
