##TITLE=1H_CA-8769x-Y
 DMSO, 8 sc, 
 1.10.2020
##JCAMPDX= 6.0         $$ Bruker NMR JCAMP-DX V2.0
##DATA TYPE= NMR FID
##DATA CLASS= NTUPLES
##ORIGIN= UXNMR, Bruker Analytische Messtechnik GmbH
##OWNER= root
$$ XWIN-NMR		Version 3.5
$$ Thu Oct  1 11:34:27 2020 Russian Standard Time (UT+4h)  she@DPX200
##.OBSERVE FREQUENCY= 200.1315066352
##.OBSERVE NUCLEUS= ^1H
##.DELAY= (6, 6)
##.ACQUISITION MODE= SIMULTANEOUS
##.ACQUISITION SCHEME= undefined
##.AVERAGES= 8
##.DIGITISER RES= 18
##SPECTROMETER/DATA SYSTEM= spect
##.PULSE SEQUENCE= zg30
##.SOLVENT NAME= DMSO
##.SHIFT REFERENCE= (INTERNAL, DMSO, 0, 15.7039)
##AUDIT TRAIL= $$ (NUMBER, WHEN, WHO, WHERE, WHAT)
$$ ##TITLE= Audit trail, XWIN-NMR		Version 3.5
$$ ##JCAMPDX= 5.01
$$ ##ORIGIN= Bruker BioSpin GmbH
$$ ##OWNER= she
$$ F:/spectra/data/she/nmr/H-F/1/audita.txt
$$ ##AUDIT TRAIL=  $$ (NUMBER, WHEN, WHO, WHERE, WHAT)
(   1,<2020-10-01 11:33:38.93 +0400>,<she>,<DPX200>,
      <created by zg, POWCHK disabled, PULCHK disabled
       configuration hash MD5:
       00 E9 B6 7A A2 85 ED C7 34 08 36 98 17 FE 4E 26
       data hash MD5: 16K
       0C E3 0F DD 86 8F 30 BF F7 51 93 B1 AF 17 8E D8>)
$$ ##END=
$$ 
$$ hash MD5
$$ 12 B1 64 C7 A5 7B 88 95 8D 2E A3 02 5C D8 70 87
##$RELAX= 
##$RELAX= 
##$RELAX= 
##$RELAX= 
##$RELAX= 
##$RELAX= 
$$ Bruker specific parameters
$$ --------------------------
##$DU= <F:/spectra>
##$EXPNO= 1
##$NAME= <H-F>
##$PROCNO= 1
##$TYPE= <nmr>
##$USER= <she>
##$AMP= (0..31)
100 100 100 100 100 100 100 100 100 100 100 100 100 100 100 100 100 100 
100 100 100 100 100 100 100 100 100 100 100 100 100 100 
##$AQSEQ= 0
##$AQ_mod= 1
##$AUNM= <au_zg>
##$AUTOPOS= <>
##$BF1= 200.13
##$BF2= 200.13
##$BF3= 200.13
##$BF4= 200.13
##$BF5= 200.13
##$BF6= 200.13
##$BF7= 200.13
##$BF8= 200.13
##$BYTORDA= 1
##$CFDGTYP= 0
##$CFRGTYP= 5
##$CHEMSTR= <none>
##$CNST= (0..31)
1 1 145 1 1 1 1 1 1 1 1 1 1 1 1 1 1 1 1 1 1 1 1 1 1 1 1 1 1 1 1 1 
##$CPDPRG= <>
##$CPDPRG1= <>
##$CPDPRG2= <>
##$CPDPRG3= <>
##$CPDPRG4= <mlev>
##$CPDPRG5= <mlev>
##$CPDPRG6= <mlev>
##$CPDPRG7= <mlev>
##$CPDPRG8= <mlev>
##$CPDPRGB= <>
##$CPDPRGT= <>
##$D= (0..31)
0 1.2 0 0 0 0 0 0 0 0.06 0 0.03 0 0 0 0 0.0002 0 0 0 0 0 0 0 0 0 0 0 0 
0 0 0 
##$DATE= 1601537618
##$DBL= (0..7)
120 120 120 120 120 120 120 120 
##$DBP= (0..7)
150 150 150 150 150 150 150 150 
##$DBP07= 0
##$DBPNAM0= <>
##$DBPNAM1= <>
##$DBPNAM2= <>
##$DBPNAM3= <>
##$DBPNAM4= <>
##$DBPNAM5= <>
##$DBPNAM6= <>
##$DBPNAM7= <>
##$DBPOAL= (0..7)
0.5 0.5 0.5 0.5 0.5 0.5 0.5 0.5 
##$DBPOFFS= (0..7)
0 0 0 0 0 0 0 0 
##$DE= 6
##$DECBNUC= <off>
##$DECIM= 32
##$DECNUC= <off>
##$DECSTAT= 4
##$DIGMOD= 1
##$DIGTYP= 9
##$DL= (0..7)
0 120 120 120 120 120 120 120 
##$DP= (0..7)
150 150 150 150 150 150 150 150 
##$DP07= 0
##$DPNAME0= <>
##$DPNAME1= <>
##$DPNAME2= <>
##$DPNAME3= <>
##$DPNAME4= <>
##$DPNAME5= <>
##$DPNAME6= <>
##$DPNAME7= <>
##$DPOAL= (0..7)
0.5 0.5 0.5 0.5 0.5 0.5 0.5 0.5 
##$DPOFFS= (0..7)
0 0 0 0 0 0 0 0 
##$DQDMODE= 0
##$DR= 18
##$DS= 0
##$DSLIST= <SSSSSSSSSSSSSSS>
$$ [...]
##$SUBNAM2= <"">
##$SUBNAM3= <"">
##$SUBNAM4= <"">
##$SUBNAM5= <"">
##$SUBNAM6= <"">
##$SUBNAM7= <"">
##$SUBNAM8= <"">
##$SUBNAM9= <"">
##$SW= 16.880792210976
##$SWIBOX= (0..15)
0 0 2 0 0 0 0 0 0 0 0 0 0 0 0 0 
##$SW_h= 3378.37837837838
##$TD= 16384
##$TD0= 1
##$TE= 0
##$TE2= 300
##$TE3= 300
##$TEG= 300
##$TL= (0..7)
0 120 120 120 120 120 120 120 
##$TP= (0..7)
150 150 150 150 150 150 150 150 
##$TP07= 0
##$TPNAME0= <>
##$TPNAME1= <>
##$TPNAME2= <>
##$TPNAME3= <>
##$TPNAME4= <>
##$TPNAME5= <>
##$TPNAME6= <>
##$TPNAME7= <>
##$TPOAL= (0..7)
0.5 0.5 0.5 0.5 0.5 0.5 0.5 0.5 
##$TPOFFS= (0..7)
0 0 0 0 0 0 0 0 
##$TUNHIN= 0
##$TUNHOUT= 0
##$TUNXOUT= 0
##$USERA1= <user>
##$USERA2= <user>
##$USERA3= <user>
##$USERA4= <user>
##$USERA5= <user>
##$V9= 5
##$VALIST= <valist>
##$VCLIST= <CCCCCCCCCCCCCCC>
##$VD= 0
##$VDLIST= <DDDDDDDDDDDDDDD>
##$VPLIST= <PPPPPPPPPPPPPPP>
##$VTLIST= <TTTTTTTTTTTTTTT>
##$WBST= 1024
##$WBSW= 4
##$XGAIN= (0..3)
0 0 0 0 
##$XL= 0
##$YL= 0
##$YMAX_a= 415641
##$YMIN_a= -263430
##$ZGOPTNS= <>
##$ZL1= 120
##$ZL2= 120
##$ZL3= 120
##$ZL4= 120
##$ABSF1= 10
##$ABSF2= 0
##$ABSG= 5
##$ABSL= 3
##$ALPHA= 0
##$AQORDER= 0
##$ASSFAC= 0
##$ASSFACI= 0
##$ASSFACX= 0
##$ASSWID= 0
##$AUNMP= <proc_1d>
##$AZFE= 0.1
##$AZFW= 0.1
##$BCFW= 1
##$BC_mod= 2
##$BYTORDP= 1
##$COROFFS= 0
##$CY= 11.3945322036743
##$DATMOD= 1
##$DC= 2
##$DFILT= <>
##$DTYPP= 0
##$F1P= 16.9975609425685
##$F2P= -3.02152046262296
##$FCOR= 0.5
##$FTSIZE= 0
##$FT_mod= 4
##$GAMMA= 1
##$GB= 0.15
##$INTBC= 1
##$INTSCL= 1
##$ISEN= 128
##$LB= 0.24
##$LEV0= 0
##$LPBIN= 0
##$MAXI= 10000
##$MC2= 0
##$MEAN= 0
##$ME_mod= 0
##$MI= 1.114404
##$NCOEF= 0
##$NC_proc= 0
##$NLEV= 6
##$NOISF1= 3.799351
##$NOISF2= 2.8
##$NSP= 1
##$NTH_PI= 0
##$NZP= 0
##$OFFSET= 15.70392
##$PC= 1
##$PHC0= -9971.935
##$PHC1= 11.00089
##$PH_mod= 1
##$PKNL= yes
##$PPARMOD= 0
##$PSCAL= 0
##$PSIGN= 0
##$REVERSE= no
##$SF= 200.130013532006
##$SI= 16384
##$SIGF1= 3
##$SIGF2= 2
##$SINO= 400
##$SIOLD= 16384
##$SREGLST= <1H.CDCl3>
##$SSB= 0
##$STSI= 0
##$STSR= 0
##$SW_p= 3612.71676300578
##$SYMM= 0
##$S_DEV= 0
##$TDeff= 0
##$TDoff= 0
##$TI= <>
##$TILT= no
##$TM1= 0
##$TM2= 0
##$TOPLEV= 0
##$USERP1= <user>
##$USERP2= <user>
##$USERP3= <user>
##$USERP4= <user>
##$USERP5= <user>
##$WDW= 1
##$XDIM= 8192
##$YMAX_p= 0
##$YMIN_p= 0
$$ End of Bruker specific parameters
$$ ---------------------------------
##NTUPLES= NMR FID
##VAR_NAME=  TIME,          FID/REAL,        FID/IMAG
##SYMBOL=    X,             R,               I
##VAR_TYPE=  INDEPENDENT,   DEPENDENT,       DEPENDENT
##VAR_FORM=  AFFN,          ASDF,            ASDF
##VAR_DIM=   8192,          8192,            8192
##UNITS=     SECONDS,       ARBITRARY UNITS, ARBITRARY UNITS
##FACTOR=    0.000296,      1,               1
##FIRST=     0,             0,               0
##LAST=      2.424536,      0,               0
##MIN=       0,             -263430,         0
##MAX=       2.424536,      415641,          0
$$ Real data points
##PAGE= N=1
##DATA TABLE= (X++(R..R)), XYDATA
$$ [...]
$$ plain form
1713 204 145 -211 -75 23 162 23 135 -10 -77 172 73 100 -77 56 -151 -118 60 -171 72 -291 -65 -104
1735 -104 64 223 62 -128 79 117 -132 117 -31 -18 89 177 -119 -13 -127 -52 38 -258 137 -48 124 -112
1757 -112 20 -41 141 -48 16 60 -113 85 -111 21 -111 0 180 114 -33 -58 136 87 -205 -61 -60 116 -18
1780 -18 147 134 95 293 -106 -89 58 -51 113 56 -114 138 10 63 309 51 53 228 -155 -223 -195 26 -305
1803 -305 -146 -260 -60 7 3 305 57 -77 -37 -18 -65 112 -56 39 -153 11 -51 2 28 -125 -256 24 -92
1826 -92 120 -26 174 -24 -3 -169 184 358 66 -107 7 5 72 -41 -176 68 58 330 115 168 -76 116
1848 116 -77 -61 11 -28 -12 -150 72 93 16 129 61 -94 210 -184 -32 111 198 -86 -12 -61 -84 67 159 -44
1872 -44 -7 -83 88 68 -143 -141 -109 97 84 55 -192 165 244 -36 249 -183 141 -75 -118 -116 -34 -201 -147 -39 -103
$$ packed form
1713B04n9l56J36R8J39j39J12j45o7K49r9K7j77J33k07L3J78k31K43l63K26l9
1735a04J68J59j61j90K07L8k49K49j48J3J07Q8k96J06j14P5R0k96L95j85J72k36
1757a12J32o1J82j89O4M4j73J98j96J32j32J11J80o6j47k5J94m9k92J44JJ76j34
1780a8J65j3l9J98l99J7J47j09J64n7j70K52j28N3K46k58KJ75l83o8K8K21l31
1803c05J59j14K00O7mL02k48j34M0J9m7J77j68R5j92J64o2N3K6j53j31K80j16
1826i2K12j46K00j98K1j66L53J74k92j73J14kO7j13j35K44j0K72k15N3k44J92
1848A16j93J6P2l9J6j38K22K1p7J13o8j55L04l94J52J43Q7k84P4m9k3J51R2k03
1872d4L7p6J71k0k11KL2K06j3k9k47L57P9k80K85m32L24k16m3KQ2j67N4J08o4
$$ plain form
1897 -103 -69 -171 -25 -391 -198 -96 -224 -17 57 49 106 97 239 61 -70 8 -141 71 -40 288 27 226 129
1920 129 102 -107 -57 179 70 -37 -135 13 -34 -208 -49 270 -64 68 -81 130 24 115 -15 204 -106 -135
1942 -135 -129 -59 -22 -104 -130 -175 11 -130 36 -212 28 -62 -77 26 74 -195 85 149 36 70 -62 -84 -51 -249 38
1967 38 -137 20 -67 94 -198 -12 -34 -134 46 -98 100 74 -8 -19 241 20 -33 176 57 -82 16 16 210
1990 210 28 -135 132 61 -101 -8 13 7 -193 -241 50 23 -19 12 -142 79 29 -160 26 -71 241 131 70 -59
2014 -59 24 -29 -293 45 -229 151 105 -17 210 -44 81 70 -190 74 40 -26 -205 69 -80 -106 65 -2 33
2037 33 -25 142 131 45 -68 40 20 -91 -120 34 133 63 30 -85 187 51 40 79 -210 65 -90 -32 -89 103
2061 103 108 349 -42 -180 48 73 -255 -218 -33 -113 -118 -4 -144 -183 58 90 -54 19 -108 -33 -92 -132 21 -96
$$ packed form
1897a03L4j02J46l66J93J02j28K07P4qN7rJ42j78j31P8j49K12j11L28k61J99r7
1920A29k7k09N0K36j09j07r8J48m7j74J59L19l34J32j49K11j06R1j30K19l10k9
1942a35OP0L7q2k6m5J86j41J66k48K40r0j5J03M8k69K80O4j13L4j32k2L3j98K87
1967C8j75J57q7J61k92J86k2j00J80j44J98k6q2j1K60k21n3K09j19j39R8%J94
1990B10j82j63K67p1j62R3K1ok00m8K91k7m2L1j54K21n0j89J86r7L12j10o1j29
2014e9Q3n3k64L38k74L80m6j22K27k54J25j1k60K64l4o6j79K74j49k6J71o7L5
2037C3n8J67j1q6j13J08k0j11k9J54R9p0l3j15K72j36j1L9k89K75j55N8n7J92
2061A03NK41l91j38K28K5l28L7J85q0nJ14j40l9K41L2j44P3j27P5n9m0J53j17
$$ plain form
2085 -96 -179 -223 83 -128 -152 -124 -243 -59 52 -31 -39 34 63 55 199 -135 -16 -6 -18 69 -83 -11 -45 -125 -168 86
2111 86 -6 -107 57 279 96 -236 160 177 49 115 -57 -77 38 43 151 -186 204 40 -18 284 221 162 0
2134 0 32 -164 -18 79 175 106 327 53 -33 87 -107 17 189 128 -230 -119 -202 75 -164 95 4 -140 43
2157 43 41 132 -78 11 182 43 48 270 -80 210 -10 -186 183 -90 175 164 -68 -103 -41 27 75 40 -43 -153 50
2182 50 -87 -18 35 43 -11 164 83 152 -31 -346 24 -136 -46 217 25 166 81 158 160 -207 -203 -8 -26 238 114
2207 114 -23 169 89 -191 -16 -115 -3 26 65 14 170 -84 -22 -198 -6 -8 36 185 6 -163 -37 140 -101
2230 -101 36 -20 -130 156 125 125 15 72 -37 -71 -11 60 175 -174 89 131 2 -107 125 360 55 -112 184
2253 184 -302 16 202 -19 -121 149 118 -231 -149 140 -240 67 -88 290 -123 72 14 127 125 158 -26 -100
$$ packed form
2085i6q3m4L06k11k4K8j19J84J11q3qP3K9qJ44l34J19J0j2Q7j52P2l4q0m3K54
2111H6r2j01J64K22j83l32L96J7j28O6j72k0J15NJ08l37L90j64n8L02o3n9j62
2134@L2j96J46R7R6o9K21k74q6J20j94J24J72o1l58J11q3K77k39K59r1j44J83
2157D3kR1k10Q9J71j39NK22l50K90k20j76L69k73K65j1k32l5O2O8M8l5q3j10K03
2182E0j37O9N3Qn4J75q1O9j83l15L70j60R0K63j92J41q5P7Kl67MJ95j8K64j24
2207A14j37J92q0k80J75r9J12K9L9n1J56k54O2j76J92kM4J49j79j69J26J77k41
2230a01J37n6j10K86l1%j10N7j09l4O0P1J15l49K63M2j29j09K32K35l05j67K96
2253A84m86L18J86k21j02K70l1l49Q2K89l80L07j55L78m13J95n8J13kL3j84p4
$$ plain form
2275 -100 18 -10 -178 51 109 -261 -92 -147 -9 -34 -162 155 -39 -81 99 -92 23 144 -77 -70 -57 -33 46
2298 46 -114 -18 -125 4 100 246 -82 81 -102 96 6 13 -261 162 80 -37 87 109 132 -1 -375 -24 -134
2321 -134 146 21 200 -110 66 18 72 -198 -52 24 -130 -14 27 30 33 34 35 86 88 -342 90 -118 102 -276 168
2346 168 84 -121 -199 138 -28 84 277 -167 -177 136 60 -115 40 -84 -74 -131 56 -137 281 28 -65 13 123
2369 123 -75 -145 -112 -37 -24 -107 -29 193 89 -18 -27 82 -238 -31 88 -179 86 -10 -36 -163 -21 -167 84
2392 84 -36 -115 65 25 150 -65 3 156 37 -31 -314 -259 229 -173 196 124 176 -137 72 73 -90 -79 101 -92
2416 -92 -139 110 -21 -79 4 -105 -64 -67 -206 -200 -28 -29 101 -22 84 -16 -214 56 70 -71 -172 -29 77 -23
2440 -23 -90 -4 -46 134 -9 -48 -65 -127 -18 -3 58 129 176 64 90 -70 -133 164 174 -92 -158 39 5 142 83 80
$$ packed form
2275a00J18k8j68K29N8l70J69n5J38k5j28L17j94m2J80j91J15J21k21PJ3K4P9
2298D6j60R6j07J29R6J46l28J63j83J98r0Pk74M23q2j17J24K2K3j33l74L51j10
2321a34K80j25J79l10J76m8N4k70J46P6j54J16M1LLJJN1Km30M32k08K20l78M44
2346A68q4k05p8L37j66J12J93m44j0L13p6j75J55j24J0n7J87j93M18k53r3P8J10
2369A23j98p0L3P5J3q3P8K22j04j07rJ09l20K07J19k67K65r6k6j27J42j46K51
2392H4j20p9J80m0J25k15O8J53j19o8k83N5M88m02L69p2N2l13K09Jj63J1J80j93
2416i2m7K49j31n8Q3j09M1lj39OJ72jJ30j23J06j00j98K70J4j41j01J43J06j00
2440b3o7Q6m2J80j43l9j7o2J09J5O1P1M7j12K6j60o3K97J0k66o6J97l4J37n9l
$$ plain form
2466 80 -118 67 100 -16 9 -190 -108 -128 140 147 23 -11 -110 -2 4 -69 106 30 220 49 -169 47 -213 185
2490 185 -23 14 66 -39 238 -23 41 -137 90 -151 -36 -194 -78 74 -121 111 -49 -68 129 -90 -83 14
2512 14 -59 -133 -72 -301 155 -160 5 -209 20 -20 27 131 -92 -1 -66 -44 -97 101 -113 -10 119 -220 -121 127
2536 127 -139 17 -17 13 96 68 -60 68 -148 202 19 -13 74 -76 101 -126 53 22 127 10 -22 -53 -11
2559 -11 15 -63 -51 45 32 -1 -179 -146 -88 147 -245 -124 -70 136 133 316 -112 -27 -45 75 -15 -4 38 145 41 69
2585 69 -94 -39 96 148 107 -57 -121 -6 34 41 -84 48 168 -17 77 -10 164 -72 237 -117 -32 15 168 -167
2609 -167 68 -83 -100 -58 57 261 101 -80 -120 35 114 131 138 -240 242 194 24 -104 -250 -157 137 -53 125
2632 125 19 183 158 -5 -157 244 56 -120 -6 -122 -63 94 115 33 108 -237 28 -210 20 89 -129 14
$$ packed form
2466H0j98J85L3j16K5j99Q2k0K68Pj24l4r9J08Op3J75p6J90j71k18K16k60L98
2490A85k08L7N2j05K77k61O4j78K27k41J15j58J16J52j95K32j60j9J97k19PR7
2512A4p3p4O1k29M56l15J65k14K29m0M7J04k23R1o5K2n3J98k14J03J29l39R9K48
2536A27k66J56l4L0Q3k8j28J28k16L50j83l2Q7j50J77k27J79l1J05j17l2l1M2
2559a1K6p8J2R6j3l3j78L3N8K35l92J21N4K06lJ83m28Q5j8J20r0J1M2J07j04K8
2585F9j63N5J35N2m1j64o4J15M0Pj25J32J20j85R4q7J74k36L09l54Q5M7J53l35
2609a67K35j51j7M2J15K04j60j81m0J55P9J7Pl78M82m8j70j28j46R3K94j90J78
2632A25j06J64k5j63j52M01j88j76J14j16N9J57K1q2P5l45K65k38K30O9k18J43
$$ plain form
2654 14 3 -16 -78 91 228 -138 -42 -31 -15 194 -17 280 -146 33 -34 61 17 106 -11 80 176 -103 -15 26 46
2679 46 237 59 -67 52 -273 53 -28 228 25 -112 15 99 -76 231 -17 148 22 32 120 3 -276 -158
2701 -158 214 27 16 106 108 52 164 -41 173 105 -129 -43 85 -35 195 205 -112 -93 43 -171 117 201 180 -258
2725 -258 154 -144 94 129 -1 -113 -163 -34 -74 -15 112 185 -21 -56 90 124 2 -34 -288 74 46 89 -5 -118
2749 -118 -221 -26 -313 -182 -122 74 -97 98 -132 -95 -231 -54 140 -70 34 224 -88 -99 -22 -171 -75 -119
2771 -119 -144 -177 -109 -1 -8 -17 26 -18 -40 34 39 69 154 46 37 13 54 -217 -23 68 -62 -17 -64 195 4 -23 -66 82
2799 82 -124 122 131 161 147 -23 -100 -258 -143 -40 8 -49 39 -17 122 264 -83 -26 67 122 -144 -136 181 136 225 116
2825 116 126 44 151 58 140 153 74 121 -128 -84 42 -63 63 56 89 119 163 -94 -17 -97 -142 -96 -132 170 82 -158
$$ packed form
2654A4j1j9o2J69J37l66R6J1J6K09k11K97m26J79o7R5m4Q9j17R1R6k79Q8M1K0
2679D6J91j78j26J19l25L26q1K56k03j37J27Q4j75L07k48J65j26J0Q8j17k79J18
2701a58L72j87j1R0Kn6J12k05K14o8k34Q6J28j20K30J0l17J9J36k14K88Q4k1m38
2725b58M12k98K38L5j30j12n0J29m0N9J27P3k06l5J46L4j22l6k54L62k8M3r4j13
2749a18j03J95k87J31O0J96j71J95k30L7j36J77J94k10J04J90l12j1P7j49R6m4
2771a19k5l3O8J08prM3m4k2P4NL0Q5j08rk4M1k71J94R1j30M5m7K59j91k7m3J48
2799H2k06K46RL0j4j70p7j58J15J03M8n7Q8n6J39J42l47N7R3N5k66QL17m5Q9j09
2825A16J0q2J07r3Q2J3p9M7k49M4J26j05J26pL3L0M4k57P7q0m5M6l6L02q8k40
$$ plain form
2851 -158 -107 -42 -59 69 275 -23 -167 227 49 346 -118 -267 212 -22 115 75 75 100 1 52 -213 79 -179
2874 -179 -133 140 156 -92 40 161 -24 -97 -125 31 -19 -106 -85 -56 -81 -109 58 79 -144 230 41 10 304 181
2898 181 -39 123 112 -47 79 -14 -207 -119 -49 -112 45 169 49 92 234 -28 35 64 -111 -12 -183 -13 -51
2921 -51 -80 71 -34 73 10 211 -46 100 20 -12 -57 -176 -223 -24 -101 51 65 207 149 -10 15 18 -149 -111 -20
2946 -20 144 252 -77 -166 -82 -213 -105 -323 57 -39 31 4 -30 -138 -26 136 41 -27 -379 4 7 -195 35 -55
2970 -55 -147 242 -79 191 -133 11 100 194 -16 -83 18 91 18 41 -76 39 -1 -28 253 155 -105 -169 -38 -44 76
2995 76 -136 51 199 -1 -263 -26 121 122 -88 -89 85 -37 -61 -93 63 170 187 24 16 303 -154 275 -59
3018 -59 -354 343 -54 -131 203 73 -47 12 -146 140 153 86 129 158 122 158 146 -178 127 110 -264 -130 49 -94
$$ packed form
2851a58N1O5j7J28K06k98j44L94j78K97m64j49M79k34J37m0%K5r9N1k65K92k58
2874a79M6K73J6k48J32J21j85p3k8J56n0q7K1K9k5k8J67K1k23L74j89l1K94j23
2898A81k20J62j1j59J26r3j93Q8P0o3J57J24j20M3J42k62O3K9j75R9j71J70l8
2921e1k9J51j05J07o3K01k57J46q0l2m5j19m7J99p7J52J4J42n8j59K5Lj67L8R1
2946b0J64J08l29q9Q4j31J08k18L80r6P0k7l4j08J12J62r5o8l52L83Lk02K30r0
2970e5r2L89l21K70l24J44Q9R4k10o7J01P3p3K3j17J15m0k7K81r8k60o4J31oJ20
2995G6k12J87J48k00k62K37J47Jk10jJ74j22k4l2J56J07J7j63qK87m57M29l34
3018e9k95O97l97p7L34j30j20N9j58K86J3o7M3K9l6L6j2l24L05j7l74J34J79j43
$$ plain form
3042 -94 81 171 0 -80 9 157 -274 243 -213 7 -28 45 81 -138 -68 -175 -51 49 -98 -72 13 -81 -135 122
3066 122 -71 199 107 125 -137 16 89 142 -2 100 -40 -127 172 -87 82 -4 88 -29 73 60 -221 -72 -123
3089 -123 118 110 21 -134 83 142 92 -41 -58 137 -27 54 282 205 7 89 12 93 24 -91 -5 57 58 -76 -175 95
3115 95 9 174 147 -65 24 77 44 -30 171 134 -246 -194 -35 8 -59 -97 -32 -30 -134 290 -22 117 -55 4 -118
3140 -118 17 -136 -57 43 64 -155 128 31 183 92 29 143 10 -111 3 171 -83 -31 -67 112 84 23 -6
3163 -6 -232 -89 -113 -105 -83 -88 125 -24 61 -28 29 -97 165 -69 -41 -56 67 -85 -115 -4 10 52 -156 -125 95 93
3189 93 124 201 121 -244 25 20 57 30 -163 -55 91 -73 57 99 183 24 -113 -5 74 -52 44 -75 -97 -426
3213 -426 -33 65 95 -186 111 -242 -42 -64 -141 47 -206 161 -59 261 -28 -78 253 54 -6 89 -208 -148 71
$$ packed form
3042i4J75R0j71q0Q9J48m31N17m56K20l5P3L6k19P0j07J24J00j47K6Q5r4n4K57
3066A22j93K70r2J8k62J53P3N3j44J02j40q7K99k59J69q6R2j17J02j3k81J49n1
3089a23K41qq9j55K17N9n0j33j7J95j64Q1K28p7j98Q2p7Q1o9j15Q6O2Jj34r9K70
3115I5q6J65k7k12Q9N3l3p4K01l7l80N2J59M3o7l8O5Kj04M24l12J39j72N9j22
3140a18J35j53P9J00K1k19K83r7J52r1o3J14j33j21J14J68k54N2l6J79k8o1k9
3163fk26J43k4QK2nK13j49Q5q9N7j26K62k34K8j5J23j52l0J11J4M2k08L1K20k
3189I3L1P7q0l65K69nL7k7j93J08J46j64J30M2Q4j59j37J08P9j26R6j19k2l29
3213d26L93R8L0k81K97l53K00k2p7J88k53L67k20L20k89n0L31j99o0R5k97O0K19
$$ plain form
3236 71 -112 43 187 218 192 102 -25 -151 -160 -7 70 367 -148 -87 114 -117 -122 -101 -27 61 90 -95 -222 -109 146
3261 146 -139 67 -130 -50 -170 -22 -167 -21 14 352 34 -7 -123 90 -109 -96 -192 -269 28 -347 77 267
3283 267 176 16 -22 52 113 12 126 -35 86 83 73 -19 19 69 -103 91 -80 -22 -151 49 -53 -30 -15 -93 32
3308 32 51 -69 -71 -19 -190 -152 107 67 -122 356 27 95 14 -208 124 8 -19 127 15 -55 -45 -263 133 -67
3332 -67 -182 53 39 -236 -101 -23 121 -43 -69 219 120 127 -78 18 172 174 -58 13 55 158 168 -187 89 -192
3356 -192 8 -112 105 -215 -121 -156 -174 79 -109 -118 -193 -73 -59 -1 187 -92 -111 -83 8 118 10 75 16 -146
3380 -146 -25 -99 -144 -42 98 -41 -266 414 -37 189 95 -19 -11 -105 -52 -26 -112 -22 28 103 -217 263 -56 -130
3404 -130 -224 170 -155 -99 72 -162 -4 -127 113 120 -9 -121 102 103 62 -74 -74 37 35 -70 18 -52 122 -238
$$ packed form
3236G1j83J55J44L1k6r0j27j26rJ53P7K97n15O1K01k31nK1P4Q8K9j85j27J13K55
3261A46k85K06j97Q0j20J48j45J46L5L38l18m1j16K13j99J3r6p7K97l75M24J90
3283B67r1j60l8P4O1j01J14j61J21lj0r2L8N0j72J94j71N8j29K00j02K3J5p8J25
3308C2J9j20kN2j71L8K59m0j89M78l29O8q1k22L32j16k7J46j12p0J0k18L96k00
3332f7j15K35j4k75J35P8J44j64k6K88r9Pk05R6J54Kk32P1M2J03J0l55K76k81
3356a92K00j20K17l20R4l5j8K53j88rp5J20J4N8J88k79j9K8R1J10j08O5n9j62
3380a46J21p4m5J02J40j39k25O80m51K26r4j14Qr4N3K6q6R0N0P5l20M80l19p4
3404a30r4L94l25N6J71k34J58j23K40Pj29j12K23Jm1j36%J11kj05Q8p0J74l60
$$ plain form
3428 -238 -55 -4 -95 -140 -121 -6 55 -50 12 68 -1 167 70 70 -161 -43 -143 -33 -198 104 -22 -22 92 2 33
3453 33 -35 -256 37 71 -148 -35 -182 -199 -125 6 -27 148 -16 -28 -225 17 36 81 -169 -14 263 174 -95
3476 -95 24 155 128 -141 1 -169 -25 46 -62 27 74 -125 19 -113 -55 -57 17 73 89 183 -75 49 68 84 -6
3501 -6 121 144 -123 -56 -57 218 -113 -114 172 14 -133 -146 -88 -238 -184 -195 7 -43 188 -111 -212 38 -131 82
3525 82 -72 -52 117 -60 -1 -151 -121 -130 29 -55 4 170 -39 -193 49 -42 -63 -51 -299 6 -40 -282 -119 40
3549 40 134 69 -27 -85 112 -18 -22 31 -103 57 -143 213 72 48 38 -324 -310 -153 -100 -290 100 19 146 83 64
3574 64 159 -15 -148 -130 -43 -31 181 140 3 -20 133 8 158 28 235 -18 13 130 -153 114 69 -391 -238
3597 -238 -150 -163 -72 113 -86 145 37 34 -76 -320 -6 -60 -71 -132 -110 75 -2 148 76 -48 -220 60 -69 23
$$ packed form
3428b38J83N1r1m5J9J15O1j05O2N6o9J68r7%k31J18j00J10j65L02j26%J14r0L1
3453C3o8k21K93L4k19J13j47j7P4J31l3J75j64j2j97K42J9M5k50J55K77q9k69
3476i5J19J31k7k69J42j70J44P1j08Q9M7j99J44j32N8kP4N6J6R4k58J24J9J6r0
3501fJ27K3k67O7jK75l31jK86j58j47j3N8j50N4j1K02n0K31k99j01K50j69K13
3525H2j54K0J69j77N9j50L0rJ59q4N9J66k09j54K42r1k1J2k48L05m6k42J63J59
3549D0R4o5r6n8J97j30mN3j34J60k00L56j41k4j0l62J4J57N3j90L90q1J27o3j9
3574F4R5j74j33J8Q7J2K12m1j37k3J53j25J50j30K07k53L1J17k83K67m5m60J53
3597b38Q8j3R1J85j99K31j08lj10k44L14n4j1o1K2J85p7J50p2j24j72K80j29R2
$$ plain form
3621 23 -103 -136 -175 -26 23 5 -173 22 -83 -25 -60 154 168 -357 253 55 -184 -19 -64 -218 144 2 257
3644 257 116 61 10 175 58 -102 -41 -72 3 64 -58 -22 35 92 -8 -89 74 29 -349 0 -57 -152 38 194
3668 194 -121 13 100 30 293 -203 14 -6 -187 -52 -120 -52 239 -101 -156 42 53 -199 -111 167 77 -138 173
3691 173 43 -51 176 -4 -184 -243 -5 61 68 149 -48 44 47 104 31 124 113 -54 126 -139 168 209 -77 211 -131
3716 -131 63 53 -3 113 -281 4 -164 23 169 33 -111 210 82 11 104 -19 145 -52 56 -163 86
3737 86 -249 224 -150 -128 93 171 -146 85 -30 -18 -30 23 222 -81 153 -100 187 -74 265 -85 77 -233
3759 -233 -10 152 57 171 -69 -89 -33 165 105 -8 -190 -205 -7 60 194 -93 -60 -71 -141 -34 176 63 -129
3782 -129 174 85 -63 -4 100 -10 28 -125 -116 142 -46 -81 46 -133 66 105 72 -60 -123 110 16 50 90 17
$$ packed form
3621B3j26l3l9J49M9j8j78J95j05N8l5K14J4n25O10j98k39J65m5j54L62j42K55
3644B57j41n5n1J65j17j60O1l1P5O1j22L6N7N7j00q1J63m5l78L49n7r5J90J56
3668A94l15J34Q7p0K63m96K17k0j81J35o8O8K91l40n5J98J1k52Q8K78r0k15L11
3691A73j30r4K27j80j80n9K38O6PQ1j97R2LN7p3R3j1j67J80k65L07M1k86K88l42
3716a31J94j0n6J16l94K85j68J87J46j36j44L21j28p1R3j23J64j97J08k19K49
3737H6l35M73l74K2K21P8l17K31j15J2j2N3J99l03K34k53K87k61L39l50J62l10
3759b33K23J62r5J14k40k0N6J98o0j13j82j5J98O7J34k87L3j1p0J07K10j13j92
3782a29L03q9j48N9J04j10L8j53RK58j88l5J27j79J99L9l3j32o3K33r4L4M0p3
$$ plain form
3806 17 -37 -44 -22 29 48 1 -28 -221 191 -106 65 132 -148 59 -23 74 -202 -180 21 132 146 -150 100 -240 -374
3831 -374 33 169 43 -108 -32 143 73 -44 89 292 -36 -201 147 -164 -184 -86 -139 -110 -3 5 -84 -86 320 -70
3855 -70 -117 -202 -126 -103 -61 -127 119 -167 -32 63 -154 -69 29 -117 -47 -85 -68 -15 88 283 30 -157 -16 232 -88
3880 -88 129 -177 -77 134 -133 -71 186 102 153 -183 45 -121 128 17 -83 -219 29 82 -241 55 16 -143
3902 -143 -88 211 -189 50 173 61 -31 90 94 -100 155 5 -83 75 248 -302 232 14 147 -62 6 8 -26
3925 -26 9 -191 -241 31 14 -57 -142 -393 16 45 6 -64 75 -23 67 -107 -131 -62 -82 -165 117 136 195 -9 100 127
3951 127 -171 154 62 -46 -39 138 -108 66 -94 72 34 217 141 -8 -154 -59 -278 28 167 33 17 -13 -159
3974 -159 9 1 -146 64 -245 -153 -164 166 219 8 134 -214 -49 -100 92 -89 -194 -163 -164 -19 101 -84 -32
$$ packed form
3806A7n4pK2N1J9m7k9j93M12k97J71O7k80K07q2R7k76K2K01J11J4k96K50l40j34
3831c74M07J36j26j51P6J75p0j17J33K03l28j65L48l11k0R8n3K9J07Qq9kM06l90
3855g0m7q5P6K3M2o6K46k86J35R5k17Q5R8j46P0l8J7N3J03J95k53j87J41K48l20
3880h8K17l06J00K11k67O2K57q4N1l36K28j66K49j11j00j36K48N3l23K96l9j59
3902a43N5K99m00K39J23j12r2J21Mj94K55j50q8J58J73n50N34k18J33k09O8Kl4
3925b6L5k00n0K72j7p1q5k51M09K9l9p0J39r8R0j74k4O9k0q3K82J9N9k04J09K7
3951A27k98L25r2j08PJ77k46J74j60J66l8J83p6j49j46R5k19L06J39j34j6l0j46
3974a59J68qj47K10l09R2j1L30N3k11J26l48J65n1J92j81j05L1jJ45J20j85N2
$$ plain form
3997 -32 25 -195 190 -189 79 32 -138 188 64 8 -22 55 -164 -197 -152 206 -17 14 -140 128 40 35 107 -240
4021 -240 140 -45 172 -96 76 13 -18 -73 -191 -138 42 164 156 -115 101 45 -109 67 166 -83 -225 172 -177
4044 -177 -38 7 129 -21 -156 -317 110 181 -145 36 -205 -100 179 99 112 52 -228 95 1 -21 -27 -138 104
4067 104 -131 61 -105 35 -11 25 -137 -41 63 216 -2 11 -37 143 94 -40 98 -19 212 10 -173 -124
4089 -124 -153 -16 94 -203 85 19 -188 24 -157 -68 220 -23 162 14 -45 -88 122 -130 -51 -86 -68 -176 0
4112 0 -27 -12 8 -33 -75 -39 -68 -161 -11 -74 -163 -54 88 -68 210 80 36 -64 112 -56 251 30 126 -188 -101
4137 -101 27 -78 37 -328 -50 -62 -24 144 25 -102 -2 16 -161 -16 -124 -97 -75 13 97 247 176 -144 33
4160 33 -61 -85 114 91 -254 -67 -81 124 59 -12 -112 62 224 -284 156 27 -5 202 -16 18 86 -105 -173 -138
$$ packed form
3997c2N7k20L85l79K68m7j70L26j24n6l0P7k19l3M5L58k23L1j54K68q8nP2l47
4021b40L80j85K17k68J72o3l1n5j18N3J80J22qk71K16n6j54J76R9k49j42L97l49
4044a77J39M5J22j50j35j61M27P1l26J81k41J05K79q0J3o0k80L23r4k2oj11K42
4067A04k35J92j66J40m6L6j62R6J04J53k18J3m8J80m9j34J38j17K31k02j83M9
4089a24k9J37J10k97K88o6k07K12j81Q9K88k43J85j48n9m3K10k52P9l5J8j08J76
4112@k7J5K0m1m2L6k9r3J50o3q9J09J42j56K78j30m4j00J76j68L07k21R6l14Q7
4137a01J28j05J15l65K78j2L8J68j19j27J00J8j77J45j08K7K2Q8Q4J50p1l20J77
4160C3r4k4J99k3l45J87j4K05o5p1j00J74J62n08M40j29l2K07k18L4O8j91o8L5
$$ plain form
4184 -138 223 -18 5 8 67 177 -90 10 72 177 189 5 76 -151 49 291 -87 -53 -221 116 10 42 -12
4207 -12 30 -63 -245 14 -93 155 -7 112 4 -31 -154 76 61 -101 56 -83 157 145 162 19 -145 -223 -24
4230 -24 5 -213 -81 -117 97 76 -39 -64 200 38 65 -12 -96 149 -71 347 260 6 236 9 242 107 140
4253 140 -45 62 150 145 191 -168 247 -7 286 103 263 -136 54 148 -72 70 -38 61 -42 53 281 105
4275 105 -134 -27 -166 -4 89 -301 190 214 -49 -34 -148 42 63 20 38 -4 33 72 -34 59 51 -84 47 170
4299 170 -117 -131 -297 49 233 -138 48 -91 -37 115 30 -137 322 64 38 80 108 122 6 -12 -37 134 212
4322 212 183 189 17 182 -74 -74 -118 79 -111 1 -112 -22 13 -65 -132 -42 -245 -183 105 -22 -171 -25 43 62 126
4347 126 110 -76 -50 -12 75 176 -147 159 -37 -15 56 75 215 318 -178 -37 139 -119 -35 -187 116 -80 -77
$$ packed form
4184a38L61k41K3LN9J10k67J00O2J05J2j84P1k27K00K42l78L4j68L37j06L2n4
4207a2M2r3j82K59j07K48j62J19j08l5j23K30j5j62J57j39K40j2J7j43j64p8J99
4230b4K9k18J32l6K14k1j15k5K64j62K7p7q4K45k20M18q7k54K30k27K33j35L3
4253A40j85J07Q8nM6l59M15k54K93j83J60l99J90R4k20J42j08R9j03R5K28j76
4275A05k39J07j39J62R3l90M91K4k63J5j14J90K1m3J8m2L7L9j06R3qj35J31J23
4299A70k87j4j66L46J84l71J86j39N4J52q5j67M59k58k6M2K8J4j16j8k5J71P8
4322B12k9Oj72J65k56%m4J97j90J12j13R0L5p8o7R0k03O2K88j27j49J46O8J9O4
4347A26j6j86K6L8Q7J01l23L06j96K2P1J9J40J03m96J41J76k58Q4j52L03j96L
$$ plain form
4370 -77 -120 249 99 -247 -12 129 -162 182 -153 -116 26 141 7 -73 -28 -152 -96 -125 3 -20 116 -74 287
4393 287 -70 104 -2 20 -150 54 284 -124 -32 140 222 114 34 -86 -40 -122 119 101 58 -260 -63 83 -131
4416 -131 -76 53 -5 -156 -153 223 77 -30 10 -34 -210 -274 81 -260 80 50 -94 25 -48 67 -47 -7 134
4439 134 -110 53 11 -183 41 -85 188 -25 41 -130 -268 -308 187 -19 -310 -296 -66 66 58 -36 42 156 128
4462 128 165 171 -112 -172 1 199 134 -452 -31 -16 102 -399 -267 -39 139 236 -40 -8 242 43 -77 75 197
4485 197 -125 101 -258 -15 -55 137 -7 237 88 88 88 34 191 52 271 -244 95 -58 121 -47 -40 -70 -168
4508 -168 -137 175 -199 230 35 -26 170 3 -211 43 117 40 139 34 65 -56 54 241 83 -164 81 127
4530 127 -149 20 -30 160 -90 -49 -245 -4 -42 -85 -80 64 169 117 25 -87 -98 -165 -214 75 -68 310 -226 -173
$$ packed form
4370g7m3L69j50l46K35J41k91L44l35L7J42J15j34q0M5j24N6k9J28k3J36j90L61
4393B87l57J74j06K2j70K04K30m08R2J72Q2j08q0j20M6q2K41j8m3l18J97J46k14
4416a31N5J29n8j51LL76j46j07M0m4j76o4L55l41L40l0j44J19p3J15j14M0J41
4439A34k44J63m2j94K24j26K73k13O6j71j38m0M95k06k91J4K30J32qr4P8J14k8
4462A28L7Ok83o0J73J98o5n86M21J5J18n01J32K28J78R7k76L2K50j99j20J52J22
4485A97l22K26l59K43m0J92j44K44j49%%n4J57j39K19n15L39j53J79j68Pl0r8
4508a68L1L12l74M29j95o1J96j67k14K54P4p7R9j05L1j21J10J87j58k47K45M6
4530A27k76J69n0J90k50M1j96K41l8m3NJ44J05n2r2j12j1o7m9K89j43L78n36N3
$$ plain form
4554 -173 105 101 -1 -73 78 -71 111 -200 47 -70 -75 -155 -137 68 -35 -175 227 95 -51 82 182 -18
4576 -18 -61 -117 -131 15 -133 4 64 -184 107 -119 -380 -21 -65 -273 -195 -100 -150 78 41 -224 40 -78 9 -126
4600 -126 -29 -47 -139 -176 182 7 -132 0 -183 68 193 -204 161 8 -292 239 13 29 48 -42 -297 85
4622 85 128 100 42 -4 -132 -15 76 124 -63 99 211 192 37 -219 -154 0 -6 379 -80 110 254 -21 -147 166
4646 166 80 -52 -1 99 -24 92 154 -52 -140 145 -71 368 -6 -167 80 -37 115 81 -298 -70 288 201
4668 201 40 19 126 3 -27 39 -23 -64 31 -50 140 -156 -414 -117 104 -65 -91 88 -75 -207 43 -29 -71
4691 -71 101 -79 16 -63 -121 -229 13 19 -103 -150 148 -49 -202 15 38 -62 273 -68 -100 -155 -211 2 -23 -218
4715 -218 300 -140 95 147 -304 -226 -18 -168 -65 -80 -182 -181 -60 -217 -79 42 -23 103 13 88 85 -53 -17 -58
$$ packed form
4554a73K78mj02p2J51j49J82l11K47j17nq0J8K05j03j40M02j32j46J33J00k00
4576a8m3n6j4J46j48J37O0k48K91k26k61L59m4k08P8R5n0K28l7k65K64j18Q7j35
4600a26R7j8r2l7L58j75j39J32j83K51J25l97L65j53l00N31k26J6J9r0k55L82
4622H5M3k8n8m6j28J17R1M8j87J62J12j9j55k56O5J54oL85m59J90J44k75j26L13
4646A66q6j32N1J00j23J16O2k06q8K85k16M39l74j61K47j17J52l4l79K28L58q7
4668B01j61k1J07j23l0O6o2m1R5q1J90k96k58K97K21j69k6J79j63j32K50p2m2
4691g1J72j80R5p9n8j08K42Oj22m7K98j97j53K17K3j00L35l41l2n5n6K13k5j95
4715b18N18m40K35N2m51P8K08j50J03j5j02JJ21j57J38J21o5J26r0P5lj38L6m1
$$ plain form
4739 -58 39 -174 123 -80 -33 302 67 -146 -44 146 -16 -4 194 52 -14 -137 67 171 -72 -230 0 -8
4761 -8 67 -32 93 31 106 -25 -15 148 191 239 254 -142 -179 55 63 130 36 -44 -77 -58 -159 -259 60 4 4 -102 43
4788 43 -176 130 -281 113 -13 -111 40 20 -55 -17 135 -271 133 129 56 -267 226 31 43 -91 376 -19 28
4811 28 29 196 113 -11 -11 20 31 -127 -145 -129 -80 -117 -118 -1 16 -341 53 -137 -77 -90 -68 13 -169 -3 54 72 82
4838 82 47 -141 -82 181 -152 -12 111 18 -13 62 -133 -109 32 81 56 -123 1 -67 -106 47 -8 75 262 58
4862 58 11 -41 48 174 23 -63 -147 174 -78 282 16 -277 -88 114 7 62 -22 -21 17 -152 -134 67 74 -319 -45
4887 -45 6 181 55 56 13 -2 -12 -97 -296 61 -62 -132 -73 -21 78 2 59 84 293 -105 311 71 26 -79 171
4912 171 20 160 26 27 -51 -13 -25 -27 31 -125 -44 -172 -182 186 160 12 -87 287 -10 12 -129 -23 -158 24
$$ packed form
4739e8R7k13K97k03M7L35k35k13J02J90j62J2J98j42o6j23K04J04k43j58K30q
4761hP5r9J25o2P5j31J0J63M3M8J5l96l7K34QO7r4q0l3J9j01j00L19n6%j06J45
4788D3k19L06m11L94j26r8J51k0p5L8J52m06M04mp3l23M93j95J2j34M67l95M7
4811B8JJ67q3j24%L1J1j58j8J6M9l7jJ17J7l57L94j90O0j3K2Q1j82J66N7J8J0
4838H2l5j88N9K63l33J40J23r3l1P5j95K4J41M9k5j79J24o8l9J53n5Q3J87k04
4862E8m7n2Q9J26j51q6q4L21k52L60k66k93J89K02j07N5q4JL8j69J8K01Pl93K74
4887d5N1J75j26Jm3j5j0q5j99L57j23p0N9N2R9p6N7K5K09l98M16k40m5j05K50
4912A71j51J40j34Jp8L8j2kN8j56Q1j28j0L68k6j48r9L74k97K2j41J06j35J82
$$ plain form
4936 24 -32 89 -150 -44 95 114 32 -100 81 129 -81 103 191 90 -15 -96 71 -259 -83 67 119 -254 -112
4959 -112 -143 26 -238 -81 -55 -105 -86 -4 -67 -4 58 61 77 10 47 -117 163 -90 -118 51 5 -19 -25 111 -28 -153
4985 -153 -27 126 2 -43 18 -18 -106 32 16 110 -130 -183 79 -157 54 20 65 20 103 115 -70 143 291 109
5009 109 27 6 94 112 213 -4 136 -9 68 -107 38 63 126 -169 99 109 277 67 -70 -135 83 -72 -55
5032 -55 -36 -86 69 134 -99 0 108 -68 -9 70 -103 -44 176 -96 56 79 -58 12 158 -53 -257 15 -163
5055 -163 135 61 17 -45 31 -125 -64 -28 28 226 -44 -154 -105 -179 151 55 -198 41 88 -18 33 -243 172 51
5079 51 -240 -22 -200 72 -83 -19 78 101 191 202 -53 -28 109 -1 53 114 -138 119 -112 -190 -183 20 250 -191
5103 -191 -27 -96 -84 -73 85 49 -224 40 136 -147 22 -57 -130 -167 17 106 -14 -11 -56 87 32 211 7 -123
$$ packed form
4936B4n6J21k39J06J39J9q2j32J81M8k10J84Q8j01j05q1J67l30J76J50N2l73J42
4959a12l1J69k64J57K6n0J9Q2o3O3O2LJ6o7L7j64K80k53k8J69m6k4oJ36j39j25
4985a53J26J53j24m5O1l6q8J38j6R4k40n3K62k36K11l4M5m5Q3J2j85K13J48j82
5009A09q2k1Q8J8J01k17J40j45P7j75J45K5O3k95K68J0J68k10j37o5K18j55J7
5032e5J9n0J55O5k33R9J08j76N9P9j73N9K20k72J52K3j37P0J46k11k04K72j78
5055a63K98p4m4o2P6j56O1L6N6J98k70j10M9p4L30r6k53K39M7j06N1k76M15j21
5079E1k91K18j78K72j55O4R7K3R0J1k55K5J37j10N4O1k52K57k31p8PK03K30m41
5103a91J64o9J2J1J58l6k73K64R6k83J69p9p3l7J84Q9j20Lm5J43n5J79k04j30
$$ plain form
5127 -123 244 111 -71 -208 75 -198 -6 -129 231 119 4 -48 -119 -218 79 130 -67 10 -168 -156 0 -128
5149 -128 50 83 -30 -82 -32 -28 -326 280 107 95 -120 122 -115 158 -186 325 34 110 -127 56 -111 190
5171 190 -49 58 -16 -119 24 5 182 50 63 42 -207 -116 3 -5 58 -44 -66 80 124 -168 32 -161 -66 101
5195 101 303 -224 187 126 42 -9 -101 188 -242 122 -80 32 145 -257 -24 10 -99 198 -132 -74 197 -139
5217 -139 -113 -162 -201 -132 100 133 -153 117 75 48 -126 52 -150 -209 -75 -80 -302 -253 -63 -149 -70 25 -259 -162 -65
5242 -65 125 57 102 -185 -85 -133 -86 74 151 149 -135 30 -123 43 -190 -26 15 -247 178 81 -139 53 19 -33
5266 -33 -25 129 35 -90 -156 -245 -239 -209 -137 -78 25 68 30 -104 -167 -77 -248 150 73 -76 10 152 107 3 37 -30 -17
5293 -17 -206 32 -111 -62 -102 80 -89 -78 112 -101 204 -2 31 48 27 -60 -60 -79 141 20 -48 -374 -24 128
$$ packed form
5127a23L67j33j82j37K83k73J92j23L60j12j15n2p1r9K97N1j97P7j78J2J56j28
5149a28J78L3j13n2N0Mk98O06j73j2k15K42k37K73l44N11k91P6k37J83j67L01
5171A90k39J07p4j03J43j9J77j32J3k1k49R1J19qO3j02k2J46M4k92K00j93R5J67
5195A01K02n27M11o1q4n1r2K89m30L64k02J12J13m02K33L4j09K97l30N8K71l36
5217a39K6m9l9O9K32L3k86K70m2k7j74J78k02n9J34nk22M9J90q6P9R5k84R7R7
5242f5J90o8M5k87J00m8M7J60P7kk84J65j53J66k33J64M1k62M25r7k20J92l4n2
5266c3QJ54r4j25o6q9OL0P2N9J03M3l8j34o3R0j71L98p7j49Q6J42m5j04L4o7J3
5293a7j89K38j43M9m0J82j69J1J90k13L05k06L3J7k1q7%j9K20j21o8l26L50J52
$$ plain form
5317 128 -30 -223 233 220 -108 -4 75 54 -126 98 15 25 -1 -259 -77 13 102 148 -37 113 -37 202 -192
5340 -192 150 143 129 20 0 -97 -67 -67 69 -67 -42 -114 -1 28 -69 86 66 -243 71 312 152 130 -71 -163 -14
5365 -14 -88 309 -57 -235 -70 162 -250 153 14 -81 76 45 20 2 220 -102 -45 158 60 -140 -100 -169 164
5388 164 23 118 87 -87 -11 67 -25 -55 21 -146 -112 -218 209 -311 5 37 -183 26 56 -271 -120 65 -57
5411 -57 -28 77 -36 -5 -93 58 25 92 275 67 101 -206 250 94 -152 -5 -57 -231 53 -167 -31 -172 14
5434 14 56 226 -189 -135 -150 19 -25 -144 221 63 -113 -55 -52 -52 135 119 11 45 -57 -12 -197 159 75 -11 42
5459 42 55 40 120 13 8 -151 -138 -10 21 28 -98 125 77 199 -109 -53 70 -162 -31 121 -49 166 159 -206 34
5484 34 32 0 -132 27 -37 100 -49 21 -72 -108 136 91 -12 96 36 105 19 34 -65 -138 -49 12 -2 166 -83 -129
$$ packed form
5317A28j58j93M56j3l28J04P9k1j80K24q3J0k6k58J82R0Q9M6j85J50j50K39l94
5340a92L42pj4j09k0r7L0%J36j36K5p2J13K9r7J55k0l09L14K41j60k2k01r2J49
5365a4p4L97l66j78J65K32m12M03j39r5J57l1k5j8K18l22N7K03r8k00M0o9L33
5388A64j41R5l1j74P6P8r2l0P6j67L4j06M27n20L16L2k20K09L0l27J51J85j22
5411e7K9J05j13L1q8J51l3O7J83k08L4l07M56j56k46J47n2j74K84k20J36j41J86
5434A4M2J70m15N4j5J69m4j19L65j58j76N8L%J87j6j08L4j02M5j85L56q4q6N3
5459D2J3j5Q0j07nj59J3J28L1Pj26K23m8J22l08N6J23k32J31J52j70K15pl65K40
5484C4kl2j32J59o4J37j49P0r3l6K44m5j03J08o0O9q6J5r9p3Q9O1j4J68k49m6
$$ plain form
5510 -129 -42 -177 -122 6 5 79 106 0 183 -11 47 206 26 -197 161 231 24 -44 -201 -205 191 129 -123 -92
5534 -92 136 186 38 238 173 119 -14 5 -32 -234 86 205 -259 127 -60 -111 -38 -65 110 51 -143 -116 49 -97
5558 -97 -62 37 -287 -305 -70 -10 210 107 103 -216 178 58 -10 16 7 -93 -40 85 44 26 223 -31 -10 -59 75
5583 75 27 -75 -189 141 -101 -83 -164 -133 -100 47 -103 72 -156 130 -40 -179 2 224 -61 -3 39 6 7 26
5607 26 -162 -166 103 -170 -196 -15 -141 137 -130 129 100 -210 277 65 219 178 35 -320 -71 -148 163 -47
5629 -47 78 115 181 40 -132 -10 48 -1 -113 9 79 -54 127 -120 -12 27 -115 18 -17 118 116 282 -29
5652 -29 -190 2 310 -47 -205 -89 292 188 142 -1 80 260 99 172 204 223 134 39 -128 -108 76 124 128 217
5676 217 44 129 -98 -45 227 56 13 -186 7 -21 -20 -183 -206 -128 86 121 95 173 -43 -122 395 58 248 -18
$$ packed form
5510a29Q7j35N5J28jP4K7j06J83j94N8J59j80k23L58P0k07o8j57mL96o2k52L1
5534i2K28N0j48K00o5n4j33J9l7k02L20J19m64L86j87n1P3k7J75n9j94K7J65j46
5558i7L5R9l24j8K35O0K20j03ml19L94j20o8K6rj00N3J25m1j8J97k54K1m9J34
5583G5m8j02j14L30k42J8q1L1L3J47j50J75k28K86j70j39J81K22k85N8M2l3JJ9
5607B6j88mK69k73k6J81j26K78k67K59k9l10M87k12J54m1j43l55K49p7L11k10
5629d7J25L7O6j41j72J22N8m9j12J22P0j33J81k47J08L9j42J33l5J35kJ66l11
5652b9j61J92L08l57j58J16L81j04m6j43Q1J80j61P3L2J9q9r5j67K0J84M8MQ9
5676B17j73Q5k27N3K72j71m3j99J93k8Jj63k3P8K14L5k6P8k16p9N17l37J90k66
$$ plain form
5700 -18 -294 135 -42 28 346 285 -3 -122 7 -245 160 108 52 5 207 -35 -105 -45 -54 -198 19 -4 -17 135
5724 135 16 17 2 26 17 136 -59 -99 -207 179 9 40 -169 136 -91 32 121 150 153 -1 13 22 -216 -79 -130
5749 -130 -14 30 105 44 -20 100 -44 -219 -87 -94 97 -242 0 -134 265 88 -73 -12 184 -156 100 24 -37
5772 -37 71 -8 -100 -103 64 10 -167 150 36 150 -58 178 -38 -158 -53 -206 122 -55 -362 -190 -293 -7
5794 -7 -37 -9 247 87 -37 -101 209 74 36 73 -189 -206 -95 -87 -35 -106 -35 36 55 29 -107 15 48 -51 118 140
5820 140 144 -95 -137 140 -57 229 52 -73 -120 73 -192 0 -82 -16 15 -16 -108 -260 58 -16 -83 133 93 -109
5844 -109 -230 -27 -109 -128 84 -106 -192 -162 166 -90 -78 78 24 44 -8 -357 142 11 168 7 208 139 117
5867 117 -148 192 -64 126 68 -37 -32 -145 -85 -57 13 -20 -63 -206 75 90 -119 109 102 75 -103 -87 216 40
$$ packed form
5700a8k76M29j77P0L18o1k88j19J29k52M05n2n6m7K02k42p0O0rj44K17k3j3J52
5724A35j19Jj5K4rJ19j95m0j08L86j70L1k09L05k27J23Q9K9Lj54J4Rk38J37n1
5749a30J16M4P5o1o4J20j44j75J32pJ91l39K42j34L99j77j61O1J96l40K56p6o1
5772c7J08p9r2lJ67n4j77L17j14J14k08K36k16j20J05j53L28j77l07J72j03K86
5794gl0K8K56j60j24o4L10j35l8L7k62j7J11QN2p1P1P1J9k6j36J22L3r9J69K2
5820A40Mk39m2K77j97K86j77j25m7J93k65J92q2O6L1l1r2j52L18p4o7K16m0k02
5844a09j21K03q2j9K12j90q6L0L28k56J2J56n4K0n2l49M99j31J57j61K01o9k2
5867A17k65L40k56J90n8j05Nj13O0K8P0l3m3j43K81J5k09K28pk7j78J6L03j76
$$ plain form
5891 40 -96 -11 112 -44 -79 27 -36 19 214 -141 324 111 141 -69 150 60 -117 10 -96 -70 85 -26 -58
5914 -58 -50 63 -58 -107 -62 143 68 -92 -36 341 -94 -35 99 240 177 -77 80 -83 5 -116 -74 -23 99 77
5938 77 -78 -52 -232 148 -73 -1 -57 271 75 48 34 -211 110 115 0 -165 72 -70 15 -260 182 111 20 -53
5962 -53 -321 102 55 18 117 110 28 93 -38 269 20 -39 311 55 128 -98 51 -200 -150 122 71 153 55 -56 -35
5987 -35 91 -10 -69 72 177 112 -156 106 39 164 95 -80 -102 32 -17 0 285 -233 -65 84 230 120 85
6010 85 -15 26 -72 104 48 -217 -234 150 153 -293 -51 34 -127 142 -17 -89 -88 27 50 273 -128 8 97 -149
6034 -149 218 6 123 128 139 39 83 -154 -47 111 61 36 122 120 -53 -116 -51 50 -104 198 -2 227 -68 148
6058 148 117 92 13 17 -245 22 75 -144 -99 158 25 132 23 28 125 -77 59 109 200 34 208 -301 38 30 84
$$ packed form
5891D0j36Q5J23j56l5J06o3N5J95l55M65k13L0k10K19r0j77J27j06K6J55j11l2
5914e8QJ13j21m9M5K05p5j60N6L77m35N9J34J41o3k54J57j63Q8j21M2N1J22k2
5938G7j55K6j80L80k21P2n6L28j96k7j4k45L21Nj15j65K37j42Q5k75M42p1r1p3
5962e3k68M23m7l7R9pq2O5j31L07k49n9L50k56P3k26J49k51N0K72n1Q2r8j11K1
5987c5J26j01n9J41J05o5k68K62o7J25o9j75k2J34m9J7K85n18J68J49J46j10l5
6010H5j00M1r8J76n6k65j7L84Lm46K42Q5j61K69j59p2JJ15K3K23m01J36Q9k46
6034a49L67k12J17NJ1j00M4k37J07J58n0k5Q6kj73o3O5J01j54L02k00K29k95K16
6058A48l1k5p9Mk62K67N3k19M5K57j33J07j09NR7k02J36N0R1j66J74n09L39qN4
$$ plain form
6083 84 -120 95 112 247 137 -49 123 -12 120 199 142 -203 10 -206 95 25 331 27 -126 -128 -62 -165 -69
6106 -69 15 19 -162 -85 -154 -158 -174 -9 -5 -169 -153 41 42 -206 -55 -97 -49 146 -87 -167 -35 -123 33 61 195 48
6132 48 3 67 -14 32 -51 -101 102 -90 -34 -18 183 -62 -26 2 -140 -52 22 -61 -94 -6 109 -168 -81 227 109 -50
6158 -50 27 -69 168 149 106 -193 139 55 7 282 -90 -99 163 -119 -128 -265 -76 26 71 -62 -4 -122 -188 18 -101
6183 -101 11 -102 -173 151 81 85 -115 68 -110 169 152 30 134 -119 30 26 187 33 111 91 53 126 129 -25
6207 -25 -1 172 -235 -17 65 243 0 50 -276 -169 -167 178 147 8 229 115 -159 29 -193 -94 -94 96 -194
6230 -194 67 -77 194 254 95 126 -39 -32 18 -9 -70 -45 -186 219 -179 14 48 230 135 79 -18 -10 131 -213 -113
6255 -113 151 256 -85 -162 -25 -185 -47 76 -371 -108 -103 -10 -319 -98 -97 140 90 127 -28 208 -29 -176 -26
$$ packed form
6083H4k04K15J7J35j10j86J72j35J32P9n7l45K13k16L01p0L06l04j53kO6j03R6
6106f9Q4Mj81P7o9mj6J65Mj64J6J94Jk48J51m2M8J95k33q0J32q8J56K8J34j47
6132D8m5O4q1M6q3n0K03j92N6J6K01k45L6K8j42Q8P4q3l3Q8J15k77Q7L08j18j59
6158e0P7r6K37j9m3k99L32q4m8K75l72rK62k82rj37J89J02M5j33N8j18o6K06j19
6183a01J12j13p1L24p0Mk00J83j78K79j7j22J04k53J49mJ61j54P8k0l8P3Lj54
6207b5K4J73m07K18Q2J78k43N0l26J07KL45l1j39K21j14k74J88k22R9%J90k90
6230a94K61j44K71O0j59L1j65PN0k7o1K5j41M05l98J93L4J82r5n6r7QJ41l44J00
6255a13K64J05l41p7J37j60J38J23m47K63NR3l09K21JK37n0L7j55K36k37j47J50
$$ plain form
6278 -26 -34 164 60 -9 24 -78 74 203 -98 -66 -21 -150 18 -302 -30 460 -251 72 0 125 184 -152 -16
6301 -16 -76 71 -42 -210 7 24 152 66 16 139 154 -35 175 63 66 85 3 105 -178 -15 -9 -126 157 -170
6325 -170 14 -62 -72 -160 13 -127 -19 -74 -58 88 -105 -191 -384 -206 -39 6 -45 112 172 60 43 7 219 134
6349 134 34 223 183 -95 41 -83 -103 -49 126 96 29 -5 86 -374 -54 164 -84 -22 73 -102 66 -52 -166
6372 -166 -58 11 41 62 103 -29 81 -25 -192 -72 62 -72 72 17 45 -218 284 30 187 3 -148 -134
6394 -134 -110 -38 38 -370 12 94 -69 2 -12 106 9 -74 25 -40 -113 62 193 -12 -87 -21 -172 -169 -117 10 -75 187
6420 187 89 120 -158 176 -101 -47 90 67 80 97 116 141 185 166 70 57 -59 96 -47 -39 -57 -255 30 -144 169
6445 169 107 -106 84 -98 -131 -145 -178 155 -149 -66 -94 -194 62 292 -76 -170 71 -196 -290 -178 -29 110 91
$$ packed form
6278b6qJ98j04o9L3j02J52J29l01L2M5j29J68l20K72M90p11L23p2J25N9l36J36
6301a6o0J47j13j68K17J7J28q6n0J23J5j89K10j12LJ9q2J02k83J63Oj17K83l27
6325a70J84p6j0q8J73j40J08n5J6J46j93q6j93J78J67M5n1J57O0j12j7l6K12q5
6349A34j00J89m0k78J36j24k0N4J75l0o7l4R1m60L20K18k48O2R5j75J68j18j14
6372a66J08O9L0K1M1j32J10j06j67J20J34j34J44n5K8k63N02k54J57j84j51J4
6394a34K4P2P6m08L82Q2j63P1j4J18r7q3R9o5p3J75J31k05p5O6j51LN2J27q5K62
6420A87r8L1k78L34k77N4J37k3J3J7J9K5M4j9r6j3j16J55j43Qj8j98K85j74L13
6445A69o2k13J90j82l3j4l3L33l04Q3k8j00K56K30l68r4K41k67r4J12J49J39j9
$$ plain form
6468 91 -44 -93 -171 172 -26 -149 19 89 -260 71 63 10 6 -18 -62 29 343 5 33 -144 -126 -10 54 54 0 -377
6494 -377 185 -98 -10 229 179 -97 -18 -81 -52 -135 -36 197 274 -36 43 -85 -139 61 98 135 164 20 -138 146
6518 146 80 -132 -207 249 214 -119 -202 -76 195 -128 -5 207 46 133 -3 -35 72 193 -232 82 68 -143
6540 -143 3 -8 -44 -27 -8 -9 -73 -18 1 113 151 261 73 86 -117 -174 45 189 325 165 -4 79 215 207 37
6565 37 -172 182 -32 -145 -38 -6 -190 33 44 -188 -101 -137 198 -254 -35 34 20 -172 274 -95 69 -18 11
6588 11 98 -138 -49 136 64 47 -346 -24 -109 117 -36 203 158 -20 -124 5 -36 -15 248 -60 -63 -281 52 -138
6612 -138 213 -110 65 -8 -114 57 158 140 359 51 -72 -89 253 41 101 -45 53 265 104 121 -91 -115
6634 -115 207 206 1 28 20 -173 -69 61 -169 -158 7 269 -23 125 141 -92 -113 325 26 -186 89 -190 36
$$ packed form
6468I1j35m9p8L43j98j23J68P0l49L31qn3mk4m4R1L14l38K8j77J8J16O4%n4l77
6494c77N62k83Q8K39n0k76P9o3K9q3R9K33P7l10P9j28n4K00L7L7K9j44j58K84
6518A46o6k12p5M56l5l33q3J26K71l23J23K12j61Q7j36l2J07J21m25L14j4k11
6540a43J46j1l6J7J9jo4N5J9J12L8J10j88J3k03n7K19J44J36j60j69Q3J36qj70
6565C7k09L54k14j13J07L2j84K23J1k32Q7l6L35m52K19O9j4j92M46l69J64q7K9
6588A1Q7k36Q9J85p2j7l93L22q5K26j53K39m5j78j04J29m1K1K63l08lk18L33j90
6612a38L51l23J75p3j06J71J01j8K19l08j23j7L42k12O0j46R8K12j61J7k12k4
6634a15L22jk05K7qj93J04J30k30J1J65K62k92J48J6k33k1M38k99k12K75k79K26
$$ plain form
6657 36 69 6 194 -46 -8 -66 0 -225 -20 -283 -206 -234 118 197 10 -79 27 111 18 -47 -206 159 34 158
6681 158 -60 -148 -5 62 76 2 -36 -188 -15 -58 -266 -225 -23 88 9 104 7 231 -90 2 -322 164 -100 63
6705 63 -73 -61 52 -9 -85 173 -159 3 26 177 32 -48 -30 53 74 123 -61 98 365 -8 99 -150 81
6728 81 -260 -23 -16 356 78 -76 -218 -95 -86 -297 25 -128 70 144 102 3 5 -102 197 184 60 77 -88 101
6752 101 -115 -46 -96 70 173 -3 127 4 10 61 -67 10 200 -121 -109 -12 133 -61 239 76 -121 -149 84
6775 84 160 50 -135 -183 -227 161 -92 -211 -96 22 31 -72 34 -263 -140 50 -96 117 147 -49 63 -170
6797 -170 160 1 123 22 47 -41 107 56 116 -59 13 -46 -10 -199 20 -177 66 41 250 92 -203 425 12
6820 12 41 -130 220 -227 -88 -161 -144 -263 -127 -242 58 230 -101 -169 40 26 78 74 61 -150 -154 111 18 219
$$ packed form
6657C6L3o3J88k40L8n8O6k25K05k63P7k8L52P9j87q9J06Q4r3o5j59L65j25J24
6681A58k18q8J43O7J4p4l8j52J73m3k08M1K02J11p9R5r7K24l21R2l24M86k64J63
6705F3j36J2J13o1p6K58l32J62K3J51j45q0J8Q3K1M9j84J59K67l73J07k49K31
6728H1l41K37PL72k78j54j42J23Rk11L22j53J98P4m2r9Kj07K99j3j24J7j65J89
6752A01k16O9n0J66J03j76J30j23ON1j28P7J90l21J2R7J45j94L00j63j97k8K33
6775H4P6j10j85m8m4L88k53j19J15J18Rj03J06k97J23J90j46K13L0j96J12k33
6797a70L30j59J22j01K5q8J48n1O0j75P2n9L6j89K19j97K43k5K09j58k95O28m13
6820A2K9j71L50m47J39p3J7j19J36j15L00J72l31o8K09j4N2mj3k11mK65r3K01
$$ plain form
6844 219 138 -126 92 -107 200 33 -46 124 169 -70 -90 -42 -148 153 -179 91 22 130 27 37 -99 -179 26
6867 26 -104 -126 -144 -185 -55 5 -163 167 -52 183 190 -283 18 -161 -71 -1 -161 -106 -43 -102 106 78 55 -285 193
6892 193 -21 -33 112 14 135 161 8 -188 -19 26 -53 -90 -110 12 54 28 68 -97 32 210 81 294 38
6915 38 25 95 -203 -1 163 -23 206 -155 -57 -17 139 -115 54 -88 13 -31 -51 -63 309 -11 -16 10 37 100
6939 100 -217 -46 -183 -13 132 -204 65 -36 -132 19 -18 -30 10 -77 209 153 15 76 -137 -27 18 166 178
6962 178 -177 93 -9 58 179 -160 85 29 101 21 -148 101 25 -76 71 -45 -41 -5 168 73 -164 26 120
6985 120 -126 -15 -27 184 61 126 -177 66 58 -28 -159 195 249 88 -119 -33 -163 -219 -33 -8 156 50 34
7008 34 15 1 58 35 107 73 56 154 -172 235 44 -85 -159 4 -138 30 -53 62 10 42 -49 -21 -208 -229 45
$$ packed form
6844B19q1k64K18j99L07j67p9J70M5k39k0M8j06L01l32K70o9J08j03J0j36q0K05
6867B6j30k2j8m1J30O0j68L30k19K35Pm73L01j79R0P0j60N5O3n9K08k8k3l40M78
6892A93k14j2J45r8J21K6j53j96J69M5p9l7k0J22M2k6M0j65J29J78j29K13k56
6915C8j3P0k98K02J64j86K29l61R8M0J56k54J69j42J01m4k0j2L72l20nK6K7O3
6939A00l17J71j37J70J45l36K69j01r6J51l7j2M0q7K86n6j38O1k13J10M5J48J2
6962A78l55K70j02O7J21l39K45n6P2q0j69K49p6j01J47j16ML6J73r5k37J90R4
6985A20k46J11j2K11j23O5l03K43qq6j31L54N4j61k07Q6j30n6J86K5J64j06j6
7008C4j9j4N7k3P2l4j7R8l26M07j91j29p4J63j42J68q3J15n2L2r1K8j87k1K74
$$ plain form
7033 45 -172 26 27 -175 -142 207 25 -29 223 14 -41 136 25 -123 -111 -103 56 -78 -98 38 -31 -3 -56 10 40
7058 40 -123 38 122 -174 267 -113 92 -160 97 -37 -172 84 -87 -89 36 125 24 78 -10 -120 99 3 -86
7081 -86 -74 -8 76 153 -55 -2 -233 -154 45 -243 304 -156 -225 295 -16 275 -154 -249 118 -114 65 71 195 223
7105 223 -303 72 -99 -61 235 -97 -69 -53 202 48 -8 24 -7 -21 110 -179 -97 -82 80 143 -121 -19 -198
7128 -198 116 10 -108 -112 -40 -54 28 -127 -177 123 -51 104 -115 -167 -211 136 51 111 30 22 -53 138 -26 287 64
7153 64 -1 131 80 -101 73 -56 -67 116 18 -49 77 202 110 92 -54 61 -55 -136 -220 29 236 -169 242
7176 242 -56 61 147 -92 -32 35 -156 106 -178 127 -43 -6 -53 176 -247 112 -70 -82 -88 185 12 81 95
7199 95 -40 22 -35 -147 -159 -3 -215 -163 -79 28 68 118 -35 -181 -150 -133 3 -65 36 -94 -135 32 -4 44 -151
$$ packed form
7033D5k17J98Jk02L3L49j82n4K52k09n5J77j11j48J2QJ59j34k0J36o9K8n3O6L0
7058D0j63J61Q4k96M41l80K05k52K57j34j35K56j71kJ25Q9j01N4q8j10K19r6q9
7081h6J2O6Q4P7k08N3k31P9J99k88N47m60o9N20l11K91m29r5L67k32J79OJ24K8
7105B23n26L75j71L8K96l32K8J6K55j54n6L2l1j4J31k89Q2J5J62O3k64J02j79
7128a98L14j06j18mP2j4Q2j55n0L00j74J55k19n2m4L47q5O0q1qp5J91j64L13k23
7153F4o5J32n1j81J74j29j1J83r8o7J26J25r2j8j46J15j16q1q4K49K07m05M11
7176B42k98J17Q6k39O0O7j91K62k84L05j70L7m7K29m23L59j82j2oK73j73O9J4
7199I5j35O2n7j12j2J56k12N2Q4J07M0N0j53j46L1J7J36o8J01j30m1J67l6M8j95
$$ plain form
7224 -151 -157 -48 218 50 -109 8 -155 -226 144 132 100 220 -114 81 -96 89 87 122 -55 17 -28 80 83 -107
7248 -107 34 -403 282 185 13 -159 173 249 -183 87 -108 -41 -23 119 81 -27 84 53 -60 14 -50 -16 36
7271 36 86 122 -149 -96 73 -76 -119 154 -211 184 -158 -75 89 -54 52 -148 275 -170 40 90 -134 -162 -6
7294 -6 41 104 116 -44 247 21 -230 24 38 293 -118 -147 -77 26 -35 -123 -86 -33 11 -191 -174 -206 -132 -82 -41 202
7320 202 19 -196 -73 58 -194 115 -66 -113 81 89 -24 272 122 -41 -223 -220 -146 22 109 -19 46 336 -1
7343 -1 -99 -30 83 -58 -45 23 -97 52 58 -51 -65 -150 -141 51 -126 -93 90 -114 -102 290 75 73 -70 21 89 -15
7369 -15 28 22 -88 20 134 -41 13 34 1 109 -121 -16 -43 8 -94 -143 -71 -90 -58 320 222 -159 -100 30 117
7394 117 81 82 13 42 363 73 119 96 69 -177 -142 207 14 -8 7 18 260 77 -18 126 -89 -15 250 39 -20
$$ packed form
7224a51oJ09K66j68j59J17j63p1L70j2l2J20l34J95j77J85kL5j77P2m5J08Lj90
7248a07J41m37O85r7j72j72L32P6m32K70j95O7J8J42l8j08J11l1j13P4o4L4N2
7271C6N0L6k71N3J69j49m3K73l65L95l42Q3J64j43J06k00M23m45K10N0k24k8J56
7294fM7O3J2j60K91k26k51K54J4K55m11k9P0J03o1q8L7N3M4k02J7l2P4N0M1K43
7320B02j83k15J23J31k52L09j81m7J94Qj13K96j50j63j82LP4J68Q7j28O5K90l37
7343ar8O9J13j41J3O8j20J49Oj09j4q5RJ92j77L3J83k04J2L92k15kj43R1O8j04
7369a5M3oj10J08J14j75N4K1l3J08k30J05k7N1j02m9P2j9L2L78r8l81N9J30Q7
7394A17l6Jo9K9L21k90M6k3k7k46L5L49j93k2J5J1K42j83r5J44k15P4K65k11n9
$$ plain form
7419 -20 186 -94 -152 -17 -76 -90 -158 -6 -29 -162 -24 0 186 228 -289 -63 -12 -64 -26 56 -130 64 -96 -177
7443 -177 202 -149 102 276 13 -188 63 38 147 -101 58 105 247 39 112 -75 263 -224 105 -28 193
7464 193 -170 -222 -134 -153 -341 -153 -217 -13 19 109 191 50 -114 40 126 182 222 50 204 37 -134 10 55 -34
7488 -34 270 115 89 165 -96 71 9 -7 -139 -87 42 -264 123 -55 33 -28 -173 -285 32 -44 -57 259 69
7511 69 26 -111 276 14 259 159 -90 -57 -156 -147 -28 -125 29 252 196 -22 -37 -50 -26 129 -31 -158 98 136
7535 136 9 136 -211 46 -60 5 -10 41 58 27 -91 13 -112 185 -37 -131 -120 -55 8 51 -165 94 -36
7558 -36 184 166 -64 44 -135 33 181 -65 -159 218 40 168 161 -80 64 14 2 23 72 -30 -71 -131 -159 24
7582 24 -421 -52 -255 -164 -76 -32 35 -88 -132 129 143 175 269 -52 274 123 16 -75 189 -101 -68 97 -63 -90
$$ packed form
7419b0K06k80n8J35n9j4o8J52k3j33J38K4J86M2n17K26N1n2L8Q2j86J94j60q1
7443a77L79l51K51J74k63k01K51k5J09k48J59M7J42k08P3j87L38m87L29j33K21
7464A93l63n2Q8j9j88J88o4K04L2R0Q2j41j64J54Q6N6M0j72J54j67j71J44M5q9
7488c4L04j55k6P6k61J67o2j6j32N2J29l06L87j78Q8o1j45j12L17p6j3L16j90
7511F9m3j37L87k62K45j00k49L3r9RJ19r7J54K23n6k18j5j3K4J55j60j27K56L8
7535A36j27J27l47K57j06O5j5N1J7l1j18J04j25K97k22r4J1O5O3M3k16K59j30
7558c6K20j8k30J08j79J68J48k46r4L77j78J28pk41J44n0j2K1M9j02m1o0k8J83
7582B4m45L69k03R1Q8M4O7j23m4K61J4L2R4l21L26j51j07r1K64k90L3J65j60k7
$$ plain form
7606 -90 -81 -47 258 86 191 -156 -69 -36 9 96 220 -193 34 -103 135 -32 -173 -91 61 -48 -99 -88 -103 208
7630 208 72 7 -36 128 -141 19 -6 161 187 61 27 -29 -368 -12 17 45 180 -127 200 -135 -125 -374 -133
7653 -133 111 -194 15 -83 -122 102 -181 -47 119 45 -75 36 -72 -24 -1 175 138 -145 -5 258 74 -202
7675 -202 37 -25 -87 440 48 -61 -129 68 148 105 -69 -91 -166 -174 -132 -254 -40 -44 -203 43 -166 123 -96 -30
7699 -30 21 -201 -26 -65 -55 -125 -112 -111 127 38 -118 45 162 106 141 93 172 102 -33 383 14 -108 -272 60 146
7724 146 126 115 -74 107 -208 -89 142 4 -224 -8 -161 -195 25 -42 -42 122 33 178 66 -88 -73 120 230
7747 230 107 -44 20 -267 -255 -85 -163 -49 124 -65 -81 -86 44 -57 15 90 38 238 -251 -43 41 106 -136 -35
7771 -35 -50 88 145 53 85 -59 -36 62 -115 63 -68 10 187 -137 16 -156 -18 -70 38 36 4 199 52 32
$$ packed form
7606i0RL4L05j72J05l47Q7L3M5Q7J24m13K27j37K38j67j41Q2J52j09n1J1j5L11
7630B08j36o5m3J64k69J60k5J67K6j26l4n6l39L56K9K8J35l07L27l35J0k49K41
7653a33K44l05K09r8l9K24k83J34J66p4j20J11j08M8K3J76l7k83J40K63j84k76
7675b02K39o2o2N27l92j09o8J97Q0m3j74k2p5qM2j22K14mj59K46k09K89k19O6
7699c0N1k22J75l9J0p0J3JK38q9j56J63J17n6L5m8P9p0j35M16l69j22j64L32Q6
7724A46k0j1j89J81l15J19K31j38k28K16j53l4K20o7%J64q9J45j12j54J5J93J10
7747B30j23j51O4k87J2J70p8J14J73j89j6nJ30j01P2P5n2K00m89K08Q4O5k42J01
7771c5j5J38N7r2L2j44K3R8j77J78j31P8J77l24J53j72J38n2J08kl2J95j47k0
$$ plain form
7795 32 -48 -13 -19 42 -114 127 -20 -249 -73 93 -32 -120 24 -58 86 64 -43 -62 69 -99 56 -58 -24 -50
7819 -50 -231 -15 114 38 -135 16 121 -115 153 147 -85 -238 -280 12 96 -75 12 284 -115 63 -7 -173 188
7842 188 -42 206 -52 -27 -36 -85 -104 -164 79 -30 14 -16 -38 -275 209 -69 111 134 97 -25 84 -108 132 73
7866 73 162 -395 -268 7 55 45 151 -51 132 -129 8 12 -77 -29 -61 -168 -181 63 223 -238 -5 125 -123
7889 -123 98 83 -208 136 -68 96 92 -149 86 89 0 121 -42 -131 186 244 -87 69 -87 87 7 60 100 -146
7913 -146 107 182 -73 27 40 -81 129 -150 -3 215 214 -19 -202 -51 19 -97 -82 200 -209 -296 -16 53 -126
7936 -126 -155 254 14 51 -142 73 -35 -84 135 -59 -57 42 -62 -172 -158 -40 123 -84 182 49 -222 -267 -151
7959 -151 -84 -6 149 -204 -93 45 -63 -304 24 -1 125 31 75 166 -201 128 -51 -36 194 -92 -85 115 -53
$$ packed form
7795C2q0L5oO1j56K41j47k29J76J66j25q8J44q2J44k2j07j9J31j68J55j14L4k6
7819e0j81K16J29p6j73J51J05k36K68ok32j53m2K92Q4j71Q7K72l99J78p0j66L61
7842A88k30K48k58K5rm9j9o0K43j09M4l0k2k37M84k78J80K3l7j22J09j92K40n9
7866G3Q9n57J27K75M8j0J06k02J83k61J37Mq9M8l2j07j3K44J60m61K33J30k48
7889a23K21j5k91L44k04J64mk41K35Lq9J21j63q9L17N8l31J56j56J74q0N3M0k46
7913a46K53P5k55J00J3j21K10k79J47K18jk33j83J51P0j16J5K82m09q7K80O9j79
7936a26k9M09k40L7j93K15j08m9K19j94KR9j04j10J4J18J63k07K66j33k71m5J16
7959a51O7P8J55l53J11J38j08k41L28k5J26r4M4R1l67L29j79J5K30k86PK00j68
$$ plain form
7982 -53 -27 178 -99 79 -186 143 -28 116 -20 10 -150 -5 -208 457 -360 54 -264 31 -8 -266 -165
8003 -165 -8 287 -41 32 -203 109 -152 -292 107 -98 86 129 -236 72 -121 -159 90 -118 -179 -109 -155 -151 -146
8026 -146 173 -99 -169 -133 -32 91 -28 -79 149 17 125 75 -41 -278 -84 -3 138 239 -72 -168 85 42
8048 42 17 118 -59 203 -96 -16 144 75 -88 85 65 -127 4 -44 33 -55 -223 -72 -68 -286 -55 -253 47
8071 47 140 -10 6 86 -166 -16 -82 23 49 -17 2 -48 -142 -23 53 -48 57 -44 76 74 -49 139 89 178 80
8096 80 -17 -114 62 283 52 157 0 -22 38 -24 224 41 -26 50 -33 51 -96 116 108 186 -83 -126 -86 101 -133
8121 -133 -65 32 -33 -21 68 38 -193 -105 -226 -197 2 -32 2 -168 -93 120 -93 19 21 -266 -194 -14 -145 82 133
8146 133 -60 67 -24 188 77 -66 -11 -128 -43 42 -265 197 41 170 239 -288 120 -191 231 -49 95 253
$$ packed form
7982e3K6K05k77J78k65L29j71J44j36L0j60J45k03O65q17M14l18K95l9k58J01
8003a65J57K95l28P3k35L12k61j40L99k05J84M3l65L08j93l8K49k08o1P0m6MN
8026a46L19k72p0L6J01J23j19n1K28j32J08n0j16k37J94Q1J41J01l11r6K53m3
8048D2k5J01j77K62k99Q0J60o9j63J73k0j92J31m8P7q8j68J51Mk18K31j98L00
8071D7R3j50J6Q0k52J50o6J05K6o6J9n0r4J19P6j01J05j01J20kj23J88n0Q9r8
8096H0r7r7J76K21k31J05j57k2O0o2K48j83o7P6q3Q4j47K12qP8k69m3M0J87k34
8121a33O8R7o5J2Q9l0k31Q8j21K9J99l4L4j70P5K13k13J12Kk87P2J80j31K27N1
8146A33j93J27r1K12j11j43N5j17Q5Q5l07M62j56J29O9n27M08l11M22k80J44J58
$$ plain form
8168 253 98 -165 -151 -59 -52 -14 -106 -58 201 -116 113 -51 115 44 -235 -44 -78 -59 59 -130 -52 -129 4
$$ packed form
8168B53j55k63J4R2PL8r2M8K59l17K29j64J66p1k79J91l4J9J18j89P8p7J33
8191D
$$ Imaginary data points
##PAGE= N=2
##DATA TABLE= (X++(I..I)), XYDATA
$$ plain form
0 0 0 0 0 0 0 0 0 0 -8 8 -8 16 -16 24 -24 32 -40 48 -64 72 -88 104 -122 144 -168 200 -228 266 -306 352 -402
31 -402 458 -516 586 -659 742 -835 934 -1043 1163 -1291 1437 -1593 1763 -1948 2152 -2373
47 -2373 2616 -2883 3174 -3497 3853 -4245 4686 -5176 5735 -6368 7098 -7947 8950 -10159
61 -10159 11643 -13521 15973 -19334 24226 -32020 46393 -81644 348441 415641 -39411 373672
73 373672 22273 -420 -69580 -230373 -157508 -263430 -164842 34112 40727 173071 159556
84 159556 204138 163491 118994 41624 -100918 -89030 -233273 -246110 -65841 -129650 -35514
95 -35514 87938 152997 128114 103387 219430 76546 -45145 -64951 -156526 -114469 -184485
106 -184485 -64277 7252 -130786 130122 163941 87530 193380 22026 12800 -13351 -120906
$$ packed form
0@%%%%%%%%qJ6j6K4l2M0m8N6p2Q8j12J36j60J92k26K66l12L68m28M94n72O58p54
31d02Q60r74J102j245J401j577J769j977K206k454K728l030L356l711M100m525
47b373M989n499O057o671P350q098Q931r862J0911j2103J3466j5045J6897j9109
61a0159K1802k5164K9494l5307M3560n6246P8413j28037M30085O7200m55052M13083
73C73672l51399k2693o9160j60793P2865j05922R8588J98954O615J32344j3515
84A59556M4582m0647m4497p7370j42542J1888j44243j2837J80269o3809R4136
95c5514J23452O5059k4883k4727J16043j42884j21691j9806r1575M2057p0016
106a84485J20208P1529j38038K60908L3819p6411J05850j71354r226k6151j07555
$$ plain form
117 -120906 -95607 -170218 -130166 -112332 -69128 68761 50393 101010 114743 87004 73080 18439
129 18439 28208 -120509 -91798 -15360 -160261 4322 25578 -1440 163650 38073 87488
140 87488 139732 -6854 27624 -42550 -87724 -77223 -112952 -29765 -32994 -17800 43281 64134
152 64134 82222 39984 88780 24018 -84262 -15541 -60807 -92054 -60394 -53852 -14336 -1112
164 -1112 53605 78423 74446 58052 23094 49943 -31067 -29785 -2679 -114972 -3294 -16174
176 -16174 -60835 115658 20715 4667 100890 23416 19332 -8376 -8007 -36151 -106510 -16753
188 -16753 -20405 -42282 15830 27381 41117 19987 66624 51940 -25480 13477 -39967 -52527
200 -52527 -18899 -57909 -21073 -19419 -323 29132 19323 62821 20436 -4144 21342 -16578
$$ packed form
117a20906K5299p4611M0052J7834M3204J37889j8368N0617J3733k7739j3924n4641
129A8439R769j48717K8711P6438j44901J64583K1256k7018J65090j25577M9415
140H7488N2244j46586L4478p0174m5174J0501l5729Q3187l229J5194O1081K0853
152F4134J8088m2238M8796o4762j08280O8721m5266l1247L1660O542L9516J3224
164a112N4717K4818l977j6394l4958K6849q1010J282K7106j12293J11678j2880
176a6174m4661J76493r4943j6048R6223p7474m084k7708L69k8144p0359Q9757
188a6753l652k1877N8112J1551J3736k1130M6637j4684p7420L8957n3444j2560
200e2527L3628l9010L6836J654J9096K9455r809M3498m2385k4580K5486l7920
$$ plain form
212 -16578 -26099 -41262 -20542 -30923 -53027 31164 12491 2964 45710 19911 24080 -4005 3913
225 3913 4040 -55872 -21237 -20365 -33335 4390 10514 19684 20925 41329 25415 17064 44723 -31124
239 -31124 -10531 5798 -58493 7075 -11340 -19612 28673 -10056 39838 33388 -3448 36497
251 36497 -6335 -13973 -6859 -24491 -9594 -26117 -9461 -4401 3300 23752 590 27894 7410
264 7410 -20375 14193 -17027 -25514 -14731 -25739 -15570 -10886 10286 14557 12086 14122 12862
277 12862 26323 -4162 3815 5542 -40625 1525 -7906 -21052 19274 -9108 8420 18640 8113
290 8113 26397 -1517 6953 -1229 -25168 7279 -6997 -15547 -3254 4677 7539 -2934 32768
303 32768 11641 -13758 19085 -8580 -8830 -4041 -16270 -4473 -24061 2330 14051 -8204 21171
$$ packed form
212a6578r521j5163K0720j0381k2104Q4191j8673r527M2746k5799M169k8085P918
225C913J27n9912L4635Q72j2970L7725O124R170J241K0404j5914q351K7659p5847
239c1124K0593J6329o4291O5568j8415q272M8285l8729M9894o450l6836L9945
251C6497m2832p638P114j7632J4897j6523J6656N060P701K0452k3162K7304k0484
264G410k7785L4568l1220q487J0783j1008J0169M684K1172M271k471K036j260
277A2862J3461l0485P977J727m6167M2150r431j3146M0326k8382J7528J0220j0527
290H113J8284k7914Q470q182k3939L2447j4276q550J2293P931K862j0473L5702
303C2768k1127k5399L2843k7665k50M789j2229J1797j9588K6391J1721k2255K9375
$$ plain form
316 21171 6825 -1338 15300 660 -1789 -11232 -7508 -15798 -18573 8525 -10024 -4549 7910
329 7910 -1648 11538 580 7374 4568 -19889 1204 -740 -14076 -1164 3192 -1714 -1980 19454
343 19454 7060 1278 17584 -9599 1375 2289 -14830 4878 -13642 -4310 6059 -8800 18325
356 18325 6247 -283 17586 -1008 2227 3169 -1132 -6490 -12027 4408 -9420 -1109 9665 -7594
370 -7594 9523 2327 -766 10353 -7079 -1069 -4097 -9058 1260 -6740 1284 2325 -1700 5959
384 5959 4262 7306 -538 2210 1368 -10674 1887 -4737 -5406 1152 -6328 6377 1796 3921 12335
399 12335 -2536 5030 3363 -3658 2503 -4348 -3226 -7684 -1033 2099 -7522 8414 -666 -5302
413 -5302 6759 -3923 1577 -4483 -5567 1872 -12181 3070 4247 -8691 7380 2065 -1006 5779
$$ packed form
316B1171j4346q163J6638j4640k449r443L724q290k775K7098j8549N475J2459
329G910r558J3186j0958O794k806k4457K1093j944j3336J2912M356m906k66K1434
343A9454j2394n782J6306k7183J0974R14j7119J9708j8520R332J0369j4859K7125
356A8325j2078o530J7869j8594L235R42m301n358n537J6435j3828Q311J0774j7259
370g594J7117p196l093J1119j7432O010l028m961J0318q000Q024J041m025P659
384E959j697L044p844K748q42j2042J2561o624o69O558p480J2705m581K125Q414
399A2335j4871P566j667p021O161o851J122m458O651L132r621J5936r080m636
413e302J2061j0682N500o060j084P439j4053J5251J177j2938J6071n315l071O785
$$ plain form
427 5779 3236 438 -5974 1666 -4569 -6047 3885 -6235 -999 1126 -876 6779 -865 4592 3681
442 3681 -5697 4385 45 -3808 -463 -1419 -1067 -2510 5693 1875 -621 6411 -1057 3111 2322 -161
458 -161 3805 -5357 3003 3050 -3446 8272 1531 -187 5250 1471 2281 -1337 1575 -3572 -6457 2926
474 2926 -6624 -3095 668 -4861 1556 -2006 1388 1696 -4281 3612 -3543 -2941 3256 -5341 -358 -321
490 -321 -2674 1114 241 2514 -1356 125 1146 -2710 2022 -1679 -1146 -152 -3280 3472 -565 78
506 78 3557 -1941 1915 908 -685 109 -2262 -376 -3292 -321 1050 -2893 2784 -269 1171 2477
522 2477 172 5249 -1905 152 4535 -4071 2712 2147 -3055 1502 -26 1274 -322 778 835 -3856
538 -3856 1885 -1318 -2426 1360 -2954 -112 -481 392 2610 -2325 2575 1098 -2864 3017 -535 -1478
$$ packed form
427E779k543k798o412P640o235j478R932j0120N236K125k002P655p644N457r11
442C681r378J0082m340l853L345r56L52j443Q203l818k496P032p468M168p89k483
458a61L966r162Q360M7o496J1718o741j718N437l779Q10l618K912n147k885R383
474B926r550L529L763n529O417l562L394L08n977P893p155O02O197q597M983L7
490c21k353L788q73K273l870J481J021l856M732l701N33R94l128O752m037O43
506G8L479n498L856j007j593P94k371J886k916K971J371l943N677l053J440J306
522B477k305N077p154K057M383q606O783n65n202M557j528J300j596J100N7m691
538c856N741l203j108L786m314K842l69Q73K218m935M900j477l962N881l552r43
$$ plain form
554 -1478 -247 -1135 169 -1776 1449 108 -526 1846 -398 2053 199 208 1731 -2765 1140 626 -1984
571 -1984 1933 -1407 -467 460 -160 490 -2107 747 -1399 -2350 1762 -1714 -707 -410 -329 1285 -1754
588 -1754 2952 507 -2481 3093 -1470 -762 1571 -2207 -343 -1054 -341 28 -577 1555 -1467 633
604 633 1549 -678 1146 -276 483 62 -960 2216 -1004 -102 1703 -1035 1074 78 -5 411 -1206
621 -1206 745 -742 155 366 -513 1007 -526 1407 960 -120 2186 -1282 -365 1635 -1869 453
637 453 -175 -1219 -398 -799 1208 -1459 -38 1222 -1785 904 60 -73 -229 -1108 911 -1104 292
654 292 1023 -1944 1052 169 -1238 1321 -709 -224 -456 -267 364 -913 985 -22 -271 1039 385
671 385 1255 -334 252 949 -907 876 254 -591 150 -915 155 98 -153 699 -789 409 -162 -23
$$ packed form
554a478J231q88J304j945L225j341o34K372k244K451j854RJ523m496L905n14k610
571a984L917l340R40R27o20O50k597K854k146r51M112l476J007K97Q1J614l039
588a754M706k445k988N574m563P08K333l778J864p11P13L69o05K132l022K100
604F33R16k227J824j422P59m21j022L176l220R02J805k738K109r96q3M16j617
621a206J951j487Q97K11q79J520j533J933m47j080K306l468R17K000l504K322
637D53o28j044Q21m01K007k667J421J260l007K689q44j33j56q79K019k015J396
654B92P31k967K996q83j407K559k030M85k32J89O31j277J898j007k49J310o54
671C85Q70j589N86O97j856J783o22q45P41j065J070n7k51Q52j488J198n71J39
$$ plain form
689 -23 655 -509 263 -611 445 612 -1298 1073 -210 -1247 1241 -463 -450 -115 -500 -84 -1147 507
707 507 -137 -811 623 -459 109 516 -118 458 -497 273 -542 -358 1326 -1241 -265 423 -866 480
725 480 -73 370 267 -515 1005 -151 417 321 -14 610 -205 951 -59 -578 737 -419 259 288 -754
744 -754 354 -536 21 106 -270 700 -583 123 711 -306 173 92 487 -463 -314 912 -938 134 326
763 326 -941 343 -3 -323 306 -455 206 -424 220 301 -488 530 -64 2 299 144 543 -489 169 318
783 318 -770 387 -187 -596 274 -610 152 -317 -20 428 -395 -6 -92 127 147 -239 407 -516 -149 242
803 242 -588 416 -198 -420 383 -432 252 -264 204 68 -360 878 -118 -321 695 157 239 -10 299 77
823 77 -499 503 9 -462 442 -714 171 92 -191 456 -349 454 101 -47 438 -358 53 324 138 -198
$$ packed form
689b3O78j164P72q74J056J67j910K371j283j037K488j704J3L35l85M16j063J654
707E07o44o74J434j082N68M07o34N76r55P70q15J84J684k567R76O88j289J346
725D80n53M43j03p82J520j156N68r6l35O24q15J156j010n19J315j156O78K9j042
744g54J108q90N57Q5l76R70j283P06N88j017M79q1L95r50J49J226j850J072J92
763C26j267J284l46l20O29p61O61o30O44Q1p89J018n94O6K97j55L99j032O58J49
783C18j088J157n74m09Q70q84P62m69K97M48q23L89q6K19K0l86O46r23L67L91
803B42q30J004o14k22Q03q15O84n16M68j36m28J238r96k03J016n38Q2k49L09k22
823G7n76J002m94m71R04j156Q85p9k83O47q05Q03l53j48M85p96M11K71j86l36
$$ plain form
843 -198 -166 325 -124 -142 452 -264 -41 192 -167 305 -618 363 361 -386 341 114 33 165 45 281 -350 295
865 295 -343 -134 306 -625 -384 -18 -261 20 -122 -215 -228 -31 210 -416 285 -32 56 102 52 -11 -213 100
887 100 179 -397 170 12 -241 462 -84 -31 212 154 264 -195 81 43 -239 395 195 111 -165 -100 43 -97
909 -97 -54 -40 -39 92 118 187 102 -80 266 44 76 306 -215 373 25 -86 -72 6 67 -336 103 60 -521 233 -150
934 -150 -320 -36 -1 -43 123 -41 220 -233 69 -9 -6 435 1 74 171 181 125 -175 129 -289 -105 384 -124
957 -124 217 157 -74 202 -12 348 -108 -27 -107 -91 -246 -55 -71 -35 -226 -193 225 -66 -26 -64 -124 -100 -24 185
981 185 -183 292 24 -47 430 -286 232 225 16 20 16 139 -28 -266 11 -314 121 272 113 45 -172 -106 212
1004 212 53 96 -259 166 80 -204 69 56 -76 -61 -51 207 -267 -119 -29 -263 146 -101 -34 343 59 92 -99
$$ packed form
843a98L2M91m49j8N94p16K23K33l59M72r23R81kp47P27k27q1J32j20K36o31O45
865B95o38K09M40r31K41L66k43K81j42r3j3J97K41o26P01l17Q8M6n0o3k02L13
887A00P9n76N67j58k53P03n46N3K43n8J10m59K76l8k82O34k00q4k76O5J43j40
909i7M3J4JJ31K6O9q5j82L46k22L2K30n21N88l48j11J4P8O1m03M39m3n81P54l83
934a50j70K84L5m2J66j64K61m53L02p8LM41m34P3R7J0n6l00L04m18J84M89n08
957a24L41o0k31K76k14L60m56Q1q0J6j55J91j6L6j91L3M18k91M0l8o0K4P6K09
981A85l68M75k68p1M77p16N18pk09MmJ23j67k38K77l25M35J51j59o8k17O6L18
1004B12j59M3l55M25q6k84K73j3j32J5J0K58m74J48R0k34M09k47O7L77k84L3j91
$$ plain form
1027 -99 120 97 -41 -38 83 8 -156 -47 2 -177 185 67 -341 -143 -39 55 29 115 148 8 -130 287 -42
1050 -42 277 129 -269 -76 -43 -153 -308 178 -19 15 226 -174 100 106 17 -179 -123 91 -161 -254 120 -204 -129
1073 -129 -103 -98 -115 -323 -49 183 76 71 14 165 200 25 250 126 17 108 -363 -122 73 -147 -18 -152 -164
1096 -164 51 -22 166 -69 -3 -33 -36 106 153 150 147 -16 -15 72 243 -37 -31 72 -87 -45 98 -118 47 321 -43
1121 -43 199 40 263 -298 22 13 -128 275 122 80 -237 46 148 -113 162 48 -69 124 16 147 -99
1142 -99 -144 -77 -188 -24 194 87 290 -106 203 -219 -2 10 -161 -83 -115 -259 -71 44 -99 -132 46 16 -52
1165 -52 139 188 -98 36 -61 72 72 -189 193 -156 -34 -128 1 251 174 -233 -47 -281 93 -20 127 17
1187 17 -63 7 204 181 232 198 187 48 -80 -34 -111 -207 -93 -203 42 -110 67 -37 -166 126 1 32 266 -18
$$ packed form
1027i9K19k3j38LJ21p5j64J09M9j79L62j18m08J98J04R4k6Q6L3j40j38M17l29
1050d2L19j48l98J93L3j10j55M86j97L4K11m00K74Oq9j96N6K14k52r3L74l24P5
1073a29K6Nj7k08K74K32j07nn7J51L5j75K25j24j09R1m71K41J95k20J29j34j2
1096a64K15p3J88k35O6l0lJ42M7llj63JQ7J71k80OJ03j59M2J43k16J65K74l64
1121d3K42j59K23n61L20rj41M03j53m2l17K83J02k61K75j14j17J93j08J31k46
1142i9m5O7j11J64K18j07K03l96L09m22K17J2j71P8l2j44J88J15j43l3J78l0o8
1165e2J91M9k86J34r7J33%k61L82l49J22r4J29K50p7m07J86k34L74j13J47j10
1187A7q0P0J97k3N1l4j1j39j28M6p7r6J14j10K45j52J77j04j29K92j25L1K34k84
$$ plain form
1211 -18 -84 210 223 12 -24 16 -62 154 -96 109 0 245 126 -63 27 209 15 177 -8 -81 194 -74 -68
1234 -68 114 23 163 81 60 -145 -167 93 -168 77 47 -252 -63 111 -94 -54 180 -8 -68 11 40 167 341
1257 341 -106 -156 20 48 69 -245 106 125 87 -72 -115 63 34 -71 150 96 -255 -44 -140 16 38 47 -12 -276
1281 -276 -19 -321 -219 46 -109 -118 26 165 89 176 -48 60 171 166 -107 113 -64 130 100 -236 -26 -12 -174
1304 -174 49 39 -53 -103 -432 183 26 -34 151 -20 146 -234 -12 159 -121 -95 -8 90 -26 61 -98 -122 -100
1327 -100 -191 -212 -101 -11 -326 48 -80 91 -77 -216 -112 -58 -44 -56 89 -158 -157 -36 -329 71 -139 -212 92
1350 92 -146 141 243 -15 -3 -14 124 155 -57 -49 -80 -97 39 -272 245 -17 -16 -35 34 -45 -140 48 -230 -278 74
1375 74 -59 107 -98 -190 118 40 -74 -117 269 181 47 -3 197 31 16 -34 -24 117 28 -25 -73 124 -59 -270
$$ packed form
1211a8o6K94J3k11l6M0p8K16k50K05j09K45j19j89R0J82j94J62j85p3K75k68O
1234f8J82r1J40q2k1k05k2K60k61K45l0k99J89J74k05M0K34j88o0P9K9J27J74
1257C41m47n0J76K8K1l14L51J9l8j59m3J78k9j05K21n4l51K11r6J56K2Rn9k64
1281b76K57l02J02K65j55rJ44J39p6Q7k24J08J11nk73K20j77J94l0l36K10J4j62
1304a74K23j0r2n0l29O15j57o0J85j71J66l80K22J71k80K6Q7R8j16Q7j59k4K2
1327a00r1k1J11R0l15L74j28J71j68j39J04N4J4j2J45k47JJ21k93M00k10p3L04
1350I2k38K87J02k58J2j1J38L1k12Ql1j7J36l11N17k62Jj9O9p9r5J88k78m8L52
1375G4j33J66k05r2L08p8j14m3L86q8j34n0K00j66j5n0J0J41q9n3m8J97j83k11
$$ plain form
1399 -270 -100 -149 -118 96 120 18 87 137 -2 -188 46 8 -7 271 -173 128 173 -39 98 75 155 218 238 170
1423 170 168 74 42 -35 14 -46 98 143 -98 119 -243 181 121 64 -105 -8 -96 39 171 36 -180 93 56 -23 -40
1448 -40 62 73 -123 171 133 -157 -113 -96 -1 -95 165 91 -40 112 133 -120 -209 -28 -102 336 -66 176 243 17
1472 17 -235 -210 -110 75 185 107 -168 -11 5 -105 -129 -53 -183 91 64 -174 -77 26 203 148 99 -161 -50
1495 -50 58 30 -180 -147 -23 9 70 -236 -284 -30 73 -56 106 -166 -101 334 -243 -239 142 148 -98 98 116 48
1519 48 15 35 37 170 -303 69 -45 62 -186 -11 105 126 -68 -112 69 -236 -12 -146 -40 -11 -51 56 -33
1542 -33 -16 0 -1 113 -321 138 191 -62 4 108 72 -103 -69 -102 27 -20 91 -127 172 -115 -134 -15 -109 346
1566 346 -1 -77 -76 55 55 -117 -152 55 -124 38 -85 -147 -29 7 14 208 68 -36 88 166 32 -30 42 132 178
$$ packed form
1399b70J70m9L1K14K4j02O9N0j39j86K34l8j5K78m44L01M5k12J37k3Q0O3K0o8
1423A70kr4l2p7M9o0J44M5k41K17l62M24o0n7j69R7q8J35J32j35k16K73l7p9j7
1448d0J02J1j96K94l8k90M4J7R5r4K60p4j31J52K1k53q9J81p4M38m02K42O7k26
1472A7k52K5J00J85J10p8k75J57J6j10k4P6j30K74k7k38R7J03J77n5m9k60J11
1495e0J08k8k10L3J24L2O1l06m8K54J03j29J62k72O5M35n77ML81Ok46J96J8o8
1519D8l3K0KJ33m73L72j14J07k48J75J16K1j94m4J81l05K24j34J06K9m0J07q9
1542c3J7J6jJ14m34M59N3k53O6J04l6j75L4l3J29m7J11k18K99k87j9J19r4M55
1566C46l47p6JJ31%j72l5K07j79J62j23o2J18L6PJ94j40j04J24P8j34o2P2R0M6
$$ plain form
1591 178 147 -91 -18 -149 -134 80 8 87 -23 -21 -195 -43 8 2 42 305 -2 -31 163 28 50 -35 -52 -35 -35 -47
1617 -47 339 93 -12 -327 127 103 -111 -23 47 -51 245 27 -212 173 -114 100 -116 -42 179 -144 57 -14
1639 -14 -41 16 -41 46 137 85 -27 -259 -61 -111 -8 -221 -264 -209 123 -32 -129 38 197 -23 -150 94 -88 -41
1663 -41 -55 -43 68 214 306 44 -15 -58 199 60 -111 158 307 -5 30 -71 151 -144 352 -109 54 45 74
1686 74 -107 -15 120 -158 -58 -97 124 -96 98 -120 -171 -140 -17 -89 -44 -142 -87 -49 -346 -134 106 183 195 -35
1710 -35 -63 32 166 138 -64 -153 147 22 -113 137 -175 -183 57 -106 142 -150 26 91 77 273 145 -73 -111
1733 -111 -10 -210 -246 -126 163 -112 -40 75 -34 224 -22 75 -127 96 -42 -69 98 94 94 -20 -22 -171 13
1756 13 -130 -270 -80 -18 -265 -225 153 -215 -147 90 -103 101 -132 -10 173 10 76 -32 -153 -358 59 -2
$$ packed form
1591A78l1k38P3j31J5K14p2P9j10Kj74J52N1oM0K63l07k9J94j35K2q5j7J7%j2
1617d7L86k46j05l15M54k4k14Q8P0r8K96k18k39L85k87K14k16P4K21l23K01p1
1639a4k7N7n7Q7R1n2j12k32J98n0J03k13m3N5L32j55r7J67J59k20j27K44j82M7
1663d1j4J2J11J46R2k62n9m3K57j39j71K69J49l12L5j01K22k95M96m61J63rK9
1686G4j81R2J35k78J00l9K21k20J94k18n1L1J23p2M5r8N5L8k97K12K40P7J2k30
1710c5k8R5J34k8k02q9L00j25j35K50l12qK40j63K48k92J76O5j4J96j28k18l8
1733a11J01k00l6J20K89k75P2J15j09K58k46R7k02K23j38k7J67m%j14kj49J84
1756A3j43j40J90O2k47M0L78l68O8K37j93K04k33J22J83j63O6j08j21k05M17o1
$$ plain form
1778 -2 -15 -366 -64 -25 49 162 125 55 -11 -4 -25 -31 -30 -83 -51 -282 42 196 -196 -128 250 -93 121 157 8 -145
1804 -145 41 97 -290 111 -32 -77 107 192 153 72 31 -59 47 37 17 181 192 33 25 -161 150 169 89 -162 204
1829 204 205 -173 102 14 -217 17 138 -51 308 51 -56 -142 80 -170 14 -93 203 -9 -86 -292 20 -135
1851 -135 5 50 -173 9 13 -11 128 -61 -99 -230 -79 -68 -34 -51 172 -107 -64 53 -163 14 65 -203 78
1874 78 108 -125 132 20 1 -73 -50 102 110 101 -96 109 -32 -57 -112 -40 -63 40 -28 51 -101 -214 89 -67 -24
1899 -24 -200 251 68 -103 106 -25 32 -61 -140 91 -26 -11 68 -226 -126 -331 87 33 82 11 -39 151 26
1922 26 159 152 57 -214 134 49 -63 -69 78 -46 -91 -222 117 91 100 122 -82 350 -139 15 -157 -102 28 -81
1946 -81 -60 86 160 -102 123 -235 -55 -20 13 226 82 -207 -2 -57 76 -124 -221 -12 109 18 33 118 68 166
$$ packed form
1778bj3l51L02L9P4J13l7p0o6Pk1oJn3L2k31L24J54l92O8L78l43K14L6j49j53
1804a45J86N6l87M01j43m5J84Q5l9q1m1r0J06j0k0J64J1j59qj86L11J9q0k51L66
1829B04Jl78K75q8k31K34J21j89L59k57j07q6K22k50J84j07K96k12p7k06L12j55
1851a35J40M5k23J82Mk4J39j89l8j31J51J1L4j7K23k79M3J17k16J77N1k68K81
1874G8L0k33K57j12j9p4K3J52Qrj97K05j41k5n5P2k3J03o8P9j52j13L03j56M3
1899b4j76M51j83j71K09j31N7r3p9K31j17J5P9k94J00k05M18n4M9p1n0J90j25
1922B6J33pr5k71L48q5j12oJ47j24m5j31L39k6RK2k04M32m89J54j72N5J30j09
1946h1K1J46P4k62K25l58J80L5L3K13j44k89K05n5J33k00r7K09J21r1J5Q5n0R8
$$ plain form
1970 166 -102 22 12 -203 103 118 -11 -106 -122 -115 -217 148 -146 32 -81 -33 89 220 196 -80 -45 -49 -93 -202
1994 -202 -193 -23 -107 -122 -35 91 18 -67 -136 -60 -40 -44 1 79 -152 -379 202 168 -8 -40 16 100 -133 40 -123 -94
2020 -94 177 74 21 -104 79 -168 -66 -237 -183 55 -63 -137 -41 157 -17 -87 -72 -107 58 14 266 -96 6
2043 6 -85 4 203 -189 -225 193 -8 36 297 -180 -151 -115 -64 -131 -107 -8 -133 60 35 -144 -34 -112 -77 -28 100
2068 100 9 -150 -4 -106 42 -22 -137 252 89 134 169 170 -266 36 -31 -32 -118 -193 96 -15 -20 -330 5 54 -237
2093 -237 -51 -46 44 -101 222 -66 -15 55 -71 33 1 205 -85 -71 -163 160 -71 206 -389 20 55 -43 -331
2116 -331 -36 288 63 169 -68 200 203 -10 -26 -37 -52 84 -217 107 60 66 -32 79 -4 -27 -88 69 -69 48
2140 48 -28 -99 121 128 77 -157 210 217 16 75 -95 -193 41 -65 25 -146 -45 -96 -6 -146 138 -184 -83 23
$$ packed form
1970A66k68J24j0k15L06J5j29r5j6Pj02L65k94J78j13M8J22J31k4k76L5mm4j09
1994b02RJ70q4j5Q7J26p3q5o9P6K0mM5P8k31k27N81l4j76l2N6Q4k33J73j63K9
2020i4K71j03n3j25J83k47J02j71N4K38j18p4R6J98j74p0J5l5J65m4K52l62J02
2043Fr1Q9J99l92l6M18k01M4K61m77K9L6N1o7K4R9j25J93k5j79J10p8L5M9J28
2068A00r1j59J46j02J48o4j15L89j63M5L5Jm36L02o7jq6p5K89j11nl10L35M9k91
2093b37J86NR0j45L23k88N1P0j26J04l2K04k90J4r2L23k31K77n95M09L5r8k88
2116c31K95L24k25J06k37K68Lk13j6j1j5J36l01L24m7Or8J11q3k3o1J57j38J17
2140D8p6p1K20Pn1k34L67Pk01N9j70r8K34j06R0j71J01n1R0j40K84l22J01J06
$$ plain form
2164 23 -18 -40 -64 127 24 -197 -79 5 -247 -24 23 -114 106 71 -43 95 172 52 73 -98 -75 -218 -246 -69
2188 -69 -181 -34 -183 30 -58 -132 232 11 -117 -2 140 -188 -53 -43 -27 -4 122 -28 82 -114 189 -110
2210 -110 -33 27 -70 211 -6 156 -19 93 26 168 -28 -168 33 59 -107 -82 55 -97 -60 218 -19 -269
2232 -269 -241 130 87 89 63 120 59 97 -180 112 191 46 234 135 111 102 -124 -67 -16 -27 97 -129 -178 -118 -41 -8 38
2259 38 -123 135 -26 50 -205 46 47 66 115 35 140 -140 204 90 -209 29 16 -72 168 182 -136 -62 29 -163
2283 -163 -213 176 45 43 30 93 -124 287 -146 187 165 -94 353 89 33 412 199 50 -122 136 -65 142
2305 142 110 69 113 -197 -301 57 -180 89 202 26 93 15 152 -4 -50 -90 -176 213 -57 -48 40 -31 69 127
2329 127 -122 46 -14 30 67 -56 29 70 4 156 -231 -51 145 -288 69 51 137 -5 40 -129 -70 82 -156
$$ packed form
2164B3m1k2k4J91j03k21J18Q4k52K23M7j37K20l5j14J38P7j20K1j71K3j43k8J77
2188f9j12J47j49K13q8p4L64k21j28J15J42l28J35J0J6K3J26j50J10j96L03k99
2210a10P7O0r7K81k17J62j75J12o7J42j96j40K01K6j66K5J37j52L7K78k37k50
2232b69K8L71m3Kk6N7o1L8k77K92P9j45J88r9k4rk26N7N1j1J24k26m9O0P7L3M6
2259C8j61K58j61P6k55K51JJ9M9q0J05k80L44j14k99K38j3q8K40J4l18P4R1j92
2283a63n0L89j31kj3O3k17M11m33L33k2k59M47k64n6L79k13j49j72K58k01K07
2305A42l2m1M4l10j04L58k37K69J13j76O7p8J37j56m6m0q6L89k70RQ8p1J00N8
2329A27k49J68o0M4L7j23Q5M1o6J52l87J80J96m33L57j8Q6j42M5j69N9J52k38
$$ plain form
2352 -156 -192 14 -215 87 173 -119 -149 -118 174 -31 53 -119 -101 75 195 81 -30 -66 -83 12 25 -184 386
2375 386 -263 55 6 -83 -234 -85 -93 -118 -147 -112 -63 52 71 24 46 -56 -50 -52 45 -35 -224 198 132 338 9 -112
2401 -112 -190 331 -154 134 105 190 25 37 -110 -135 134 -61 -92 -331 -86 62 251 -56 -101 -101 61 -63 -7
2424 -7 128 6 -137 3 -75 3 -78 -31 -11 -113 -29 67 14 -59 -243 -87 -97 50 71 192 92 -36 78 -85
2448 -85 -32 -70 119 124 -129 4 47 121 -69 -11 41 90 -73 -42 93 -21 182 127 79 10 -16 84 55 5 8 31 113
2475 113 168 -75 -106 42 139 292 -179 -229 85 117 57 108 -216 -15 -87 85 -19 25 -52 -19 70 -63 -64 47 50
2500 50 -135 -41 35 -35 127 -209 58 -76 1 130 -92 189 -7 52 200 77 -17 8 -105 -12 7 -25 214 32
2524 32 101 15 -21 14 116 -55 47 -215 -50 188 -209 -47 11 31 96 -42 -93 -132 -132 -28 -115 -181 27 164 -111
$$ packed form
2352a56l6K06k29L02Q6k92l0L1K92k05Q4j72J8J76J20j14j11l6j7R5J3k09N70
2375C86o49L18m9q9j51J49qk5k9L5M9J15J9m7K2j02OkR7q0j89M22o6K06l29j21
2401a12p8N21m85K88k9Q5j65J2j47k5K69j95l1k39K45J48J89l07m5%J62j24N6
2424gJ35j22j43J40p8P8q1M7K0j02Q4R6n3p3j84J56j0J47K1J21j00j28J14j63
2448h5N3l8J89Nk53J33M3P4j90N8N2M9j63L1J35j14K03n5m8o9k6J00k9n0LK3Q2
2475A13N5k43l1J48R7J53m71n0L14L2o0N1l24K01p2J72j04M4p7L3Q9j33jJ11L
2500E0j85R4P6p0J62l36K67j34P7J29k22K81j96N9J48j23r4K5j13R3J9l2K39j82
2524C2O9q6l6L5J02j71J02k62J65K38l97J62N8K0O5j38n1l9%J04q7o6K08J37k75
$$ plain form
2549 -111 -209 72 -257 -41 53 27 71 307 -187 39 35 -82 -144 149 228 81 -183 -185 13 -135 57 46 -31 360
2573 360 -144 -71 -65 138 154 -59 29 -89 84 103 -94 41 176 -42 -76 26 14 -40 104 -18 -142 39 -171
2596 -171 -240 -50 -53 25 -53 146 99 17 53 -10 49 150 161 -111 159 26 -44 -43 -58 -161 -295 -6 -165 61 186
2621 186 14 -127 135 -4 -27 25 97 188 -5 -52 265 216 37 -84 -90 159 4 144 71 325 71 -35 -40 -152
2645 -152 -58 -202 66 145 1 154 127 -154 199 104 -27 146 126 -460 -142 -106 23 -31 -90 137 277 26 136
2668 136 149 -168 -323 93 -79 -80 40 107 -343 29 14 77 -32 -119 1 141 36 -115 -35 -59 27 25 91 28 9
2693 9 188 149 152 135 116 123 131 -59 -31 67 -232 37 73 107 90 -41 151 -126 -225 -10 35 165 -156 111 73 247
2719 247 32 -89 56 -20 55 24 185 158 12 -45 -10 84 121 -118 -74 -76 -61 21 -51 183 -116 -200 35 -65 136
$$ packed form
2549a11r8K81l29K16R4k6M4K36m94K26mj17o2K93P9j47k64kJ98j48J92j1p7L91
2573C60n04P3OK03J6k13Q8j18J73J9j97J35J35k18l4J02j2n4J44j22j24J81k10
2596a71o9J90lP8p8J99m7q2L6o3N9J01J1k72K70j33p0Jj5j03j34K89j59K26J25
2621A86j72j41K62j39k3N2P2R1j93m7L17m9j79j21oK49j55J40p3K54k54j06nj12
2645a52R4j44K68P9j44J53k7k81L53r5j31J73k0n86L18L6J29n4n9K27J40k51J10
2668A36J3l17j55M16j72jJ20O7m50L72j5O3j09q7J20J40j05j51Q0k4Q6kO6o3j9
2693IJ79l9Lj7j9PQj90K8R8k99K69L6L4j7j31J92k77r9K15M5J30l21K67l8J74
2719B47k15j21J45p6P5l1J61k7j46n7L5R4L7k39M4kJ5Q2p2K34k99q4K35j00K01
$$ plain form
2744 136 -121 24 -52 -52 84 48 -190 12 -31 69 -60 -45 13 89 -162 0 146 6 22 6 -48 4 -143 35
2768 35 -80 -33 156 116 165 -37 -1 -174 142 40 -89 100 -66 170 106 -19 166 -16 42 86 -11 -112 131
2791 131 -91 100 -82 -80 -117 -52 26 -207 118 26 -34 39 76 37 -22 -6 177 124 -27 -200 200 42 110 48 8
2816 8 -18 -75 -93 59 -22 55 -116 -17 -83 -106 13 -1 29 -191 -179 44 96 -134 90 -98 -138 269 -101 -28 84
2841 84 13 91 83 -35 -227 -134 59 0 108 86 46 -86 -278 109 -128 -8 10 -230 -133 87 168 44 -59 -122
2865 -122 -185 21 -146 25 -56 -161 -108 37 125 -188 52 -140 136 -43 109 43 -118 212 65 -163 -63 18
2887 18 142 203 -59 -67 -11 307 86 -16 228 -134 41 46 -48 -71 -22 -369 -242 215 154 77 -180 -83 -88 -8 41 -296
2913 -296 -140 0 -32 35 -50 -227 -16 -36 184 82 6 86 -174 380 -204 38 308 60 28 -63 52 196 124
$$ packed form
2744A36k57J45p6%J36l6k38K02m3J00j29J5N8P6k51J62J46j40J6j6n4N2j47J78
2768C5j15M7J89m0M9k02L6j73L16j02j29J89j66K36o4j25J85j82N8M4r7j01K43
2791A31k22J91j82Kl7O5P8k33L25r2o0P3L7l9n9J6J83n3j51j73M00j58O8o2m0
2816Hk6n7j8J52q1P7j71R9o6k3J19j4L0k20J2K23N2k30K24j88m0M07l70P3J12
2841H4p1P8qj18j92R3J93n9J08k2m0j32j92L87k37J20J8k40R7K20Q1j24j03o3
2865a22o3K06j67J71q1j05N3J45Q8l13K40j92K76j79J52o6j61L30j47k28J00Q1
2887A8J24O1k62qN6L18k21j02K44l62J75Nr4k3M9l47J27M57o1p7k57R7nQ0M9l37
2913b96J56J40l2O7q5j77K11k0K20j02p6Q0k60N54n84K42K70k48l2r1J15J44p2
$$ plain form
2936 124 -24 -39 51 -84 -52 -149 -59 -61 34 5 97 78 -1 87 -245 -44 -110 -79 -134 138 -9 54 -179 -80 -22 27 126
2963 126 92 -63 -18 45 464 93 318 140 -134 306 -27 -246 -284 92 -143 -21 -1 -1 70 306 -76 66 -7
2986 -7 -164 131 297 204 23 -70 71 -19 -70 238 106 -119 -228 -105 50 -60 -26 -122 277 -72 115 169 32
3009 32 48 -281 -158 22 50 182 18 154 185 69 65 -17 -57 151 94 8 44 91 41 -94 49 4 -165 47 102
3034 102 8 153 -18 -78 18 -27 -108 -64 -43 187 -119 -64 -92 104 -170 -66 -208 -188 151 -77 97 -81 -358
3057 -358 57 43 86 -169 163 34 -45 226 158 -102 121 -195 135 -15 139 -226 -243 78 -26 -45 99 261
3079 261 132 -97 -207 -25 65 15 -104 -11 218 64 -44 -15 89 1 186 -57 -65 12 -72 136 46 -32 -32 -210
3103 -210 178 -168 173 72 -177 -79 72 -197 164 -103 -34 49 -117 50 77 56 -141 68 -172 56 -38 80
$$ packed form
2936A24j48j5R0j35L2r7R0kR5k9R2j9p9Q8l32K01o6L1n5K72j47O3k33R9N8M9R9
2963A26l4j55M5O3M19l71K25j78k74M40l33k19l8L76k35J22K0%P1K36l82J42p3
2986gj57K95J66r3j81r3J41r0n1L08j32k25j09J23J55j10L4r6L99l49J87N4j37
3009C2J6l29J23J80K8J32j64J36L1j16mq2m0K08n7q6L6M7n0j35J43m5j69K12N5
3034A02r4J45j71o0R6m5q1M4K1K30l06N5k8J96k74J04j42K0L39k28J74j78k77
3057c58M15j4M3k55L32j29p9K71o8k60K23l16L30j50J54l65j7L21j04j9J44J62
3079B61j29k29j10J82R0n0j19R3K29j54j08K9J04q8J85k43qP7q4K08r0p8%j78
3103b10L88l46L41j01k49R8J51k69L61k67O9Q3j66J67K7k1j97K09k40K28r4J18
$$ plain form
3125 80 155 32 55 311 432 -150 272 45 -37 -51 -95 201 23 -59 136 72 -91 257 -30 -171 -112 -173 21
3148 21 -93 -21 30 -110 138 110 88 448 -175 -78 -43 -125 -100 -10 72 12 -67 172 5 92 40 88 -1 -107 84 102
3174 102 57 -197 -273 -150 25 -10 -29 89 32 6 -247 80 22 -103 -40 -21 134 222 -123 101 225 48 -118
3197 -118 -5 52 -114 -12 -108 -45 -21 37 -77 -38 126 198 260 210 -135 55 50 -92 -108 -6 32 166 92 -140 102
3222 102 -141 53 -2 30 178 54 -6 -172 68 30 -116 108 98 -117 219 4 295 243 -8 -94 -134 -15 -67
3245 -67 -9 -41 128 -24 -298 -51 -304 -196 -74 114 -155 95 63 160 68 -76 -21 -152 149 13 191 49
3267 49 -34 -67 -94 -82 -14 -34 37 -30 -24 -185 12 -41 29 -98 -113 231 -98 -207 204 -114 93 79 54 127 233 133
3293 133 -159 31 29 -215 153 33 -1 71 -62 -128 57 135 -77 -53 -75 45 225 176 57 27 61 109 -18 -90
$$ packed form
3125H0P5j23K3K56J21n82M22k27q2j4m4K96j78q2J95o4j63L48k87j41N9o1J94
3148B1j14P2N1j40K48k8k2L60o23R7L5q2K5R0Q2o0p9K39j67Q7n2M8q9j06J91J8
3174A02m5k54p6J23J75l5j9J18n7k6k53L27n8j25O3J9J55Q8l45K24J24j77j66
3197a18J13N7j66J02r6O3K4N8j14L9J64P2O2n0l45J90nj42j6J02L8J34p4k32K42
3222A02k43J94n5L2J48j24o0j66K40l8j46K24j0k15L36k15K91n2k51q6m0J19n2
3245f7N8l2J69j52k74K47k53J08J22J88k69K50l2R7r2j44N5j31L01j36J78j42
3267D9q3l3k7J2O8k0P1o7Oj61J97n3P0j27j5L44l29j09M11l18K07j4k5P3J06j00
3293A33k92J90kk44L68j20l4P2j33o6J85P8k12K4k2J20J80m9j19l0L4M8j27p2
$$ plain form
3317 -90 -79 -53 95 -201 124 -133 198 199 -159 -120 150 5 -4 114 91 -21 108 -76 3 65 -226 259 -385 4
3341 4 39 97 31 -142 -141 197 126 -173 138 36 -126 -220 -86 25 50 206 -49 111 -109 140 -369 -42 54 -90
3365 -90 -61 161 -28 -1 12 157 139 -66 -71 229 -94 -59 8 -211 167 -14 -251 -29 -6 76 98 152 295 -22
3389 -22 -67 54 -66 -227 130 0 -73 -103 108 117 -95 -125 -135 -212 19 61 -73 -76 171 18 -122 143 -5 43
3413 43 -46 13 -10 37 131 25 253 -125 191 -239 -31 179 -294 106 -29 110 16 -102 -104 -41 -10 -257 201 3
3437 3 78 -109 -80 -15 -42 163 17 -83 -157 -366 -28 -1 -60 31 -395 268 -61 218 106 161 38 57 47 -11 41
3462 41 -179 135 61 37 84 11 77 116 -157 64 -122 37 106 45 214 100 129 -55 142 17 -15 -150 218 71
3486 71 136 61 125 -279 -253 85 9 119 137 -155 55 185 -118 52 -160 -8 -38 -169 227 -3 -185 -41 57
$$ packed form
3317i0J1K6J48k96L25k57L31Jl58L9K70j45rJ18k3j12J29j84P9O2k91M85o44L89
3341DL5N8o6j73JL38p1k99L11j02j62r4J34J11K5J56k55J60k20K49n09L27R6j44
3365i0K9K22j89K7J3J45j8k05nL00l23L5O7k19L78j81k37K22K3Q2K2N4J43l17
3389b2m5J21j20j61L57j30p3l0K11Rk12l0j0p7K31M2j34lK47j53j40K65j48M8
3413D3q9N9k3M7R4j06K28l78L16m30K08K10m73M00j35J39r4j18kO3L1k47M58j98
3437CP5j87K9O5k7K05j46j00p4k09L38K7n9R1m26O63l29K79j12N5j23J9j0n8N2
3462D1k20L14p4k4M7p3O6L9k73K21j86J59O9o1J69j14K9j84J97j25l2j35L68j47
3486G1O5p5O4m04K6L38p6J10J8k92K10J30l03J70k12J52l0j31L96k30j82J44R8
$$ plain form
3509 57 -32 -17 -133 -120 -244 -20 56 -39 46 -90 -36 -1 -131 220 87 -171 254 -53 -122 134 104 -122 35 25
3533 25 -117 -62 13 24 -36 199 232 105 99 -193 165 -129 -89 231 270 -6 18 -58 -164 34 -30 -59 179 -72 167
3558 167 -125 51 -242 314 -54 -11 -52 -167 -20 -46 -79 -161 -290 -160 94 190 145 -45 4 -313 413 -52 -4
3581 -4 163 -145 56 203 120 -89 -4 110 133 0 -53 110 48 -176 29 69 -176 65 14 53 -120 -104 145 -59
3605 -59 -291 -78 94 -40 -14 -33 -121 -128 -62 -11 -75 -72 137 127 110 374 238 -2 -151 -6 -105 99 -127 66 174
3630 174 -115 55 50 -70 -75 -41 -9 195 -132 124 186 20 -72 -4 121 -220 -68 141 76 -128 -152 69 -53 76
3654 76 -119 -223 -40 -58 -212 24 -38 -51 62 -23 307 52 -217 158 94 -49 -9 216 50 -54 221 -114
3676 -114 90 -248 155 -25 -30 -205 -23 -22 103 44 112 82 -96 76 165 96 65 -109 -48 55 -22 52 -171 -145 85
$$ packed form
3509E7q9J5j16J3j24K24P6r5Q5j36N4L5j30L51j33k58M25l07o9K56l0k26J57j0
3533B5j42N5P5J1o0K35L3j27ok92L58k94M0L20L9k76K4p6j06J98o4k9K38k51K39
3558A67k92J76k93N56l68M3m1j15J47k6l3q2j29J30K54R6m5j90M9l17P26m65M8
3581dJ67l08K01J47q3k09Q5J14K3j33n3J63o2k24K05M0k45K41n1L9j73J6K49k04
3605e9k32K13J72j34K6j9q8pO6N1o4LK09j0j7K64j36k40j49J45r9K04k26J93J08
3630A74k89J70nj20nL4L2K04l27K56O2j66r2O8J25l41J52K09o5k04k4K21j22J29
3654G6j95j04J83j8j54K36o2j3J13q5L30k55k69L75o4j43M0K25j66j04K75l35
3676a14K04l38M03j80nj75J82JJ25n9O8l0j78J72Q9o9l1j74O1J03p7P4k23K6K30
$$ plain form
3701 85 -67 -20 66 108 73 -83 -270 -94 -106 80 -30 -161 -149 -42 72 292 -33 2 -23 -180 -111 59 -179
3724 -179 -112 176 -97 -13 -62 -149 -91 -242 17 -22 62 36 -167 87 4 106 32 -62 -188 -101 338 148 -270 -133
3748 -133 -106 98 -23 178 104 -127 153 34 -109 -269 -69 314 -134 -81 -73 -146 -150 -5 112 110 39 159 78 -96
3772 -96 22 -274 11 80 -192 73 -93 -286 -35 -130 137 17 143 37 -465 -27 256 103 288 -124 -37
3793 -37 -130 -100 -79 136 3 177 -9 -94 -85 -37 -20 12 -44 241 -10 -38 162 -301 43 -162 -65 -115 -9 134 239
3818 239 191 160 177 -93 51 251 67 213 -51 -109 63 -127 188 -88 -370 -112 85 -30 230 1 -169
3839 -169 -146 -42 114 -45 -156 28 -37 37 133 73 -369 28 34 -476 54 76 169 -81 -20 -186 408 50 -90
3862 -90 -150 193 -121 -77 -207 -34 -263 131 -67 -70 -134 21 78 83 -24 -25 -228 -206 54 11 54 -141 82 -128 -14
$$ packed form
3701H5j52M7Q6M2l5j56j87J76j2J86j10j31J2J07J14K20l25L5k5j57O9J70k38
3724a79O7K88k73Q4m9q7N8j51K59l9Q4k6k03K54q3J02p4r4j26Q7M39j90m18J37
3748a33K7K04j21K01p4k31K80j19j43j60K00L83m48N3Qp3mJ45J17kp1J20q1j74
3772i6J18k96K85O9k72K65j66j93K51r5K67j20J26j06n02M38K83j53J85m12Q7
3793c7r3L0K1K15j33J74j86q5RM8J7L2n6K85k51k8K00m63L44k05R7n0J06J43J05
3818B39m8l1J7k70J44K00j84J46k64n8J72j90L15k76k82K58J97j15K60k29j70
3839a69K3J04J56j59j11J84o5P4R6o0m42L97On10N30K2R3k50O1j66N94l58j40
3862i0o0L43l14M4j30J73k29L94j98lo4J55N7Nj07jk03K2K60m3M3j95K23k10J14
$$ plain form
3887 -14 54 32 71 87 -246 -80 243 148 19 -126 28 72 155 -93 -82 148 -4 -127 102 -24 29 234 -220
3910 -220 -26 -61 -99 -133 86 -93 307 223 47 46 -149 2 55 -46 -89 221 43 30 28 41 -173 18 97 -144
3934 -144 -156 -268 -74 -159 130 -98 -25 -19 59 -39 14 -53 65 -13 162 106 -21 -163 51 -97 -239 -48 65 145
3958 145 -40 28 -83 33 47 -15 -33 -12 -30 -72 53 184 52 230 -78 -84 17 -14 21 -26 234 134 204 -172
3982 -172 197 7 84 -148 30 34 -211 -136 -52 -198 70 -65 -180 110 9 18 102 131 186 52 83 32 -33 -19 -79
4007 -79 53 96 65 95 62 12 -36 126 -204 -125 14 116 -92 163 47 39 16 21 1 -46 -90 -37 72 -44 145 -36
4033 -36 12 13 133 21 57 56 6 -332 1 -59 -192 -32 45 -22 -318 -76 13 -123 304 28 -9 -171 -208 -121 51
4058 51 -189 245 -7 -20 -60 -278 -100 103 -4 13 67 221 -198 -84 201 128 -29 -177 292 -50 12 111 -26
$$ packed form
3887a4O8k2L9J6l33J66L23r5j29j45J54M4Q3k48J1K30j52j23K29j26N3K05m54
3910b20J94l5l8l4K19j79M00q4j76jj95J51N3j01m3L10j78j3kJ3k14J91P9k41
3934a44j2j12J94q5K89k28P3OP8r8N3o7J18p8J75n6j27j42K14j48j42J91J13Q0
3958A45j85O8j11J16J4o2j8K1j8m2J25J31j32J78l08oJ01l1L5m7K60j00P0l76
3982a72L69j90P7k32J78Mk45P5Q4j46K68j35j15K90j01RQ4K9N5j34L1n1o5J4o0
4007g9J32M3l1L0l3n0m8J62l30P9J39J02k08K55j16qk3Nk0m7m4N3J09j16J89j81
4033c6M8JJ20j12L6jn0l38L33o0j33J60P7o7k96K42Q9j36M27k76l7j62l7Q7J72
4058E1k40M34k52j3m0k18J78K03j07J7N4J54m19J14K85p3j57j48M69l42O2R9j37
$$ plain form
4081 -26 -84 -226 17 238 -157 -69 29 -33 -89 -16 179 202 96 31 64 -260 -103 -108 -90 -289 -180 -174 -104 -63 95 8
4107 8 66 -101 68 -10 -294 -176 -176 333 209 -69 14 196 44 164 -94 152 45 125 1 231 155 185 250 -138
4131 -138 30 -33 -24 -6 47 -83 -165 -124 -159 137 78 -6 -185 174 -113 -6 12 99 235 283 161 61 -137 -3
4155 -3 -184 -8 77 63 81 -36 -16 -9 214 103 -43 -95 -27 -3 -31 51 0 90 122 -10 -223 -56 -122 34 180 -133
4181 -133 16 -97 297 -60 167 118 -59 10 128 121 5 -18 139 -57 -8 231 127 108 240 159 62 -100 29
4204 29 193 72 62 -80 216 -69 1 -214 -272 39 -33 -193 -21 230 -236 37 -135 288 -89 136 99 -59
4226 -59 26 -63 -81 95 28 -41 299 232 77 129 135 47 133 -151 147 26 211 31 68 -33 52 275 169 5 -58
4251 -58 -80 51 42 -3 -45 -103 38 -130 -68 -171 26 -143 -72 -127 54 -45 -92 -2 -124 -70 -124 58 -60 112 49
$$ packed form
4081b6n8j42K43K21l95Q8R8o2n6P3J95K3j06o5L3l24J57nJ8j99J09OP0M1J58q7
4107HN8j67J69p8k84J18%N09j24k78Q3J82j52J20k58K46j07Q0j24K30p6L0O5l88
4131a38J68o3RJ8N3j30q2M1l5K96n9q4j79L59k87J07J8Q7J36M8j22j00j98J34
4155cj81J76Q5j4J8j17K0PK23j11j46n2O8K4k8Q2n1R0L2j32k13J67o6J56J46l13
4181a33J49j13L94l57K27m9j77O9J18pj16k3J57j96M9K39j04j9J32q1r7j62J29
4204B9J64j21j0j42K96k85P0k15n8L11p2j60J72K51m66K73j72M23l77K25l7j58
4226e9Q5q9j8J76o7o9L40o7j55N2Oq8Q6k84K98j21J85j80L7j01Q5K23j06j64o3
4251e8k2J31rm5m2n8J41j68O2j03J97j69P1n5J81r9m7R0j22N4n4J82j18J72o3
$$ plain form
4276 49 90 -146 39 146 -109 -135 -122 63 221 117 -40 55 -163 5 -207 113 -206 -162 78 -109 77 42
4298 42 -130 -72 106 -115 188 -246 176 19 -7 -49 -25 74 51 -319 -90 154 89 -30 -245 -18 -105 45 248
4321 248 -192 -183 -71 151 -156 11 -57 -287 -358 186 203 150 43 -163 36 173 -231 37 40 -124 144 -115 19
4344 19 -12 4 55 -41 90 109 -163 -134 -13 151 -68 -30 -224 59 -7 135 -66 164 -47 -278 -120 207 32
4367 32 -168 -44 -314 9 -85 144 -163 -57 -42 116 230 -126 43 17 -40 -23 102 -131 -64 -7 -176 -126 117
4390 117 37 -89 -66 -1 184 130 -12 -34 -115 239 5 181 -58 -231 126 153 50 109 160 -74 -120 95 94 -243
4414 -243 -155 249 157 29 132 -57 62 295 128 -21 -166 -278 -152 -49 -239 -72 -27 44 183 81 -99
4435 -99 80 11 -191 133 -21 315 89 165 -321 126 -5 223 -173 2 -37 5 -63 -153 -135 -182 164 -69 -126
$$ packed form
4276D9M1k36J85J07k55k6J3J85J58j04j57R5k18J68k12L20l19M4K40j87J86l5
4298D2j72N8J78k21L03m34M22j57k6m2K4R9k3l70K29K44o5j19k15K27q7J50K03
4321B48m40RJ12K22l07J67o8k30p1N44J7n3j07k06J99J37m04K68Lj64K68k59J34
4344A9l1J6N1r6J31J9k72K9J21J64k19L8j94K83o6J42k01K30k11k31J58L27j75
4367C2k00J24k70L23r4K29l07J06J5J58J14l56J69k6n7J7J25k33O7N7j69N0K43
4390A17q0j26K3O5J85n4j42k2q1L54k34J76k39j73L57K7j03N9N1k34m6K15jl37
4414b43Q8M04r2j28J03j89J19K33j67j49j45j12J26J03j90J67M5P1J39j02j80
4435i9J79o9k02L24j54L36k26P6m86M47j31K28l96J75l9M2o8r0J8m7L46k33n7
$$ plain form
4458 -126 -133 131 16 267 356 113 45 -106 -28 -303 -85 44 -33 -143 16 10 52 103 -30 20 -167 -60 2 85
4482 85 310 312 65 76 -224 99 -92 -74 -81 7 37 -66 -198 37 129 -78 192 -133 134 -137 106 -202 12
4505 12 249 -24 40 187 -114 56 39 -37 -189 88 102 -101 -169 -39 3 -180 -82 -160 -64 -418 122 52 70 -77
4529 -77 -89 168 132 117 80 11 15 14 231 215 148 -67 118 -172 12 53 -54 -232 145 126 -199 143 -108 239 45
4554 45 -106 2 -193 63 49 -123 -106 217 27 73 -88 172 -81 146 -130 -256 122 -242 -193 136 -55 29
4576 29 -57 -17 33 93 76 -168 160 142 143 -186 97 -274 361 179 -79 -22 -58 79 -34 -49 18 32 -129 -47 248
4601 248 -156 153 74 -143 97 136 204 -42 242 -4 -14 -246 1 31 -54 52 -61 -276 115 -9 -4 181 113
4624 113 62 -78 -33 91 36 154 92 144 146 128 164 40 110 -197 -2 199 -127 12 13 84 89 -201 8 71 -76
$$ packed form
4458a26pK64j15K51Q9k43o8j51P8k75K18J29p7j10J59oM2N1j33N0j87J07O2Q3
4482H5K25Kk47J1l00L23j91J8pQ8L0j03j32K35R2k07K70l25K67k71K43l08K14
4505A2K37k73O4J47l01J70j7p6j52K77J4k03o8J30M2j83R8p8R6l54N40p0J8j47
4529g7j2K57l6j5l7o9MjK17j6o7k15J85k90J84M1j07j78L77j9l25L42k51L47j94
4554D5j51J08j95K56j4j72J7L23j90M6j61K60k53K27k76j26L78l64M9L29j91Q4
4576B9q6M0N0O0j7k44L28j8Jl29K83l71O35j82k58N7l6J37j13j5O7J4j61Q2K95
4601B48m04L09p9k17K40L9O8k46K84k46j0k32K47L0q5J06j13k15L91j24NJ85o8
4624A13n1j40M5J24n5J18o2N2Kj8L6j24P0l07J95K01l26J39JP1Nk90K09O3j47
$$ plain form
4649 -76 43 -146 138 -5 -53 -78 255 183 -143 35 -233 -11 16 -212 -18 145 -65 -24 80 -79 -121 -8
4671 -8 0 65 -102 11 135 -37 167 -27 157 249 42 -81 33 -14 -3 -119 103 97 -99 121 -220 -51 -53 -197
4695 -197 -166 182 -95 33 -16 -210 60 -115 120 -139 118 7 4 -31 -164 -185 -45 55 204 -130 213 -6
4717 -6 -113 -160 71 11 113 -73 135 29 147 -1 -40 229 130 -174 -35 130 -216 127 -30 -66 -213 162
4739 162 -68 4 -27 377 115 -220 -76 -140 -137 -51 127 302 -48 166 121 67 181 -129 -162 55 -27 303 -47
4762 -47 -88 -138 -167 -243 -36 62 -11 270 -68 60 -166 102 132 190 135 -93 44 53 7 -4 -335 91 -199 93 112
4787 112 165 -152 54 81 194 -230 1 -42 110 113 -134 38 -4 -24 223 87 -75 163 -98 -6 68 -149 -109
4810 -109 52 -291 -22 190 74 196 73 116 5 35 125 -76 -19 132 -137 50 31 -193 140 -45 187 -6
$$ packed form
4649g6J19j89K84j43m8k5L33p2l26J78k68K22K7k28J94J63k10M1J04j59m2J13
4671hQO5j67J13J24j72K04j94J84R2k07j23J14m7J1j16K22oj96K20l41J69kj44
4695a97L1L48k77J28m9j94K70j75K35k59K57j11ll5j33k1J40J00J49l34L43k19
4717fj07m7K31o0J02j86K08j06J18j48l9K69r9l04J39J65l46L43j57l6j47L75
4739A62k30P2l1M04k62l35J44o4LQ6J78J75l50K14m5n4J14l10l3K17q2L30l50
4762d7m1n0k9p6K07R8p3K81l38J28k26K68L0N8n5k28J37Rm6j1l31M26k90K92J9
4787A12N3l17K06K7J13m24K31m3J52Lk47J72m2k0K47j36j62K38k61R2P4k17M0
4810a09J61l43K69K12j16J22j23M3j11L0R0k01N7J51k69J87j9k24L33j85K32j93
$$ plain form
4832 -6 79 -7 -271 0 -15 -168 -131 -259 42 5 -71 -137 -140 -86 -35 63 200 -75 -33 -55 -136 -102 -169 -56 60 181
4858 181 56 -4 -201 185 -248 18 40 -99 56 -31 -67 -56 -74 275 230 92 37 109 -112 42 29 150 -156
4881 -156 47 285 75 28 -143 100 -33 -70 -37 34 78 -219 -220 128 113 -281 -287 -70 -160 -60 87 -68 125 158
4905 158 187 190 10 43 103 -5 11 -168 12 215 106 14 19 258 -2 -2 -227 -172 24 332 -59 53 69 65 -145
4930 -145 -58 -11 33 -159 -97 192 11 -158 139 101 -81 -72 30 -390 74 122 103 190 -56 -97 -64 160 58 -47
4954 -47 -2 -62 29 -58 53 106 130 -33 123 -90 -2 178 10 -142 49 29 154 -268 74 152 -112 104 -34
4977 -34 -17 -210 -313 102 -148 -162 -211 -158 -31 2 -45 -249 -37 50 147 55 2 -63 33 296 -220 137 -107 -35 0
5002 0 -114 29 17 -77 -35 -337 50 177 93 223 0 -130 -74 56 62 116 -216 -252 -23 -21 -78 -51 -94 -2 -145 107
$$ packed form
4832fQ5q6k64K71j5j53L7j28L01l7p6o6lN4N1R8J37k75M2k2q1L4o7J13J16J21
4858A81j25o0j97L86m33K66K2j39J55q7l6J1j8L49m5j38n5P2k21J54j3J21l06
4881a56K03K38k10m7j71K43j33l7L3P1M4k97jL48j5l94oK17r0J00J47j55J93L3
4905A58K9Lj80L3O0j08J6j79J80K03j09r2NK39k60%k25N5J96L08l91J12J6mk10
4930a45Q7M7M4j92O2K89j81j69K97l8j82RJ02m20M64M8j9Q7k46m1L3K24j02j05
4954d7M5o0R1q7J11N3K4j63J56k13Q8J80j68j52J91k0J25m22L42P8k64K16j38
4977c4J7j93j03M15k50j4m9N3J27L3m7k04K12Q7R7r2n3o5R6K63n16L57k44P2L5
5002@j14J43j2r4M2l02L87J27q4J30k23j30N6J30ON4l32l6K29Kn7K7m3R2j43K52
$$ plain form
5028 107 145 49 -101 57 -44 31 -176 116 -1 0 -143 -29 69 -55 -66 -100 252 -52 127 7 214 -5 -128
5051 -128 87 36 -299 56 56 27 -123 -79 -192 29 66 -11 36 269 162 -56 -33 -34 -20 -16 -144 -186 -56 -5 303
5076 303 -138 15 -75 -112 200 36 -316 -190 80 122 246 37 31 -54 -210 -60 222 181 94 5 24 190 90
5099 90 155 187 -238 272 -137 21 200 -158 -132 32 -114 -90 33 61 19 -134 24 3 -60 -124 96 14 129 138
5123 138 72 -31 58 -20 -62 1 18 195 -200 -18 269 -63 113 141 0 30 -69 -179 -231 -329 160 -174 -103 -48
5147 -48 -83 116 -22 -80 104 71 96 -70 189 -59 -122 234 -45 -98 -32 172 31 -89 25 -52 44 201 73
5170 73 -26 -85 -93 202 60 43 -89 161 -13 91 -12 60 -214 -95 -154 -126 103 146 -16 -103 -176 21 132 159
5194 159 175 187 -83 -88 -51 0 -240 -48 133 79 146 -113 138 -356 24 -123 -3 -42 -41 -113 -88 -29 232 20 -120
$$ packed form
5028A07L8r6j50J58j01P5k07K92j17Jj43J14R8j24j1l4L52l04J79j20K07k19j23
5051a28K15n1l35L55%k9j50M4j13K21L7p7M7K33j07k18K3jJ4Mj28m2J30N1L08
5076C03m41J53r0l7L12j64l52J26K70M2J24k09oq5j56J50K82m1q7q9J9J66j00
5099I0O5L2m25N10m09J58J79l58K6J64j46K4J23K8m2j53J58k1o3o4K20q2J15R
5123A38o6j03Q9p8m2O3J7J77l95J82K87l32J76K8j41L0r9j10n2r8M89l34P1N5
5147d8l5J99j38n8J84l3K5j66K59k48o3L56k79n3O6K04j41j20J14p7R6J57j28
5170G3r9n9qK95j42j7j32K50j74J04j03P2k74J19n9K8K29M3j62q7p3J97J11K7
5194A59J6J2k70nL7N1k40J92J81n4O7k59K51m94L80j47J20l9Jp2K5N9K61k12j40
$$ plain form
5219 -120 14 25 88 49 79 -166 -7 122 -122 -63 116 12 147 196 7 -33 -66 297 38 -23 -41 -46 -84 -11 298
5244 298 -74 -93 102 109 -101 -51 -123 99 163 61 -216 73 100 12 174 -45 -24 -122 -76 7 -14 39 -6 -58 304
5269 304 247 73 250 30 -177 -78 309 -183 68 181 80 -189 99 -57 82 -170 -182 62 -63 21 -201
5290 -201 -36 -56 -126 -84 13 39 -21 -249 71 138 218 -75 22 -170 49 157 14 59 -139 136 -78 -275 138
5313 138 258 110 138 39 -164 -80 73 -13 40 103 -59 -88 -5 168 -82 158 42 -38 178 32 195 158 -66
5336 -66 -267 27 -81 -88 123 24 -184 -146 18 -151 -120 -179 22 239 -171 -212 72 131 -107 -74 23 50 -173 -59
5360 -59 4 -111 148 71 -121 78 -134 -146 -148 -93 -168 -206 -54 103 3 116 181 86 -115 11 -314 184 -38 -187
5384 -187 61 -225 11 -153 -70 -156 175 28 -74 88 54 -265 -15 74 11 122 -113 161 -48 -168 221 -53
$$ packed form
5219a20J34J1O3l9L0k45J59J29k44N9J79j04J35M9j89m0l3L63k59o1j8nl8P3L09
5244B98l72j9J95Pk10N0p2K22O4j02k77K89K7q8J62k19K1r8M6Q3k1N3m5n2L62
5269C04n7j74J77k20k07R9L87m92K51J13j01k69K88j56J39k52j2K44j25Q4k22
5290b01J65k0p0M2R7K6o0k28L20O7Q0k93R7j92K19J08j43M5j98K75k14j97M13
5313A38J20j48K8r9k03Q4J53q6N3O3j62k9Q3J73k50K40j16q0K16j46J63l7k24
5336f6k01K94j08pK11r9k08L8J64j69L1n9K01K17m10m1K84N9k38L3R7K7k23J14
5360e9O3j15K59p7j92J99k12j2kN5p5l8J52J57j00J13O5r5k01J26l25M98k22j49
5384a87K48k86K36j64Q3q6L31j47j02J62l4l19K50Q9o3J11k35K74k09j20L89k74
$$ plain form
5406 -53 -114 149 94 -61 -127 61 113 -182 68 -104 -60 46 -19 29 -29 -6 -79 -185 -242 -17 -81 75 11 85 -78
5431 -78 -152 -99 -213 -10 -110 -73 10 43 -175 99 34 -44 -189 77 238 -44 123 260 -71 281 -108 303 61
5454 61 144 -187 -144 -112 -46 -130 -28 240 87 -94 -94 102 -303 184 -79 82 -114 -48 301 -72 38 156 56
5477 56 -168 83 117 57 -98 -28 185 -24 193 80 -14 25 -133 -210 -64 57 181 157 82 -74 66 32 18 28
5501 28 -120 51 -236 276 41 -25 -33 -36 -131 -47 -38 59 86 257 92 -65 -288 -57 370 -101 144 -85 43 -79
5525 -79 -369 -83 -65 -40 19 -60 -122 226 -19 -33 -211 20 -104 -151 -22 -65 163 -49 -75 12 -54 0 -60 59 -104
5550 -104 99 42 96 -285 147 -63 249 -62 -132 140 61 52 148 -98 -7 2 -62 -9 -28 -128 -113 -128 -81 -311 -128
5575 -128 222 -8 -157 2 -85 57 -151 68 52 23 82 -235 75 -128 188 100 -234 -170 212 66 66 89 0
$$ packed form
5406e3o1K63n5j55o6J88N2k95K50j72M4J06o5M8n8K3p3j06n7K25o4J56o4P4j63
5431g8p4N3j14K03j00L7Q3L3k18K74o5p8j45K66J61k82J67J37l31L52l89M11k42
5454F1Q3l31M3L2O6q4J02K68j53j81%J96m05M87k63J61j96O6L49l73J10J18j00
5477E6k24K51L4o0j55P0K13k09K17j13r4L9j58p7J46J21J24k4p5j56J40l4j4J0
5501B8j48J71k87N12k35o6qlr5Q4RR7K7J71j65j57k23K31M27m71K45k29J28j22
5525g9k90K86J8K5N9p9o2L48k45j4j78K31j24m7J29m3K28k12k6Q7o6N4o0J19j63
5550a04K03n7N4l81M32k10L12l11p0K72p9rR6k46R1Ro4N3j9j00J5j5M7k30J83
5575a28L50k30j49J59q7J42k08K19j6k9N9l17L10k03L16q8l34O4L82j46%K3q9
$$ plain form
5598 0 -235 25 -227 -21 48 -27 70 2 -134 210 0 159 44 -21 85 -127 -61 16 -5 -16 -88 -31 145 15
5622 15 183 161 57 47 119 -119 168 37 210 21 -186 55 11 -139 121 -15 35 175 -76 -41 116 -71
5644 -71 5 116 253 60 138 -40 75 219 76 -38 210 -7 89 -13 144 -232 114 -66 83 91 3 99 -13
5667 -13 11 84 213 -425 -57 -113 -286 23 -42 -49 111 -56 184 181 -102 -132 -159 127 179 97 -2 84 -30 103 94 -36
5693 -36 280 -54 103 -129 61 -12 -10 90 -106 233 -114 -210 79 39 94 -70 98 -130 -12 150 -254 164
5715 164 45 40 17 164 -14 -148 -72 -71 -230 -225 -149 20 24 247 17 11 -79 -61 38 -121 -177 136 293 222 -187 -123
5741 -123 -121 -71 -219 -325 -5 -62 198 -89 -157 -29 183 117 7 -32 -19 -62 65 84 18 -135 -25 -89 116 -56
5765 -56 -51 -38 69 117 -86 174 -168 -177 109 53 -57 -103 136 -77 -160 95 164 -40 -160 -76 -92 -263 -231 -48 20
$$ packed form
5598@k35K60k52K06O9p5R7o8j36L44k10J59j15o5J06k12O6P7k1j1p2N7J76j30
5622A5J68k2j04j0P2k38K87j31J73j89k07K41m4j50K60j36N0J40k51L5J57j87
5644g1P6J11J37j93P8j78J15J44j43j14K48k17R6j02J57l76L46j80J49Qq8R6j12
5667a3K4P3J29o38L68n6j73L09o5pJ60j67K40lk83l0k7K86N2q2r9Q6j14J33rj30
5693c6L16l34J57k32J90p3KJ00j96L39l47r6K89m0N5j64J68k28J18J62m04M18
5715A64j19nk3J47j78j34P6Jj59NP6J69MK23k30or0J8R9j59n6L13J57p1m09O4
5741a23KN0j48j06L20n7K60k87o8J28K12o6j10l9J3m3J27J9o6j53J10o4K05j72
5765e6NJ3J07M8k03K60l42rK86n6j10m6K39k13q3K55O9k04j20Q4j6j71L2J83O8
$$ plain form
5790 20 189 -23 -48 10 25 166 97 -431 103 44 150 36 43 94 66 -149 -342 295 -68 -40 36 28 -22 -118 170
5815 170 126 -10 -71 76 -49 62 131 -194 45 68 160 -55 105 -239 -229 -36 -196 -13 -16 16 80 -156 -53
5838 -53 62 -43 -297 -224 103 -139 33 60 -133 342 20 -116 -275 -242 -20 -88 -71 194 -1 32 -135 -14
5860 -14 214 16 187 -75 -232 30 4 -208 -14 -138 50 -166 -48 170 60 72 153 91 212 -130 -154 -233
5882 -233 27 112 -21 -158 241 83 -63 -107 30 -130 46 -51 175 82 63 46 -164 19 64 54 -57 56 130
5905 130 283 -113 33 -198 -81 -164 -30 68 -7 49 73 -203 28 51 169 141 138 -71 57 34 84 10 62 -114
5929 -114 -115 -64 -169 42 -35 -26 -34 198 201 178 199 78 147 80 77 2 -25 -111 147 145 85 188 -157 -305 169 -160 -126 201
5957 201 -99 25 68 -197 -49 -154 -186 -15 -81 -21 3 -131 -86 100 -31 59 -212 -14 223 4 -28 -192 303
$$ packed form
5790B0J69k12k5N8J5J41o9n28N34n9J06j14PN1k8k15j93O37l63K8P6qn0r6K88
5815A70m4j36o1J47j25J11O9l25K39K3R2k15J60l44J0J93j60J83lL2O4k36J03
5838e3J15j05k54P3L27k42J72K7j93M75l22j36j59L3K22o8J7K65j95L3j67J21
5860a4K28j98J71k62j57K62k6k12J94j24J88k16J18K18j10J2Q1o2J21l42k4p9
5882b33K60Q5j33j37L99j58j46m4J37j60J76r7K26r3j9j7k10J83M5j0j11J13P4
5905A30J53l96J46k31J17q3J34R8p5N6K4k76K31K3J18k8lk09J28k3N0p4N2j76
5929a14jN1j05K11p7RqK32Lk3K1j21O9o7lp5k7q6K58ko0J03l45j48M74l29L4L27
5957B01l00J24M3k65J48j05l2J71o6O0K4j34M5J86j31R0k71J98K37k19l2j64M95
$$ plain form
5980 303 -123 -42 199 118 -184 -177 19 -98 -173 -70 112 69 215 49 -82 -77 -86 -205 164 57 130 -15 -53 46
6004 46 43 -97 -70 53 61 -4 206 24 -47 71 112 40 -74 120 -34 -97 -195 8 129 -41 45 8 -59 131 -108
6029 -108 59 56 -6 -66 -112 -122 -343 99 155 20 -86 18 161 142 -135 -53 -165 -55 -53 165 8 193 -110 -53
6053 -53 92 -20 -2 -25 29 -18 129 -69 -29 13 165 123 -147 88 116 0 236 94 -81 -235 140 21 48
6076 48 -4 -50 14 50 -8 101 84 -148 -201 -73 -363 133 -105 250 -99 -99 10 78 -188 -32 1 -141 36 137
6100 137 136 -56 109 102 15 -8 -105 122 -73 -179 -21 -185 127 64 3 -162 213 -138 138 124 -36 193 -91
6123 -91 -71 279 21 -179 44 -173 246 70 -100 70 -290 -245 60 -153 102 138 -201 -51 396 -14 18 75
6145 75 134 -161 -101 32 2 151 32 209 65 -183 -95 -86 -193 -61 69 -262 -44 -86 -163 -173 8 48 -18 158
$$ packed form
5980C03m26Q1K41q1l02PJ96j17p5J03J82m3J46j66j31Nrj19L69j07P3j45l8R9
6004D6lj40K7J23Qo5K10j82p1J18M1p2j14J94j54o3r8K03J21j70Q6l7o7J90k39
6029a08J67lo2o0m6j0k21M42N6j35j06J04J43j9k77Q2j12J10KK18j57J85l03N7
6053e3J45j12J8k3N4m7J47j98M0M2J52m2k70K35K8j16K36j42j75j54L75j19K7
6076D8n2m6O4L6n8J09j7k32n3J28k90M96k38L55l49%J09O8k66J56L3j42J77J01
6100A37jj92J65pq7k3r7K27j95j06J58j64L12o3o1j65L75l51K76j4j60K29k84
6123i1K0L50k58k00K23k17M19j76j70J70l60M5L05k13K55L6l39J50M47m10L2N7
6145G5N9k95O0J33l0J49j19J77j44k48Q8Rj07J32J30l31K18m2p7j0J81M0o6J76
$$ plain form
6169 158 -250 99 188 -29 183 -6 -20 127 -141 87 37 86 110 -60 120 -124 97 155 -86 -128 97 6 39
6192 39 -78 -67 68 92 72 -160 45 -71 -77 -335 105 60 48 -72 -155 -19 62 -123 78 131 -60 -48 -198 10
6216 10 99 54 -100 181 42 122 27 55 334 -74 2 -9 -131 92 2 128 -166 -155 -82 -55 260 -34 134 -124
6240 -124 -68 119 -53 -53 -276 54 -25 -163 20 -178 110 39 87 62 223 110 -18 -157 178 -34 46 33 38 159
6264 159 -98 29 120 168 143 77 -65 110 -19 76 18 -173 -138 -285 -125 -201 -61 222 -127 179 273 157 -3
6287 -3 -28 158 25 79 -62 268 -17 51 67 -22 66 -1 88 84 -100 100 94 -222 -14 216 -120 117 -21 -13 -38 41
$$ packed form
6169A58m08L49Q9k17K12j89j4J47k68K28n0M9K4j70J80k44K21N8k41m2K25r1L3
6192C9j17J1J35K4k0k32K05j16ok58M40m5j2j20q3J36Q1j85K01N3j91J2j50K08
6216A0Q9m5j54K81j39Q0r5K8K79m08P6j1j22K23r0J26k94J1P3K7L15k94J68k58
6240a24N6J87j72%k23L30p9j38J83j98K88p1M8k5J61j13j28j39L35k12Q0j3NJ21
6264A59k57J27R1M8k5o6j42J75j29R5n8j91L5j47J60p6J40K83l49L06R4j16j60
6287ck5J86j33N4j41L30k85O8J6q9Q8o7Q9mj84K00ol16K08K30l36K37j38Qk5P9
$$ [...]
8191i4
##END NTUPLES=NMR FID
##END=
