##TITLE=1H_CA-8769-2
 CDcl3, 8 sc, 
 30.9.2020
##JCAMPDX= 6.0         $$ Bruker NMR JCAMP-DX V2.0
##DATA TYPE= NMR FID
##DATA CLASS= NTUPLES
##ORIGIN= UXNMR, Bruker Analytische Messtechnik GmbH
##OWNER= root
$$ XWIN-NMR		Version 3.5
$$ Wed Sep 30 10:16:35 2020 Russian Standard Time (UT+4h)  she@DPX200
##.OBSERVE FREQUENCY= 200.1315066352
##.OBSERVE NUCLEUS= ^1H
##.DELAY= (6, 6)
##.ACQUISITION MODE= SIMULTANEOUS
##.ACQUISITION SCHEME= undefined
##.AVERAGES= 8
##.DIGITISER RES= 18
##SPECTROMETER/DATA SYSTEM= spect
##.PULSE SEQUENCE= zg30
##.SOLVENT NAME= CDCl3
##.SHIFT REFERENCE= (INTERNAL, CDCl3, 0, 15.7039)
##AUDIT TRAIL= $$ (NUMBER, WHEN, WHO, WHERE, WHAT)
$$ ##TITLE= Audit trail, XWIN-NMR		Version 3.5
$$ ##JCAMPDX= 5.01
$$ ##ORIGIN= Bruker BioSpin GmbH
$$ ##OWNER= she
$$ F:/spectra/data/she/nmr/H-F/1/audita.txt
$$ ##AUDIT TRAIL=  $$ (NUMBER, WHEN, WHO, WHERE, WHAT)
(   1,<2020-09-30 10:15:39.10 +0400>,<she>,<DPX200>,
      <created by zg, POWCHK disabled, PULCHK disabled
       configuration hash MD5:
       00 E9 B6 7A A2 85 ED C7 34 08 36 98 17 FE 4E 26
       data hash MD5: 16K
       36 80 7C CD 02 16 46 AA A9 47 1A 7A 1C 77 15 0C>)
$$ ##END=
$$ 
$$ hash MD5
$$ 3E AD 3F 3D E0 DB F0 75 AC 56 BF 3E 31 C4 DE 3D
##$RELAX= 
##$RELAX= 
##$RELAX= 
##$RELAX= 
##$RELAX= 
##$RELAX= 
$$ Bruker specific parameters
$$ --------------------------
##$DU= <F:/spectra>
##$EXPNO= 1
##$NAME= <H-F>
##$PROCNO= 1
##$TYPE= <nmr>
##$USER= <she>
##$AMP= (0..31)
100 100 100 100 100 100 100 100 100 100 100 100 100 100 100 100 100 100 
100 100 100 100 100 100 100 100 100 100 100 100 100 100 
##$AQSEQ= 0
##$AQ_mod= 1
##$AUNM= <au_zg>
##$AUTOPOS= <>
##$BF1= 200.13
##$BF2= 200.13
##$BF3= 200.13
##$BF4= 200.13
##$BF5= 200.13
##$BF6= 200.13
##$BF7= 200.13
##$BF8= 200.13
##$BYTORDA= 1
##$CFDGTYP= 0
##$CFRGTYP= 5
##$CHEMSTR= <none>
##$CNST= (0..31)
1 1 145 1 1 1 1 1 1 1 1 1 1 1 1 1 1 1 1 1 1 1 1 1 1 1 1 1 1 1 1 1 
##$CPDPRG= <>
##$CPDPRG1= <>
##$CPDPRG2= <>
##$CPDPRG3= <>
##$CPDPRG4= <mlev>
##$CPDPRG5= <mlev>
##$CPDPRG6= <mlev>
##$CPDPRG7= <mlev>
##$CPDPRG8= <mlev>
##$CPDPRGB= <>
##$CPDPRGT= <>
##$D= (0..31)
0 1.2 0 0 0 0 0 0 0 0.06 0 0.03 0 0 0 0 0.0002 0 0 0 0 0 0 0 0 0 0 0 0 
0 0 0 
##$DATE= 1601446538
##$DBL= (0..7)
120 120 120 120 120 120 120 120 
##$DBP= (0..7)
150 150 150 150 150 150 150 150 
##$DBP07= 0
##$DBPNAM0= <>
##$DBPNAM1= <>
##$DBPNAM2= <>
##$DBPNAM3= <>
##$DBPNAM4= <>
##$DBPNAM5= <>
##$DBPNAM6= <>
##$DBPNAM7= <>
##$DBPOAL= (0..7)
0.5 0.5 0.5 0.5 0.5 0.5 0.5 0.5 
##$DBPOFFS= (0..7)
0 0 0 0 0 0 0 0 
##$DE= 6
##$DECBNUC= <off>
##$DECIM= 32
##$DECNUC= <off>
##$DECSTAT= 4
##$DIGMOD= 1
##$DIGTYP= 9
##$DL= (0..7)
0 120 120 120 120 120 120 120 
##$DP= (0..7)
150 150 150 150 150 150 150 150 
##$DP07= 0
##$DPNAME0= <>
##$DPNAME1= <>
##$DPNAME2= <>
##$DPNAME3= <>
##$DPNAME4= <>
##$DPNAME5= <>
##$DPNAME6= <>
##$DPNAME7= <>
##$DPOAL= (0..7)
0.5 0.5 0.5 0.5 0.5 0.5 0.5 0.5 
##$DPOFFS= (0..7)
0 0 0 0 0 0 0 0 
##$DQDMODE= 0
##$DR= 18
##$DS= 0
##$DSLIST= <SSSSSSSSSSSSSSS>
$$ [...]
##$SUBNAM2= <"">
##$SUBNAM3= <"">
##$SUBNAM4= <"">
##$SUBNAM5= <"">
##$SUBNAM6= <"">
##$SUBNAM7= <"">
##$SUBNAM8= <"">
##$SUBNAM9= <"">
##$SW= 16.880792210976
##$SWIBOX= (0..15)
0 0 2 0 0 0 0 0 0 0 0 0 0 0 0 0 
##$SW_h= 3378.37837837838
##$TD= 16384
##$TD0= 1
##$TE= 0
##$TE2= 300
##$TE3= 300
##$TEG= 300
##$TL= (0..7)
0 120 120 120 120 120 120 120 
##$TP= (0..7)
150 150 150 150 150 150 150 150 
##$TP07= 0
##$TPNAME0= <>
##$TPNAME1= <>
##$TPNAME2= <>
##$TPNAME3= <>
##$TPNAME4= <>
##$TPNAME5= <>
##$TPNAME6= <>
##$TPNAME7= <>
##$TPOAL= (0..7)
0.5 0.5 0.5 0.5 0.5 0.5 0.5 0.5 
##$TPOFFS= (0..7)
0 0 0 0 0 0 0 0 
##$TUNHIN= 0
##$TUNHOUT= 0
##$TUNXOUT= 0
##$USERA1= <user>
##$USERA2= <user>
##$USERA3= <user>
##$USERA4= <user>
##$USERA5= <user>
##$V9= 5
##$VALIST= <valist>
##$VCLIST= <CCCCCCCCCCCCCCC>
##$VD= 0
##$VDLIST= <DDDDDDDDDDDDDDD>
##$VPLIST= <PPPPPPPPPPPPPPP>
##$VTLIST= <TTTTTTTTTTTTTTT>
##$WBST= 1024
##$WBSW= 4
##$XGAIN= (0..3)
0 0 0 0 
##$XL= 0
##$YL= 0
##$YMAX_a= 350251
##$YMIN_a= -283339
##$ZGOPTNS= <>
##$ZL1= 120
##$ZL2= 120
##$ZL3= 120
##$ZL4= 120
##$ABSF1= 10
##$ABSF2= 0
##$ABSG= 5
##$ABSL= 3
##$ALPHA= 0
##$AQORDER= 0
##$ASSFAC= 0
##$ASSFACI= 0
##$ASSFACX= 0
##$ASSWID= 0
##$AUNMP= <proc_1d>
##$AZFE= 0.1
##$AZFW= 0.1
##$BCFW= 1
##$BC_mod= 2
##$BYTORDP= 1
##$COROFFS= 0
##$CY= 11.3945322036743
##$DATMOD= 1
##$DC= 2
##$DFILT= <>
##$DTYPP= 0
##$F1P= 16.9975609425685
##$F2P= -3.02152046262296
##$FCOR= 0.5
##$FTSIZE= 0
##$FT_mod= 4
##$GAMMA= 1
##$GB= 0.15
##$INTBC= 1
##$INTSCL= 1
##$ISEN= 128
##$LB= 0.24
##$LEV0= 0
##$LPBIN= 0
##$MAXI= 10000
##$MC2= 0
##$MEAN= 0
##$ME_mod= 0
##$MI= 1.114404
##$NCOEF= 0
##$NC_proc= 0
##$NLEV= 6
##$NOISF1= 3.799351
##$NOISF2= 2.8
##$NSP= 1
##$NTH_PI= 0
##$NZP= 0
##$OFFSET= 15.70392
##$PC= 1
##$PHC0= -9970.209
##$PHC1= 13.60089
##$PH_mod= 1
##$PKNL= yes
##$PPARMOD= 0
##$PSCAL= 0
##$PSIGN= 0
##$REVERSE= no
##$SF= 200.130013532006
##$SI= 16384
##$SIGF1= 3
##$SIGF2= 2
##$SINO= 400
##$SIOLD= 16384
##$SREGLST= <1H.CDCl3>
##$SSB= 0
##$STSI= 0
##$STSR= 0
##$SW_p= 3612.71676300578
##$SYMM= 0
##$S_DEV= 0
##$TDeff= 0
##$TDoff= 0
##$TI= <>
##$TILT= no
##$TM1= 0
##$TM2= 0
##$TOPLEV= 0
##$USERP1= <user>
##$USERP2= <user>
##$USERP3= <user>
##$USERP4= <user>
##$USERP5= <user>
##$WDW= 1
##$XDIM= 8192
##$YMAX_p= 0
##$YMIN_p= 0
$$ End of Bruker specific parameters
$$ ---------------------------------
##NTUPLES= NMR FID
##VAR_NAME=  TIME,          FID/REAL,        FID/IMAG
##SYMBOL=    X,             R,               I
##VAR_TYPE=  INDEPENDENT,   DEPENDENT,       DEPENDENT
##VAR_FORM=  AFFN,          ASDF,            ASDF
##VAR_DIM=   8192,          8192,            8192
##UNITS=     SECONDS,       ARBITRARY UNITS, ARBITRARY UNITS
##FACTOR=    0.000296,      1,               1
##FIRST=     0,             0,               0
##LAST=      2.424536,      0,               0
##MIN=       0,             -283339,         0
##MAX=       2.424536,      350251,          0
$$ Real data points
##PAGE= N=1
##DATA TABLE= (X++(R..R)), XYDATA
$$ [...]
$$ plain form
1721 47 -72 -34 -114 144 -42 125 171 -23 -98 -65 72 59 46 -2 150 -39 81 100 179 -332 -48 -10 -110 -65
1745 -65 264 73 -119 -155 45 -29 22 83 -66 -19 17 119 -28 -148 -48 126 -90 -57 37 -12 -225 -12 231
1768 231 63 21 -69 -147 84 90 -158 -154 211 27 53 44 -72 23 -155 22 143 142 44 0 -328 63 1 57 -26 195
1794 195 -260 -209 117 50 -144 64 22 20 20 -153 -1 -222 -63 -64 11 10 -90 156 57 -369 18 -79 43 135 76
1819 76 -80 -100 -21 -285 -26 51 78 165 -114 83 67 81 17 213 169 14 -81 85 52 -27 100 54 84 113 69 47
1845 47 -88 108 24 192 -50 115 155 -100 95 -144 -54 50 -81 7 1 -19 24 -52 153 -16 -66 441 248 43
1869 43 -114 -136 -21 -13 55 158 101 185 -64 102 85 -108 55 -135 74 -77 -73 44 -118 -78 46 138 -121 121
1893 121 -63 -214 152 6 80 186 46 -50 221 -28 -79 91 -152 198 154 60 -180 -42 260 302 -273 83
$$ packed form
1721D7j19L8q0K58j86J67M6j94p5L3J37j3j3m8J52j89J20J9P9n11K84L8j00M5
1745f5L29j91j92l6K00p4N1O1j49M7L6J02j47j20J00J74k16L3R4m9k13K13K43
1768B31j68m2r0p8K31Ok48ML65j84K6rj16R5j78J77J21jr8m4l28L91o2N6q3K21
1794A95m55N1L26o7j94K08m2k%j73J52k21J59jP5jj00K46r9m26L87r7J22R2n9
1819G6j56k0P9k64K59P7K7Q7k79J97j6J4o4J96m4j55r5J66l3p9J27m6L0K9m4k2
1845D7j35J96q4J68k42J65M0k55J95k39R0J04j31Q8ok0M3p6K05j69n0N07j93k05
1869D3j57k2J15QO8J03n7Q4k49J66j7j93J63j90K09j51MJ17j62M0J24R2k59K42
1893A21j84j51L66j46P4J06j40r6K71k49n1J70k43L50m4r4k40J38L02M2n75L56
$$ plain form
1915 83 -91 -144 19 81 -22 149 302 -250 43 94 -19 35 45 193 -66 13 100 178 -146 -67 191 79 16 -16
1939 -16 -250 -113 109 -64 -12 -161 82 -31 -133 -152 -186 -31 80 -7 -154 -52 143 -70 127 -223 -79 -63
1961 -63 -28 -20 -48 15 26 111 -92 90 -27 -207 60 -102 -101 49 81 -40 83 17 58 -69 135 164 -8 -95 73
1986 73 217 -2 -124 114 -86 -152 80 -37 -56 -61 -95 -17 -4 -42 -11 -391 -102 104 15 123 -9 163 -62 -153
2010 -153 260 -116 -60 220 181 -109 92 -99 58 -169 -103 -13 112 98 1 -3 265 -45 -41 -116 -95 136 -98 -86
2034 -86 -6 -119 -194 34 89 -12 1 181 53 -67 -37 41 56 -37 -138 73 -72 152 83 -173 -206 109 -5 -66
2058 -66 214 -165 -14 191 337 95 153 -41 -71 -187 57 120 -142 12 121 -141 37 115 62 -164 -248 238
2080 238 -157 179 82 -106 103 -67 57 423 33 112 -13 -334 -61 267 92 113 137 131 -65 128 6 -117
$$ packed form
1915H3j74n3J63O2j03J71J53n52K93N1j13N4J0J48k59P9Q7P8l24P9K58j12o3l2
1939a6k34J37K22j73N2j49K43j13j02j9l4J55J11q7j47J02J95k13J97l50J44J6
1961f3L5Qk8O3J1Q5k03J82j17j80K67j62JJ50L2j21J23o6M1j27K04K9j72q7J68
1986G3J44k19j22K38k00o6K32j17j9nl4P8J3l8L1l80K89K06q9J08j32J72k25r1
2010a53M13l76N6K80l9k90K01j91J57k27O6R0J25j4r7mK68l10Mp5K1K31k34J2
2034h6Q0j13p5K28N5j01J3J80j28j20L0P8J5r3j01K11j45K24o9k56l3L15j14o1
2058f6K80l79J51K05J46k42N8j94l0j16K44O3k62J54J09k62J78P8n3k26q4M86
2080B38l95L36r7j88K09j70J24L66l90P9j25l21K73L28j75K1K4oj96J93j22j23
$$ plain form
2102 -117 70 -44 67 -100 -141 -25 -110 139 -203 97 62 -172 -105 -8 -28 -17 134 -75 -8 254 -97 -181 14
2125 14 -2 -187 124 -21 155 52 -82 11 -391 244 -88 -72 -27 149 209 21 346 151 -111 -120 138 5 -187
2148 -187 -167 -50 70 2 -80 228 -106 36 47 -83 79 -110 42 67 24 -132 150 -126 86 -245 23 -133
2170 -133 -26 -85 -119 7 9 31 168 261 -273 -82 0 25 -107 -15 14 4 130 -67 -152 80 36 314 -244 -109
2194 -109 19 -196 156 178 105 -6 -148 132 125 21 106 118 -68 -81 237 -123 8 -142 -24 208 172 -8 127
2217 127 70 37 195 84 -69 147 -86 207 -149 62 97 -62 -39 -122 209 210 192 102 133 81 86 -12 65 95 79 -167
2243 -167 -57 -23 -172 11 312 289 61 -60 -83 -49 -172 -3 83 -107 -165 -78 112 -69 107 71 -80 45 192
2266 192 119 -26 144 -242 -303 -17 128 257 -135 -96 -136 71 -65 110 -53 -50 27 -66 11 43 -290 -219 204 -108
$$ packed form
2102a17J87j14J11j67m1J16q5K49l42L00l5k34O7R7k0J1J51k09O7K62l51q4J95
2125A4j6j85L11j45J76j03j34R3m02O35l32J6M5J76O0j88L25j95k62rK58j33j92
2148a87K0J17J20o8q2L08l34J42J1j30J62j89J52K5m3j56K82k76K12l31K68j56
2170a33J07n9l4J26KK2J37R3n34J91Q2K5j32R2K9j0J26j97q5K32m4K78n58J35
2194a09J28k15L52K2p3j11j42K80pj04Q5J2j86j3L18l60J31j50J18K32l6j80J35
2217A27n7l3J58j11j53K16k33K93l56K11L5j59K3q3L31Jj8r0L1n2Nr8P7L0j6k46
2243a67J10L4j49J83L01k3k28j21k3L4j23J69Q6j90n8Q7J90j81J76l6j51J25J47
2266A92p3j45J70l86o1K86J45J29l92L9m0K07j36J75j63LP7r3P7L2l33P1M23l12
$$ plain form
2290 -108 133 -48 -160 -23 -8 -138 -16 -137 -102 136 -67 113 6 -39 11 -113 57 -22 133 -118 -112 -196 15
2313 15 -249 -24 47 -73 -59 181 7 201 86 -16 -94 111 5 -6 106 -116 89 -72 25 108 27 36 -75
2336 -75 111 -53 17 -230 -112 -82 138 -159 -73 -91 50 7 -251 32 86 19 66 36 -150 -30 95 34 -234 -77
2360 -77 -269 131 288 310 15 -222 11 194 -89 -131 -63 55 -29 -184 -112 -33 -245 -227 117 253 -143 63 93
2383 93 17 102 96 59 -105 70 -191 55 -34 143 -13 -46 -69 185 108 -56 122 152 84 -43 10 -23 177 -91 -80
2408 -80 -123 -115 229 75 30 49 112 20 -136 -49 -32 -100 -17 -41 -109 -29 31 59 -64 -35 164 89 19 55 -4 -48 -124 15
2436 15 -184 -25 -40 3 110 -64 118 102 60 289 -145 -41 147 -43 208 49 91 51 4 68 -228 -70 -37
2459 -37 212 -174 -15 -117 16 -196 -57 18 -209 -134 -170 173 -174 4 -125 -50 167 93 -130 -51 154 138 5
$$ packed form
2290a08K41j81j12J37J5j30J22j21L5K38k03J80j07m5N0j24J70p9J55k51Oq4K11
2313A5k64K25P1j20J4K40j74J94j15j02p8K05j06j1J12k22K05j61R7Q3q1Rj11
2336g5J86j64P0k47J18L0K20k97Q6j8J41m3k58K83N4o7M7l0j86J20J25o1k68J57
2360g7j92M00J57K2k95k37K33J83k83m2O8J18q4j55P2P9k12J8L44J36l96K06L0
2383I3p6Q5ol7j64J75k61K46q9J77j56l3k3K54p7j64J78L0o8j27N3l3K00k68J1
2408h0m3QL44j54m5J9O3r2j56Q7J7o8Q3k4o8Q0O0K8j23K9J99p5p0L6n9m4p6J39
2436A5j99J59j5M3J07j74J82j6m2K29m34J04J88j90K51j59M2m0m7O4k96J58L3
2459c7K49l86J59j02J33k12J39P5k27P5l6L43l47J78j29P5K17p4k23P9K05j6j33
$$ plain form
2482 5 -291 -158 -57 -184 196 37 144 71 247 46 -46 -9 -44 -26 137 -99 66 139 32 -203 -65 29 58
2505 58 -205 -186 101 223 91 -216 48 -110 59 222 166 -83 56 100 -79 -172 -73 5 -235 -42 -29 91 3
2528 3 -14 -126 6 12 -79 102 -7 -41 104 160 -41 165 -126 118 41 -29 148 -73 331 -10 -234 76 -135
2551 -135 -73 -73 -240 -168 -136 -101 277 104 7 -232 248 71 -202 212 -87 46 126 27 77 -52 -112 -103 28 -158
2575 -158 130 -135 259 309 -216 102 335 -143 -103 -127 -81 -124 69 -210 -161 -167 4 68 94 44 52 75 -33 -102 1
2600 1 -266 162 -28 160 90 -20 370 130 5 68 104 -108 43 -31 74 213 99 -95 -178 174 82 266 223
2623 223 61 -43 -3 -131 78 84 35 -119 -164 25 -91 -15 119 210 -72 55 -51 254 104 -17 -53 -130 103
2646 103 -74 36 51 -102 -42 157 -97 118 -65 32 -62 -150 -88 -201 -71 40 -35 -98 32 14 -228 45 109
$$ packed form
2482Ek96J33J01j27L80j59J07p3J76k01r2L7l5J8J63k36J65P3j07k35J38R4K9
2505E8k63J9K87J22j32l07K64j58J69J63n6k49J39M4j79r3R9P8k40J93J3J20q8
2528Cj7j12J32Or1J81j09l4J45N6k01K06k91K44p7p0J77k21M04l41k24L10k11
2551a35O2%j67P2L2L5L78j73r7k39M80j77k73M14k99J33Q0r9N0j29o0RJ31j86
2575a58K88k65L94N0n25L18K33m78M0k4M6m3J93k79M9oJ71O4K6n0QK3j08o9J03
2600Ak67M28j90J88p0j10L90k40j25O3L6k12J51p4J05J39j14j94q3L52r2J84m3
2623B23j62j04M0j28K09Om9j54m5J89j16P6J34R1k82J27j06L05j50j21l6p7K33
2646A03j77J10J5j53O0J99k54K15j83R7r4q8O2j13J30J11p5o3J30j8k42K73O4
$$ plain form
2669 109 -22 294 204 1 112 103 30 86 -7 54 331 198 -136 -65 248 -87 -31 84 -18 259 -109 -86 28
2692 28 -49 130 259 -66 152 -26 1 7 12 79 -137 126 212 -35 129 6 -362 -27 38 -119 -112 136 83 -194
2716 -194 96 36 -261 -44 -124 -178 74 -14 -23 156 111 2 -121 -43 -196 -228 -188 0 67 -197 -216 81 -110 -15
2740 -15 115 -162 87 -95 93 -163 -76 24 -59 130 99 -151 -24 -125 10 -91 104 -200 -151 -248 111 214
2762 214 -163 -60 -287 60 27 -105 226 63 27 -129 94 16 -44 -109 81 -18 231 -27 -24 -164 67 54 -19
2785 -19 -72 -101 273 268 -24 99 -103 -72 -126 58 -16 -206 -76 -121 35 -19 -98 71 63 -6 -249 -9 -124 -36 29
2810 29 236 136 23 215 78 -268 56 -94 -231 182 -13 -90 124 -89 84 -85 -101 41 2 234 -134
2831 -134 10 -136 -113 -303 54 49 137 34 -76 -106 -66 75 -241 2 -49 57 -6 -87 154 -11 -81 -50 77 -38
$$ packed form
2669A09j31L16r0k03J11rp3N6r3O1K77j33l34P1L13l35N6J15j02K77l68K3J14
2692B8p7J79J29l25K18j78K7ONO7k16K63Q6k47J64j23l68L35O5j57PK48n3k77
2716a94K90o0k97K17q0n4K52q8rJ79m5j09j23P8j53l2M0J88O7k64j9K97j91R5
2740a5J30k77K49j82J88k56Q7J00q3J89l1k50J27j01J35j01J95l04M9r7L59J03
2762B14l77J03k27L47l3j32L31j63l6j56K23p8o0o5J90r9K49k58Lj40K31j3p3
2785a9n3k9L74nk92J23k02L1n4J84p4j90J30m5J56n4p9J69qo9k43K40j15Q8O5
2810B9K07j00j13J92j37l46L24j50j37M13j95p7K14k13J73j69j6J42l9K32l68
2831a34J44j46K3j90L57nQ8j03j10l0M0J41l16K43n1J06o3q1K41j65p0L1J27j15
$$ plain form
2855 -38 24 -39 -21 47 160 -143 90 109 -103 -10 32 -372 -48 -121 -83 60 60 -150 -247 113 2 -182 -44 -41 -80
2880 -80 170 21 -146 30 -33 -46 -60 125 -56 -105 -58 341 91 -79 16 -5 95 -80 -19 -112 169 -307 -87
2903 -87 75 116 46 200 -136 -399 75 -4 149 45 24 -16 -74 87 -158 -96 203 -152 137 77 -170 86 -163
2926 -163 85 -5 77 -27 -49 45 24 295 -13 80 -100 -278 13 -20 93 144 -81 -23 -32 45 -47 -133 -190 185 76
2951 76 129 -211 -12 85 -115 70 -199 38 82 -67 79 100 19 149 -14 -169 19 -109 96 -57 -141 38
2973 38 35 151 -86 263 -91 148 112 -25 -92 28 -108 -94 122 38 85 67 199 189 3 29 289 -58 186 193
2997 193 -175 86 150 121 -51 -120 132 7 -41 30 -50 -60 33 -68 -172 85 332 -95 -71 179 -86 141 50
3020 50 6 -150 32 159 148 -147 -127 -118 17 -254 18 -57 -268 129 -202 75 -62 -6 -219 59 -144 -95 -49
$$ packed form
2855c8O2o3J8O8J13l03K33J9k12R3M2m04L24p3L8J43%k10r7L60j11j84J38Ll9
2880h0K50j49j67J76o3j3j4J85j81m9M7L99k50j70R5k1J00j75O1r3K81m76K20
2903h7J62M1p0J54l36k63M74p9J53j04k1m0n8J61k45O2K99l55K89o0k47K56k49
2926a63K48r0Q2j04k2R4k1K71l08R3j80j78K91l3J13N1k25N8rP7r2q6n7L75j09
2951G6N3l40J99R7k00J85k69K37M4j49J46K1q1J30j63j55J88j28K05j53q4J79
2973C8lJ16k37L49l54K39l6j37o7J20j36J4K16q4M7j8J32j0j86K6K60l47K44P
2997A93l68K61O4k9j72o9K52j25m8P1q0j0R3j01j04K57K47m27K4K50k65K27r1
3020E0m4j56J82J27j1k95K0RJ35k71K72p5k11L97l31K77j37N6k13K78k03M9M6
$$ plain form
3043 -49 197 -36 -9 -305 144 -35 -155 18 -96 202 -91 48 -99 -153 54 140 85 -136 -189 -124 280 280 49
3066 49 21 -69 125 -129 -224 79 -56 -29 -93 33 -96 -62 24 15 26 102 137 -112 86 -107 32 -48 -13 3 -115
3091 -115 76 128 87 -261 -87 73 -101 47 62 217 -84 -223 -45 -111 78 186 107 46 -177 71 24 -22 59
3114 59 34 114 216 -219 -132 -89 -11 -274 -60 97 30 -74 83 161 -97 107 227 -198 -59 -278 159 51 -66
3137 -66 -100 -399 46 -57 216 -47 258 205 -7 -42 224 -126 118 -92 44 -44 -91 126 -115 -49 -7 108 -205
3160 -205 21 -53 -142 55 -36 -10 257 -33 186 -226 77 -56 13 -172 -16 -51 17 -136 -74 124 -122 -31 -106
3183 -106 -8 113 42 69 -250 66 106 -343 -186 111 -9 127 -9 -166 -32 182 125 153 19 -53 118 -167
3205 -167 -102 -231 -129 -82 -196 69 -38 17 -168 81 131 -63 -246 70 162 -156 -36 72 133 -255 17 150
$$ packed form
3043d9K46k33K7k96M49j79j20J73j14K98k93J39j47n4K07Q6n5k21n3O5M04%k31
3066D9k8r0J94k54r5L03j35K7o4J26j29L4Q6rJ1P6L5k49J98j93J39q0L5J6j18
3091a15J91N2m1l48J74J60j74J48J5J55l01j39J78o6J89J08p9o1k23K48m7m6Q1
3114E9k5Q0J02m35Q7M3P8k63K14J57o7j04J57P8k58K04J20m25J39k19M37j08j17
3137f6l4k99M45j03K73k63L05n3k12l5K66l50K44k10J36q8m7K17k41O6M2J15l13
3160b05K26p4q9J97r1K6K67k90K19m12L03j33O9j85J56l5O8j53O2J98k46R1p5
3183a06R8J21p1K7l19L16M0m49J57K97j20J36j36j57J34K14n7K8j34p2J71k85
3205a67O5j29J02M7j14K65j07N5j85K49N0j94j83L16R2l18J20J08O1l88K72J33
$$ plain form
3227 150 48 -27 126 6 -106 -15 -89 102 205 -187 -141 -66 284 -145 5 38 -186 31 -247 94 9 70 -57
3250 -57 -183 -69 -219 31 -82 61 -184 46 -136 222 -157 139 -16 -232 88 12 152 -57 127 -72 -18
3271 -18 28 -162 37 86 -173 -165 -178 33 58 45 159 193 -83 -33 0 84 77 77 2 153 -374 51 89 -123 112 131
3297 131 -20 96 -10 96 1 -47 93 6 75 52 137 -41 -100 35 -183 -26 -140 124 -138 -105 38 -6 158
3320 158 -48 -44 176 76 114 73 -28 145 -103 73 226 -92 -17 63 -170 -14 10 22 97 -135 60 112 127 -33
3344 -33 39 -13 292 31 13 -90 33 -49 55 82 -167 -10 5 -207 119 -64 -156 89 84 -57 -25 -50 59 -92
3368 -92 114 -72 -350 70 -23 -97 24 -88 -119 38 21 -32 -155 -62 -175 -104 71 -58 169 -35 -2 -290 -198
3391 -198 -84 -218 33 -123 -235 -95 309 -60 -9 135 -291 -218 94 -63 142 162 283 -89 81 -167 -6
$$ packed form
3227A50j02p5J53j20j12R1p4J91J03l92M6P5L50m29J50L3k24K17k78L41q5O1j27
3250e7j26J14j50K50j13J43k45K30j82L58l79K96j55k16L20p6J40k09J84j99N4
3271a8M6j90J99M9k59Qj3K11K5j3J14L4k76N0L3Q4p%p5J51n27M25L8k12K35J9
3297A31j51J16j06J06r5m8J40q7O9k3Q5j78n9J35k18J57j14K64k62L3J43m4J64
3320A58k06MK20j00L8m1j01J73k48J76J53l18P5Q0k33J56K4J2P5k32J95N2J5j60
3344c3P2n2L05k61j8j03J23q2J04K7k49J57J5k12L26j83r2K45nj41L2k5J09j51
3368i2K06j86k78M20r3p4J21j12l1J57j7n3j23R3j13P1J75j29K27k04L3k88R2
3391a98J14j34K51j56j12J40M04l69N1J44m26P3L12j57K05K0J21l72J70k48J61
$$ plain form
3412 -6 78 -122 -68 -39 -21 -187 -108 -75 88 123 92 -135 220 -96 37 -154 303 -163 47 21 -12 -72 -48 75 -23
3437 -23 -45 -87 -47 -43 52 37 -112 320 202 -263 -170 -231 148 62 190 120 -46 66 -144 -169 57 16 135 -4 17
3462 17 244 51 -61 364 32 -98 173 -121 -135 90 -100 37 117 91 85 -38 208 135 103 -111 47 -114 221
3485 221 125 -51 135 -123 64 34 203 -49 7 246 110 154 -155 50 -38 157 -104 31 -1 -146 32 77
3507 77 -45 158 -63 18 47 -10 -162 155 -17 -48 -156 131 -191 -69 202 -256 -18 -58 -96 -66 95 167 49
3530 49 132 -52 51 82 139 -158 -178 -163 -264 118 -2 -157 3 -260 -159 -23 -128 128 65 -42 58 48 -18
3553 -18 137 33 86 47 163 -59 159 104 -215 -68 42 -28 -141 -79 102 20 -67 -71 122 138 93 -118 35 250
3577 250 -45 -243 186 -91 -136 -133 -281 89 -128 -72 -160 -263 -163 141 -24 -64 -119 12 -204 -81 72 6 76
$$ packed form
3412fQ4k00N4K9J8j66P9L3J63L5l1k27L55l16J33j91M57m66K10k6l3o0K4J23r8
3437b3k2m2M0MR5j5j49M32j18m65R3o1L79q6J28p0j66J12k10k5K26m1J19j39K1
3462A7K27j93j12M25l32j30K71k94j4K25j90J37Q0k6oj23K46p3l2k14J58j61L35
3485B21r6j76J86k58J87l0J69k52N6K39j36M4l09K05q8J95k61J35l2j45J78M5
3507G7j22K03k21Q1K9n7j52L17j72l1j08K87l22J22K71m58K38m0l8L0J61P2j18
3530D9Q3j84J03L1N7k97k0J5j01L82j20j55J60k63J01J36j05K56o3j07J00j0o6
3553a8J55j04N3l9J16k22K18n5l19J47J10p0j13O2J81q2q7mJ93J6m5k11J53K15
3577B50k95j98M29k77m5Lj48L70k17N6q8j03J00L04j65m0n5J31k16J23J53o6P0
$$ plain form
3600 76 -32 42 62 -70 -150 45 54 162 -82 -50 29 -61 96 119 -190 91 -148 -40 -1 164 169 24 279 -2
3624 -2 147 184 122 -213 60 5 -163 -25 88 290 94 -125 -171 -179 158 193 -16 41 38 111 63 176 137 55 -156
3649 -156 326 -99 -200 64 123 -159 -93 46 127 28 -73 40 54 132 33 -18 24 -15 67 71 -33 -160 -170 -347 -222
3674 -222 31 233 -177 -34 -91 -10 -180 119 2 -28 -105 50 82 70 -55 -31 67 113 -164 327 98 -120 -275
3697 -275 240 404 -188 -126 -79 145 -227 120 56 -106 -61 178 149 -55 67 -117 2 -134 -88 107 29 58 18
3720 18 -23 -52 -147 125 -119 -278 289 10 45 48 105 50 -204 -48 -109 40 98 48 193 98 31 109 35 54 -26 -106
3746 -106 152 -10 -136 85 -163 98 -61 -44 -5 85 -47 81 226 169 123 -131 -103 42 53 154 -187 -127 177
3769 177 9 71 -84 44 -74 -260 -36 216 196 50 -126 151 -7 90 1 113 -34 114 212 107 -32 -218
$$ packed form
3600G6j08P4K0j32q0J95RJ08k44L2P9r0J57K3l09K81k39J08L9J65Nj45K55k81
3624bJ49L7o2l35K73n5j68J38J13K02j96k19m6qL37L5k09N7lP3m8J13l9q2k11
3649a56M82m25j01K64N9k82O6J39Q1r9j01J13J4P8r9n1M2l9Q2Mj04j27j0j77J25
3674b22K53K02m10J43n7Q1j70K99j17l0p7J55L2j2j25K4R8M6k77M91k29k18j55
3697b75N15J64n92O2M7K24l72L47o4j62M5K39k9k04J22j84J19j36M6J95p8K9m0
3720A8m1k9r5K72k44j59N67k79L5LN7n5k54J56o1J49N8n0J45r5o7P8p4J9q0q0
3746a06K58j62j26K21k48K61j59J7L9R0j32J28J45n7m6k54K8J45J1J01l41O0L04
3769A77j68O2j55J28j18j86K24K52k0j46j76K77j58R7q9J12j47J48R8j05j39j86
$$ plain form
3791 -218 -193 -76 -7 -96 24 37 93 -90 -17 -129 195 -52 52 47 -66 -75 -225 -133 -95 -19 -178 -216 230 -10 31
3816 31 210 89 372 -81 21 47 214 -118 199 2 -67 122 71 -200 41 105 101 76 48 205 -84 74 -132
3839 -132 19 -74 101 27 82 90 149 9 -91 -107 -139 -16 -56 -85 -8 -104 92 141 -101 -111 62 42 -109 -111 9 -76
3865 -76 -133 -235 59 126 22 254 -4 64 -189 113 31 117 130 -110 -124 -213 -152 1 70 103 56 21 125 -128 172
3890 172 13 -78 95 168 -92 -59 177 -180 65 402 80 -225 25 -32 51 -7 86 -10 -34 31 -192 -289 -63 -188
3914 -188 155 64 -30 -91 72 -97 45 126 183 154 45 156 40 -18 -104 -196 -176 185 -73 -253 287 -43 -160
3937 -160 55 138 350 -132 -99 50 71 -110 152 86 -131 -95 29 0 6 -112 -7 112 -96 -19 -244 -9 -91
3960 -91 135 -147 116 108 1 185 -59 125 127 -14 3 10 98 291 237 -245 81 -59 -71 -140 259 195 -317 -308 -8
$$ packed form
3791b18K5J17O9q9J20J3N6j83P3j12L24k47J04nj13rj50R2L8P6j59l8M46k40M1
3816C1J79j21K83m53J02K6J67l32L17j97o9J89n1k71K41O4mk5k8J57k89J58k06
3839a32J51r3J75p4N5QN9j40j00j6l2J23m0k9P7r6J96M9k42j0J73k0j51kJ20q5
3865g6n7j02K94O7j04K32k58O8k53L02q2Q6J3k40j4q9O1J53O9L3m7l5J04k53L00
3890A72j59r1J73P3k60L3K36l57K45L37l22l05K50n7Q3n8R3r6k4O5k23r7K26j25
3914a88L43r1r4o1J63j69J42Q1N7k9j09J11j16n8q6r2K0L61k58j80N40l30j17
3937a60K15Q3K12m82L3J49K1j81K62o6k17L6J24k9Oj18J05J19k08P7k25K35q2
3960i1K26k82K63qj07J84k44J84Kj41J7PQ8J93n4m82L26j40j2o9L99o4n12RL00
$$ plain form
3985 -8 -149 71 57 -170 -159 -50 235 82 132 -106 -190 101 -28 9 254 -101 191 53 -7 193 182 138 -111
4008 -111 26 59 -26 9 101 -107 128 134 -184 -122 -106 70 63 161 -136 124 46 90 -35 131 -115 -168 -20 -186 55
4033 55 11 7 146 -107 43 -216 67 100 15 -20 -167 98 28 174 -45 94 117 -57 -24 152 -158 9 43 92
4057 92 175 -16 -34 137 0 -169 82 -1 -247 -29 -141 -114 -98 128 240 126 86 -97 29 35 71 318 128
4080 128 -12 -165 81 3 219 -18 -178 66 65 -204 -155 169 -65 -106 -114 -12 175 43 17 27 48 104 161 163 96
4105 96 125 46 -139 -112 111 8 -203 -14 -193 30 -42 -51 134 -32 -26 19 -41 12 -122 -78 13 116 216 90 -58
4130 -58 319 -172 -38 35 -4 -228 -156 -72 34 49 -90 3 157 39 -345 38 110 -259 -69 185 -74 19 -43
4153 -43 -160 39 -179 21 111 -130 156 -85 -47 -46 -57 -145 80 -153 -114 -181 -173 281 89 -139 -95 191 126 36 107
$$ packed form
3985hj41K20j4k27J1J09K85j53N0k38q4K91j29L7K45l55K92j38o0K00j1m4k49
4008a11J37L3q5L5R2k08K35Ol18O2J6J76pR8k97K60p8M4j25J66k46n3J48j66K41
4033E5m4mJ39k53J50k59K83L3q5l5j47K65p0J46k19J39K3j74L3J76l10J67L4M9
4057I2Q3j91j8J71j37j69K51q3k46K18j12K7J6K26J12j14m0j83J26OL6K47j90
4080A28j40j53K46p8K16k37j60K44jk69M9L24k34m1qJ02J87j32k6J0K1N6N7Ko7
4105I6K9p9j85K7K23j03k11J89j79K23p2rJ85j66OM5o0N3j34M4R1J03J00j26j48
4130e8L77m91J34P3l9k24P2Q4J06J5j39R3J54j18l84L83P2l69J90K54k59R3o2
4153d3j17J99k18K00R0k41K86k41L8Jj1q8K25k33L9o7QM54j92k28M4K86o5r0P1
$$ plain form
4178 107 120 199 262 -155 -35 -117 144 -4 62 -165 1 -210 84 30 43 75 35 -17 68 177 80 -27 -273 50
4202 50 -284 -20 -107 6 29 -40 -100 269 -92 53 151 45 -111 -165 -276 145 -208 37 21 94 58 126 -17 -41
4226 -41 -124 -72 -316 -192 128 -33 -93 -121 152 -164 87 -185 120 123 -51 -23 27 -164 65 -96 259 60 -137
4249 -137 67 -84 -39 -164 -81 62 -16 25 -172 194 55 59 90 -140 -127 81 215 58 -82 -164 152 -181 46
4272 46 -50 -150 140 249 44 104 -92 118 14 69 -70 55 -240 -85 90 79 146 72 3 -130 199 7 74
4295 74 -116 208 -41 -111 -109 89 243 303 129 78 43 155 -209 -132 157 -45 77 89 -69 89 16 22 11 156
4319 156 101 -24 -58 -32 -90 -226 73 -361 22 136 -76 -93 64 -327 -93 197 -128 73 24 106 126 -21 11
4342 11 -6 -154 -246 36 58 -45 177 29 217 -103 329 69 -235 249 -59 -55 121 132 8 253 -15 53 141
$$ packed form
4178A07J3P9O3m17J20q2K61j48O6k27J66k11K94n4J3L2m0n2Q5J09r7j07k46L23
4202E0l34K64q7J13K3o9o0L69l61J45R8j06j56n4j11M21l53K45j6P3l6O8j43k4
4226d1q3N2k44J24L20j61o0k8K73l16K51k72L05Lj74K8N0j91K29j61L55j99j97
4249a37K04j51M5j25Q3J43p8M1j97L66j39ML1k30J3K08J34j57j40q2L16l33K27
4272D6r6j00K90J09k05O0j96K10j04N5j39J25k95J55J75j1O7p4o9j33L29j92O7
4295G4j90L24k49p0KJ98J54O0j74n1l5J12l64P7K89k02J22J2j58J58p3Oj1J45
4319A56n5j25l4K6n8j36K99m34L83J14k12j7J57l91K34K90l25K01m9Q2K0j47L2
4342A1j7j48r2K82K2j03K22j48J88l20M32k60l04M84l08MJ76J1j24K45k68O8Q8
$$ plain form
4365 141 201 -143 144 91 42 -194 -50 3 -29 -34 -142 22 -115 123 210 80 178 -81 26 -189 -145 -66 -108 204
4389 204 164 -174 2 -217 16 76 -175 -161 -291 -85 98 226 33 -87 -172 -75 82 41 37 195 -141 -91 81
4412 81 58 173 -118 148 30 -140 -208 130 27 121 -235 -65 185 -179 23 -56 -214 -35 53 73 -131 255
4434 255 -309 -182 -151 -22 -80 142 95 124 -113 -29 -69 132 -236 97 -328 -22 132 -76 230 6 130 -57
4456 -57 154 -28 -37 74 9 -181 -107 59 233 152 44 19 53 3 -156 -148 82 -35 -111 -60 -327 61 20 36 -76
4481 -76 199 71 -23 69 -19 -34 64 -64 74 131 -20 -54 489 23 42 90 -148 -165 -75 -239 59 -185 92 70
4505 70 -84 -85 -96 165 -55 -42 -74 356 197 162 -36 -23 -118 -58 104 66 -24 2 76 161 -169 -37 19 80 72 -302
4531 -302 79 -58 -27 -1 -93 -275 -83 94 -136 -50 -64 78 -98 -48 -163 -26 -137 -32 -180 35 -12 140
$$ packed form
4365A41O0l44K87n3m9k36J44N3l2nj08J64j37K38Q7j30R8k59J07k15M4P9m2L12
4389B04m0l38J76k19K33O0k51J4j30K06J83J28j93j20q5R7J57m1mJ58l36N0J72
4412H1k3J15k91K66j18j70o8L38j03R4l56J70K50l64K02p9j58J79Q8K0k04L86
4434B55n64J27L1J29n8K22m7K9k37Q4m0K01l68L33m25L06J54k08L06k24J24j87
4456e7K11j82rJ11o5j90P4J66J74q1j08k5L4n0j59QK30j17p6N1k67L88m1J6j12
4481g6K75j28r4R2q8j5R8j28J38N7j51l4N43m66J9M8k38j7R0j64K98k44K77k2
4505G0j54jj1K61k20J3l2M30j59l5j98J3r5O0J62l8r0K6P4Q5l30J32N6O1ql74
4531c02L81j37L1K6r2j82J92J77k30Q6j4J42j76N0j15J37j11J05j48K15m7J52
$$ plain form
4553 140 13 -121 -225 140 349 18 -95 71 -297 -315 184 -73 -120 191 6 -20 27 -24 120 -33 -204 93
4575 93 -6 19 -65 166 153 89 -172 91 -216 -59 -43 -135 -205 231 -94 28 273 -48 217 95 48 -252 74
4598 74 -153 -102 82 8 -65 62 -177 -112 106 -127 -210 -26 -44 43 -74 -39 -192 120 242 -145 79 121 -6
4621 -6 -162 -131 47 -112 -59 1 -32 -174 110 120 -132 100 -187 53 -66 -10 -287 78 -51 -42 16 -126 -72 121
4645 121 8 -49 80 48 -31 -13 131 102 -26 -94 -83 23 -158 -136 128 -128 155 -76 -29 72 346 -73 -165
4668 -165 -3 -44 -155 106 82 -110 -61 187 149 -70 100 -46 -1 -12 79 152 8 272 -9 15 -234 -124 -60
4691 -60 51 -29 74 -4 6 -7 195 43 -16 -5 -117 59 46 -27 158 185 132 129 145 -12 -128 -48 194 -37 -91
4716 -91 37 -50 126 36 -41 -535 64 -42 -142 -28 -45 46 267 28 76 30 -97 -289 -3 -101 -102 4 32 53
$$ packed form
4553A40j27j34j04L65K09l31j13J66l68j8M99k57m7L11j85k6M7n1J44j53j71K97
4575I3r9K5q4K31j3o4k61K63l07J57J6r2p0M36l25J22K45l21K65j22m7l00L26
4598G4k27N1J84p4p3J27k39O5K18k33q3J84j8Q7j17L5j53L12J22l87K24M2j27
4621fj56L1J78j59N3O0l3j42K84J0k52K32k87K40j19N6k77L65j29RN8j42N4J93
4645A21j13n7J29l2p9J8J44k9j28o8J1J06j81K2K64k56K83k31M7J01K74m19r2
4668a65J62m1j11K61k4j92M9K48l8k19J70j46M5j1R1P3j44K64k81K4k49J10O4
4691f0J11q0J03p8J0j3K02j52n9J1j12J76j3p3J85K7n3lJ6j57j16Q0K42k31n4
4716i1J28q7J76r0p7m94N99j06j00J14j7R1K21k39M8m6j27j92K86r8jJ06K8K1
$$ plain form
4740 53 -66 99 118 -25 124 -93 295 44 162 94 -11 10 3 -12 9 2 170 59 1 -52 -3 -43 130 131 -179
4765 -179 -115 10 97 -156 52 78 58 -141 -52 -17 -245 -115 -163 102 -65 -66 3 89 -14 -135 -201 -12 128 24
4789 24 117 13 291 110 47 -194 11 21 249 -21 -78 -116 128 208 -24 -23 26 22 110 -62 172 -36 -31 -59 14 -234
4815 -234 13 83 -265 210 59 22 87 -40 44 -254 -14 -96 267 -73 79 222 -95 -109 -81 139 -197 140
4837 140 -221 -53 -43 104 -79 97 -290 -24 80 -79 -135 -67 8 -65 123 112 -17 -116 28 -142 52 181
4859 181 -8 16 97 32 -135 125 -124 -84 172 -113 -180 -188 -19 127 -192 133 -144 159 -207 -279 -117 65 70
4882 70 0 -143 -157 121 -98 -84 -206 89 136 46 -7 -73 -40 -107 -57 -307 -43 202 190 -51 150 -93 -83 -61 -39
4907 -39 -105 -218 212 141 14 -189 301 -163 -50 -6 -40 6 44 155 194 -183 -6 -39 -25 94 -158 -84 108 -190
$$ packed form
4740E3j19J65J9j43J49k17L88k51J18o8j05K1pj5K1pJ68j11n8n3M9m0J73Jl10
4765a79O4J25Q7k53K08K6k0j99Q9L5k28J30m8K65j67jO9Q6j03j21o6J89J40j04
4789B4R3j04K78j81o3k41K05J0K28k70n7l8K44Q0k32JM9mQ8j72K34k08Nk8P3k48
4815b34K47P0l48M75j51l7O5j27Q4k98K40q2L63l40J52J43l17j4K8K20l36L37
4837A40l61J68J0J47j83J76l87K66J04j59n6O8P5p3J88j1j29r9J44j70J94J29
4859A81j89K4Q1o5j67K60k49M0K56k85o7qJ69J46l19L25k77L03l66p2J62J82N
4882G0p0j43j4K78k19J4j22K95M7r0n3o6L3o7N0k50K64K45j2k41K01k43J0K2K2
4907c9o6j13M30p1j27k03M90m64J13M4l4M6L8J11L9l77J77l3J4J19k52P4J92k98
$$ plain form
4931 -190 -27 11 -1 39 -192 45 70 75 34 99 125 -36 -149 0 9 16 95 -11 43 14 80 66 -84 133 277 180
4957 180 -38 244 -118 3 -101 -185 139 -141 193 -35 -54 36 260 -146 -37 16 21 -56 37 280 -159 184 36
4980 36 115 -37 43 198 192 190 -35 132 -56 63 -28 -12 -60 -132 -54 -28 115 61 -90 -132 78 79 -81 -210 -7 -246
5006 -246 194 -97 -56 -174 -22 144 18 103 99 -29 -100 -35 -224 -137 311 220 -112 -51 128 52 45 119 -121 63
5030 63 -44 235 -159 -279 -103 -196 219 46 -73 218 13 8 -139 278 106 127 -134 -165 -89 -29 7 89 115 -53
5054 -53 34 26 78 98 203 -29 -176 -142 -77 -10 -111 -59 46 -139 80 129 -107 161 35 57 10 69 224 -42 -254
5079 -254 39 215 107 294 -36 254 137 -151 128 -144 53 -159 -30 156 -23 -11 106 44 -75 122 22
5100 22 292 -18 -128 -203 -98 169 84 127 -75 -8 -8 17 80 22 44 -62 161 21 230 32 -68 198 -137 -24
$$ packed form
4931a90J63L8j2M0k31K37K5Nm1O5K6j61j13J49RPP9j06N4k9O6j4j50K17J44r7
4957A80k18K82l62J21j04q4L24k80L34k28j9R0K24m06J09N3Np7R3K43m39L43j48
4980C6P9j52Q0J55okk25J67j88J19r1J6m8p2P8K6J43n4j51m2K10Jj60j29K03k39
5006b46M40k91M1j18J52J66j26Q5mj28p1O5j89Q7M48r1l32O1J79p6pP4k40J84
5030F3j07K79l94j20J76r3M15j73j19K91k05nj47M17j72K1k61l1P6O0L6Q2K6j68
5054e3Q7qN2K0J05k32j47L4O5O7j01N2J05j85K19M9k36K68j26K2m7N9J55k66k12
5079b54K93J76j08J87l30K90j17k88K79k72J97k12J29J86j79J2J17o2j19J97j00
5100B2K70l10j10p5J05K67q5M3k02O7%K5O3n8K2j06K23j40K09j98j00K66l35J13
$$ plain form
5124 -24 -69 54 103 298 146 194 71 -51 10 -145 -277 -46 -92 -153 3 57 -98 -191 99 -36 79 -30 12
5147 12 66 155 -135 39 43 173 -95 -68 28 -58 -214 -3 -165 -80 -15 -68 15 0 -8 -95 -149 150 95 195 -74 11
5173 11 -32 76 93 118 124 -83 -24 -270 -192 -10 -13 -56 -24 186 -217 15 1 114 -50 -85 208 -38 17 -154 -50
5198 -50 94 -83 33 -104 85 71 -86 -186 -45 194 -78 -87 -155 -105 -219 194 59 -102 -23 91 56 -97 108
5221 108 -28 -153 133 -34 -23 -31 3 69 -160 79 -118 -176 100 100 134 -137 72 -58 70 166 -258 -164 -82 247
5245 247 64 3 6 203 193 61 35 15 19 -63 149 132 -120 125 241 -116 -149 218 -47 20 61 28 -215 -47 -111
5270 -111 -38 39 246 202 58 226 41 -111 6 -79 -41 -133 -140 -106 -107 21 52 15 28 -115 -140 -164 62 132 -67 -58
5296 -58 -6 -88 109 -81 -32 -99 -120 34 29 -246 -53 25 121 25 178 -100 11 -83 116 -26 -195 -163 -97 -74 -144
$$ packed form
5124b4m5J23M9J95j52M8j23j22O1j55j32K31m6o1J56N4j55r3K90j35J15j09M2
5147A2N4Q9k90J74MJ30k68K7R6q6j56K11j62Q5O5n3Q3j5qq7n4K99n5J00k69Q5
5173A1m3J08J7K5Ok07N9k46P8J82lm3L2K10m03K32j4J13j64l5K93k46N5j71J04
5198e0J44j77J16j37J89j4j57j00J41K39k72ro8N0j14M13j35j61P9J14l5j53K05
5221A08j36j25K86j67J1qL4O6k29K39j97n8K76%L4k71K09j30J28R6m24R4Q2L29
5245B47j83o1LJ97j0j32k6k0Mq2K12j7k52K45J16l57l3L67k65O7M1l3k43J68o4
5270a11P3P7K07m4j44J68j85j52J17q5L8r2pL4jJ28L1l7J3j43k5k4K26P0j99R
5296e8N2q2J97j90M9o7k1J54nk75J93P8R6r6J53k78J11r4J99j42j69L2O6K3p0
$$ plain form
5321 -144 -116 -60 -44 -192 -13 147 139 -89 -92 94 191 -97 -63 -16 55 123 -121 -71 -51 77 150 -82 -169 162 -155
5346 -155 -165 41 -149 -100 129 -301 -142 -168 -71 24 -131 164 -31 220 189 -3 266 77 -53 177 -147 -31
5368 -31 33 78 -65 -249 -18 117 -29 30 -68 52 98 138 -119 22 8 52 -47 51 124 -193 12 -13 -51 -229 216
5393 216 94 -155 93 -113 48 -68 -30 174 -85 -84 118 154 10 -73 -8 -170 -199 -94 -259 46 14 206 164
5416 164 -80 78 -142 126 142 -146 -101 -37 0 250 143 96 77 138 31 31 21 86 -84 176 -48 49 26 25 -57
5441 -57 -145 -240 -317 -100 108 -194 -144 -23 -198 -113 40 110 46 192 -37 -25 -17 223 33 -23 119 149 -13 232
5465 232 256 275 131 -144 -15 62 -64 203 214 -94 27 -72 117 -69 -139 -28 -116 -9 17 23 -166 -31 -142
5488 -142 106 -34 -105 94 -54 76 -80 -53 -10 -39 90 105 -90 66 -44 86 30 -121 -111 -96 170 -114 11
$$ packed form
5321a44K8N6J6j48J79J60qk28lJ86R7k88L4M7P1O8k44N0K0J28P3k32q7L31l17
5346a55j0K06j90M9K29m30J59k6R7R5j55K95j95K51l1j92K69j89j30K30l24J16
5368c1O4M5j43j84K31J35j46N9r8J20M6M0k57J41j4M4r9R8P3l17K05k5l8j78M45
5393B16j22k49K48k06J61j16L8K04k59JK02L6j44q3O5j62k9J05j65L05l2J92m2
5416A64k44J58k20K68J6k88M5O4L7K50j07m7j9O1j07%j0O5j70K60k24R7k3jq2
5441e7q8r5p7K17K08l02N0J21j75Q5J53P0o4J46k29J2QK40j90n6J42L0j62K45
5465B32K4J9j44k75J29P7j26K67J1l08J21r9J89j86p0J11q8J07K6Oj89J35j11
5488a42K48j40p1J99j48J30j56K7M3k9J29J5j95J56j10J30n6j51J0J5K66k84J25
$$ plain form
5511 11 -51 105 -61 151 179 2 51 -77 5 -70 -42 -86 19 -115 109 -117 -27 45 35 -216 154 -159 139 -100
5535 -100 75 -63 -113 45 112 -221 66 234 -170 143 75 150 19 -131 63 -75 -74 6 0 -156 42 -9 -116
5558 -116 215 45 95 158 27 37 -167 -6 -76 -72 48 -56 98 24 -76 95 153 219 -29 25 -50 -71 104 -41
5582 -41 9 53 119 196 -118 176 -17 -279 65 213 53 -127 78 -6 -208 -3 -306 183 -35 -71 -146 165 -140
5605 -140 56 -193 -181 189 108 -363 66 304 192 149 -12 -44 -103 -11 10 304 -18 -2 62 -67 30 -394 -89
5628 -89 -31 -42 -36 7 34 -362 -137 91 3 -123 77 125 58 -1 225 98 -54 -41 204 -36 21 -84 -3 -25 -59
5653 -59 -53 -57 -247 -203 28 -147 -114 -27 -27 -35 -24 14 56 126 300 -105 20 -194 50 225 109 -54 2 -140 -63 -156
5679 -156 -4 -133 112 65 -78 126 117 -42 168 83 -97 -51 93 205 13 74 -66 58 -88 228 -48 136
$$ packed form
5511A1o2J56j66K12K8j77M9j28Q2p5K8m4J05j34K24k26R0P2j0k51L70l13K98k39
5535a00J75j38n0J58O7l33K87J68m04L13o8P5j31j50J94j38JQ0oj56J98n1j07
5558a16L31j70N0O3j31J0k04J61p0MJ20j04J54p4j00J71N8O6k48N4p5k1J75j45
5582d1N0M4O6P7l14K94j93k62L44J48j60j80K05q4k02K05l03M89k18l6p5L11l05
5605a40J96k49J2L70q1m71M29K38j12m3j61l2n9R2K1K94l22J6O4j29R7m24L05
5628h9N8j1OM3K7l96K25K28q8j26K00M8o7n9K26j27j52J3K45k40N7j05Q1k2l4
5653e9Omj90M4K31j75L3Q7%qJ1L8M2P0J74m05J25k14K44J75j16j63N6j42P7r3
5679a56J52j29K45m7j43K04rj59K10q5j80M6J44J12j92O1j40J24j46L16k76J84
$$ plain form
5701 136 -64 -140 -181 14 -135 125 -84 -70 -5 47 -81 130 -160 27 171 -63 95 -71 234 -126 -197 5
5723 5 -38 178 145 -50 73 -6 -25 39 -112 156 182 -82 9 19 -3 116 -114 -115 -40 -146 -94 -104 157 -110 -278
5748 -278 171 -74 -134 146 1 14 -105 -24 -135 29 -56 196 -63 87 -61 -161 72 -12 -142 111 -80 -37
5770 -37 155 -6 -132 -68 -171 105 -1 143 184 -30 -60 -14 60 -154 125 -112 77 -189 147 -220 -46 150
5792 150 100 235 -112 128 109 -162 -11 38 108 148 -10 6 203 249 -187 -122 34 -165 183 24 27 -61 -103 -54
5816 -54 330 109 -93 180 82 -92 -192 -30 122 -94 -38 -31 55 -129 24 -92 -44 117 -221 -105 -72 -95 43
5839 43 29 -18 -122 2 -268 -27 -7 115 132 302 -20 226 60 -46 -121 226 39 180 152 -201 -44 -40 229
5862 229 167 100 76 -22 -179 -79 -101 -39 95 181 -154 -18 -59 26 72 -107 117 -67 82 73 162 -399 83 -96
$$ packed form
5701A36k00p6m1J95j49K60k09J4O5N2j28K11k90J87J44k34J58j66L05l60p1K02
5723Em3K16l3j95J23p9j9O4j51K68K6k64R1J0k2J19k30jP5j06N2j0K61k67j68
5748b78M49k45o0K80j45J3j19Q1j11J64q5K52k59J50j48j00K33q4j30K53j91M3
5770c7J92j61j26O4j03K76j06J44M1k14l0M6P4k14K79k37J89k66L36l67J74J96
5792A50n0J35l47K40j9k71J51M9P0M0j58J6J97M6m36O5J56j99L48j59Lq8m2M9
5816e4L84k21k02K73r8j74j00J62J52k16N6PQ6j84J53j16M8J61l38J16L3k3J38
5839D3j4m7j04J24k70K41K0J22J7J70l22K46j66j06p5L47j87J41k8l53J57MK69
5862B29o2o7k4r8j57J00k2O2J34Q6l35J36m1Q5M6j79K24j84J49rQ9n61M82j79
$$ plain form
5886 -96 182 -113 309 44 -82 207 -51 -107 212 143 -108 -261 -83 -31 -49 2 168 -3 171 -235 153 11
5908 11 187 96 44 69 4 -217 -129 80 121 -155 59 193 80 -9 94 -56 -66 -3 -32 52 23 82 -122 -32 -197
5933 -197 171 15 416 -151 189 183 98 195 209 122 -20 24 -201 231 58 -7 -140 146 48 -125 232 163 -291
5956 -291 255 -170 -67 167 -9 -116 52 -97 32 94 244 258 -120 220 -106 -54 12 206 77 46 344 16
5978 16 -25 -301 -111 12 157 139 -18 130 33 119 -169 182 -246 -9 11 -216 -129 46 -94 220 -38 -66 288
6001 288 15 -2 -118 28 -369 -6 66 19 62 -160 -238 136 -63 -162 181 -147 211 233 38 -23 -199 12 -63
6024 -63 -17 -152 -247 127 -240 58 -24 100 -183 63 98 40 154 157 -98 -8 -88 -26 -100 -153 -153 97 226 69 50
6049 50 -157 164 43 -313 137 -180 -195 32 206 -101 -362 76 -116 120 78 -180 -149 40 -128 -17 234
$$ packed form
5886i6K78k95M22k65j26K89k58n6L19o9k51j53J78N2j8N1J66j71J74m06L88j42
5908A1J76r1n2K5o5k21Q8K09M1k76K14J34j13q9J03j50j0O3k9Q4k9N9k04R0j65
5933a97L68j56M01n67L40oq5R7J4q7j42M4k25M32j73o5j33K86r8j73L57o9m54
5956b91N46m25J03K34j76j07J68j49J29O2J50J4l78L40l26N2O6J94j29l1K98l28
5978A6m1k76J90J23J45j8j57J48r7Q6k88L51m28K37K0k27Q7J75j40L14k58k8L54
6001B88k73j7j16J46l97L63P2m7M3k22p8L74j99r9L43l28L58K2j95o1j76K11p5
6024f3M6j35r5L74l67K98q2J24k83K46L5n8J14Lk55R0q0O2p4n3%K50J29j57j9
6049E0k07L21j21l56M50l17j5K27J74l07k61M38j92K36m2k58L1J89j68J11K51
$$ plain form
6070 234 22 34 -45 46 100 -58 -67 60 -147 60 -14 -17 -35 -81 -270 -140 -79 -158 2 76 157 -5 -202 -175 -215 17
6096 17 -19 -142 8 113 -89 158 -150 11 -131 3 -217 40 169 -53 31 170 -103 -96 -17 -154 46 108
6118 108 -38 -148 -17 156 74 -215 99 353 -95 -124 -159 77 -225 62 113 52 120 188 114 108 45 116 -92 25
6142 25 -104 160 94 220 185 -213 16 334 67 79 314 261 60 60 -212 125 93 -35 -97 -174 -162 -220 -214 -32 -42
6167 -42 -68 118 89 47 -191 -4 61 -45 95 -100 80 -29 42 162 78 -62 89 -18 220 163 81 -10 -113
6190 -113 -89 -103 -29 254 -112 23 160 -75 6 -105 80 -20 239 -216 82 116 -147 -71 125 133 47 129 24
6213 24 349 22 -177 -174 90 95 -64 53 9 -27 217 -16 81 -33 -235 -28 -33 140 31 -200 -118 -58 71 -29
6237 -29 -10 -206 199 57 -109 53 -169 -32 -46 420 71 -11 59 -204 113 -6 -199 143 -33 47 -103 136
$$ packed form
6070B34k12J2p9R1N4j58rJ27k07K07p4lj8m6j89J30O1p9J60P4Q1j62j97K7m0K32
6096A7l6j23J50J05k02K47l08J61j42J34k20K57J29k22Q4J39k73PP9j37K00O2
6118A08j46j10J31J73q2k89L14K54m48k9l5K36l02K87N1o1O8O8p4oo3P1k08J17
6142B5j29K64o6J26l5l98K29L18k67J2K35n3k01%k72L37l2j28o2p7J2n8OJ82j0
6167d2k6J86k9m2k38J87O5j06J40j95J80j09P1J20q4j40J51j07K38n7q2r1j03
6190a13K4j4P4K83l66J35J37k35Q1j11J85j00K59m55K98L4k63P6J96Qq6Q2j05
6213B4L25l27j99LK64Nj59J17m4l6K44k33R7j14k02K07nJ73j09k31Q2O0J29j00
6237b9J9j96M05j42j66J62k22J37j4M66l49q2P0k63L17j19j93L42j76Q0j50K39
$$ plain form
6259 136 38 38 -14 -111 175 -55 191 153 121 -123 99 285 206 121 -331 -223 -232 81 -13 19 91 109 -68 4 181
6284 181 -62 -103 -28 4 30 150 -79 228 -104 123 198 -106 65 55 -24 4 167 164 48 105 218 -2 14 -201
6308 -201 14 130 75 143 -35 -44 -152 -15 150 -74 -24 -83 -239 -216 -108 -3 106 37 -346 -60 -35 -204 27
6331 27 14 118 118 81 25 76 118 -34 -183 -46 130 126 -104 -105 60 37 40 -96 10 178 -120 11 96 16 177 16
6357 16 -76 -24 -48 -24 -53 99 176 55 -10 -62 -157 -2 -93 72 141 -303 16 -5 -2 149 34 63 -26 151 -121 -234
6383 -234 2 -110 12 82 -29 -132 41 -17 226 103 -76 -5 65 -70 -17 134 -84 196 -7 -59 191 -22
6405 -22 60 -53 -27 120 259 24 7 28 154 16 118 121 178 29 197 182 -153 16 140 -19 -115 -38 58 109
6429 109 103 -36 -32 -44 115 -35 227 -90 -46 165 76 -70 87 -73 9 98 41 -176 73 -18 -43 134 -73 -106
$$ packed form
6259A36r8%n2r7K86k30K46l8l2k44K22J86p9q5m52J08rL13r4L2P2J8j77P2J77
6284A81k43m1P5L2K6J20k29L07l32K27P5l04J71j0p9K8J63lj16N7J13k20J6k15
6308b01K15J16n5O8j78rj08J37J65k24N0n9j56K3J08J05J09o9l83K86K5j69K31
6331B7j3J04%l7n6N1M2j52j49J37J76mk30jJ65k3Lj36J06J68k98J31Q5q0J61j61
6357A6r2N2k4K4k9J52P7j21o5n2r5J55r1J65O9m44L19k1LJ51j15K9q9J77k72j13
6383b34K36j12J22P0j11j03J73n8K43j23j79P1P0j35N3J51k18K80k03n2K50k13
6405b2Q2j13K6J47J39k35j7K1J26j38J02LN7j49J68j5l35J69J24j59r6P7R6N1
6429A09oj39Mj2J59j50K62l17M4K11q9j46J57j60Q2Q9n7k17K49r1k5J77k07l3
$$ plain form
6453 -106 10 -89 113 170 126 -18 -108 -133 -37 -148 -186 61 -83 -62 242 7 -140 46 132 -19 -57 62 -76
6476 -76 -16 48 -20 115 -55 -28 132 -68 78 -168 174 -29 215 83 3 -129 48 20 81 -81 -47 178 13
6499 13 -81 75 -189 -154 -109 40 -36 -48 83 -145 -87 -85 14 281 -37 -135 -47 231 -101 124 -57 75 160 68 115
6524 115 119 253 -188 -79 135 137 85 -148 -7 169 -176 162 -191 -91 194 91 -120 25 -42 47 93 -118 -8
6547 -8 -162 152 94 -292 -23 33 19 59 -3 16 -95 -56 -77 -193 -76 5 -24 32 300 34 -99 -111 -61 8 -29 -119
6573 -119 186 -156 -72 3 -87 -211 108 19 -40 18 -3 233 -200 -93 114 -24 -28 -62 338 -29 -191 -59 247
6596 247 -92 131 -93 -103 -174 -44 339 -109 49 7 -178 -189 57 -165 51 233 123 16 -133 84 229
6617 229 -139 -4 198 -158 0 3 222 72 39 143 -264 41 -5 -258 226 62 -6 3 -305 82 -31 24 -179
$$ packed form
6453a06J16r9K02N7m4j44r0k5R6j11l8K47j44K1L04k35j47J86Q6j51l8J19j38
6476g6O0O4o8J35j70K7J60k00J46k46L42k03K44j32q0j32J77k8O1j62L4K25j65
6499A3r4J56k64L5M5J49p6j2J31k28N8KR9K67l18r8Q8K78l32K25j81J32Q5r2M7
6524A15MJ34m41J09K14Kn2k33J41J76l45L38l53J00K85j03k11J45o7Q9M6k11J10
6547hj54L14n8l86K69N6j4M0o2J9j11L9k1j16J17Q1k9N6K68k66j33j2N0O9l7r0
6573a19L05l42Q4P5r0j24L19q9n9N8k1K36m33J07K07j38ml4M00l67j62J32L06
6596B47l39K23k24j0p1J30L83m48J58m2j85j1K46k22K16J82j10j07j49K17J45
6617B29l68J35K02l56J58LK19j50l3J04m07L05m6k53M84j64o8Rl08L87j13N5k03
$$ plain form
6640 -179 158 -62 132 -154 -91 -74 294 -99 229 -35 -112 67 206 10 75 233 -7 72 -131 139 62 22
6662 22 -55 5 112 145 467 40 5 64 -152 -188 -93 -45 -6 69 -261 -77 -127 91 -22 -195 302 49 -26 -61 4
6687 4 -197 10 -74 -181 194 -6 138 88 -133 -50 -13 107 84 91 -37 -183 121 -107 -93 -132 127 23 99 135
6711 135 124 -145 34 -109 35 -42 -21 -42 214 0 -73 -39 -28 -282 -124 -236 -109 166 22 3 -269 -155 -8
6734 -8 103 -57 -17 -39 -80 214 -1 -15 181 -33 74 -183 51 85 63 118 72 -113 -64 143 -77 89 0 -158
6758 -158 139 -100 15 -74 74 72 37 -94 -53 -13 210 -196 27 -46 115 -140 -4 104 54 -50 243 200 -117
6781 -117 9 -143 48 -12 179 0 79 10 220 -33 -203 -12 7 -147 25 -146 -61 254 -85 13 -154 -121
6803 -121 55 109 -25 -29 107 75 -35 -26 -13 -16 -221 -41 62 -21 -3 80 -161 -10 -94 -41 84 -23 62 33 -30 289
$$ packed form
6640a79L37k20J94k86O3J7L68l93L28k64p7J79J39j96O5J58k40P9k03K70p7m0
6662B2p7O0J07L3L22m27l5N9k16l6R5M8L9P5l30J84n0K18j13j73M97k53p5l5O5
6687Dk01K07q4j07L75k00J44n0k21Q3L7J20k3Pj28j46L04k28J4l9K59j04P6L6
6711A35j1k69J79j43J44p7K1k1K56k14p3L4J1k54J58j12J27K75j44j9k72J14J47
6734hJ11j60M0k2m1K94k15j4J96k14J07k57K34L4k2N5m6j85M9K07k20J66q9j58
6758a58K97k39J15q9J48kl5j31M1M0K23m06K23p3J61k55J36J08n0j04K93m3l17
6781a17J26j52J91o0J91j79P9o9K10k53j70J91J9j54J72j71Q5L15l39R8j67L3
6803a21J76N4j34mJ36l2j10RJ3lk05J80J03q3J8Q3k41J51q4N3J25j07Q5k9o3L19
$$ plain form
6829 289 29 -88 41 -28 -65 -122 95 -225 -53 113 -292 148 105 121 48 96 -220 57 -122 -150 182 -262 39
6852 39 113 112 -1 -11 40 -83 -120 -21 81 95 432 83 28 -74 -65 401 -14 -136 -109 224 124 -66 125 46 -196
6877 -196 8 186 63 369 -157 20 102 118 196 105 145 -126 141 66 6 -71 -151 366 53 -27 121 123 20 141
6901 141 -31 -45 -74 134 144 -177 59 -158 74 132 -52 -72 44 130 219 95 -82 -77 1 25 86 -140 115 184
6925 184 -48 -13 -190 -96 -66 -40 205 -7 -30 -159 117 -207 -162 -18 -192 39 -59 144 40 26 53 -225 -220 -29
6949 -29 10 45 2 -106 -180 -34 156 -13 146 98 -194 143 -64 -90 -94 -42 -47 111 -234 84 -144 -127 10 78 -51
6974 -51 108 -39 47 152 77 224 -17 45 51 -62 -98 -32 114 85 117 112 -40 12 -4 85 -76 106 129 -186 142
6999 142 -90 -5 -244 27 -165 -127 -126 80 -113 -87 189 -15 -93 4 -27 192 16 71 140 -26 117 22 85 83 29
$$ packed form
6829B89k60j17J29o9l7n7K17l20J72J66m05M40m3J6p3M8l16K77j79k8L32m44L01
6852C9P4jj13j0N1j23l7R9J02J4L37l49n5j02RM66m15j22K7L33j00j90J91p9k42
6877a96K04J78j23L06n26J77Q2J6P8r1M0k71K67p5o0p7q0N17l13q0J48Kj03J21
6901A41j72j4k9K08J0l21K36k17K32N8j84k0J16Q6Q9j24j77NP8K4O1k26K55O9
6925A84k32L5j77R4L0K6K45k12k3j29K76l24M5J44j74K31r8K03j04j4K7k78NJ91
6949b9L9L5m3j08p4J46J90j69J59m8k92L37k07k6mN2nJ58l45L18k28J7J37O8j29
6974e1J59j47Q6J05p5J47k41O2Oj13l6O6J46k9L2nj52N2j6Q9j61J82K3l15L28
6999A42k32Q5k39K71j92L8JK06j93K6K76k04p8R7l1K19j76N5O9j66J43r5O3kn4
$$ plain form
7024 29 9 346 283 8 -79 -56 61 -235 49 -69 1 -49 -67 -3 -147 -38 115 -13 -9 165 90 15 -17 -30 -209
7049 -209 -194 100 81 -186 144 -99 -90 -276 -104 -84 -157 103 26 37 -85 22 -197 -27 -257 54 63 48 169 35
7073 35 -138 298 -23 54 138 95 -144 -184 -170 -10 101 15 -13 18 -157 -12 50 -73 54 -44 -33 -106 -18 -133 -9
7098 -9 -131 -84 89 -20 52 -73 -7 6 -304 186 7 -144 15 67 -64 159 -15 199 -210 -4 57 -3 36
7121 36 -35 -175 276 177 -7 -198 -207 -32 -318 149 46 -35 -122 216 11 -39 134 -5 6 -174 85 -70 146
7144 146 94 -207 150 169 31 -125 209 93 38 139 119 -16 188 -90 -111 -228 63 57 215 -103 -50 36 -4
7167 -4 260 124 -13 17 -22 -70 -144 -110 208 141 -42 272 43 336 -27 30 93 -52 162 137 -15 -164 -164 -5
7191 -5 -144 254 14 -42 130 17 18 155 225 -254 -176 -37 152 245 63 -196 79 -143 -119 71 116 -68 100
$$ packed form
7024B9k0L37o3k75q7K3J17k96K84j18P0n0j8O4j44J09J53j28MJ74p5p5l2j3j79
7049b09J5K94j9k67L30k43Rj86J72K0p3K60p7J1j22J07k19J70k30L11Rj5J21j34
7073C5j73M36l21P7Q4m3k39m0J4J60J11q6k8L1j75J45O2j23J27r8J1p3Q8j15J24
7098ij22M7J73j09P2j25O6J3l10M90j79j51J59N2j31K23j74K14m09K06O1o0L9
7121C6p1j40M51r9j84j91rJ75k86M67j03q1q7L38k05n0J73j39J1j80K59j55K16
7144A46n2l01L57J9j38j56L34j16n5J01k0j35K04k78k1j17K91oJ58l18N3Q6m0
7167dK64j36j37L0l9m8p4L4L18o7j83L14k29K93l63N7O3j45K14k5j52j49%J59
7191ej39L98k40n6J72j13JJ37P0m79P8J39J89R3j82k59K75k22K4J90M5j84J68
$$ plain form
7214 100 93 152 38 -26 51 44 11 -90 -48 -239 -46 65 -59 -33 133 -83 10 117 -30 211 -259 331 111 -19
7238 -19 105 126 92 -49 151 65 -71 -28 223 -12 91 -142 -72 12 -98 -20 6 126 203 160 127 117 31 -20 -66
7263 -66 124 52 -83 -101 -56 -100 -69 30 84 -9 -5 7 154 0 114 -251 -140 -135 -28 15 -112 -10 -115 -231 -68
7288 -68 359 122 -9 -37 68 -88 147 78 -39 94 -32 -2 -106 -149 -281 -70 -133 24 13 31 14 -220 61
7311 61 40 130 -104 0 182 22 -43 66 -122 147 -114 -108 -192 -41 79 58 118 21 -84 -84 -157 32 -119 -129 -36
7336 -36 38 175 157 208 74 285 -13 10 -78 167 237 264 -2 -304 -21 -200 -77 -7 -32 -102 0 313 133 -11
7360 -11 -66 -63 4 10 150 273 -238 115 -5 141 -246 -10 71 -70 -8 188 186 97 48 -154 84 -165 287 156
7384 156 94 -128 149 33 -53 11 138 -36 153 -176 68 70 -86 59 -13 301 -10 -122 107 -62 130 -81
$$ packed form
7214A00pN9j14o4P7pl3j01M2j91J93J11j24K6J66k16R3J07j47K41m70N90k20j30
7238a9J24K1l4j41K00q6j36M3K51k35J03k33P0Q4j10P8K6J20P7m3l3j0q6n1m6
7263f6J90p2j35j8M5m4L1R9N4r3MJ2J47j54J14l65J11NJ07M3j27J02j05j16J63
7288f8M27k37j31k8J05j56K35o9j17J33j26L0j04m3j32K11o3J57j1J8j7k34K81
7311F1k1R0k34J04J82j60o5J09j88K69k61Oq4J51J20k1O0r7j05%p3J89j51j0R3
7336c6P4J37j8N1j34K11k98K3q8K45P0K7k66l02K83j79J23P0k5p0J02L13j80j44
7360a1n5LO7OJ40J23n11L53j20J46l87K36Q1j41O2J96kq9m9k02K38k49M52j31
7384A56o2k22K77j16q6O4J27j74J89l29K44Kj56J45p2L14l11j12K29j69J92k11
$$ plain form
7406 -81 149 -166 -272 -25 -123 128 71 47 138 -68 22 -209 53 -16 113 -26 -220 66 -147 18 78 -77 -150
7429 -150 87 -109 -32 -164 244 -98 97 -39 -22 71 131 -147 -226 136 77 0 -115 166 -105 -41 -150 145 119
7452 119 129 2 76 -115 85 -29 -138 86 75 111 -38 74 -152 -21 -5 -71 74 197 -62 277 -64 -19
7474 -19 67 -42 -409 204 106 -33 85 -134 116 117 -5 -77 125 -290 -160 -141 50 -107 -224 -94 -85 24 -100
7497 -100 -128 266 30 161 -88 383 71 -124 -50 25 -123 103 28 -147 31 33 -15 -228 -204 -157 -88 17 -79 -139
7521 -139 -85 63 -92 65 -18 -19 20 -120 180 141 -85 -172 26 -98 90 17 300 63 -100 88 -165 98 8
7544 8 -21 -161 -45 122 -22 31 -54 -204 87 -59 300 -18 45 124 154 128 274 118 -37 -79 -61 319 -76 179
7568 179 29 -44 51 -246 199 230 164 -244 50 104 -64 28 203 117 -74 -115 223 130 46 -358 -82 12 -13 12
$$ packed form
7406h1K30l15j06K47r8K51n7k4R1k06R0k31K62o9J29j39j94K86k13J65O0j55p3
7429a50K37j96P7j32M08l42J95j36J7R3O0k78p9L62n9p7j15K81k71O4j09K95k6
7452A19J0j27P4j91K00j14j09K24j1L6j49J12k26J31J6o6J45J23k59L39l41M5
7474a9Q6j09l67O13r8j39J18k19K50Jj22p2K02m15J30J9J91j57j17J30RJ09j24
7497a00k8L94k36J31k49M71l12j95P4P5j48K26p5j75J78Km8k13K4M7O9J05r6o0
7521a39N4J48j55J57q3jL9j40L00l9k26q7J98j24J88p3K83k37j63J88k53K63r0
7544Hk9j40J16J67j44N3q5j50K91j46L59l18O3P9L0k6J46j56j55m2J8L80l95K55
7568A79j50p3R5k97M45L1o6m08K94N4j68R2J75q6j91m1L38r3q4m04K76R4k5K5
$$ plain form
7592 12 23 -91 247 19 -80 19 248 -90 81 -160 179 -65 -3 88 4 140 63 48 10 63 -51 147 -283 23
7616 23 105 9 62 126 -49 141 50 -102 -39 11 93 -51 -116 48 -20 -56 1 39 90 -24 120 153 51 -69 -142 180
7642 180 -97 247 75 45 39 -65 88 112 -213 92 198 73 -88 -48 52 79 -84 -275 -40 -112 118 -157
7664 -157 -55 -116 217 -84 -65 -135 -59 137 -17 -58 93 29 2 -87 128 61 211 209 -242 115 -143 120 -158 -300
7688 -300 -98 138 -156 -102 184 19 20 152 85 123 5 0 69 -52 -139 40 255 9 185 -214 -28 -17 -99 260
7712 260 244 -260 21 131 6 -99 -78 -109 -129 5 275 -13 226 123 128 -13 -23 -40 74 -192 93 -109 122
7735 122 106 -46 -32 156 -91 37 148 51 27 83 65 -125 1 -66 -48 -246 27 224 -283 -182 -23 97 24
7758 24 -5 -7 -103 182 23 -55 -118 3 -141 13 -4 -113 5 66 78 227 -79 -294 64 -105 120 192 24 -83
$$ packed form
7592A2J1j14L38k28r9R9K29l38J71k41L39k44O2R1q4J36p7j5l8N3j14J98m30L06
7616B3Q2r6N3O4j75J90r1j52O3N0Q2j44o5J64o8l6N7L8N1j14J44L3j02j20p3L22
7642A80k77L44j72l0oj04J53K4l25L05J06j25j61M0J00K7j63j91K35p2K30k75
7664a57J02o1L33l01J9p0P6J96j54m1J51o4k7q9K15o7J50km51L57k58K63k78j42
7688c00K02K36k94N4K86j65JJ32o7L8j18nO9j21q7J79K15k46J76l99J86J1q2L59
7712B60j6n04K81J10j25j05K1l1k0J34K70k88K39j03Nj41j0j7J14k66K85k02K31
7735A22j6j52J4J88k47J28J11r7k4N6j8j90J26o7J8j98K73J97n07J01J59J20p3
7758B4k9kr6K85j59p8o3J21j44J54j7j09J18O1J2J49l06k15L58j69K25P2j68j07
$$ plain form
7782 -83 59 189 -14 59 159 -48 -200 32 -64 251 -88 -84 136 -19 4 -167 -214 -11 -104 -175 39 64 -64
7805 -64 -13 296 151 -64 142 -75 77 62 -247 -62 -277 125 162 110 -232 147 -97 -25 -85 -158 -7 -228 -153
7828 -153 -113 5 83 -96 33 300 -113 -16 8 -67 81 -88 54 -66 198 0 -22 -254 77 -10 141 113 188
7851 188 105 210 206 -51 119 98 259 -98 -37 9 -132 75 264 157 -63 -242 23 -49 -126 -93 -53 15 -164 -103
7875 -103 53 129 -7 -22 -145 -144 31 230 109 -150 116 -144 167 7 -160 246 142 -126 -171 -125 -11 -5 -93
7898 -93 -136 -296 -85 123 130 70 -101 50 -16 -10 155 -57 -119 119 139 -172 232 12 -38 47 116 8 32 133 -216
7923 -216 -197 130 -10 131 -11 -225 41 -131 -25 -43 128 -73 -241 -140 215 88 54 177 -110 -342 80
7944 80 -52 154 -197 -18 -127 20 -85 124 105 354 -182 46 131 48 111 -35 135 -120 -179 116 -25 120
$$ packed form
7782h3J42J30k03P3J00k07j52K32r6L15l39MK20j55K3j71m7K03r3p1K14K5j28
7805f4N1L09j45k15K06k17J52j5l09J85k15M02L7n2l42L79k44P2o0p3J51k21P5
7828a53M0J18P8j79J29K67m13R7K4p5J48j69J42j20K64j98k2k32L31q7J51k8P5
7851A88q3J05mk57J70k1J61l57O1M6j41K07J89j07k20j79K65p2p7L3M0O8j79O1
7875a03J56P6j36j5j23JJ75J99j21k59K66k60L11j60j67M06j04k68m5M6J14Oq8
7898i3m3j60K11K08Po0j71J51o6OJ65k12o2K38K0l11M04k20n0Q5O9j08K4J01l49
7923b16J9L27j40J41j42k14K66j72J06j8J71k01j68J01L55j27l4J23k87k32M22
7944H0j32K06l51J79j09J47j05K09j9K49n36K28Q5q3O3j46J70k55n9K95j41J45
$$ plain form
7966 120 -34 -119 48 72 -259 -141 27 72 -85 -87 84 -41 96 15 -77 -47 -75 -223 -24 176 145 -371 -123
7989 -123 18 -206 98 265 18 -53 111 -73 -141 -98 135 -5 18 23 -78 111 -11 180 -217 -235 -49 5 -149
8012 -149 222 154 33 340 -299 -13 58 125 -73 51 62 69 26 -3 90 164 -57 151 -40 -261 -36 -73 89 -262
8036 -262 -9 105 159 144 163 26 73 32 -255 9 6 -177 -79 19 43 -24 -112 -229 23 25 -73 114 -15 -60 13 178
8062 178 -48 -18 -46 181 -154 -84 66 48 -140 50 180 -76 -169 -115 11 -105 47 -129 -21 151 156 9 4
8085 4 5 199 25 -98 5 -184 23 89 -51 109 -280 -98 113 -52 -37 -200 16 -95 82 -159 120 8
8107 8 250 68 182 66 18 39 -153 -20 143 50 -70 -104 173 -58 -220 -182 101 -283 83 -76 37 176
8129 176 -28 -126 34 74 5 45 -75 106 -176 142 -41 -27 43 13 -139 -107 -92 42 64 49 70 46 -92 133
$$ packed form
7966A20j54q5J67K4l31J18J68M5j57kJ71j25J37q1r2L0k8j48J99K00l1n16K48
7989a23J41k24L04J67k47p1J64j84o8M3K33j40K3Nj01J89j22J91l97j8J86N4j54
8012a49L71o8j21L07o39K86P1O7j98J24J1Pm3k9R3P4k21K08j91k21K25l7J62l51
8036b62K53J14N4j5J9j37M7m1k87K64lj83R8R8K4o7q8j17K52Kr8J87j29m5P3J65
8062A78k26L0k8K27l35P0J50j8j88J90J30k56r3N4J26j16J52j76J08J72Nj47n
8085DJJ94j74j23J03j89K07O6j40J60l89J82K11j65J5j63K16j11J77k41K79j12
8107HK42j82J14j16m8K1j92J33J63r3j20l4K77k31j62L8K83l84L66j59J13J39
8129A76k04r8J60M0o9M0j20J81k82L18j83J4P0l0j52L2J5J34K2j5K1k4j38K25
$$ plain form
8153 133 20 -180 3 25 -30 0 -8 -131 -64 130 -89 -237 161 -141 -60 149 -145 7 -51 2 220 45 -173
8176 -173 -32 -103 40 90 43 131 20 175 38 143 -26 73 25 -217 -81
$$ packed form
8153A33j13k00J83K2n5L0qj23O7J94k19j48L98l02Q1K09k94J52n8N3K18j75k18
8176a73J41p1J43N0m7Q8j11J55j37J05j69R9m8k42J36
8191h1
$$ Imaginary data points
##PAGE= N=2
##DATA TABLE= (X++(I..I)), XYDATA
$$ plain form
0 0 0 0 0 0 0 0 0 0 -8 8 -8 8 -16 16 -24 24 -32 40 -48 64 -72 88 -104 120 -144 168 -192 224 -259 296 -339
31 -339 387 -436 492 -556 627 -704 787 -879 980 -1089 1209 -1341 1484 -1640 1810 -1995
47 -1995 2199 -2423 2668 -2939 3237 -3568 3936 -4349 4816 -5350 5961 -6676 7518 -8534
61 -8534 9782 -11356 13411 -16217 20288 -26716 38396 -66169 260832 143508 -283339 251221
73 251221 -41598 20629 75564 8039 129043 -64316 -18439 155332 -85165 -3756 95919
84 95919 -14505 -81711 30975 75861 -86880 -25438 -30351 -3439 59273 -97674 13859
95 13859 -59471 -53161 68226 -61431 6105 2530 -64347 3836 -22422 36768 3620 -28865
107 -28865 35698 -89210 65045 76605 -108555 36087 14032 35460 -15420 -34803 76202
$$ packed form
0@%%%%%%%%qJ6j6J6k4L2m0M8n6P2q8J12j36J60j92K24k64L12l60M16m83N55o35
31c39P26q23R28j048J183j331J491j666J859k069K298k550K825l124L450l805
47a995M194m622N091n607O176o805P504q285R165j0166J1311j2637J4194j6052
61h534J8316k1138K4767k9628L6505m7004O5112j04565L27001j17324m26847N34560
73B51221k92819O2227N4935o7525J21004j93359M5877J73771k40497Q1409R9675
84I5919j10424o7206J12686M4886j62741O1442m913K6912O2712j56947J11533
95A3859p3330O310J21387j29657O7536l575o6877O8183k6258N9190l3148l2485
107b8865O4563j24908J54255J1560j85160J44642k2055K1428n0880j9383J11005
$$ plain form
118 76202 -75065 15441 65743 -53587 16683 -20119 -12204 2666 -32613 80805 -31587
129 -31587 -80249 28445 -2804 36285 -42879 1760 21718 -51563 56149 -27556 10804 28865
141 28865 -48351 73699 -21133 -16843 87165 -63886 12152 60045 -14327 58500 -54875
152 -54875 -12088 81210 -25306 7241 31216 -23425 -31548 49648 -8052 -33828 51660 -41577
164 -41577 -17407 7639 -25152 46467 -55585 -39776 64443 -59343 8347 12045 -72142 35507
176 35507 -6599 3624 -14252 -29707 37327 -43589 8839 29682 -14710 1455 -29301 23931
188 23931 7435 -14912 55000 -47017 -22130 71031 -24787 -4781 6234 14334 4540 -24339
200 -24339 48483 -19320 -18760 33711 -9345 1209 11340 15721 -26331 -21610 49254 2901 -18570
$$ packed form
118G6202j51267R0506N0302j19330P0270l6802P915J4870l5279J13418j12392
129c1587m8662J08694l1249L9089p9164M4639J9958p3281J07712q3705L8360J8061
141B8865p7216J22050r4832M290J04008j51051P6038M7893p4372P2827j13375
152e4875M2787R3298j06516L2547K3975n4641q123Q1196n7700k5776Q5488r3237
164d1577K4170K5046l2791P1619j02052J5809J04219j23786O7690L698q4187J07649
176C5507m2106J0223j7876j5455O7034q0916N2428K0843m4392J6165l0756N3232
188B3931j6496k2347O9912j02017K4887R3161r5818K0006J1015Q100r794k8879
200b4339P2822o7803N60N2471m3056J0554J0131M381m2052M721P0864m6353k1471
$$ plain form
213 -18570 8713 -14107 11186 -5228 16143 8852 -43097 41873 -10877 -26465 35820 -10648
225 -10648 -3217 -16693 9752 21492 -29509 1505 4092 -13681 11027 11037 -11385 -36852 25120
238 25120 18518 -49699 40902 -8144 -34304 27761 -29974 28830 -967 -30508 31510 -33929
250 -33929 6959 36839 -37508 867 12935 -3869 9439 -9834 4700 -2173 4975 5286 -2278
263 -2278 16061 -19105 8656 2690 -3708 30398 -17688 -5854 6548 -2496 20699 -4988 -8995
276 -8995 5396 -970 7672 -7860 6412 2201 -14598 16666 -14294 7669 4938 -23625 16076
289 16076 -13856 13379 5739 -33812 16345 -4706 -2752 15628 -21588 3765 -2773 -7094 16642
302 16642 -19397 11986 1618 -23640 15849 1908 2184 -10970 484 8701 -11715 17116 -5322
$$ packed form
213a8570K7283k2820K5293j6414K1371p291n1949Q4970n2750j5588O2285m6468
225a0648P431j3476K6445J1740n1001L1014K587j7773K4708J0k2422k5467O1972
238B5120o602o8217R0601m9046k6160O2065n7735N8804k9797k9541O2018o5439
250c3929M0888K9880p4347L8375J2068j6804J3308j9273J4534o873P148L11p564
263b278J8339l5166K7761n966o398L4106m8086J1834J2402r044K3195k5687m007
276h995J4391o366Q642j5532J4272m211j6799L1264l0960K1963k731k8563L9701
289A6076k9932K7235p640l9551N0157k1051J954J8380l7216K5353o538m321K3736
302A6642l6039L1383j0368k5258L9489j3941K76j3154J1454Q217k0416K8831k2438
$$ plain form
315 -5322 -14636 10910 3980 7179 -11510 -551 20091 -25766 9662 25284 -22269 6260 1758
328 1758 -3261 3441 8345 7103 -18388 4405 9859 3050 -6166 -3995 16748 -15319 -777 22429
342 22429 -23228 3289 11825 -18572 13582 -3680 451 -3119 -19376 24143 -3947 -11284 5681
355 5681 -7255 -1689 485 9942 -9705 -9625 16106 -12211 -4902 14820 -8988 69 -6826 5246
369 5246 10374 -18863 13572 -5361 -11276 20281 -4919 -6405 -2388 3421 4195 -6921 6392 1516
383 1516 -9045 2160 2651 3163 -1614 499 880 -9246 13762 1057 -5650 4258 -6091 13431
397 13431 -3069 -1849 9797 -9109 7896 3711 -2974 7468 -5021 1495 1993 -362 10023
410 10023 -8553 -400 -642 -3308 11926 -11769 558 -843 -8859 8893 -10388 -305 1431
$$ packed form
315e322r314K5546o930L199j8689J0959K0642m5857L5428J5622m7553K8529m502
328A758n019O702M904j242k5491K2793N454o809r216K171K0743l2067J4542K3206
342B2429m5657K6517Q536l0397L2154j7262M131l570j6257M3519k8090p337J6965
355E681j2936N566K174R457j9647Q0K5731k8317P309J9722k3808R057o895J2072
369E246N128k9237L2435j8933n915L1557k5200j486M017N809P74j1116J3313m876
383A516j0561J1205M91N12m777K113L81j0126K3008j2705o707R908j0349J9522
397A3431j6500J220J1646j8906J7005m185o685J0442j2489O516M98k355J0385
410A0023j8576Q153k42k666J5234k3695J2327j401q016J7752j9281J0083J736
$$ plain form
423 1431 -12580 5375 -3074 -6119 4878 -8564 -3694 2403 1827 -1181 -7602 4033 -2069 3405
437 3405 3782 -4107 3795 -4729 8714 2385 -5665 13374 -4106 -4419 10606 889 1492 -451 89
452 89 4075 -3309 8169 -2285 -7229 5558 109 1666 -6745 3663 635 -10916 9432 -1036
466 -1036 -4995 1949 -4578 1943 -1718 1874 5642 -12950 4059 8059 -7056 4527 -772 1938
480 1938 -1435 633 8521 -7990 2334 4557 -4322 1814 2780 856 -7205 -1109 8188 -6078 -1560
495 -1560 2826 -8505 996 169 -74 -3656 -5004 4786 -6703 -875 3697 -3283 -2669 -1871 4558 -1916
511 -1916 -669 4287 -5573 2794 6203 -1983 2891 -2750 4002 4874 -4805 9070 -1317 -2759 5990
526 5990 -1055 4056 98 165 564 -3153 4991 549 -3291 110 -1684 1745 -1834 -1405 1354 -6171
$$ packed form
423A431j4011J7955q449l045J0997j3442M870O097n76l008o421J1635o102N474
437C405L77p889P902q524J3443o329q050J9039j7480l13J5025r717O03j943N40
452H9L986p384J1478j0454m944J2787n449J557q411J0408l028j1551K0348j0468
466a036l959O944o527O521l661L592L768j8592J7009M000j5115J1583n299K710
480A938l373K068P888j6511J0324K223q879O136R66j924q061O096R297j4266M518
495a560M386j1331R501q27k43l582j348R790j1489N828M572o980O14P98O429o474
511a916J247M956r860Q367L409q186M874n641O752Q72r679J3875j0387j442Q749
526E990p045N111l958O7L99l717Q144m442l840L401j794L429l579M29K759p525
$$ plain form
542 -6171 3172 -1061 -3490 3414 -5581 512 -707 -983 2980 -3185 -885 -837 403 3445 -2187 -851
558 -851 985 -747 1677 -376 1852 -2193 -941 4400 -3913 2983 595 -3489 1990 -1429 3469
573 3469 -1550 -3290 2814 -2495 958 2238 -3250 46 -603 1067 694 -1955 3692 -3850 -169 3136
589 3136 -1568 2793 -2472 1573 651 -1714 5326 -2467 -2378 4083 -523 130 625 413 363 -3139 4338
606 4338 579 -3068 2241 -942 -180 -971 3529 -891 -5375 3659 -21 -2006 926 -678 -631 -1975
622 -1975 975 1943 -4092 1617 791 -3098 2268 37 202 -2454 31 3059 -2607 2048 -625 -1774
638 -1774 1505 -64 1787 -1429 -640 2652 -2932 1500 2434 -2995 1354 -754 896 781 -1216 2240
654 2240 -2969 572 2753 -1323 -622 -592 1348 -967 -249 2572 -2413 -704 1834 -1126 1169 -563
$$ packed form
542f171R343m233k429O904q995O093j219k76L963o165K300M8J240L042n632J336
558h51J836j732K424k053K228m045J252N341q313O896k388m084N479l419M898
573C469n019j740O104n309L453J280n488L296o49J670l73k649N647p542L681L305
589C136m704M361n265M045r22k365P040p793Q9O461m606O53M95k12n0l502P477
606D338l759l647N309l183P62p91M500m420m484R034l680j985K932j604M7j344
622a975K950R68o035N709q26l889N366k231J65k656K485L028n666M655k673j149
638a774L279j569J851l216P89L292n584M432R34n429M349k108J650j15j997L456
654B240n209L541K181m076P01L0J940k315P18K821m985J709K538k960K295j732
$$ plain form
670 -563 198 -136 -2005 3194 -972 -1076 867 -814 1468 -488 423 -157 -1096 939 -308 837 162
687 162 -1518 1433 -429 -210 2014 -1938 456 -950 416 1804 -2277 1061 -450 -557 1256 -490
703 -490 587 -1195 -327 1166 -972 831 214 -1580 658 -477 1154 -398 -1313 1661 -1526 1258
719 1258 571 -1164 451 -1040 1192 -152 -140 1229 -1670 -189 1441 -648 -1 85 19 -415 -13 1756
737 1756 -2579 -353 973 -845 549 -547 1073 -1230 -843 2476 -1325 -648 1232 -953 -242 477
753 477 892 -97 -1684 1809 -231 -463 1206 -610 382 -904 1284 697 -1607 1527 -572 -467 1056
770 1056 76 188 -541 110 1129 -1180 694 97 -1628 1213 142 295 -942 366 548 -1687 1709
787 1709 228 -1314 435 -121 191 -533 245 314 -1511 592 837 -1041 311 -644 114 -275 -348 1013
$$ packed form
670e63P61l34j869N199m166j04J943j681K282j956R11n80r39K035j247J145o75
687A62j680K951j862K19K224l952K394j406J366J388m081L338j511j07J813j746
703d90J077j782Q68J493k138J803o17j794K238j135J631j552r15K974l187K784
719A258o87j735J615j491K232j344J2J369k899J481J630k089O47Q6o6m34M02J769
737A756m335K226J326j818J394j096J620k303L87L319l801O77J880k185P11P19
753D77M15r89j587L493k040k32J669j816R92j286K188n87k304L134k099J05J523
770A056r80J12p29O51J019k309J874n97j725K841j071J53j237J308J82k235L396
787A709j481j542J749n56L12p24P78O9j825K103K45j878J352r55P58l89p3J361
$$ plain form
805 1013 -1350 125 55 -226 1052 -688 340 -150 -530 920 -366 243 20 -523 737 -347 123
822 123 414 -1252 898 -517 -33 379 -734 601 -519 393 246 -582 45 -232 299 606 -477 176
840 176 -547 51 839 -471 686 -400 69 824 -696 1118 -520 -448 458 176 237 -731 3 -148 -638
859 -638 1041 -1 -824 354 -450 99 -294 -70 650 -1671 541 301 -887 -66 -89 -116 -594 219 618
878 618 -1076 135 437 -367 604 158 451 -490 78 1233 -292 127 336 -452 426 -31 679 -98 -344
897 -344 711 -306 23 372 -733 -160 71 331 -184 -443 740 -478 -36 614 -289 -58 -522 352 -85
916 -85 -384 924 -697 -368 499 -237 -189 -143 184 110 -801 784 93 -541 381 -262 384 -88 113 299 -610
937 -610 572 -133 -64 172 -550 241 -287 -68 490 -578 -203 290 -533 402 -315 -87 -252 -56 584 -372
$$ packed form
805A013k363J475p0k81J278j740J028m90l80J450j286O09k23n43J260j084M70
822A23K91j666K150j415M84M12j113J335j120R12j47q28O27k77N31L07j083O53
840A76p23N98P88j310J157j086M69P55j520J814j638P2R06k82O1r68P34j51m90
859f38J679j042q23J178q04N49l93K24P20k321K212k40j188Q21k3k7m78Q13L99
878F18j694J211L02q04R71m46K93r41N68J155j525M19K09p88Q78m57P10p77k46
897c44J055j017L29L49j105N73K31K60n15k59J183j218M42O50r03K31m64Q74m37
916h5k99J308j621L29Q67p36M8M6L27p4r11J585o91o34R22o43O46m72K01J86r09
937f10J182p05O9K36p22P91n28K19N58j068L75M93q23R35p17K28j65J96O40r56
$$ plain form
957 -372 30 -121 -302 569 -306 123 -192 -85 262 -249 300 146 -379 509 186 247 490 -325 467 -154 213
978 213 49 -89 452 -459 212 238 -262 349 -147 235 154 -128 496 -131 -279 300 -260 353 -148 -4 -72
999 -72 -561 675 -319 -327 -13 19 27 -6 418 -204 -771 231 51 -71 300 -284 59 -274 84 426 -754 333
1021 333 160 -212 442 283 31 -494 -51 307 -337 42 119 -400 44 284 188 -332 6 719 -607 574
1041 574 218 -444 190 -22 212 -385 -24 226 -328 482 532 -170 -239 -3 217 121 -259 640 -253 -190 387
1062 387 100 149 -485 -1 -10 -322 504 -87 -120 -79 -60 106 -75 251 -209 -284 -56 -34 -213 38 -86 134 25
1085 25 166 272 -269 -14 -293 23 53 -198 157 -45 124 -27 111 66 -289 -130 357 -40 257 56 82
1106 82 167 -186 164 -195 -11 58 -394 227 -63 -78 -33 -166 66 -12 -241 278 -244 229 58 18 51 -173 -169
$$ packed form
957c72M02j51j81Q71q75M29l15J07L47n11N49j54n25Q88l23O1K43q15P92o21L67
978B13j64j38N41r11O71K6n00O11m96L82q1k82O24o27j48N79n60O13n01J44o8
999g2m89J236r94qL14L2Ql3M24o22n67J002j80j22L71n84L43l33L58L42j180J087
1021C33j73l72O54j59k52n25M43L58o44L79P7n19M44K40r6n20L38P13j326J181
1041E74l56o62O34k12K34n97L61K50n54Q10N0p02o9K36K20r6l80Q99q93O3N77
1062C87k87M9o34M84rl12Q26n91l3M1J9J66j81L26m60p5K28K2j79K51j24K20j09
1085B5J41J06n41K55k79L16L0k51L55k02J69j51J38m5l55J59M87l97K97k01K6
1106H2Q5l53L50l59J84O9m52O21k90j5M5j33K32p8k29N19n22M73j71m0L3k24M
$$ plain form
1129 -169 -82 119 236 -259 72 -4 -151 -17 -73 6 48 -89 294 -35 -328 -45 91 0 164 190 40 -228
1151 -228 114 -73 74 244 -160 -146 -262 148 195 -225 109 -90 -282 202 -94 -35 54 68 227 -110 248 -248
1173 -248 -164 326 -179 136 -241 188 -138 -178 87 -152 -178 -87 33 187 -208 54 264 -353 -34 180 -222
1194 -222 236 -273 91 -254 -113 325 -328 77 191 82 14 24 -9 -2 104 356 -144 44 216 -24 327 132
1216 132 279 32 -206 334 -216 27 -4 -170 -115 -53 -33 109 -302 20 0 44 76 -375 -184 21 13 -141 -77
1239 -77 -13 -101 37 -40 -176 -45 168 77 221 163 205 -166 -2 -3 -216 325 -29 -208 -39 -30 192 10 -189 -242
1263 -242 -213 234 -120 -69 -97 -212 -148 -216 77 211 -365 187 123 -150 277 39 230 16 71 27 -316 -153 144
1286 144 -26 196 23 67 45 11 380 282 311 -23 -133 -116 273 137 -13 -256 13 6 169 -9 187 85 -89
$$ packed form
1129a69Q7K01J17m95L31p6j47J34n6P9M2j37L83l29k93K83J36r1J64K6j50k68
1151b28L42j87J47J70m04J4j16M10M7m20L34j99j92M84k96N9Q9J4J59l37L58m96
1173b48Q4M90n05L15l77M29l26m0K65k39k6R1J20J54l95K62K10o17L19K14m02
1194b22M58n09L64l45J41M38o53M05J14j09o8J0l3PJ06K52n00J88J72k40L51j95
1216A32J47k47k38N40n50K43l1j66N5O2K0J42m11L22k0M4L2m51J91K05qj54O4
1239g7O4q8J38p7j36J31K13r1J44n8M2l71J64jk13N41l54j79J69RK22j82j99n3
1263b42K9M47l54N1k8j15O4o8K93J34n76N52o4k73M27k38J91k14N5m4l43J63K97
1286A44j70K22j73M4k2l4L69r8K9l34j10J7L89j36j50k43K69pJ63j78J96j02j74
$$ plain form
1309 -89 3 39 -356 12 -10 -48 -4 60 -233 -60 150 -63 -243 1 144 52 -274 -29 43 -86 146 -141 188
1332 188 236 -74 -168 167 57 30 -31 75 61 -225 -48 184 -106 -18 -156 -32 -69 -16 -87 -306 201 -101 220
1355 220 48 141 78 -39 -87 -2 -38 233 219 -37 -16 -273 162 -44 -116 -29 79 138 37 9 -152 23 22 -38 42
1380 42 80 -54 119 63 -115 -10 22 -17 126 -178 107 -123 86 -112 -349 19 -245 -53 -64 50 -25 -137
1402 -137 -1 12 73 97 55 -90 169 -85 -62 17 32 304 -101 15 -172 -64 -4 -6 -173 -26 96 61 10 -40
1426 -40 37 -26 289 -207 53 152 -223 -157 -31 94 147 -219 130 25 -148 49 29 85 19 -24 309 45 27 -138
1450 -138 292 99 -115 -24 42 73 192 -6 93 -134 63 311 -208 277 -51 300 202 50 35 -99 41 -111
1472 -111 48 291 -57 69 4 46 122 -17 -42 -150 -142 92 -196 -171 -38 106 114 79 -17 -47 -53 -29 39 -89 34
$$ packed form
1309h9R2L6l95L68k2l8M4O4k93J73K10k13j80K44J43r2l26K45P2j29K32k87L29
1332A88M8l10r4L35j10k7o1J06j4k86J77K32k90Q8j38J24l7N3p1k19N07l02L21
1355B20j72R3o3j17m8Q5l6K71j4k56K1k57M35k06p2Q7J08N9j01k8j61J75jo0Q0
1380D2L8j34J73n6j78J05L2l9J43l04K85k30K09j98k37L68k64J92j1J14p5j12
1402a37J36J3O1K4m2j45K59k54K3P9J5K72m05J16j87J08O0kj67J47J22l5n1n0
1426d0P7o3L15m96K60R9l75O6J26J25N3l66L49j05j73J97k0N6o6m3L33k64j8j65
1450a38M30j93k14R1O6L1J19j98R9k27J97K48n19M85l28L51r8j52j5j34J40j52
1472a11J59K43l48J26o5M2P6j39k5j08QK34k88K5J33J44Ql5r6l0oK4O8j28J23
$$ plain form
1497 34 -92 48 -86 28 -301 -34 64 49 -30 114 138 -171 -34 35 -225 1 96 -32 -221 41 161 -143
1519 -143 15 145 -72 53 -50 218 157 -49 26 -27 3 -215 -29 160 -30 213 -58 -21 9 -160 -51 -232
1541 -232 -23 184 -72 8 -172 358 -79 69 -207 128 69 69 -17 53 1 -84 -208 -53 64 -93 -30 34 133 -4
1565 -4 -22 153 165 51 -92 225 106 114 -159 91 126 -124 234 2 177 160 58 50 25 -65 -112 84 202 -130
1589 -130 55 96 63 16 14 -98 -22 255 -73 0 5 -43 72 251 161 -121 -135 260 279 -213 158 154 -300 28 -73
1614 -73 -108 -47 -65 163 -35 1 65 -52 -270 83 -93 85 67 -181 -87 -77 -57 71 251 2 244 169 153 338
1638 338 -31 34 294 -135 -161 16 104 7 -73 259 99 157 6 128 55 50 53 142 63 256 -16 -23 263 -223 -148
1663 -148 -151 92 -169 -204 -140 70 153 91 -30 214 23 -184 -110 -174 127 43 79 132 -6 -127 -171 -242 30 57 126
$$ packed form
1497C4j26J40j34J14l29K67R8j5p9J44K4l09J37O9k60K26R5j28j89K62J20l04
1519a43J58J30k17J25j03K68o1k06P5n3L0k18J86J89j90K43k71L7L0j69J09j81
1541b32K09K07k56Q0j80N30m37J48k76L35n9%q6P0n2q5j24J55J17j57O3O4R9j37
1565dj8J75J2j14j43L17j19Qk73K50L5k50L58k32J75j7j02qk5r0m7J96J18l32
1589a30J85M1l3m7kj12P6K77l28P3Nm8J15J79r0k82j4L95J9m92L71mm54L28j01
1614g3l5O1j8K28j98L6O4j17k18L53j76J78j8k48R4J0K0J28J80k49K42p5j6J85
1638C38l69O5K60m29k6J77Q8r7q0L32j60N8j51J22p3nLQ9p9J93k72pK86m86P5
1663a48lK43k61l5O4K10Q3o2j21K44j91k07P4o4L01q4L6N3j38j21m4p1K72K7O9
$$ plain form
1688 126 -36 87 9 -141 -222 26 68 -87 54 -265 94 -26 -166 -352 -18 92 177 383 15 -38 -104 61
1710 61 44 185 180 66 -71 205 -129 208 193 39 232 -140 -10 82 -54 111 169 -244 -111 -134 -5 -123 -96
1733 -96 -201 -10 -93 -43 -261 -98 -50 15 110 -213 68 76 -124 115 192 172 16 -5 105 120 70 -120 48 -188
1757 -188 118 262 65 -219 151 136 6 80 -68 -113 -48 -77 77 -50 -135 -162 -349 -8 -233 -60 -183 -27
1779 -27 266 -67 -39 20 -97 -19 234 -59 -183 88 -99 180 -136 28 84 -115 -51 2 55 35 20 85 51 -215
1803 -215 -188 15 268 -137 -349 247 137 -121 -169 -21 307 54 -198 -133 140 195 -132 49 -73 -90 107 -194
1825 -194 120 22 18 -64 -10 293 -42 -62 -75 122 187 -31 -199 107 109 -103 80 -327 -111 147 18 1 82 -43
1849 -43 175 -62 32 -85 7 -120 -157 119 -71 -40 30 -122 -41 8 -119 -290 81 332 -100 51 -54 -11 -60
$$ packed form
1688A26j62J23p8j50q1K48M2j55J41l19L59j20j40j86L34J10Q5K06l68n3o6J65
1710F1j7J41nj14j37K76l34L37j5j54J93l72J30R2j36J65N8m13J33k3J29j18K7
1733i6j05J91q3N0k18J63M8O5R5l23K81Qk00K39P7k0j56k1J10J5n0j90J68k36
1757a88L06J44j97k84L70j5j30P4j48m5O5k9J54j27q5k7j87L41k25J73j23J56
1779b7K93l33K8N9j17P8K53k93j24K71j87K79l16J64N6j99O4N3N3k0j5O5l4k66
1803b15K7K03K53m05k12N96j10k58m8J48L28k53k52O5K73N5l27J81j22j7J97l01
1825a94L14r8mq2N4L03l35k0j3J97O5k18j68L06Kk12J83m07K16K58j29j7Q1j25
1849d3K18k37R4j17R2j27l7K76j90L1P0j52Q1M9j27j71L71K51m32J51j05M3m9
$$ plain form
1872 -60 -87 -37 -50 46 -189 -76 50 126 232 5 -76 129 -107 -61 133 74 73 96 11 1 185 -96 81 291 -80
1897 -80 192 -177 -6 -36 127 22 281 126 156 131 -105 -9 284 157 25 -36 35 -1 141 -100 -39 145 111
1920 111 -46 53 3 -103 95 -5 -8 -16 253 108 -128 156 54 -12 -401 -351 179 83 98 39 -205 150 -25 116
1944 116 53 -160 -55 -175 175 63 -191 -5 -200 -56 -47 -172 120 54 128 177 -248 -55 -68 177 236 53 -41
1967 -41 -156 15 119 -101 56 190 -132 54 -90 -146 73 29 199 -70 93 -41 19 -85 -22 -78 -139 136
1989 136 -58 76 -154 -42 104 -12 66 0 129 0 7 304 -130 -216 86 173 113 32 40 115 -153 -19 34 31 -11
2014 -11 150 -66 -43 227 -128 -147 171 -47 39 -49 109 70 -184 41 -121 -155 -319 -44 -2 49 -440 13 -36
2037 -36 172 71 83 65 -68 -143 -63 156 42 -58 119 18 -185 -33 -40 178 -182 -124 77 -221 51 12 -2
$$ packed form
1872f0k7N0j3R6k35J13J26P6J06k27q1K05k36M6J94n9jK3q5j0J84k81J77K10l71
1897h0K72l69J71l0J63j05K59j55L0k5k36R6K93j27j32o1P1l6J42k41O1J84l4
1920A11j57R9n0j06J98j00lqK69j45k36K84j02o6l89N0N30r6J5n9k44L55j75J41
1944A16o3k13J05j20L50j12k54J86j95J44Rj25K92o6P4M9m25J93j3K45N9j83r4
1967d1j15J71J04k20J57J34l22J86j44n6K19m4J70k69J63j34O0j04O3n6o1K75
1989A36j94J34k30J12J46j16P8o6J29j29PK97m34q6L02Q7o0q1QP5k68J34N3lm2
2014a1J61k16K3K70l55j9L18k18Q6q8J58l9k54K25j62l4j64K75M2N1m89M53m9
2037c6K08j01J2j8j33p5Q0K19j14j00J77j01k03J52pK18l60N8K01k98K72l9j4
$$ plain form
2060 -2 177 -183 28 -24 68 64 70 -65 12 3 60 -56 35 -73 16 216 32 -143 -106 129 -150 247 -36 -131 -109 -157
2086 -157 28 -93 -17 240 109 34 128 -37 55 -101 72 24 -66 59 215 187 -91 -122 -92 175 -62 -219 163
2109 163 -99 9 17 30 -198 101 -92 -97 129 229 82 -213 6 109 -122 -156 20 -59 141 -66 -166 243
2131 243 -191 230 -19 -34 130 100 159 38 -35 -106 233 -58 226 291 124 44 158 59 177 -24 387 -172 24
2154 24 236 -1 -2 -59 240 -105 56 89 -20 -99 73 -105 137 -10 83 -43 79 -216 262 -66 -2 -39 104
2177 104 127 -181 202 19 -31 43 15 -302 274 124 7 -129 -29 -21 -132 -119 61 -122 61 111 -36 134 46
2200 46 -102 -68 -31 -88 59 -53 -47 103 -90 -234 35 205 19 299 162 97 74 -186 63 61 -142 95 -114
2223 -114 56 -230 -42 10 -87 -20 17 -8 225 337 142 78 -116 -54 120 -68 -70 -67 38 -10 -127 193 3 -61
$$ packed form
2060bJ79l60K11n2R2mOj35P7rN7j16R1j08Q9K00j84j75L7K35k79L97k83r5K2m8
2086a57J85j21P6K57j31p5R4j65R2j56J73m8r0J25J56k8k78l1L0K67k37j57L82
2109A63k62J08QJ3k28K99j93nK26J00j47k95K19J03k31l4J76p9K00k07j00M09
2131B43m34M21k49j5J64l0N9j21p3p1L39k91K84O5j67q0J14r9J18k01M11n59J96
2154B4K12k37jn7K99l45J61L3j09p9J72j78K42j47R3j26J22k95M78l28O4l7J43
2177A04K3l08L83j83n0P4k8l17N76j50j17j36J00Qj11J3J80j83J83N0j47J70q8
2200D6j48L4L7n7J47j12OJ50j93j44K69J70j86K80j37o5k3k60K49kk03K37k09
2223a14J70k86J88N2r7O7L7k5K33J12j95o4j94O2J74j88kLJ05m8j17L20j90o4
$$ plain form
2247 -61 -54 29 70 71 -209 158 212 -28 88 -120 -81 241 -120 89 -20 -189 -26 136 -31 -158 -181 135 48 153
2271 153 158 276 -39 -104 98 -198 -59 -191 175 -367 -163 97 -41 246 -27 76 -30 136 -114 -230 42
2292 42 -21 -96 -79 81 44 39 -152 -23 -5 -140 71 236 -56 211 -277 259 -256 -51 41 93 22 64 -103 -137
2316 -137 -70 12 34 58 -18 -77 -151 -129 113 -117 73 -76 -42 8 51 158 28 -84 -61 -39 -108 -90 21 153 111
2341 111 97 -13 228 -18 348 47 -102 75 -38 -84 40 -9 340 190 18 -41 154 154 37 103 -90 -40 -66
2364 -66 38 -61 206 5 119 234 124 59 -59 70 -120 29 -120 41 40 -34 81 -9 81 8 -238 -153 -80 -249
2388 -249 174 65 51 31 -115 139 27 -52 76 -20 60 115 -74 68 63 -68 98 180 -139 -97 14 65 158 171
2412 171 -36 338 -263 -3 89 2 -312 177 12 -140 -48 151 2 163 -38 176 78 54 -51 -239 -96 126
$$ packed form
2247f1PQ3M1Jk80L67N4k40J16k08L9L22l61K09j09j69J63J62j67j27k3L16q7J05
2271A53NJ18l15o5K02k96J39j32L66n42K04K60j38K87k73J03j06J66k50j16K72
2292D2o3p5J7J60l7nj91J29J8j35K11J65k92K67m88N36n15K05R2N2p1M2j67l4
2316a37O7Q2K2K4p6n9p4K2K42k30J90j49L4N0M3J07j30j12K3K2o9J8J11J32m2
2341A11j4j10K41k46L66l01j49J77j13m6J24m9L49j50j72n9J95%j17O6j93N0k6
2364f6J04r9K67k01J14J15j10o5j18J29j90J49j49J61jp4J15r0R0p3k46Q5P3j69
2388b49M23j09j4k0j46K54j12p9J28r6Q0N5j89J42nj31J66Q2l19M2J11N1R3J3
2412A71k07L74o01K60R2q7l14M89j65j52R2J99j49J61k01K14r8k4j05j88J43K22
$$ plain form
2434 126 319 157 57 -213 -45 177 117 -279 -76 -50 -197 -72 -28 -49 138 267 -47 -201 -221 171 -59 -43
2456 -43 21 -156 138 262 261 -20 13 172 140 -30 -33 -95 160 -29 190 275 -110 8 112 -59 -73 79 -36 -190
2480 -190 154 30 101 180 104 -88 -176 -1 44 41 -176 -28 174 29 -4 37 -215 -139 50 -122 -197 36 -91 -62
2504 -62 -128 -92 -88 -186 160 -85 183 170 -62 -83 -103 -7 193 78 155 19 -92 -181 69 -102 136 236 -65 -92
2528 -92 105 -116 99 260 192 -32 54 -17 -122 101 33 109 -57 -97 77 -126 10 -33 66 55 -305 143 -145
2551 -145 24 133 130 -70 130 141 -164 -4 -156 -74 5 -74 -365 -91 -68 148 -126 -125 -6 -30 -177 -177 49 -35
2575 -35 25 38 -48 -251 114 -68 -279 -210 -60 128 -133 5 -94 -135 -38 -117 -33 -35 -247 189 88 72 165 -228 36
2600 36 -146 -148 -11 -5 -105 -51 149 107 24 -110 -120 -45 7 -192 -143 21 146 -74 -173 117 81 -63 64 135 155
$$ packed form
2434A26J93j62j00k70J68K22o0l96K03K6j47J25M4k1J87J29l14j54k0L92k30J6
2456d3O4j77K94J24jk81L3J59l2j70lo2K55j89K19Q5l85J18J04j71j4J52j15j54
2480a90L44j24P1P9p6j92q8J75M5lk17J48K02j45l3M1k52P6J89j72p5K33j27K9
2504f2o6L6Mr8L46k45K68j3k32k1k0R6K00j15P7j36j11q9K50j71K38J00l01k7
2528i2J97k21K15J61o8k24Q6p1j05K23o8P6j66m0J74k03J36m3R9j1l60M48k88
2551a45J69J09lk00K00J1l05J60j52Q2P9p9k91K74K3K16k74JJ19k4j47%K26q4
2575c5O0J3q6k03L65j82k11O9J50J88k61J38r9m1R7p9Q4kk12M36j01j6R3l93K64
2600C6j82kJ37Oj00N4K00m2q3j34j0P5N2j99M9J64J25k20r9K90l6j44J27P1K0
$$ plain form
2625 155 20 -92 -42 -2 -4 20 154 -119 -106 27 69 -72 18 -25 88 54 -44 -7 62 84 -118 10 127 -106 65
2650 65 -292 -109 -165 -56 43 -155 -113 -172 -43 -35 2 -123 95 -153 61 -71 7 23 -58 179 -216 51 -43 57
2674 57 143 -75 19 13 -78 -66 -130 114 -240 -9 -7 -50 -116 -106 -89 -116 29 -83 -130 -171 54 -179 -45 -196 -87 -3
2700 -3 72 128 -78 203 -104 110 169 154 134 5 217 -86 -39 24 65 -29 10 -86 -136 -115 92 -116 -79 86 -26
2725 -26 41 -66 -24 -75 217 156 328 255 88 -37 -83 129 -51 130 144 72 134 209 102 186 271 -19 -246 159
2749 159 -158 135 -82 24 -89 -110 -120 102 125 -118 -151 -151 -11 70 64 148 -66 -45 -51 -67 154 -128 41 -113 -218
2774 -218 -317 53 -42 47 4 -42 -263 50 -160 -86 169 -105 -246 149 -119 -14 112 73 -82 -247 47 -27 57
2797 57 -102 -1 20 -97 111 -109 -218 137 -174 -70 31 -89 152 -123 -57 14 -181 60 -170 -172 112 139
$$ packed form
2625A55j35j12N0M0kK4J34k73J3J33M2j41R0m3J13l4r8L7O9K2k02J28J17k33J71
2650F5l57J83n6J09R9j98M2n9J29QL7j25K18k48K14j32P8J6q1K37l95K67r4J00
2674E7Q6k18R4or1J2o4K44l54K31Km3o6J0J7k7J45j12m7m1K25k33J34j51J09Q4
2700cP5N6k06K81l07K14N9j5k0j29K12l03M7O3M1r4L9r6n0K1K07k08L7J65j12
2725b6O7j07M2n1K92o1J72p3j67j25m6K12j80J81J4p2O2P5j07Q4Q5k90k27M05
2749A59l17K93k17J06j13k1j0K22K3k43l3%J40Q1oQ4k14K1oj6K21k82J69j54j05
2774b18r9L70r5Q9m3m6k21L13k10P4K55k74j41L95k68J05J26l9j55j65K94p4Q4
2797E7j59J01K1j17K08k20j09L55l11J04J01j20K41k75O6P1j95K41k30kK84K7
$$ plain form
2819 139 -16 102 -129 -100 28 -34 3 94 90 -109 51 90 -53 -175 136 -22 -9 -34 -33 -62 6 101 143 18 70
2844 70 -103 -217 56 15 29 337 88 -93 -141 71 89 -148 197 65 -92 -73 102 86 122 -35 465 15 -215
2867 -215 -105 39 -96 -348 -85 98 56 152 121 75 -86 151 134 48 -97 -193 -121 -242 31 -9 87 11 -180 -49
2891 -49 335 233 -138 146 58 -12 57 276 -176 -1 -177 -22 -16 -68 177 -6 -132 -267 -113 140 -64 367
2913 367 -65 -156 -18 -31 -24 128 -2 21 107 163 103 -80 -171 -103 -105 -66 -235 115 -290 -53 -76 -135 -45 62 -156
2938 -156 119 170 14 15 -43 82 65 76 45 -141 -214 12 -181 130 30 193 -100 -36 -49 -23 -20 -49 56 -99 -17
2963 -17 -33 78 21 -6 -352 -87 121 -35 -102 51 -127 -26 62 130 -107 -249 -112 283 134 144 -89 70 140
2986 140 -16 62 -58 -241 102 27 136 129 -31 -43 -127 -340 -167 149 3 236 194 -18 11 -50 -146 107 191 -94
$$ packed form
2819A39j55J18k31K9J28o2L7R1mj99J60L9j43j22L11j58J3k5Jk9O8R5M2j25N2
2844G0j73j14K73m1J4L08k49j81m8K12J8k37L45j32j57J9J75j6L6j57N00m50k30
2867b15J10J44j35k52K63J83m2R6l1m6j61K37j7q6j45r6P2j21K73m0R6p6j91J31
2891d9L84j02l71K84q8p0O9K19m52J75j76J55On2K45j83j26j35J54K53k04M31
2913C67m32r1J38j3PJ52j30K3Q6N6o0j83r1O8kL9j69L50m05K37k3n9R0J07k18
2938a56K75N1j56Jn8J25j7J1l1j86p3K26j93L11j00J63k93O4j3K6Lk9J05j55Q2
2963a7j6J11n7k7l46K65K08j56o7J53j78J01Q8O8k37j42J37L95j49J0k33J59P0
2986A40j56P8j20j83L43p5J09pj60j2q4k13J73L16j46K33m2k12K9o1r6K53Q4k85
$$ plain form
3010 -94 156 257 -69 -140 -37 -79 -124 62 -79 -224 104 91 40 87 -113 62 -86 284 -165 -57 -232 272
3032 272 -178 221 -189 117 -14 -271 -139 -344 15 -27 -134 54 97 123 47 -293 -103 137 -88 -143 112 95
3054 95 -138 62 222 -196 236 14 124 -22 -139 -219 77 70 -220 25 -102 316 -15 197 -10 -72 -87 92
3076 92 86 195 -50 -76 -42 -139 -156 8 46 -200 87 -77 -160 73 262 22 -35 39 85 123 165 181 139 39 -120
3101 -120 -100 62 -108 122 -121 -207 48 74 180 101 -120 -78 -112 -232 -241 -112 -223 -285 177 -1 126 106 18 171
3125 171 124 88 15 161 -34 -227 -80 119 -93 -5 81 14 110 -266 143 127 -26 -149 22 94 -107 -221 -115
3148 -115 67 93 -2 70 153 63 -68 214 -207 -95 152 166 99 -207 17 -62 217 189 83 177 -58 126 -4
3171 -4 -58 -131 -185 2 -158 -14 163 183 -74 65 -100 -265 86 -182 -55 7 120 -197 95 148 127 -33 -26 135
$$ packed form
3010i4K50J01l26p1J03m2m5J86j41j45L28j3n1M7k00J75j48L70m49J08j75N04
3032B72m50L99m10L06j31k57J32k05L59m2j07J88M3K6p6l40J90K40k25n5K55j7
3054I5k33K00J60m18M32k22J10j46j17q0K96pk90K45j27M18l31K12k07o2j5J79
3076I2oJ09k45k6L4r7j7J64L8k46K87j64q3K33J89k40n7P4M6L8M2J6m2j00j59
3101a20K0J62j70K30k43q6K55K6J06p9k21M2l4j20rJ29j11o2M62j78J27k0q8J53
3125A71m7l6p3J46j95j93J47J99k12Q8Q6o7R6l76M09j6j53j23J71P2k01j14J06
3148a15J82K6r5P2Q3r0j31K82m21J12K47J4o7l06K24p9K79k8j06R4k35J84j30
3171dn4p3n4J87j60J44J77K0k57J39j65j65L51k68J27O2J13l17K92N3k1j60PJ61
$$ plain form
3195 135 -130 53 -140 234 -141 -129 -33 -59 -86 186 28 154 -205 -40 -21 20 -116 265 93 119 -49 -109 80
3218 80 130 -9 186 148 29 -77 -144 68 -54 223 -200 -10 -112 -23 44 -10 -277 109 -180 102 -78 62
3240 62 -71 -203 -62 86 -60 -41 -123 -133 80 -270 -123 -77 -52 387 -225 -111 110 172 -28 -100 -112 137 -125
3263 -125 -12 192 98 21 -139 -292 -243 -88 -197 257 124 31 154 228 156 49 -23 -5 5 -49 91 14 55 157
3287 157 -87 -248 -46 223 125 -189 -48 -228 -125 -2 -50 -350 -130 38 -303 -161 -35 -188 143 13 77
3308 77 -104 -37 56 135 -21 35 134 127 305 104 -131 -191 -226 7 101 -120 -107 -131 230 108 -33 33 69 -48 7
3333 7 -56 -88 153 241 255 35 -45 227 34 175 -214 -198 -147 70 40 51 42 25 101 -80 -88 68 220 109 -186 -69
3359 -69 196 -128 -219 259 257 56 92 198 -30 -14 143 -200 76 -97 -38 106 209 -6 -161 -75 -76 62 -4 32
$$ packed form
3195A35k65J83j93L74l75J2R6k6k7K72j58J26l59J65J9M1j36L81j72K6j68o0J89
3218H0N0j39J95l8j19j06o7K12j22K77m23J90j02Q9O7n4k67L86k89K82j80J40
3240F2j33j32J41J48j46J9q2j0K13l50J47M6K5M39o12J14K21O2k00p2j2K49k62
3263a25J13K04r4p7j60j53M9J55j09M54j33r3J23P4p2j07p2J8J0n4J40p7M1J02
3287A57k44j61K02K69r8l14J41j80J03J23m8l00K20J68l41J42J26j53L31j30O4
3308G7j81O7R3P9j56N6R9pJ78k01k35o0l5K33R4k21J3k4L61j22j41O6L6j17N5
3333Go3l2K41Q8J4k20q0K72j93J41l89J6N1K17l0J1rj7P6j81qJ56J52j11k95J17
3359f9K65l24r1M78kk01L6J06k28J6J57l43K76j73N9J44J03k15j55Q6jJ38o6L6
$$ plain form
3383 32 38 -62 -174 49 13 38 -16 236 97 -168 110 -28 154 74 -95 143 -19 -167 73 15 -146 90 51
3406 51 -337 -15 106 92 309 75 55 -52 7 125 -152 40 97 -78 -262 95 116 272 -313 59 87 199
3428 199 43 286 163 143 117 -117 195 214 139 61 -182 -2 208 133 90 -34 -73 201 -197 79 214 185 255
3451 255 94 -181 37 75 248 294 117 87 -63 -197 122 -52 -9 -228 135 254 93 -58 -112 64 121 48
3473 48 -57 -68 13 138 136 -21 144 -271 163 -11 -66 382 214 121 -24 -122 28 -4 -65 -125 -162 71 -92 -43
3497 -43 66 126 139 64 -98 -93 79 -183 -12 220 75 37 156 0 16 -115 -19 45 189 67 -47 -39 -193 143
3521 143 37 -140 70 -248 -38 -57 59 -109 70 202 -96 52 80 6 195 -111 159 265 137 47 -255
3542 -255 -194 10 -166 -82 -16 -74 242 20 12 -195 -56 41 9 -166 43 107 -102 99 94 31 -130 5 90 -48
$$ packed form
3383C2Oj00j12K23l6K5n4K52j39k65K78j38J82q0j69K38j62j48K40n8j61K36l9
3406E1l88L22J21j4K17k34k0j07N9J18k77J92N7j75j84L57K1J56n85L72K8J12
3428A99j56K43j23k0k6k34L12J9p5p8k43J80K10p5m3j24l9K74l98K76J35k9P0
3451B55j61k75K18L8J73M6j77l0j50j34L19j74M3k19L63J19j61j51n4J76N7p3
3473D8j05j1Q1J25kj57J65m15M34j74n5M48j68r3j45r8J50l2o1o0l7K33j63M9
3497d3J09O0J3p5j62NJ72k62J71K32j45l8J19j56J6j31R6O4J44j22j14Qj54L36
3521A43j06j77K10l18K10j9J16j68J79J32k98J48K8p4J89l06K70J06j28r0l02
3542b55O1K04j76Q4O6n8L16k22qk07J39R7l2j75K09O4k09K01no3j61J35Q5j38
$$ plain form
3566 -48 26 -57 -49 -79 60 155 90 -208 -13 102 232 -162 -175 24 -141 153 63 12 259 38 -120 -116 65 55 -81
3591 -81 3 -50 45 -265 -239 -115 191 -60 -61 163 162 88 91 -37 256 32 103 -89 116 95 225 24 -126 -318 -131
3616 -131 -17 20 37 -65 -136 88 162 -171 6 -46 170 -130 17 -133 13 -251 -15 -107 -150 -24 -118 -316 102
3639 102 87 25 118 -47 109 14 -10 0 -64 -5 65 -48 187 -81 -194 -53 -80 152 62 -97 -105 100 7 -39 74
3664 74 164 69 117 -243 343 -79 -294 41 144 101 79 51 81 126 -205 55 42 161 -92 359 45 -114 70
3687 70 5 19 114 -61 218 -19 -77 95 54 107 -72 -45 -69 -17 -234 77 -181 -51 -15 -148 -110 128 91 320
3711 320 -22 170 -193 218 132 -213 3 80 -6 -101 58 -102 160 96 71 -159 -58 291 216 68 -27 -120 142
3734 142 105 79 -31 112 49 101 -106 17 46 -68 -11 -100 -53 158 -58 19 84 -136 -82 -158 -37 33 -42 -112 127
$$ packed form
3566d8P4q3Ql0J39R5o5k98J95J15J30l94j3J99j65K94r0n1K47k21j58MJ81j0j36
3591h1Q4n3R5l10K6J24L06k51jK24jp4Lj28K93k24P1j92K05k1J30k01j50j92J87
3616a31J14L7J7j02p1K24P4l33J77n2K16l00J47j50J46k64K36r2m3J26r4j98M18
3639A02j5o2R3j65J56r5k4J0o4N9P0j13K35k68j13J41k7K32r0j59qK05r3m6J13
3664G4R0r5M8l60N86m22k15L35J03m3k2k8L0M5l31K60j3J19k53M51l14j59J84
3687G0o5J4R5j75K79k37n8J72m1N3j79K7k4N2k17L11k58J30L6j33L8K38l7K29
3711C20l42J92l63M11q6l45K16P7q6r5J59j60K62o4k5k30J01L49p5j48r5r3K62
3734A42l7k6j10J43o3N2k07J23K9j14N7q9M7K11k16P7O5k20N4p6J21P0p5p0K39
$$ plain form
3759 127 73 -3 -9 -66 82 208 -65 51 177 117 222 99 -90 -424 34 -192 -60 75 15 1 -39 42 -45 161
3783 161 -7 21 94 -116 -102 66 -19 -128 43 -131 -13 -138 -50 -93 70 160 -233 93 -96 87 -17 76 -70
3806 -70 -6 -275 -12 23 -73 -63 151 -48 154 -67 27 -80 37 -84 103 120 -156 -2 -128 -41 -43 -139 143 61
3830 61 134 45 53 47 116 -184 -13 130 161 146 -102 -224 74 247 11 -150 -163 -87 22 32 -217 -165 72 125 -72
3855 -72 9 129 122 75 -19 -254 65 -163 -40 88 149 81 -39 -352 -99 -59 302 -211 -86 78 162 -32 173
3878 173 -51 -111 123 214 -80 12 56 27 57 -140 -5 -34 -112 29 -149 -195 -59 -68 -152 32 -91 -1 337 -5
3902 -5 -111 107 99 -222 -164 20 92 202 224 11 -19 113 -33 -207 -25 -71 -283 -34 -99 -113 -107 141 136 184 -152
3927 -152 -7 15 96 -100 16 95 98 15 16 -222 -15 269 -253 -68 63 -68 -135 -132 185 323 -145 -199 158 28
$$ packed form
3759A27n4p6on7J48J26k73J16J26o0J05j23j89l34M58k26J32J35o0j4m0Q1q7K06
3783A61j68K8P3k10J4J68q5j09J71j74J18j25Q8m3J63R0l93L26j89J83j04R3j46
3806g0O4k69K63L5r6J0K14j99K02k21R4j07J17j21J87J7k76J54j26Q7kr6K82q2
3830F1P3q9QoO9l00J71J43L1j5k48j22K98J73k36j61j3P6J09J0k49N2K37N3j97
3855g2Q1J20pm7r4k35L19k28J23J28O1o8j20l13K53M0L61n13J25J64Q4j94K05
3878A73k24o0K34R1k94R2M4k9L0j97J35k9p8J41j78m6J36rq4J84j23R0L38l42
3902ej06K18ql21N8J84P2J10K2k13l0J32j46j74J82m6k12K49o5j4OK48nM8l36
3927a52J45K2Q1j96J16P9Lq3Jk38K07K84n22J85J31j31o7LL17J38m68n4L57j30
$$ plain form
3951 28 9 -73 -166 -85 54 45 93 177 130 -13 -38 99 -132 30 -40 276 -174 -222 142 152 9 -300 40 36 -98
3976 -98 170 -21 -102 195 252 120 79 227 115 260 -32 39 83 -296 39 -16 -62 9 33 201 16 8 78 -71
4000 -71 -28 -182 -75 -56 -2 43 -23 -4 37 -122 -48 -49 -99 -53 255 -182 78 32 -148 -112 91 -14 -150 -7 -77
4025 -77 -10 14 -131 75 34 108 8 98 188 -29 -113 -90 -122 -193 155 -72 101 323 94 -149 -188 -76 195 -126
4049 -126 119 -70 148 3 -94 112 74 169 251 40 82 9 130 -115 95 157 -81 136 93 -224 59 43 -110
4072 -110 -177 -14 30 277 84 -132 -106 -126 14 -191 89 120 206 -225 9 -305 -212 149 45 -83 -15 -95 133
4095 133 196 13 -123 156 -32 22 385 -53 164 22 193 -135 -36 -79 -140 39 -29 -85 -73 -159 -37 231 -160
4118 -160 61 -4 18 175 67 -45 89 121 -34 0 58 -49 -10 82 17 -33 -24 -153 -25 -102 39 259 133 13
$$ packed form
3951B8j9q2r3Q1J39rM8Q4m7j43k5J37k31J62p0L16m50m8L64J0j43l09L40mj34
3976i8K68j91q1K97N7j32m1J48j12J45k92P1M4l79L35n5m6P1K4J68j85qP0j49
4000g1M3j54J07J9N4M5o6J9M1j59P4jn0M6L08m37K60m6j80L6K03j05j36J43p0
4025g7O7K4j45K06m1P4j00R0R0k17q4K3l2p1L48k27J73K22k29k43l9J12K71l21
4049a26K45j89K18j45r7K06l8R5Q2k11M2p3J21k45K10O2k38K17m3l17K83j6j53
4072a10o7J63M4K47j93k16K6k0J40k05K80L1Q6m31K34l14R3L61j04j28O8q0K28
4095A33O3j83j36K79j88N4L63m38K17j42J71l28R9m3o1J79o8n6J2q6J22K68l91
4118a60K21o5K2J57j08j12J34L2j55L4N8j07L9R2o5n0Rj29J28p7J41K20j26j20
$$ plain form
4142 13 0 -19 229 154 240 -25 233 -78 -88 36 -111 77 2 45 -127 38 -25 -32 -54 77 210 -96 -57 -142 -132
4167 -132 -136 56 97 0 -95 211 25 -192 57 138 109 -103 153 -62 -76 -140 -29 160 -167 109 -102 -116 258
4190 258 -18 -125 261 -181 89 185 -122 17 -59 -213 82 -100 63 67 -21 175 124 -26 -118 -250 116 138 -142
4213 -142 -23 -17 9 -78 -188 -200 -46 -60 152 199 3 -38 -357 -39 -65 185 -108 72 -13 129 14 9 86 46 -189
4238 -189 112 282 43 289 -13 -97 25 -194 242 -25 -216 133 -36 -171 -255 88 122 -89 -136 82 -106
4259 -106 147 -68 -160 -60 -2 -119 236 -64 89 -101 138 84 -343 40 11 219 167 -59 -88 -9 -156 -164 -143
4282 -143 -201 3 113 17 -73 112 -98 61 160 7 -90 -100 125 -33 -217 -33 263 39 6 250 -66 -191
4304 -191 73 -29 85 22 -98 -238 -29 109 -24 -64 128 28 33 34 -99 -33 -6 84 -190 146 17 -73 291
$$ packed form
4142A3j3j9K48p5Q6k65K58l11j0J24j47J88p5M3j72J65o3pk2J31J33l06L9q5J0
4167a32mJ92M1r7r5L06j86k17K49Q1k9k12K56k15j4o4J11J89l27K76k11j4L74
4190B58k76j07L86m42K70R6l07J39p6j54K95j82J63Mq8J96n1j50r2j32L66K2k80
4213a42J19OK6q7j10j2J54j4K12M7j96m1l19L18k6K50k93J80q5J42j15nP7m0k35
4238a89L01J70k39K46l02q4J22k19M36k67j91L49j69j35q4L43L4k11m7K18j88
4259a06K53k15r2J00N8j17L55l00J53j90K39n4m27L83k9K08n2k26k9P9j47qK1
4282a43n8K04J10r6r0J85k10J59R9j53r7j0K25j58j84J84K96k24l3K44l16j25
4304a91K64j02J14o3j20j40K09J38j33m0J92j00NJj33O6K7R0k74L36j29r0L64
$$ plain form
4327 291 95 -157 -133 99 61 109 -40 -110 -134 16 -126 22 135 -102 103 -172 -130 59 -126 96 -8 236
4349 236 15 -133 -282 165 104 -8 23 -184 85 123 274 -52 61 146 49 -160 -42 231 11 -85 79 304
4371 304 -16 119 135 281 3 147 -91 21 -123 -106 -73 94 133 17 -72 -223 11 -62 279 -94 261 -88
4393 -88 -217 -21 131 -197 12 -174 236 8 -74 -133 -49 -146 -237 -35 -122 183 -310 -108 129 111 -86 122 -167
4416 -167 220 222 85 -269 -318 97 124 70 -126 -5 -3 70 49 95 252 -15 -211 -62 178 -171 -10 -155 -100 -67
4440 -67 127 -34 35 -163 89 46 51 67 -35 -106 -36 -75 79 235 76 -82 -82 206 22 -59 221 62 -32 176
4464 176 17 204 199 108 38 -95 -110 -88 40 -191 -67 170 117 72 -29 4 25 -132 71 -151 -13 61 -265 76
4488 76 210 -5 -73 112 21 70 -188 230 152 57 132 58 -37 -87 81 229 -85 -128 -45 -159 42 41 -133 0 2
$$ packed form
4327B91j96k52K4K32l8M8j49p0k4J50j42J48J13k37K05k75M2J89j85K22j04K44
4349B36k21j48j49M47o1j12L1k07K69L8J51l26J13Q5r7k09J18K73k20r6J64K25
4371C04l20J35J6J46k78J44k38J12j44J7L3J67L9j16q9j51K34p3L41l73L55l49
4393h8j29J96J52l28K09j86M10k28q2n9Q4r7r1K02q7L05m93K02K37j8j97K08k89
4416a67L87Kj37l54m9M15K7n4j96J21KP3k1M6J57k67j96J49K40l49J61j45N5L3
4440f7J94j61O9j98K52m3NJ6j02p1P0l9J54J56j59j58%K88j84q1K80j59r4K08
4464A76j59J87nr1p0j33j5K2J28k31J24K37n3m5j01L3K1j57K03k22J38P4l26L41
4488G6J34k15o8J85r1M9k58M18p8r5P5p4r5n0J68J48l14m3Q3j14K01jj74J33K
$$ plain form
4513 2 -2 -37 1 -65 83 269 117 78 -120 196 -390 -222 -270 71 137 261 -18 -132 -224 186 -11 -194 -228 -191
4537 -191 -148 8 -89 -196 2 46 22 36 -72 -37 69 135 78 88 90 102 108 -74 213 -67 191 195 161 -98 -47 37
4563 37 197 -103 -29 86 90 41 -198 12 2 -88 59 -131 189 89 -12 -183 90 -197 -4 97 -16 99
4585 99 -85 83 29 45 -112 -222 -128 -45 -30 13 -65 -181 -75 44 -10 -150 -121 -223 -14 -189 -137 237 121 269
4609 269 36 242 -107 -35 81 -145 93 99 -18 -77 -44 -200 45 52 -99 95 -185 18 64 26 58 53 -10 -18 88
4634 88 -126 103 -54 171 -65 -105 113 -31 -80 -64 43 -49 -39 -117 -173 359 176 135 -228 -292 -162 -22 -11 46
4658 46 57 77 -126 36 62 90 67 6 -8 -38 17 -42 -77 6 -262 -186 -59 9 39 40 34 -241 -58 -45 -25 102 -174
4685 -174 293 230 94 -25 -8 -13 -125 122 -46 -112 191 46 -80 50 -24 88 19 136 -10 -136 94 201
$$ packed form
4513Bml5L8o6J48J86j52l9j98L16n86J68m8L41O6J24k79j14r2M10j97j83l4L7
4537a91M3J56r7j07J98M4k4J4j08L5J06O6n7J0KJ2Oj82K87k80K58Ml4k59N1Q4
4563C7J60l00P4J15Mm9k39K10j0r0J47j90L20j00j01j71K73k87J93J01j13J15
4585I9j84J68n4J6j57j10R4Q3J5M3p8j16J06J19n4j40K9j02K09j75N2L74j16J48
4609B69k33K06l49P2J16k26K38Oj17n9L3j56K45Pj51J94k80K03M6l8L2no3qJ06
4634H8k14K29j57K25k36m0K18j44m9J6J07r2J0p8n6N32j83m1l63o4J30J40J1N7
4658D6J1K0k03J62K6K8k3o1j4l0N5n9l5Q3k68P6J27O8L0Jok75J83J3K0J27k76
4685a74M67o3j36j19J7nj12K47j68o6L03j45j26J30p4J12o9J17j46j26K30J07
$$ plain form
4707 201 -112 -192 -157 78 242 23 182 -79 103 177 64 -23 291 7 -127 -47 -26 -15 -107 -69 187 -63 -245
4730 -245 -99 -48 -217 -58 179 -178 140 194 -124 33 92 242 -213 -176 15 80 132 197 85 136 128 74 -35 -163
4754 -163 -21 -151 97 -11 -97 -197 -142 -75 -29 90 -156 -22 -277 -40 149 -47 -85 -86 -42 -110 -62 111 144 -59
4778 -59 -106 -111 20 73 16 -7 26 99 -18 -83 -135 -74 55 -38 -82 227 -53 -89 -90 -53 -26 24 132 206 -29 -54 121
4805 121 -21 168 -196 -116 -199 43 221 -6 347 98 41 -311 -59 52 -186 28 36 172 -118 190 -39 75
4827 75 32 -56 15 -112 7 -6 -311 57 149 335 98 -38 -213 -28 162 -11 15 -22 65 -93 -144 134 34
4850 34 51 18 167 70 246 -76 134 -12 66 -122 -157 161 62 -39 41 -10 37 -120 -313 178 -39 61 36 -146
4874 -146 -48 -102 10 72 329 59 -153 64 -62 155 -176 -201 30 118 -31 183 15 -51 -33 155 -38 11 175
$$ packed form
4707B01l13q0L5K35J64k19J59k61J82P4j13q7L14k84j34Q0K1J1r2L8K56k50j82
4730b45J46N1j69J59K37l57L18N4l18J57N9J50m55L7J91O5N2O5j12N1qn4j09j28
4754a63J42j30K48j08q6j00N5O7M6J19k46J34k55K37J89j96l8jM4o8M8J73L3k03
4778e9m7nJ31N3n7k3L3P3j17o5n2O1J29r3m4L09k80l6jL7K7N0J08P4k35k5J75
4805A21j42J89l64Q0q3K42J78k27L53k49n7l52K52J11k38K14QJ36k90L08k29J14
4827G5m3q8P1j27J19j3l05L68R2J86k37j36j75J85J90j73K6l7Q7j58n1K78j00
4850C4J7l3J49r7J76l22K10j46P8j88l5L18r9j01Q0n1M7j57j93M91k17J00k5j82
4874a46R8n4J12O2K57k70k12K17j26K17l31k5K31Q8j49K14j68o6J8J88j93M9J64
$$ plain form
4897 175 41 -6 -43 -173 -66 -221 87 48 -176 -129 52 -90 128 64 -98 -119 -108 185 -94 -46 121 -6 -34
4920 -34 15 51 21 -147 8 -105 -152 -21 61 -27 -23 -88 207 110 158 -62 -116 -131 217 67 56 -63 120 238 -117
4945 -117 -367 79 87 -24 -9 50 -24 206 54 219 27 -110 35 -14 233 91 -61 -74 5 142 4 -136 62
4968 62 -18 301 -83 -80 -311 160 145 -203 41 21 232 398 -32 79 144 -50 -109 24 -53 76 201 -26 84
4991 84 -50 68 -252 21 -145 -241 -99 -65 -19 105 -5 183 -5 85 -235 -75 42 87 -17 -238 -64 149
5013 149 -2 130 -209 -109 146 -56 -116 139 -145 83 25 -195 188 -125 -117 -80 133 17 -12 33 -110 67
5035 67 18 -205 -10 21 -22 -57 -64 8 12 -53 -147 109 273 -188 -89 -172 -114 -227 -161 111 -76 -87 -133 112 16 -116
5061 -116 -56 -102 -1 -189 193 94 -180 130 -34 150 28 71 20 127 -71 -101 -45 109 -44 35 16 -54 202
$$ packed form
4897A75j34m7l7j30J07j55L08l9k24M7J81j42K18o4j62k1J1K93k79M8J67j27k8
4920c4M9L6l0j68J55j13m7J31Q2q8Mo5K95r7M8k20n4j5L48j50j1j19J83J18l55
4945a17k50M46Qj11J5N9p4K30j52J65j92j37J45m9K47j42j52j3P9J37j38j40J98
4968F2q0L19l84Lk31M71j5l48K44k0K11J66m30J11O5j94n9J33p7J29J25k27J10
4991H4j34J18l20K73j66r6J42L4M6J24j10J88j88R0l20J60J17M5j04k21J74K13
5013A49j51J32l39J00K55k02o0K55k84K28n8k20L83l13QL7K13j16k9M5j43J77
5035F7m9k23J95L1m3l5pP2Mo5r4K56J64m61R9q3N8j13O6K72j87j1m6K45r6j32
5061a16O0m6J01j88L82r9k74L10j64J84j22M3n1J07j98l0N6J54j53P9j9p0K56
$$ plain form
5084 202 -83 98 34 94 -66 167 -81 135 209 64 12 50 162 173 -71 -205 -241 -201 9 29 162 -32 74
5107 74 -33 242 76 -133 -205 -44 -203 97 -149 123 149 -86 25 -6 51 -10 18 -105 -90 -177 42 181 272
5130 272 89 39 -8 -196 -2 -91 103 -33 121 -223 87 78 -109 -53 -144 -38 -9 -93 -13 -3 33 -44 4 -61 -3
5155 -3 1 212 -89 105 39 -99 -95 282 57 -5 -66 -175 39 52 130 60 -66 85 162 109 94 -161 103 -30 77
5180 77 22 128 -51 40 408 150 -84 26 192 -55 -149 202 -61 25 -148 134 11 -226 104 -101 128 -36
5202 -36 -116 -165 115 -59 -133 -66 13 -121 211 8 168 -44 1 144 19 206 -174 239 84 -2 -8 176 -34
5225 -34 82 -92 15 -135 -67 -82 39 88 -53 -11 -77 -29 198 -80 297 -13 -87 19 -127 -8 53 -28 -99 -67
5249 -67 108 -53 73 -175 71 30 -120 7 -43 -91 52 11 67 26 319 230 -19 -97 29 25 -110 205 64 -5
$$ packed form
5084B02k85J81o4O0j60K33k48K16P4j45n2L8J12J1k44j34l6M0K10K0J33j94J06
5107G4j07K75j66k09p2J61j59L00k46K72K6k35J11l1N7o1K8j23J5q7K19J39R1
5130B72j83n0m7j88J94q9J94j36J54l44L10rj87N6r1J06K9q4Q0J0L6p7M8o5N8
5155cMK11l01J94o6j38ML77k25o2o1j09K14J3P8p0j26J51P7n3j5k55K64j33J07
5180G7n5J06j79R1L68k58k34J10J66k47r4L51k63Q6j73K82j23k37L30k05K29j64
5202c6q0m9K80j74p4O7P9j34L32k03J60k12M5J43j25J87l80M13j55q6oJ84k10
5225c4J16j74J07j50O8j5J21M9j41M2o6M8K27k78L77l10p4J06j46J19O1q1p1L2
5249f7J75j61J26k48K46m1j50J27n0m8J43m1N6m1K93q9k49p8J26mj35L15j41o9
$$ plain form
5273 -5 -200 -29 -30 56 151 327 93 178 -112 -189 108 188 -36 -19 9 -66 12 84 61 -143 -17 -271 -122 38 -34
5298 -34 -71 91 -317 -149 64 -34 111 -124 -254 -21 79 -120 -87 161 81 -52 35 -76 76 -172 85 73
5320 73 -71 42 5 -7 150 62 257 14 -128 -98 -72 24 39 -30 34 -79 65 39 -102 17 175 232 -13 -173
5344 -173 -155 -218 -61 -205 -22 26 -145 -149 72 -193 -95 -141 149 3 164 126 -157 -44 -157 -354 124 87 44
5367 44 85 -141 93 -239 48 -31 -144 99 103 -52 -68 -6 83 104 252 -17 92 4 112 9 -44 -112 -100 187
5391 187 20 -295 -52 -33 -106 -62 29 51 -90 -78 -135 140 -169 45 451 107 23 235 -257 280 68 172 115
5414 115 -37 -145 54 154 -138 -133 120 99 -65 -18 170 -109 58 -23 -153 -49 -110 258 -383 160 -48 -123
5436 -123 -68 17 -17 -105 -57 110 290 101 177 75 -78 8 -14 -193 172 98 -10 -47 80 217 -42 88 64 134
$$ packed form
5273ej95J71jQ6R5J76k34Q5k90p7K97Q0k24J7K8p5P8P2k3k04J26k54J49J60p2
5298c4l7J62m08J68K13r8J45k35j30K33J00j99L3K48q0j33Q7j11J52k48K57j2
5320G3j44J13l7j2J57q8J95k43j42L0K6R6J5o9O4j13J44k6j41J19J58N7k45j60
5344a73J8o3J57j44J83M8j71mK21k65R8m6K90j46J61l8k83J13j13j97M78l7m3
5367D4M1k26K34l32K87p9j13K43Mj55j6O2Q9K1J48k69J09q8J08j03n3o8J2K87
5391A87j67l15K43J9p3M4R1K2j41J2n7K75l09K14M06l44q4K12m92N37k12J04n7
5414A15j52j08J99J00k92NK53k1j64M7J88k79J67q1j30J04o1L68o41N43k08p5
5436a23N5Q5l4q8M8J67J80j89P6j02j53Q6k2j79L65p4j08l7J27J37k59J30k4P0
$$ plain form
5460 134 -32 -165 -26 -6 14 208 89 31 -5 -202 6 -85 66 166 -23 102 -13 100 -122 59 -93 -88
5482 -88 35 -20 22 40 64 -2 155 45 -158 -154 116 79 57 -135 90 -69 127 -269 -114 -66 -43 -111 -192 26 -66
5507 -66 -250 188 87 17 -86 42 -51 99 -166 -146 66 120 79 -191 40 -92 72 81 293 200 138 82 2 -299
5531 -299 86 77 29 -33 244 -15 120 -39 106 -78 -159 114 -88 -161 4 104 70 68 92 -279 -92 48 184
5554 184 -33 -18 22 -30 5 -173 -231 -232 -73 -95 64 -137 -206 -77 -5 -69 -50 105 51 124 18 -274 72 -95 265
5579 265 -93 -34 -31 -178 -48 3 -216 45 96 -25 217 -124 212 52 11 -61 81 73 -64 -153 -22 -340 -129
5602 -129 47 19 40 -54 311 -365 -43 168 97 337 -112 -61 -302 -160 -11 228 173 -387 -214 234 149 132 -20
5625 -20 -126 154 58 -12 -379 20 125 -128 -141 -72 132 -124 139 -160 294 -128 -157 -110 140 -48 191 43
$$ packed form
5460A34j66j33J39K0K0J94j19n8l6j97K08r1J51J00j89J25j15J13k22J81j52N
5482h8J23n5M2J8K4o6J57j10k03MK70l7k2j92K25j59J96l96J55M8K3o8q1K18r2
5507f6j84M38j01p0j03J28r3J50k65K0K12N4m1k70K31j32J64RK12r3o2n6q0l01
5531b99L85rm8o2K77k59J35j59J45j84q1K73k02p3J65J00l4kK4l71J87J40J36
5554A84k17J5M0n2L5j78n8jJ59k2J59k01o9J29P2o4J9J55n4P3j06k92L46j67L60
5579B65l58N9Lj47J30N1k19K61N1j21K42l41L36j60m1p2J42qj37q9J31l18K11
5602a29J76k8K1r4L65o76L22K11p1K40m49N1k41J42J49K39n5n60J73M48q5j7j52
5625b0j06K80r6p0l67L99J05k53j3O9K04k56K63k99M54m22k9M7K50j88K39j48
$$ plain form
5647 43 -214 -145 78 91 -53 -68 -61 -136 -27 -13 68 -107 -37 153 121 -68 -220 53 -103 29 -104 115 -156 325
5671 325 -75 208 -131 81 76 84 -45 -130 12 102 -48 242 -40 -340 -106 381 271 -115 -66 -13 38 -12 -122
5694 -122 -98 30 -120 279 122 -99 253 34 -89 -147 115 130 -7 -35 18 78 -305 -8 137 152 -172 12
5716 12 81 207 52 20 -97 -50 -46 -239 -113 202 144 -96 24 -165 104 52 69 -174 -93 153 170 56 48 41 -75
5741 -75 121 -69 52 -26 17 -117 -105 -156 28 -16 -29 -15 -34 -126 -81 35 -60 152 53 -103 -341 -67 82 -142
5765 -142 47 52 -11 78 -189 -15 161 -48 80 -2 -322 115 -98 24 89 113 179 -55 -37 119 -192 -67 114
5788 114 32 -176 -159 -53 94 -56 -1 -17 50 74 190 288 17 185 -136 64 -261 -11 -2 88 46 -262 -73 -96
5812 -96 15 30 -112 237 53 227 132 -27 8 1 -145 127 -35 -133 39 42 -53 -32 87 150 0 91 3 73 -34
$$ packed form
5647D3k57O9K23J3j44j5Pp5J09J4Q1j75P0J90l2j89j52K73j56J32j33K19k71M81
5671C25m00K83l39K12nQj29q5J42R0j50K90k82l00K34M87j10l86M9N3N1n0j10
5694a22K4J28j50L99j57k21L52k19j23n8K62J5j37k8N3O0l83K97J45J5l24J84
5716A2O9J26j55l2j17M7Mj93J26L15n8k40J20j89K69n2J7k43Q1K46J7j14qpj16
5741g5J96j90J21p8M3j34J2n1J84m4j3J4j9r2M5J16r5K12r9j56k38K74J49k24
5765a42J89No3Q9k67J74J76k09J28q2l20M37k13J22O5K4O6k34J8J56l11J25J81
5788A14q2k08J7J06J47j50N5j6O7K4J16R8k71J68l21K00l25K50RR0m2l08J89k3
5812i6J11J5j42L49j84J74r5j59L5pj46K72j62r8J72Lr5K1J19O3j50R1q8P0j07
$$ plain form
5837 -34 -84 -216 66 -124 -10 -19 11 121 127 90 9 -76 9 187 50 49 -31 165 -50 144 206 140 -48 -45 154 -325
5863 -325 113 -11 45 -69 81 105 115 192 -56 -66 -176 47 -5 -269 -232 -9 -65 132 -260 72 -28 42 75
5886 75 63 -16 -153 77 86 -124 54 37 101 108 -218 -12 20 -31 -160 -118 -171 125 183 -109 -107 76 167 -62 249 51
5912 51 47 -26 -149 -9 -144 156 -69 213 -45 4 -8 -205 31 -42 -161 22 -39 148 -145 -201 -132 -109 29 109
5936 109 236 195 -15 92 100 80 -45 -26 89 188 -264 2 130 -144 87 96 -110 -299 93 118 -133 -52 -38 -125
5960 -125 172 -164 -274 223 -82 -28 66 -144 -170 -231 -21 -26 232 -147 161 46 -117 -47 -7 -165 53 42 -261
5983 -261 -2 200 -9 -206 176 52 -66 27 155 50 -71 -88 203 -127 -117 -91 20 189 192 -17 24 -57 19
6006 19 -198 -280 -35 -156 -5 -261 6 105 -159 -10 -1 -25 32 42 181 -38 219 101 -55 170 -44 -62 53
$$ packed form
5837c4n0j32K82j90J14rL0J10Ol7q1q5Q5J78j37jq0J96k15J94O2o6j88LJ99m79
5863c25M38j24N6j14J50K4J0P7k48j0j10K23n2k64L7K23n6J97l92L32j00P0L3
5886G5j2p9j37K30Rk10J78j7O4Pl26K06L2n1j29M2n3K96N8k92KJ83R1k29L11j98
5912E1mp3j23J40j35L00k25K82k58M9j2j97K36p3j19J83o1J87k93n6O9K3J38Q0
5936A09J27m1k10J07Qk0j25J9J15R9m52K66J28k74K31Rk06j89L92K5k51Q1J4q7
5960a25K97l36j10M97l05N4R4k10k6o1K10nK58l79L08j15j63P0M0j58K18j1l03
5983b61K59K02k09j97L82j24j18R3J28j05j21j7K91l30J0K6J11J69Lk09M1q1P6
6006A9k17q2K45j21J51k56K67R9k64J49Rk4N7J0J39k19K57j18j56K25k14j8J15
$$ plain form
6029 53 -112 -141 -22 77 -75 -13 -144 97 -112 -140 188 -162 -87 -134 29 68 353 54 -159 -111 92 317 -24
6052 -24 64 14 107 204 5 -16 14 -114 -18 -117 130 -115 67 -25 19 212 155 77 -56 -151 123 -70 -209 202 18
6077 18 -185 -18 -84 -62 -152 102 20 131 -45 -212 189 -68 -151 -390 171 -3 99 -274 -46 -6 -100 45 -96
6100 -96 61 -5 -24 188 348 -47 -264 -18 -81 -151 128 49 40 -58 -39 -120 -30 0 169 -253 76 250 -145 5
6124 5 -64 -80 2 -173 200 -232 50 210 86 -54 185 65 -67 -63 -39 -106 87 92 19 -307 53 -28 -11 -51 -11
6149 -11 52 62 -336 -61 -9 -184 -203 -72 16 125 -12 47 136 -126 -248 -132 163 -232 217 -84 -80 21 91 -111
6173 -111 -68 134 66 -142 0 45 -159 -119 80 -72 -126 26 -230 -176 -54 -6 -73 -146 149 28 -67 -251 -92
6196 -92 -155 -191 -110 73 -76 -59 100 69 51 69 -187 -84 -37 146 -69 109 -88 -11 -58 -250 -101 223 -24 145
$$ packed form
6029E3j65k9J19R9j52O2j31K41k09k8L28l50P5m7J63L9K85k99k13M8K03K25l41
6052b4Q8n0R3R7j99k1L0j28R6r9K47k45J82r2M4J93n7p8j33r5K74j93j39M11j84
6077A8k03J67o6K2r0K54q2J11j76j67M01k57q3k39N61j74J02l73K28M0r4J45j41
6100i6J57o6j9K12J60l95k17K46o3p0K79p9rr8J9q1R0L0J69m22L29J74l95J50
6124Eo9j6Q2j75L73m32K82J60j24j40K39j20j32MK4o7J93Np3l26L60q1J7m0M0
6149a1O3J0l98K75N2j75j9J31Q8J09j37N9Q9k62j22J16K95l95M49l01MJ01P0k02
6173a11M3K02o8k08J42M5k04M0J99j52n4J52k56N4J22M8o7p3K95j21r5j84J59
6196i2o3l6Q1J83j49J7J59l1j8J8k56J03M7J83k15J78j97P7m7j92J49L24k47J69
$$ [...]
8191a0
##END NTUPLES=NMR FID
##END=
