##TITLE=1H_CA-8769-1
 CDCl3, 8 sc, 
 29.9.2020
##JCAMPDX= 6.0         $$ Bruker NMR JCAMP-DX V2.0
##DATA TYPE= NMR FID
##DATA CLASS= NTUPLES
##ORIGIN= UXNMR, Bruker Analytische Messtechnik GmbH
##OWNER= root
$$ XWIN-NMR		Version 3.5
$$ Tue Sep 29 11:17:17 2020 Russian Standard Time (UT+4h)  she@DPX200
##.OBSERVE FREQUENCY= 200.1315066352
##.OBSERVE NUCLEUS= ^1H
##.DELAY= (6, 6)
##.ACQUISITION MODE= SIMULTANEOUS
##.ACQUISITION SCHEME= undefined
##.AVERAGES= 8
##.DIGITISER RES= 18
##SPECTROMETER/DATA SYSTEM= spect
##.PULSE SEQUENCE= zg30
##.SOLVENT NAME= CDCl3
##.SHIFT REFERENCE= (INTERNAL, CDCl3, 0, 15.7039)
##AUDIT TRAIL= $$ (NUMBER, WHEN, WHO, WHERE, WHAT)
$$ ##TITLE= Audit trail, XWIN-NMR		Version 3.5
$$ ##JCAMPDX= 5.01
$$ ##ORIGIN= Bruker BioSpin GmbH
$$ ##OWNER= she
$$ F:/spectra/data/she/nmr/H-F/1/audita.txt
$$ ##AUDIT TRAIL=  $$ (NUMBER, WHEN, WHO, WHERE, WHAT)
(   1,<2020-09-29 11:16:20.00 +0400>,<she>,<DPX200>,
      <created by zg, POWCHK disabled, PULCHK disabled
       configuration hash MD5:
       00 E9 B6 7A A2 85 ED C7 34 08 36 98 17 FE 4E 26
       data hash MD5: 16K
       92 87 6B F4 D9 C3 1B DE 73 9A 80 53 8B 19 26 0E>)
$$ ##END=
$$ 
$$ hash MD5
$$ BC AB A1 18 6D FF 7D 29 0A 34 DB 46 4F 84 2E 7F
##$RELAX= 
##$RELAX= 
##$RELAX= 
##$RELAX= 
##$RELAX= 
##$RELAX= 
$$ Bruker specific parameters
$$ --------------------------
##$DU= <F:/spectra>
##$EXPNO= 1
##$NAME= <H-F>
##$PROCNO= 1
##$TYPE= <nmr>
##$USER= <she>
##$AMP= (0..31)
100 100 100 100 100 100 100 100 100 100 100 100 100 100 100 100 100 100 
100 100 100 100 100 100 100 100 100 100 100 100 100 100 
##$AQSEQ= 0
##$AQ_mod= 1
##$AUNM= <au_zg>
##$AUTOPOS= <>
##$BF1= 200.13
##$BF2= 200.13
##$BF3= 200.13
##$BF4= 200.13
##$BF5= 200.13
##$BF6= 200.13
##$BF7= 200.13
##$BF8= 200.13
##$BYTORDA= 1
##$CFDGTYP= 0
##$CFRGTYP= 5
##$CHEMSTR= <none>
##$CNST= (0..31)
1 1 145 1 1 1 1 1 1 1 1 1 1 1 1 1 1 1 1 1 1 1 1 1 1 1 1 1 1 1 1 1 
##$CPDPRG= <>
##$CPDPRG1= <>
##$CPDPRG2= <>
##$CPDPRG3= <>
##$CPDPRG4= <mlev>
##$CPDPRG5= <mlev>
##$CPDPRG6= <mlev>
##$CPDPRG7= <mlev>
##$CPDPRG8= <mlev>
##$CPDPRGB= <>
##$CPDPRGT= <>
##$D= (0..31)
0 1.2 0 0 0 0 0 0 0 0.06 0 0.03 0 0 0 0 0.0002 0 0 0 0 0 0 0 0 0 0 0 0 
0 0 0 
##$DATE= 1601363779
##$DBL= (0..7)
120 120 120 120 120 120 120 120 
##$DBP= (0..7)
150 150 150 150 150 150 150 150 
##$DBP07= 0
##$DBPNAM0= <>
##$DBPNAM1= <>
##$DBPNAM2= <>
##$DBPNAM3= <>
##$DBPNAM4= <>
##$DBPNAM5= <>
##$DBPNAM6= <>
##$DBPNAM7= <>
##$DBPOAL= (0..7)
0.5 0.5 0.5 0.5 0.5 0.5 0.5 0.5 
##$DBPOFFS= (0..7)
0 0 0 0 0 0 0 0 
##$DE= 6
##$DECBNUC= <off>
##$DECIM= 32
##$DECNUC= <off>
##$DECSTAT= 4
##$DIGMOD= 1
##$DIGTYP= 9
##$DL= (0..7)
0 120 120 120 120 120 120 120 
##$DP= (0..7)
150 150 150 150 150 150 150 150 
##$DP07= 0
##$DPNAME0= <>
##$DPNAME1= <>
##$DPNAME2= <>
##$DPNAME3= <>
##$DPNAME4= <>
##$DPNAME5= <>
##$DPNAME6= <>
##$DPNAME7= <>
##$DPOAL= (0..7)
0.5 0.5 0.5 0.5 0.5 0.5 0.5 0.5 
##$DPOFFS= (0..7)
0 0 0 0 0 0 0 0 
##$DQDMODE= 0
##$DR= 18
##$DS= 0
##$DSLIST= <SSSSSSSSSSSSSSS>
$$ [...]
##$SUBNAM2= <"">
##$SUBNAM3= <"">
##$SUBNAM4= <"">
##$SUBNAM5= <"">
##$SUBNAM6= <"">
##$SUBNAM7= <"">
##$SUBNAM8= <"">
##$SUBNAM9= <"">
##$SW= 16.880792210976
##$SWIBOX= (0..15)
0 0 2 0 0 0 0 0 0 0 0 0 0 0 0 0 
##$SW_h= 3378.37837837838
##$TD= 16384
##$TD0= 1
##$TE= 0
##$TE2= 300
##$TE3= 300
##$TEG= 300
##$TL= (0..7)
0 120 120 120 120 120 120 120 
##$TP= (0..7)
150 150 150 150 150 150 150 150 
##$TP07= 0
##$TPNAME0= <>
##$TPNAME1= <>
##$TPNAME2= <>
##$TPNAME3= <>
##$TPNAME4= <>
##$TPNAME5= <>
##$TPNAME6= <>
##$TPNAME7= <>
##$TPOAL= (0..7)
0.5 0.5 0.5 0.5 0.5 0.5 0.5 0.5 
##$TPOFFS= (0..7)
0 0 0 0 0 0 0 0 
##$TUNHIN= 0
##$TUNHOUT= 0
##$TUNXOUT= 0
##$USERA1= <user>
##$USERA2= <user>
##$USERA3= <user>
##$USERA4= <user>
##$USERA5= <user>
##$V9= 5
##$VALIST= <valist>
##$VCLIST= <CCCCCCCCCCCCCCC>
##$VD= 0
##$VDLIST= <DDDDDDDDDDDDDDD>
##$VPLIST= <PPPPPPPPPPPPPPP>
##$VTLIST= <TTTTTTTTTTTTTTT>
##$WBST= 1024
##$WBSW= 4
##$XGAIN= (0..3)
0 0 0 0 
##$XL= 0
##$YL= 0
##$YMAX_a= 401670
##$YMIN_a= -326010
##$ZGOPTNS= <>
##$ZL1= 120
##$ZL2= 120
##$ZL3= 120
##$ZL4= 120
##$ABSF1= 10
##$ABSF2= 0
##$ABSG= 5
##$ABSL= 3
##$ALPHA= 0
##$AQORDER= 0
##$ASSFAC= 0
##$ASSFACI= 0
##$ASSFACX= 0
##$ASSWID= 0
##$AUNMP= <proc_1d>
##$AZFE= 0.1
##$AZFW= 0.1
##$BCFW= 1
##$BC_mod= 2
##$BYTORDP= 1
##$COROFFS= 0
##$CY= 11.3945322036743
##$DATMOD= 1
##$DC= 2
##$DFILT= <>
##$DTYPP= 0
##$F1P= 16.9975609425685
##$F2P= -3.02152046262296
##$FCOR= 0.5
##$FTSIZE= 0
##$FT_mod= 4
##$GAMMA= 1
##$GB= 0.15
##$INTBC= 1
##$INTSCL= 1
##$ISEN= 128
##$LB= 0.24
##$LEV0= 0
##$LPBIN= 0
##$MAXI= 10000
##$MC2= 0
##$MEAN= 0
##$ME_mod= 0
##$MI= 1.114404
##$NCOEF= 0
##$NC_proc= 0
##$NLEV= 6
##$NOISF1= 3.799351
##$NOISF2= 2.8
##$NSP= 1
##$NTH_PI= 0
##$NZP= 0
##$OFFSET= 15.70392
##$PC= 1
##$PHC0= -9963.356
##$PHC1= 6.000891
##$PH_mod= 1
##$PKNL= yes
##$PPARMOD= 0
##$PSCAL= 0
##$PSIGN= 0
##$REVERSE= no
##$SF= 200.130013532006
##$SI= 16384
##$SIGF1= 3
##$SIGF2= 2
##$SINO= 400
##$SIOLD= 16384
##$SREGLST= <1H.CDCl3>
##$SSB= 0
##$STSI= 0
##$STSR= 0
##$SW_p= 3612.71676300578
##$SYMM= 0
##$S_DEV= 0
##$TDeff= 0
##$TDoff= 0
##$TI= <>
##$TILT= no
##$TM1= 0
##$TM2= 0
##$TOPLEV= 0
##$USERP1= <user>
##$USERP2= <user>
##$USERP3= <user>
##$USERP4= <user>
##$USERP5= <user>
##$WDW= 1
##$XDIM= 8192
##$YMAX_p= 0
##$YMIN_p= 0
$$ End of Bruker specific parameters
$$ ---------------------------------
##NTUPLES= NMR FID
##VAR_NAME=  TIME,          FID/REAL,        FID/IMAG
##SYMBOL=    X,             R,               I
##VAR_TYPE=  INDEPENDENT,   DEPENDENT,       DEPENDENT
##VAR_FORM=  AFFN,          ASDF,            ASDF
##VAR_DIM=   8192,          8192,            8192
##UNITS=     SECONDS,       ARBITRARY UNITS, ARBITRARY UNITS
##FACTOR=    0.000296,      1,               1
##FIRST=     0,             0,               0
##LAST=      2.424536,      0,               0
##MIN=       0,             -326010,         0
##MAX=       2.424536,      401670,          0
$$ Real data points
##PAGE= N=1
##DATA TABLE= (X++(R..R)), XYDATA
$$ [...]
1669g4J45m58N48p14O97j93j40L35k54K37P6j05M6k86J11n6j76L49r2j61L04k52
1691a13M41n73K15K30m18K45k41K01j26J24K0K6n88N96l64J76K39k85K83l27M47
1712B08k12p3M19m51M25l45J72J4m7j03K3oo1k63L07j16o7L32n1l7L9j62Q9r3
1736e9M67o10P4N92m58J41m07J79J03j87K26jl21L22j40p4K14J39k13n7J40L8
1758A08j12K64l41L07k12J52j30k02K71k00J28r0L97o21J44P6K28j24P0R3m69
1779b63L46j41J53k77j18N15l61N05k86j72j51oK79j5Qk5J5k03M47o12M69j97
1801i0J02M0k65N60n04P3K92l09K99j87J84l15Q5QN5j16K74n6J94m14q0K29k65
1824b06K44j20j98J84J39j8O7O8q4l03OJ9J33J58j96rJ40r1K34l67K95o2j59K78
$$ y = [-74, 71, -387, 161, -553, 144, -49, -189, 146, -108, 129, 205, 100, 146, -140, -29, -85, -261, 88, -4, -165, 139, -113, 328, -245, -30, 200, -218, 27, -214, -13, -139, -15, 5, 31, -557, 39, -325, -149, 90, -195, 88, -239, 208, -4, -77, 342, -109, 316, -29, 143, 157, 110, 7, 30, 24, -37, -300, 7, -109, -176, 156, 105, 68, 107, -55, 34, -59, 408, -202, -128, 464, 6, 147, -260, -81, 22, -165, 61, 60, -261, 61, -79, -153, 61, 200, -13, -70, 70, 108, -4, 260, -81, 226, 14, 166, 36, -166, 105, -95, 33, -57, 340, -281, -137, -61, 167, 43, 113, 206, -263, 83, -58, 95, -182, -300, 215, -146, 359, 73, -99, -250, -256, 23, 8, 16, -9, 6, -197, 250, -362, 107, -90, 12, 52, -213, 347, -157, -84, 208, -101, 198, 11, 195, -120, -35, -27, 28, -88, 186, 130, 324, -90, -170, 59, -206, 38, -82, -280, -96, 43, 25, 92, 160, 76, -227, -221, -202, -69, 89, -107, -116, 24, -67, 167, -200, 95, 33, -126, 152]
1848A52l22J60j33R6q7q1K81q6O6n06J51M76qk09J14k8m8K7KK50n43K81N6l8J23
1873A46k12J75l10J60J45j9j84K43j85M6J03k2J01k29L08m44L17j68m3R2r7p3
1895a50J6K21k71K76K0L2j64N5k4R5j04n2L41j87n1M5j68J79o1j10L95n33M89
1918B89m87Q7R3M13n05Q7r5N41n78O5J32n38Q59l27P2j97K41j66l9J30Qm2O4q4
1942B3O5j23M0J13j78j46L29k97J93j88K56O5P3L9m34M38l70q3K30J4j14j05k4
1965a84J04J8j01N02m22m7Q8j74M05l90M18l59RK51N3k67P4J25k92L11r6j34j00
1988b08J19P7j18O3L5k1J93J43l60J31l91L63R5k84L49k12j17K51Q2j03k36K41
2010I2k44J86o9J43l77M28N4k86p0j2K29N1k3j25k16K91J23k37J34P3m34K21L0
$$ y = [152, -170, -10, -143, -47, -134, -215, 66, -20, 46, -460, -309, 167, 159, -50, 64, 36, -12, 15, 17, 267, -276, 5, 61, 23, 146, -66, 109, -201, -41, 104, 85, -99, 144, -41, 5, 108, 86, 187, -42, 266, -178, 139, -29, -72, 20, -77, -150, -134, 87, -184, 92, 112, 144, -20, 35, 11, 106, 2, -50, 291, 104, 53, 98, -70, 109, 48, -62, 333, -200, 289, -198, -111, -18, 395, -110, -23, -118, 423, -155, -90, 42, -496, 363, 36, 108, -89, 152, -14, -53, 77, 85, 43, 107, 23, 88, -35, 5, 118, -60, -206, 123, -174, 19, -169, 87, 152, 225, 264, -170, 268, -102, -185, 45, 59, -55, -160, -184, -80, -62, -163, 339, -83, -130, -42, -216, 189, -201, 217, -142, -133, 118, 171, -96, -22, 103, -189, 122, 26, -108, -208, -89, -12, -130, -67, -32, -53, 140, 283, -77, 54, -337, 26, 121, -163, 186, -26, -143, 108, 190, 87, -149, 92, -152, 34, -35, 108, -269, 159, 213, -73, -143, -155, 74, 125, 102, -23, -239, 52, 175, -62, 72, 145, -289, -68, -38]
2033c8n1L11m25L23l5P6K4O6j78MJ98n92O20m32L42r8j28K1j17O8m7J87o5k1P3
2058H6j12J61p5m4k33K08j3J13m2r6j31J95j63R3o0J9P0k20L92k79L71p3m00K67
2082C4k90L69j76p8K70j09J83l24J11j97M48k63R1O2N4l91K66N2j73J90l09J50
2104c0J24l11J73rJ12m44K73J1P9j02j6N3K84j74r7P5j14J93p7J26J88k21K5l27
2128b06K23%O2L3k29M76m62J67j79q4K47k5J07M6k94K45p6j76J67p6J6O4j00k8
2152h2K29J8N2j62o2k8O1j97L14j39Q8o6L42l56P1j68J39j62J07q0o5L03k62j36
2176b41L68k4K29j28j97K84l74r4L4P6Nl9P7K80m84J38J78N9j3l9j07j73K02k53
2200b36K98j00k32J92J97k7j41l1j03M02k56R8m08J70K28k02k3J19p6L15k34J24
$$ y = [-38, -89, 222, -203, 120, 85, 161, 185, 251, 73, 77, 275, -317, 303, -129, 213, 115, -13, 8, -109, -41, -88, 99, 34, 13, 86, -26, 135, 60, 16, -217, -9, -22, 91, 49, -47, -178, 17, -146, -53, -113, -94, -24, -244, 148, -131, 240, 167, -233, 34, -256, 113, -63, -141, 129, 20, 203, -121, -10, -207, 241, -22, 69, 131, 185, -206, 60, 112, -61, 129, -180, -30, 94, -217, -44, -53, 59, -385, -112, -101, -22, -124, -140, -87, 197, 23, -74, 1, -113, 80, 3, 129, 317, 96, 121, -206, 17, 17, 79, 112, -117, 359, -103, 64, -115, -199, 48, 23, 130, 176, -118, 127, 51, -125, 42, -34, -18, 46, -54, -82, 147, 165, 217, 55, -7, -35, 26, -171, 143, 4, 92, 26, 368, 12, 83, -85, 54, -108, -1, -81, -146, 157, -105, -241, 127, 103, 332, 204, 7, 291, -83, -177, -143, -67, -62, -101, -24, 256, -228, -90, 88, 147, 134, 95, -12, -185, 17, -236, 62, -38, -270, -78, 119, 92, -49, -80, -183, 219, -37, 61, -347, -177, 51, -151, -174, -55, -131, 184, -50, 74]
2222G4k40R9J08O6j10J24m9J25l61K35l27L68J73k95M6j28K57k1J38k74M8K8L8
2245A22q2m38L68RJ12r1p7K65j47m0QK14j71J4J16m51L77k8k0l8j54L37k87j61
2269b43J32J73q4pM6k9J17O9l26nK35j16J00j27O5j75J36jK56j44l36M17n19K59
2293a07J93k70J91k54L96l38P1J83N2k46N3J88l63J85R7J71l31N4O6O0p0m6o7
2316a32P8O1n0R0N8j7Kk53NK08J2%K44l31J60k00R0J12l63P3Q3N7p9K83m6j75
2342c0j6j9J96k35M2m2m3j68K22J33k32J52K48k66J24r9j83L03j98KL07l18K09
2365H9J49M9k19J81k29p5j14K14J7q4J43j83M0J81k4O3l79J81o6R1M9k57K54k87
2389b16M1L03m09L00kK87l04j3p5J58p0M5k5p3j5J40N4k85j5J25p0K17K14k05
$$ y = [74, -166, -67, 41, 107, -3, 121, 72, 197, -164, 71, -256, 112, 285, -10, 36, -92, 165, 144, 282, 8, 56, 84, 122, 40, -398, -30, -21, 91, 0, -77, 188, 41, 1, 9, 223, 52, 66, 182, -269, 108, 80, 60, 22, -132, 205, -82, -243, -111, 62, -22, -29, 17, -12, 105, 174, -152, -157, 78, -38, 62, -65, 0, -175, -39, -40, 216, 72, -264, 153, -366, -107, 86, -184, 7, -247, 149, -189, -118, 65, 117, -129, -76, 112, -251, -66, 31, 202, -129, -75, -9, 51, -19, -65, -132, -54, 7, -43, 47, 105, 88, 90, -163, -158, 50, 62, 62, 306, -25, 135, -65, 25, 137, -226, -153, -70, -13, -92, 191, 145, -30, -46, -65, 131, -104, -62, -104, -147, -315, -93, 40, -192, -40, 208, -58, 66, -33, -216, 87, -111, -109, 198, -120, 89, 238, 287, 68, 249, 20, -55, -169, 45, 62, -22, 121, -62, -22, 159, 135, 198, -181, 0, -66, 25, 74, -183, 71, -216, -175, 128, -281, 19, 17, 304, 0, -13, -88, 70, 0, 45, 20, -53, -68, 72, 126, -159, -174, -49, -119, 98, 312, 107]
2413A07P8k30O0j05JJ26r2J20n8j19L44k98J57j46M6lj35L05q6j7M4Q0j09J35
2437B05k19j7K1J01l08J08j55N38j84q5M9r9J86k53j03K99J2o9n6j4R9j70l7L29
2461A78l1k15J60k08o2K87k11K01j50L44k7p3k53j87L66m9L0k91L07k77L17P3
2483B29l07j32K86O6k62L40l50J69r4K01K1k36R0j55O8QM8k99L25k9j37P7J52
2506G9J7j72Q5j27l7J04j39Ql2K79jM0O7k71J93k09L09m5j24P3Km1O2j69J24j44
2532f9j49K55mM6k22o2L01l00K49J39k09Q5R0l81L05j18Q5L6L5j97K58%j51J9
2556D1P5j24j07J20j23n7O5j34K22JL8K50l56L10l64J17L7O5R8k47Q5%Rm2Q8j82
2582a15j62L08L3j37J32p9j63O0l6K23J89j91j62NJ54j34J07J02p4P5k11P8R3
$$ y = [107, 185, -45, 15, -90, -89, 37, -55, 65, 7, -112, 232, -66, 91, -55, -9, -12, -147, 158, 72, 55, 99, 179, 70, 205, -14, -31, -10, 91, -217, -109, -264, 274, 90, 5, 54, -45, 141, -112, -215, 84, 96, 27, -29, -43, 56, -114, -151, 178, 147, -68, 92, -116, -178, 109, -102, 99, -51, 293, 266, 193, -60, -247, 119, 70, 100, -191, 116, -161, 156, 229, -78, -210, 76, 142, -120, 220, -130, 39, -55, 146, 167, -69, 21, -134, -66, -58, -10, -309, 16, -13, -150, -73, 79, 96, -76, 9, -118, -155, -51, -190, -182, -214, 65, 64, 104, 171, -100, 93, -116, 193, 148, 24, 97, 99, 58, 120, -49, 75, -69, -218, 37, 33, 79, -143, -205, 96, -204, 45, 184, -25, 60, 150, -231, 74, -44, 41, 77, 112, -85, 173, 173, 22, 41, 116, -8, -115, 5, -118, -175, -110, -244, -22, -21, 17, 267, -89, 221, -143, -26, 11, 76, 174, -73, 12, 12, 21, -21, 67, -115, -277, 31, 64, -73, 59, -20, -183, -123, -159, 64, 253, 62, -100, -95, 59, -75, 32, 134, 60, 135, -76, 2, 95]
2605I5j29L19j37l23J59O9Nj98J27rk80K41j57J73M0P6j55L2Q2j50J28k80J68
2628a04K51r8j01j11N5k23Q4K60R1j07L7Ol3k1J63q2J6k05K02k64k0J82P4J59
2652B11k98J71KJ3k6K9k75K81k58J12j04k9J85N4J86k85N3J5q1K9K12k27N7jk84
2677b58L13q5N4J9K3j1O2P0j2J77m84J61j71K67j48k9k2R8m5L48m6l09r3L27k46
2702d0J82j60j01K48k95P4J75j01P7N7j68o7J89L4k92J52j80K96R0j35m7J53l3
2725A08j82K90j69J57j58L9p3L4Or8J43k3J35l01J44j89j27L55R3k15p2K30l9
2748H8k10K89j89k17K66n5R3j38K98k53k04J30J84r5J45j01o8K32j51L04m23o0
2770a35N0J3J84j63J21q2mJ17M3n4m0o6K12j28j9n1K7l8l5m8K71j07K4k6k7l6
$$ y = [95, -34, 285, 148, -175, -16, 53, 58, -140, -13, -22, -302, -61, -218, -45, -5, 71, -84, -52, 30, -120, 8, -272, -104, 147, 49, -52, -163, -108, -331, -247, 13, 104, -3, 34, 40, 7, -14, 149, 67, 83, -122, 80, -184, -204, -22, 52, 211, -87, 84, 86, 99, 73, 102, -173, 108, -150, -38, -142, -171, 14, 68, 254, -31, 22, 37, -44, -15, 197, -30, 27, 26, -258, 55, -30, 24, 43, 66, 55, 117, 187, 175, 352, -132, 29, -142, 125, -23, -52, -74, 24, -21, 327, 281, -28, -121, 206, -40, 142, -18, -119, 129, -166, -92, 83, -18, 59, 116, -52, -119, 70, 104, -188, -36, -216, 80, 170, 35, -12, 141, 108, -74, 216, 47, 204, 46, 85, 12, 46, 52, -46, 97, 74, 209, -92, 52, -137, -264, 91, 184, -31, -103, 127, 88, -122, 167, -22, -239, 27, -28, 65, -73, 225, -28, -232, -102, 82, -13, 132, 31, -37, 195, 44, 348, -75, -135, -85, -72, 112, -51, 70, -12, -16, 101, 144, 90, 50, -16, 196, 68, 49, -2, 25, -13, -48, -96, 175, 68, 92, 66, 39, 3]
2796CO5q5J54l06J92qK87l25o6M1k14L60j34J90o8j26O1O2p9m7J38j79J75q1J9
2821B9k11J79j08k2J83P2k01O2j99J99J67p4p7r7J54NJ7L4q5J14l03P7N7P6J3
2846F1j70r2J25J58o0n3J06k12M2K9L8k13J15Q3P9P6j65J40j40j1j0K58m9M5j78
2871Bk03K8K11Q9j16m1L9j51L15j22j60k7M5k5J16Q8j25J02j17M8K6M7l00L72
2895A41k13J6M0lj42k4O6K42j77J85j59j26K78j69K27k95J57k29L92m18M38j09
2917A18k18k0L81j41M0j2k03L4J78k67J24J09k79J46j77K11j06J30J0j27P3o5
2939f1j1qjK07O2l60J15J17j8n5J27j84K0K4K43k18K09l02mm3J68N7j94QmK57
2965A51J10j26j18J60j2j20k08J02J15k7N1J18nl27L29l2k17j16M05j50L3k8j4
$$ y = [3, 68, -17, 137, -169, 23, 15, 302, -23, -89, -48, -262, 98, -36, 154, 86, -40, 21, 83, 4, -43, 95, -84, 91, 10, 29, -182, -3, -111, -133, 50, 122, -79, -17, -216, -17, 150, 76, -1, -98, 56, 61, 78, 112, 27, 141, -162, -85, -28, 48, 61, -109, -201, -76, 82, 22, -31, 75, -137, -95, -66, -28, -241, -126, -43, 36, 112, -53, 87, -53, -64, -74, 184, 135, 180, 2, -201, -173, 38, 127, 11, -30, 9, -142, 173, 51, -109, -136, -91, -116, 0, 88, -37, 65, -52, -4, 22, 69, -231, 141, -72, -56, -16, -19, -161, -185, -119, 123, -54, 131, -28, -154, 124, -45, 182, -113, 44, -185, 207, -211, 227, 118, -100, -120, 261, 120, 160, 148, -55, -21, 157, -110, 14, 123, -156, -10, -187, 24, -82, 48, 58, -69, 4, -61, -72, -80, -81, 126, 188, -172, -57, 60, 42, -13, 114, -70, -50, -26, 217, -1, 208, -94, -98, -141, 27, 84, -110, -102, -106, 151, 261, 135, 17, 177, 165, 45, -163, -61, 54, 27, 78, 196, 191, -136, 193, 161, -56, -172, 233, 83, 116, 88, 74]
2988G4n1J34j46R3Pj59K69l80k4K40j59K56r4q0K05p8k08k5M3J91k2n0q1k41L65
3013G9J5q2r8J24L02m07L8j9O2N0k49LK62j39M9N8r4k8J57r3j49L63j58J29j04
3038G1Q9j83l6q7M49m12J78m0J0l8j8N2k91K10J2J6K7q3Qj04R0J66k58J64R8j92
3064a02J27k85M82j99M3K53l08o6L00p9p5j85M63l96j41K1J34P9l46L67L7p0j53
3087i9J16j71K59P4j60L0j9N3N7n2J8j50J50j21j46J71J92p0j37k7J56l64K18
3110b2J53j74J12jj50J5J86P6k6j43l3K07k43n5J11O5j39J41j57O7J09j08K2o7
3134e4j09j1K30k29m7L60j69j96L00k39J43P5j34j7M3Pj68K00N2lj01m1J66j90
3158a32k7O5L17l30J92j68o5J6J50J16k56L12J04k07k7N1j1m6k49J23K11l27L59
$$ y = [74, 23, 157, 11, 104, 111, -48, 221, -159, -183, 57, -102, 154, 60, -20, 185, 107, -101, -126, -83, 108, 86, 36, -45, -286, 79, 94, 12, -86, 38, 340, -67, -29, -48, 14, 64, -185, -182, 80, -59, -10, 48, -46, -74, 83, -10, -159, 204, 46, 175, 71, 160, -23, -59, -146, 303, -109, 69, 29, 39, 1, -17, 35, -256, -46, -34, -18, 9, -74, -66, -170, -80, 86, -172, -8, 90, -102, 25, -260, 222, 23, 66, 319, 11, -55, 245, 166, 91, -94, 369, -27, -168, -147, -13, 66, -280, 87, 124, 54, -99, 17, -154, 105, 179, 19, 49, 30, 83, 140, 88, 106, -44, 106, -15, -161, 10, 202, 132, -5, -32, 124, -240, -22, 131, -43, 69, 68, -82, -67, 119, 195, 169, 26, -7, 200, -43, -98, 13, 78, -61, 80, -77, -10, 99, -9, 13, -54, -163, -174, 56, -173, -220, 140, -29, -225, 75, -164, -21, 54, -80, -97, -54, -47, -215, -15, 37, 34, -67, -108, 58, -132, -159, -94, 223, -107, 85, -83, -148, -132, 18, 134, -122, 190, 294, 87, 60, 111, 100, 54, -195, -72, 139, -188, 171]
3181A71o6n4N5o8Mj75J56L6P1k33K80k14J3j69L06p4L5j95K36M4j84j23R8L36
3205B86l14J4L14l07M7j79q3J85p4J40M6J5j16P3k33M28m77L27K4k35R9J75l12
3228a57J17J40r0J30k52K82j17m1J37m01L43k13J19%j5o4K84K49m77r1K43q0j35
3251h9nl6KK5q0J61NJ36j97k3J40p8JN3l9J11N9j56j85K87p8q6l0J33k24L09j70
3278e4M6K33k86q6P9l0p0K66R1j68j36J68j8j53K15l32L00Q4m76K76k0K84m59
3301b46L71q0J62k48L8j44J36M4rj81q5M75k14n0R9j49L49q3k25L9r2K43K0p7
3325I3j40J34n9m0k14K44k31J21K73k01k3J45J58l07J92l28J75n8J22n6n5R8J10
3348A53k92M3J07lJ25q0j07k31OL70q5J36q6Q5j76j2J5k07K81K84l80J83k78J37
$$ y = [171, 105, 51, 106, 38, 42, -133, 23, 59, 130, -103, 177, -37, -24, -193, 113, 39, 74, -121, 115, 159, -25, -148, -50, 286, -28, -14, 300, -7, 40, -139, -222, -37, -111, 29, 75, 90, -26, 47, -186, 242, -235, 92, 116, -119, -20, 155, -157, -40, 100, 10, 140, -112, 170, 53, 12, 149, -252, 91, -122, -3, -3, -18, -82, 202, 451, -26, -117, 126, 46, -89, -94, -130, -128, -103, -183, -22, -17, 119, -78, -101, 39, -39, -38, 15, -24, 87, 146, -10, -195, 92, 14, -72, -102, 31, -193, 116, -54, -8, 225, -61, -147, -68, -98, -168, 98, 189, 21, -115, 53, 35, -118, 97, -235, 65, 149, -327, -51, -71, 213, -246, 125, 45, 207, -41, -3, -147, -11, 33, 24, -157, -242, 233, 19, -31, 68, -81, 268, 185, -40, -1, -93, 150, 170, 93, -47, 87, 28, -12, -226, 18, -213, -92, 181, -20, -43, 102, 260, -47, 145, -183, -8, -66, 56, 0, -55, 43, 153, -139, -96, 11, 8, 133, 53, -54, -285, -279, 91, 6, 142, 56, 141, -35, -47, -32, -239, 42, 326, -54, 129, -149, -12]
3372a2M7J20l10M3M9J47m7j22J18L2j54R7r7L1R4j22M10l08k60J51J92Lj45j9
3396f2r3L65j95q9K36m05L48k29J69j67K09l91K02J88k53J86J73m9j26lP4k70
3418a82m6K3K98j29J82j35n0K31j58j16J58j43nm9L25j43j60JL30k80J00Nj13
3441e6JJ36l18K09PK6O0j5j37p3J91q6J06K6N0n1R6Rj83KN9N1k49L66j65j09N7
3468A0J00j78QJ44K06j5l91P7L1nq4J97l11L46j01j12n3K47j91K11q0j65J49l82
3492c42L93l12Q3K6K30k1j72J79m17N68k07J55k42J50k6k74J95j9J46l01L58n9
3514I1j54K18k50R5m1N8j15k8K65q4k30J23j86K43m3R5o0j41J21P8q8N0n4n1N0
3539c8PJ20MJ30m99K93j0N3k92L67n0N8j27J05j12J91m44J75J87j91J86l10L7
$$ y = [-12, 35, 155, -155, -112, -63, 84, 37, -85, 33, 65, -89, 8, -89, -58, 36, -86, 324, 16, -244, -93, 99, 102, -43, -62, -155, 210, 15, -74, 162, -243, 105, -124, 45, -122, 87, -304, -102, 86, -167, 19, 192, 143, 17, 14, 88, -182, -228, -205, 93, -36, 146, 11, -39, 192, 34, -82, 76, -67, -72, -121, 204, 61, -99, -98, 232, -48, 52, 57, -56, -55, 81, -237, -28, -21, 5, 65, 50, -87, -160, 31, -55, 51, 77, 127, 76, 172, 181, -2, 0, 59, 110, -139, 227, 62, -47, 10, 110, -68, -60, 84, 290, 275, -116, -39, -8, -13, -97, 100, -211, 135, 34, -78, -131, 116, -75, 136, 56, -109, 40, -342, 51, -261, -178, -152, 78, 57, -115, 64, -353, 215, 8, 163, -79, 71, 45, -229, -34, -53, 93, -208, 150, 91, -63, 155, -95, 0, -41, 17, -98, -126, 139, 55, -175, -52, -238, 5, -38, 57, -3, -144, -23, 55, -33, 17, -37, -88, -38, -31, 89, 93, 223, -276, 17, 7, 60, -232, 135, 85, 143, 16, 121, 9, 200, -244, -69, 118, -73, 113, -197, -160]
3562a60J59P1o8r2R5R7j59R3j4kj52K44j8Q5J19n9k4k92N8j8K14k9j54m8J8J82
3588A46n9l48M50P7k00l83N60l47q7J77o2K29k52J43Rk14N11m22R2p1n6m8n4M11
3612B02l05K42J75n3M6j59q1J4L5J01l88K34j37j58K18kl26J85L48L9l71K6K13
3635I8j89kr0L22P1k22R6j92L15k38p0K06L42k24k86N8j56J18ok3m5j2J92r6R9
3660F6j15n5K24j42J1M2o1J75k75J10j38K47k01J33jK4k72K09K07j84J57m2P9
3683A98l03P2l3J00o1j38L8MK95j13o7P1l18J85O4j08L46k42K2J12L5j27J13k27
3707h2K51k83O2R4Q8j56l7L3M8j44Q5p8K31p9M7R0j93R5r9L9r0P9J23j2P9j66
3733B5j00J46j02r7K30k99K02K7J27l43L45J54m36k3L43l71K39j25mJ28q0q3K60
$$ y = [-160, -1, 70, 2, -90, 5, 102, -57, 36, 22, 20, -132, 112, 94, 179, 298, 239, 215, -77, -19, -37, 177, 148, -6, -54, -36, 146, 87, -261, 189, 266, 66, -317, 243, -104, -191, -14, -76, 153, -99, 44, 53, -161, 350, -72, 20, -51, -107, -155, -209, 202, -103, 139, 314, 261, 307, 148, 67, 81, 116, 217, -171, 63, -74, -232, -14, -16, -342, -157, 191, 230, -141, -115, 98, -91, -93, -183, 139, 210, -12, 84, -108, 207, -31, -101, 105, 447, 223, -63, -5, -161, -43, -49, -72, -117, -129, 63, -33, 66, -49, -104, 120, -22, -11, 31, -30, 145, -130, -20, -158, 89, -112, 21, 20, 44, -228, -19, 188, 4, 161, 119, 198, -105, -33, -66, 34, -27, -165, -127, -123, 172, 59, -8, 63, -255, -70, -6, -114, 232, -10, 12, 124, 159, 32, 145, -82, 169, -114, -52, 42, 130, -26, -63, -30, 18, -126, -41, -119, 112, 33, 80, 170, -23, 72, -27, 12, -78, 1, 124, 112, 191, 25, -75, 71, -31, -128, 102, -197, 5, 32, 159, -184, 161, 315, -121, -144, 199, -172, 67, -58, -62, 66, -14, -97, 163]
3756A63l35RK29j47J01L5J24k88J44j87L43k36l9J1K3L86l44J89k20j21J62n3
3778e1P8J22r5j2j88J91nJ9Q0k34j0J09l16L77J01k44qL96j06j81J62k86R5K40
3802B34k56K00l57J7O3J2J30K2p3k66M67l82K59j27l4L19j11N9p5q4k6Rj19r5
3826b14K30%l2L7Ll6J41j24J81%l16J37J7J04j01J68j64q4J38m54N11j19j54Q1
3850e0r9P3J83mJ79q1j46j99K69p5K24j99k0P9j13j87O2K18j15k07J93r2P7J50
3874A20q5O2j43k7K38j72k45N24m98R0j3L01k51P8R9J64kk92j37J30n2J80j90
3897a21O7J52j17l70N02qm4m2K57n26L12p2J44m0k58K85k29K02O3o0ql03q0P51
3921D57l71rq0L5jK85m17K64l19K27n4j06J53R8j86j44K03Mj71J61n2J79k43L19
$$ y = [163, -172, -163, 66, -81, 20, 55, 179, -109, 35, -152, 191, -45, -84, -73, -50, 336, -8, 181, -39, -160, 2, -51, 27, 149, 54, 42, -146, 45, 40, 59, 139, -95, -105, 4, -312, 65, 166, -78, -86, 310, 204, 23, 185, -101, -6, 234, -22, 178, -179, -162, -99, -87, 43, 65, -8, -274, 193, -189, 70, -57, -91, 228, 117, 176, 101, 17, -9, 0, -119, -214, 16, 16, -16, 21, 24, -12, 129, 5, 186, 186, -130, 7, 24, 128, 27, 195, 31, -53, 85, -369, 142, 23, -131, -50, -149, -76, 107, 103, 282, 201, 55, -144, 125, 50, 274, 75, 55, 134, 21, -166, -104, 114, -1, -208, -15, -107, -30, 120, 35, 97, -46, -73, 165, -7, -252, 272, -226, -136, -149, 152, -99, -21, 78, 242, 240, -52, -189, -59, -111, 69, -121, -54, 98, -19, -389, 113, 105, 61, 19, 276, -250, 62, -10, 134, 94, -164, 121, -108, 94, 157, 97, 89, -214, -294, 457, 86, 77, -3, 32, 31, 316, -101, 163, -156, 71, 17, -89, 64, 162, -24, -168, 35, 39, -132, 29, -23, 156, -87, 232]
3945B32l87J92k4j88K31Kq1N5L3n5J77l67K53r2j22o5M7K08q1L6q6lJ56M0l10
3970a99K82j25K2R0j20j99J55p6J05J58j48J33l9J19j25Q5j30Q8%M3L7j07k8j5
3994FJ03l59J88K98j47l3j13K54j16P8k68J55k15j8J05J8J47j96J54j78L34l91
4016a94M37m25M04j08j05p8l00L61L2L8o3r7J08R3K5l18K54o8O9j91K86o1J63
4039B62k98j8J47k46Q7l1K37o5j04j96K30J33j29j74K41k35J67p9j37J63K9L2
4061A6J44m01K45nk2k46J01L3J39K97m83M6K31k26J57N5k2j72J47k2N6R1j11n4
4085fJ13j17J74q0k7k71K49K5k62K75%J8q8Oj09r0J09L53l42J78k8k16O9P4l03
4110b96K52q8J86J81l04J77J4k54L3K17r0L0k1M6l6J8L7M1j1l1k33O9P1kk21M7
$$ y = [232, -155, 37, 13, -175, 56, 58, -23, 32, 65, 10, 187, -180, 73, -19, -141, -206, -159, 49, -32, 4, -82, -85, 71, 111, -199, 83, -42, -20, 70, -50, -249, -94, -170, -65, 93, -55, 78, 39, 158, 33, 118, -12, 76, 76, 119, 156, 49, 21, 6, 109, -250, -62, 236, 89, 56, -57, 197, 81, 159, -109, 46, -169, -187, -82, -64, 83, -113, 41, -137, 197, -194, 243, -182, 222, 114, 9, -69, -369, -8, 24, 62, -1, -98, 10, 103, 128, -190, 64, -4, 65, -126, 160, 99, 262, -36, -54, 93, -153, -66, -97, 140, 75, -29, -225, 5, 138, 9, -165, 76, -159, 8, -71, -208, -45, -16, 16, 160, -241, 4, -1, -23, -269, -168, -135, 4, 301, -182, -136, 95, -131, 26, 81, 59, -113, 34, 12, 68, 159, 48, -6, 107, -10, 164, 84, 57, -214, 35, 60, -202, 73, 73, 91, 3, 9, -100, -190, -81, 272, -70, 108, 80, -136, -67, 7, -296, -44, -132, 54, 235, -69, 108, 122, -132, -99, 118, 28, 58, 37, 83, 47, 65, 102, 143, 132, 101, -132, -63, 8, 6, -215, -168]
4136a68J61L4N7o5N1l02M7K11J50J12j16j75Q7L9k29J31k59L63j39J39j06j2j36
4159a25J95K43j55j87oK67j53j54J4R3j62K78j78N5j81J24p9K08m1p5L36l36L3
4182A4J87j24Qk21L87j67r6%l9n9n2K6K19J14j61J37p9kk88K06K0k80K3M8J28
4207e1p6J21o5L7J2J3j19P0J10k30J38N7L3k05O0q3L61j87Q9k32Kj7K02q5j67
4232b12M58k39k0K12l31J36r1K2J40l16M09l44K59N1k47L43m32K35j71J74L18
4253C54k64r7j55R4J80N4r4l48K17P7P1o5k0r5j5j05M09k62k93K92J44L8j08p0
4277f1K08l18O8K08k15K81k26j03P9QQ7J14Q4q8j70N1k41O1J57p1J16R0q5J91
4301B25m64K96n5J08k53k3J50K7J43l24J00k9K52j63m3M4L03k00r7J2L8J10j88
$$ y = [-168, -7, 27, 84, 19, 70, -232, -185, 26, 176, 288, 172, -3, 84, 123, -106, 25, -234, 129, -10, 129, 23, 11, -125, 70, 313, 158, -29, -35, 232, 79, -75, -61, 32, -130, 148, -30, 25, -156, -32, -111, 97, 56, -19, 317, -19, 14, 201, 77, 85, -136, 251, 84, -12, -12, -51, -110, -162, -136, 83, 197, 36, 173, 94, 92, -196, 10, 30, -250, -227, -179, -51, -127, -6, -71, -34, -22, -9, -128, -58, 52, -178, -40, 17, 50, -155, -95, -178, 183, -4, 85, -147, -145, -162, 40, -45, -212, 246, 7, -13, 199, -132, 4, -87, -65, 75, -241, 168, -176, 83, 134, -113, 230, -202, 33, -138, 36, 354, 90, -7, -162, -68, 112, 166, 72, -276, -59, 18, 89, 24, 4, -91, -106, -211, 198, -64, -357, -65, 79, 117, 9, -61, 147, -171, -103, 105, -110, 171, -55, -158, -79, -71, 16, 130, 214, 126, -44, 7, -234, -173, -16, -87, 29, 119, 34, 225, -239, 57, 2, 110, -143, -166, -16, 11, 154, -170, -70, -99, 153, -10, -53, -9, 294, 94, -3, 9, 47, 157, -31]
4324c1j56l1L39l02L1K03j45ll2o7j10K89J61k15j97K58l7J69Q3k64R4k16K18
4347C9K08k66J03n9l92M48Q9j00O5k85J90j31J27J51l24K3P6r1K0P7K1R0M4n6
4371F7m5m4j78j6J30K75j19r5R0j57K43k48J07R6j15N3k04K32l6N8j14J1o1m0
4395a10j80J56q9N0L65j26n7o7j76K53m0P1r6J94j81l8n7m7N7J26K8O7l97M19
4419A25j76m0kK44k27r8M2K26k02Q3K14k57J13J48J95j91k33P8R3q4KJ08L8l05
4443a06P6K50q8l23L01j45k06L46k7j7j98P9m3K95o1l02N4J86j25j97M37l85K21
4466B2j03J37j92K06J03l37O1r8J19P5j71J32j20j40K37P0j31J44J04k37L3K42
4488A56m17K41J48m1K1j80j19J64J49l7Jj90J67q3J34M1l00J91J3k5J24l46L05
$$ y = [-31, -187, -218, 121, -181, -150, 53, -92, -95, -127, -194, -304, -15, 146, -69, -266, -8, -45, 124, 207, -57, 37, -179, 39, 247, -19, 84, 25, -367, 81, 170, 70, 135, -150, 40, -91, 36, 187, -137, -114, -38, -129, -109, -32, -11, 79, 123, 67, 22, -22, -200, -216, -86, 189, 70, -25, 65, -92, 151, -97, 10, 106, -9, 44, -160, 72, 36, 94, -20, -9, -70, -110, -290, -134, -223, -173, 192, 66, 9, -58, -234, 19, -21, 50, -46, 148, -33, -71, -128, -175, -118, 8, 36, 103, -294, 125, -51, -91, -93, 151, -76, -174, -132, 94, -108, -25, 189, -68, 45, 193, 388, 197, -36, 42, 135, 51, 53, 161, 199, -106, -30, 220, 132, -191, 110, -35, -241, 105, 78, 61, -137, -58, -101, 194, 133, -169, -115, 71, -54, -251, 186, -199, 22, -81, 56, -136, 70, 173, -164, -103, -201, -82, -7, -178, -46, -166, -306, -69, 1, -130, 14, 118, -119, -86, 156, -261, -20, 128, 87, 108, -72, -191, -27, 122, 85, 86, -104, 63, -20, 114, 155, -145, 46, 59, 34, 158, -188, 117]
4511A17l1j60L7J05L6J86m47J34n1M6Q6K12l22j05q2J82O7M1r6J70j60R7l22K93
4535C3n9r0KJ32J30K02l48J69j03l67L07M6j74M31k75j16K6j42L22k00J00j26
4557a00K35m5l09J39Q0j56J18M3K8j52K83l23L92j05k04J02j29J40J54n8j14P1
4579I0L3j34J6r9L2k2J49K0j67l7MK07l82K47Q8P8l00M52l45K71k11Q0j44j42
4603b16J57n1k7K25l5p9K78p4J2j03q7J04j00K21k92J72j33O5Q6j93J17k25J7
4626a61J3P2l6L65k75j21J63o3K05k23J42l1j12J39j70p2K19kl61M66k05j49l8
4649b35R0K58n1lj38J36q9j01L34l68L09k15R1K4P0O6j87L9P4q4o2J19j86K75
4673A66k89j15K30J96j18R4l13K42j33J40j67J95k46J54K6j84O7m8K01j75K47
$$ y = [117, 86, -74, -37, 68, 104, 290, -157, -23, -74, -28, 58, 270, -52, -157, -239, -57, 10, 51, -45, 125, -35, 62, -260, 33, -26, -116, -114, 18, 148, 350, 2, 171, 68, -299, 8, 54, -120, 311, 36, -80, -54, -196, 126, -74, 26, -100, 135, 90, -219, -80, 0, -156, -38, 5, 33, -119, 164, -159, 233, 128, -76, 26, -103, 37, 191, 133, 19, 90, 123, -11, 5, -94, -62, -84, 65, 85, -82, -119, -115, 92, -290, -43, 45, 123, -177, 275, -70, 201, -10, 70, -74, -216, -59, -110, -137, 88, 53, -26, 252, 178, 190, 87, 0, 104, 4, 225, -67, 105, -28, 37, 123, -70, 47, -178, -161, -148, -76, -112, 253, -22, -143, 20, -43, 162, -61, 81, 50, -62, 77, -93, -165, 54, 52, -309, 157, -48, -197, -235, -145, 113, 62, 59, -79, 57, -32, -133, 201, -167, 142, -73, 18, 42, 112, 178, -9, 30, 104, 20, -42, 77, -109, 166, -123, -238, -8, 188, 70, 164, -149, 93, -40, 100, -67, 128, -118, 36, 62, -122, -55, -103, 98, -77, 170]
4694A70p6j07J84k03K01j13k63J07K0K45j78QOj44J92j47M4L56m45Q4O2l0M1J06
4718A20j07J98j66j43K96rl88J15J73j09P9M1j26n0n6L0M2m8J10k84L17q0O7J
4742B3o5K7J13k49O8J61Q3k50R5J15j43k8j57Q2j63J50K61l35J70K71l88L21k11
4765d9j3J13m4N9q7P2k6J77j21j90J61o9r1J46r1K70j70M5R7n2l03K31j89J25
4789Ak5Q4p7j3n1J56j86k25L56j4J6J84l3j45k56L90k12P2J01j09m4j09O6o5N5
4814h3J22%k28K86N3rk13m2qL2M07l32J34N5k35K8R9k42J69M5j41K88l70J47J49
4839A11jk1j28K0j05j36L56j51N6q2n3J83O8j59q3k3j0L15P0j80P0k46R9J89l59
4864b00O8J76k79K37J2k79L42j81K67j13k42K02K8RK4j08mr0J0K5M4J10j97J61
$$ y = [170, 94, -13, 171, -32, 169, 56, -207, -100, -80, 165, -13, -5, 1, -143, 49, -98, -54, 302, -143, -59, 3, -27, 14, 120, 13, 211, 45, -98, 198, 189, -199, -84, 89, -20, 59, 100, -26, -76, -132, -102, -60, -108, 2, -282, 35, -45, 22, 23, -42, -15, 98, -151, -83, 78, 161, -89, 6, 121, -22, -50, -207, -125, -288, -138, 123, -212, -42, 229, -159, 162, -49, -62, 51, 7, 66, -21, 51, 25, 202, 81, -109, 52, -17, -108, 38, -53, 217, 47, 92, 189, 137, -166, 65, -124, 1, -24, 60, -17, -30, -81, 75, -111, -336, 20, 6, 22, 206, 173, 28, -228, 162, -50, 22, 123, 14, -30, -139, -73, -138, -83, 39, 39, -189, 97, 150, 141, -72, -114, -122, -90, 317, -15, 119, 174, -61, -33, 66, -176, -7, 38, -103, 185, -185, -38, 111, 110, 89, -39, -19, -124, -260, 96, -55, 1, -81, -134, 49, 117, -42, -125, -148, -158, 157, 227, 47, 117, -129, -30, 159, -200, -132, 44, -235, 2, 14, -265, 77, -104, 163, 50, -192, 10, 38, 47, 71, -37, -41, -131, -121, -96, -52, 58, -139, 22]
4888B2l26rK55J81k88l0M50k61k9J6J75R9l21R8k0QojP0j71J15N5j53Q6J5q9p1
4915a30j47R6J53J47j46K2J30J22k38Q2k54J99o8M5l13J67K67r5q0J67l02J16
4937f0J93j13J37j34M0j97J01r5Q3j05j93J23O3Q7p1j3L11j16j88L09k29K62p1
4960A24j39j9L4K02j54O7k4n2J40k01k54O5K85L6j16R6n7k58l2K03J27k26J94
4983D1N9n6L0k16K36p2k58K01J0k1j4J06j84r0J98R7r6M1N3P5k71J90J16J8k67
5008g4K6J06k67N06k38j10l3J08J52k85l4L51k11L1p7L17m4m70L83k29J60r2K7
5031CO2n5K10j77k82K78R7j05J7K60j2k25m9J82k83J05o8J76j90N3j52K16p0p
5055a6JL4O1J03l22K50o2J91k87OJ20J71o0k77j3P7lo5L61j66j15k87K19J52j97
$$ y = [22, -304, -313, -58, 123, -165, -195, 255, -6, -35, -19, 156, 255, -66, 32, 12, 20, 14, 13, 83, -88, 27, 82, -71, 15, 30, -59, -130, -277, -181, -28, 119, -27, -5, 125, 247, 9, 91, -163, 36, -32, 13, -300, -133, 134, 39, -41, 126, -176, -60, 133, 20, 157, 23, 63, -134, -33, -128, -45, -150, -343, -220, -157, -70, -141, -154, 157, 41, -147, 162, -67, 195, 124, -15, -34, 0, 202, 48, 115, 91, 39, 179, -22, -276, -211, 74, 110, -6, 90, 33, -225, -257, -54, 73, -153, 41, 100, 44, 74, -142, 94, 22, -236, -35, -25, -46, -60, 46, -138, -228, -30, 67, -29, 12, 65, 140, -131, 59, 175, 193, -74, -48, 58, -209, 297, 59, -51, -84, 24, 176, -109, -143, 208, -3, 28, -49, 268, 224, -246, 137, -92, 68, -24, 3, 65, 10, 220, 43, -239, 39, 136, 31, 48, 308, 296, 71, 22, 204, -79, 26, -42, 134, -56, -3, -155, 61, -9, -16, -15, 19, 80, 183, -139, 111, 49, 240, -47, -41, 79, 250, 190, -87, -100, -23, -26, -91, 270, 104, -11, -298, -79, 73, -124]
5080a24P9j60K83o9L3j05J3J96l24K16j93K40j60j11J50R9K0o8K2l32L29j25J51
5103F0j72K77r1j23K57j30J1j91J00K15k93k8K64k30Q4j42J61k50L91k55K50j27
5125C8j15o1j0K75k79K62l9J08J8j85J01q5Q2j94J54K15j37j70Q6j9q1j02L32
5148A94k24J7p9k3QR2j28J32k00K20p6oJ57O7k36R0K8q7KK06n3j57M5j4M3J91
5174B09m04M76l42l1p9M41k28j8mN6k75Q7K27r5j66L9J52j21J3K89l85K37j67
5197h9J06j8j7p4j33L55j35R7R1N2l55K25r5J90k91K03k03K24j70J96N3l17K27
5220A22k61K42j79M6j43K4J40J37M1j45k60K42L03m84P1k2K22j26L01k66q4J22
5242D3J12j07j5j1K2O7M0k07j33L10j97J11j70K0K00j33M4j32L17j80J69k81M3
$$ y = [-124, -45, -205, 78, 9, 42, -63, -50, 146, -178, 38, -155, 85, -75, -186, -36, 63, 83, 15, 37, -295, 34, -91, 60, -112, 165, 74, -49, 208, 78, 89, -102, -2, 213, -80, -108, 156, -74, 10, -132, 29, -221, 170, -85, 165, 38, -77, -138, -148, 127, -152, 110, 71, 179, 197, 12, 113, 28, 110, -84, 70, 285, 148, -22, 64, 45, -36, -138, 194, -30, -13, -92, -115, -107, -15, -143, -11, -211, 9, -67, -73, 84, 151, -85, 5, 33, -54, -52, 154, 101, -56, -11, -25, 18, 209, -195, 281, -61, -92, -171, 270, 42, 24, 20, 76, -199, -112, 115, 20, -146, -107, 45, -76, -63, 226, -159, 78, -89, 17, -1, -18, -92, -225, 130, -5, 92, 183, 235, -120, 105, 10, 200, -91, 112, -91, 133, -37, 159, 212, -105, 122, -139, 103, -76, -30, -173, -149, -9, 128, 169, 24, -236, 6, 309, -175, -104, -126, 96, -30, 271, 5, -79, 43, 155, 48, 33, 22, 44, 111, 151, -56, -189, 121, -76, 35, -135, -115, 85, -48, -4, -136, 181, 1, 170, -111, -68]
5265f8k1r8K50ro9N6L4m1Q0q1K22l17J84j31J23jk49J71M2j02o4K96j14n7M7Q
5291I1o3R1k29J75Lj44J79j77N3l23O2K7L92k78j11K69k0M7k0L52m23P7J5M7k65
5316a73J82Q6l91L44p0J13J21l29L70l08K3L7J76P1j45N9r4k21L0K07r6N9R3j17
5340B7m4l4J17P2j85J36M7l00L03j18P7J5k05p0J45K5m9K58l12l6K50j44j58K49
5364F6M5q6M3l47J07mP5R8n8J0m0j05K15k3l3J61Rp2j54K38r4j59Q0K45j73Oj07
5391e7J15j11l3J92K31l29j24L70m20O2K27j19J1n4M8N4J4K38l14p2qK55k48K30
5415A58k18J00j26J92R2j45j46P9k3l4J53l17J09L34k89K16j59l72K14J08J47
5436G3j84on3K46J56j91j70K26q8J63k23J50n5l9j7j36J55m8k53M89k76K08m0
$$ y = [-68, -89, -187, 63, 54, -15, 41, 75, 34, 114, 33, 255, -62, 122, -9, 114, 113, -136, 35, 77, -25, -89, 207, 93, 36, 83, 91, 28, 119, -110, 65, 68, -76, 103, -74, -21, -344, -282, -255, 137, -141, -252, 17, -3, 44, 24, 376, -47, 30, 45, 92, -173, 9, 95, -296, 48, -22, 91, 212, -117, 253, -55, -32, 5, 181, 252, 107, 166, 72, -149, -119, 88, -8, 51, 144, 27, -17, -51, 66, 138, -47, 89, 136, -164, 139, 21, 98, 113, -92, -162, -17, 8, -41, 217, -95, -131, 119, -25, -183, 66, 111, 25, 68, -279, -172, -176, -101, -3, -61, -51, -91, -196, 19, -4, -37, 124, 133, 61, -93, 145, 51, -108, -28, 217, 44, 50, -57, 58, -53, -86, 106, 337, 8, -116, 254, -166, -104, 123, 4, 15, -39, 9, 63, 77, 315, 1, -71, -79, 176, -72, 158, -60, 40, -86, 106, 198, 53, -93, -14, -37, -71, 82, -235, -126, 208, -81, 135, -24, -396, -182, -74, 73, -111, -117, -170, 76, 232, 41, -129, 97, 9, 172, -51, 99, 44, 5, -12, -148, 7, -41, -294, 195, -81, 127, 87]
5459H7j42L4J72j31rL9j05J35J3j84K07n9p0O5k09J24M7Q3j3l73K45J03Kj7k67
5484b23K09K5j54k2J57J37k97K53o4j20K33N0k96L1jQ8J40j79K2q7N1j21M70m20
5508a18k2L56j58j54P4l6o4J62j0l8j12J56k11K27k09J7J12J66j40L9k43M91k45
5531D0non1Q0j03J55K34m22K56l21O2P8J27O7m68L85j91K08j90J50k14K23r3Q7
5555H8K9l6j93Q6Q4k37K15j30M8J12Pr3J59j90J5j89J55K44k32J35j03J98J24
5578B96j50Rj28j03o5j6J68j85j0K03K31l39K72j78j2Q9j43OP3K0J19j45R6L4
5602A42k35L5J17J8l5j0N0j29M2L6oK00j73k58L19j97J53k91K89m0p9j8R7j81
5626a54K00j33lL03O1K0m42L09k42LJ14Rj52L69m06k8K32l6M0m8L5M5k79L47j25
$$ y = [87, -55, -21, 151, 20, 11, 50, -55, 80, 93, -91, 116, 57, -13, 52, -157, -33, 14, 97, 84, -289, -44, 59, 61, 44, -223, -14, 11, -143, -165, -8, 129, -168, 85, 21, -99, 134, 184, -112, -81, -82, 6, 146, -33, -11, -98, -47, -168, 302, -118, -140, 216, 58, -96, -22, -58, -122, 40, 30, -8, -120, 36, -175, 52, -157, -140, -28, 138, -2, 37, -206, 285, 40, 35, 29, -22, 58, -45, 110, 344, -78, 178, -143, -81, -3, 124, 191, -277, 108, -83, 125, -65, 85, -129, 94, 1, 88, 117, 81, -112, -26, 58, -179, 36, -94, -46, 66, 73, -20, 139, -51, -36, -225, -70, 174, -58, 77, -26, 172, 296, 146, 155, 27, -76, -141, -157, 11, -174, -184, 19, 250, -89, 183, 5, -7, 82, -61, -55, 18, 38, 157, 12, 108, 142, -93, -58, 59, 77, 42, 32, 82, -47, -5, 31, 25, 225, 52, -206, 113, -84, 69, -222, 67, 27, -52, -70, 27, -154, 46, -87, -90, 213, 274, 294, -148, 161, -81, -78, 36, 45, -107, 262, -144, -172, 60, 24, 64, 16, 51, 96, -183, 164, 39]
5651C9m8L3J89k97r1Q0J33o8K49j49L5Nk75K99J15j34l1p0j23M03l46j29J20J03
5675D2n2K75p6K22n47K48k12K52j9j72L4J22j06j14K53k72M24l27K26j52j10j14
5697a75M71l03k4L0J47j03p1n1K66l9k22J85l58M17k32k07J91r6m7K66p9P1l21
5720b84Q0N4J95j4j9O6j09J72rk47J55r6J04M3l87M82R1m4k17J36l75J99m1m4
5744a09J67L4k43K97j75j46J51j72J0M01p3j31J74j58r7R2L7kJ02l6k58K97j05
5767E7R9j5k89O0l3P4K47o9qk57L17j71j14J28l0m9J23R3J66k46N9k77o4L6J56
5792gj94L37J61l48N3K57l78R3j32J52Q5N0j19j22O0j85L70N8k20J41j85J96n
5815A18L2N4l96J46r1K35j90M3k6M1J8l0K54q4k04j47J84J39k28k1J33l6r1J41
$$ y = [39, -9, 24, 213, -84, -175, -95, 38, -30, 219, 70, 105, 110, -165, 134, 249, 115, 84, 14, -109, 294, -52, -181, -61, 42, -10, 265, 189, 411, -136, 112, -100, 152, 133, -39, -5, 117, 11, -103, 150, -122, 302, -25, 201, 49, -61, -175, 296, -7, -31, -1, 146, 43, -28, -79, 187, 148, -74, 111, -247, 170, -62, -269, -78, -174, -221, 45, -34, 37, -284, -204, -150, 45, 31, 12, 78, -31, 141, 132, -115, 40, -56, 48, 91, -296, 186, 277, 233, 16, 152, -223, -24, -65, -109, 58, 92, -151, 146, -29, -175, -24, -196, -186, 215, 142, 11, 185, 27, -70, 22, 59, 57, 159, 123, -135, 162, 57, 156, 141, -148, -88, -121, -47, 200, 131, 123, -134, 183, 12, -102, 26, -4, -53, 70, 163, 329, 83, 142, -135, -199, -163, -7, -201, 136, 297, -51, 2, 259, -119, -26, -158, -6, 79, 129, 10, -112, -52, -237, 133, 191, -29, 112, -73, 123, 118, 150, 204, -192, -46, -137, 98, -92, -49, -75, -34, -16, -46, 208, 124, -80, -227, -43, 96, -132, -153, -20, -56, -147, -6]
5839fM3J17k73K84j29Jj91J90m2K2k12K3L29q7j32R6J77m30Q4K70j23j39O3Kj41
5864b04L69kj91K55j27j74k1J4K16k70J40j35J00J94k38OPJ16N2j41K09j29p1
5887b5m8j14J97N6j86N3j31J63K2K3j59J95k83N43k70j49k5J05L9J31j02n7o1
5910h3Q7R9j68J18jm9j42J64n7j03J17j66N9J24Q8j07Q7j56n5M2K44k54J76j28
5934f4PN7J4J21J4j93J66j28n7J66p6k0l48K51K95k48j02J55K0j88M9J48KM8j01
5959a2J59j58O0l1L00j29j06j0J37k45k1O5J45k19J10J58j34J51l50o3L91k97
5981i9J12k42K38pn8j14j06K56l8p1n2J78R0o8k04L69l8k30K21l21K19J13m03
6004b55L67p2Jl7Q6k40L4K09o1J14j62j18K05j76Q1J58r0R9p2N5O6l40L59l28
$$ y = [-6, 37, 154, -119, 165, 36, 37, -154, 36, -6, 16, -196, -173, 156, 69, -63, 33, 210, -220, -136, 134, 11, -128, -65, -63, -204, 165, 163, -28, 227, 100, -74, -95, -81, 135, -135, 5, -130, -30, 164, -74, -68, -61, 55, 107, -34, 175, 46, -25, -73, -187, 10, 66, -120, -67, -198, -35, -13, 10, -149, 46, -237, 306, 36, -113, -138, -33, 6, 137, 35, -22, -83, 4, 103, -65, 53, 52, 3, -139, 25, -32, -135, -18, -184, -125, -1, 87, -20, 67, -89, -144, -102, 142, -112, 64, -64, -57, 0, 14, 135, 149, -44, 122, -6, -63, 103, 27, 7, -341, -90, 205, -43, -145, 10, 30, -158, -109, 39, 41, 89, -12, 147, -11, 49, 18, 318, 189, 83, 73, 210, -35, -56, 9, 154, -65, 45, 203, 69, 220, -130, -193, 198, -99, 13, -229, 9, 2, -56, -170, -276, -20, -58, -129, -181, -3, 87, 19, -185, 184, 146, -84, 137, -184, 35, 148, -255, 112, 40, 41, 4, 90, -150, -116, 93, 32, 146, -16, -134, 71, -105, -24, 134, 44, 143, 71, 126, 192, -148, 211, -117]
6028a17K21N5j41J81k12j48J99j53j5k1Nm2K57Ln3Oq4q3qK89k72J40R6l28J43
6053h2K14K8j09j04O0m6J34J14nk17j30K24k20k7m5J8K75j84o9K10l18L19J06
6076A46k64o0J25m5n1M76k60mnk08M37m41L29K68l96R7j70O9Kr2N7k09Q5K27j73
6101f0%J77k66Q9K9n3L05m67K79j39J77J31k92K36o6P7j10P1O9l12K6j21K25N3
6125E8J11p9l66K17R4R4k80j2Q5L19k23q8RP4n9J33l8n2m4J16j72j34J07L6J30
6150C6K34l97R4l0K23J40k48j08M9K44j68Q8r8K34j55o2l20M09j32p1N4o7P9L3
6174F1j19p6J82j48M7J98k34nK6k6J04p7J59p0K1R1r6Lj56J51J46q0j4l1k5k12
6200a80J08J2j76M33j02l67J08O8q8R1MP8N6q5m8qJ88p8K4j41L2K59q7j66J12
$$ y = [-117, 104, 159, 18, 199, -13, -161, 38, -115, -130, -151, -146, -188, 69, 72, 19, 25, -59, -142, -150, 139, -133, 7, 103, -225, -82, 132, 160, 51, -53, 7, -39, 95, 209, 204, -13, -143, 81, -139, -166, -211, -193, 82, -102, -171, 39, -279, 40, 146, -118, -178, -53, -98, -149, 327, 67, 63, 58, -150, 287, -154, 175, 443, 47, 144, -26, 43, 45, -47, 10, -199, -114, 113, -60, -60, 117, -149, -60, -31, -84, 221, -246, 33, -106, 71, 202, -90, 146, 80, 157, 47, 118, 187, -125, -99, -220, 5, 58, 169, 90, -276, -59, 35, 129, -151, -163, -78, 241, 18, -70, -61, 13, -46, 87, 49, -3, -47, 69, -103, -237, -130, -94, 36, 270, -127, -33, -63, 160, 300, 52, -56, -7, 237, 69, 157, 59, 293, 138, 76, -244, 165, 33, -38, 16, -51, 28, 61, -58, -134, 48, -100, -53, 145, -89, -94, -68, -94, 10, -67, 92, 22, 43, 134, 38, 41, -115, 36, 182, 102, 88, 57, 32, -180, -72, -60, -236, 197, 95, -272, -164, -96, -184, -93, -89, -11, 45, -40, -88, -96, 92, 14, 38, -103, -71, 188, 101, -65, 47]
6225D7j69K85k40J63k01k11N71k46J55k68N1J91Kl13L72k23J45Q4m08K68J49k05
6247aj69K26o4K1j84K99J02k49o4J8J07J34k01J45k22O8n6k8L9J68J29k92P2j6
6271a8j42J23J01p3J66j50J11n3M4l06K3M85o4k33K83l40n2K57r2j53Qj25j9L20
6295A01q6o5j13K45k55M18n6j36n7J76k69R8J17K2J93j20kK04l18M4r7rq0j05
6319a50J68J57M2q4j04qM9k25M26m47K23J18K5k57k03P5K16j48Q1K32k27q6L89
6342B62l17O6q4J52j48L2J10j1q8O6p5J61j98L58j27j13N7o4p8L6Q5o7R1k14K52
6367A44j70J76m35L06L29m21J09R1M7J31l37J46r5j80K43j59M7k8q4J98j37Q5
6389FJ59Pp3l73L96Q8l27J53P2n3m1J2q0j06Q5O2P6j79O7K07j50K5q8o0J72Jj66
$$ y = [47, -122, 163, -77, 86, -115, -326, 245, -1, 154, -114, -63, 128, 130, -183, 189, -34, 111, 195, -213, 55, 204, -1, -170, 56, -8, 13, -171, 128, 230, -19, -83, -65, 42, 176, -25, 120, -102, -34, -90, -118, -79, 89, 218, -74, -2, -18, -160, -37, 64, -9, 157, 7, 118, 65, 109, -197, -174, 311, 247, 14, 297, -43, -95, 162, 70, -83, -75, -200, -219, 101, 15, -50, -163, 82, -173, 245, 189, 53, -4, 172, -97, 1, 118, 140, 333, 213, 211, 415, 97, 141, 44, 35, -45, -150, 18, 175, 217, 133, 29, 21, 70, -155, 271, -176, 47, 165, 190, -67, -270, -195, 21, -127, -46, 186, -41, -127, 262, -55, 11, -73, 79, -69, -37, 73, 62, -26, 40, -35, 126, -72, 286, 159, 46, 103, 39, -39, -3, 82, 15, 106, -108, 144, -26, 150, -285, 21, 350, -71, 38, 129, 176, 307, -30, 116, 21, -159, 84, -75, -28, -56, -140, 58, -79, 6, 165, 172, 99, -274, 122, 210, -117, 36, 108, 55, 14, 26, -54, -160, -75, -13, 63, -116, -49, 158, 8, 33, -55, -115, 57, 58, -108]
6416a08J15K12l4J20n52J63J01J28k98J76l2J67m7k33N9K9Q9k02L2J77n0R5p3
6439C4J35N9r5j19p4j12J04J00J99N9m24J76j13LJ58k05J35J5p4M30m57J95l15
6462a86qK62K4j44j92M64j36j89j15M25k99l3J53j58K65J94l54L1k62L20k42K71
6484I1j20P0p8j04L48l48K86k07l4o1K10l46L78m1j67J52K3J17q1n5J63k19j50
6507a73K38j06P4j17J72k24K34m4K2l01K71Q9k52K96r5o3l09L30j25R3J17J55
6529B82j76k99L29j46j29R0j7J08K6K2P5l54L12K6l21M14k58K4J77j39l26K44
6551c6j64L75p8J1r0J33l73L5J73K57j61M0n5j71J9l3J88j9j25J07j11J7l1pL65
6576B66k25J24k76L30l03j11K17L1j88o0J75k43M14k97L51j00l63J73Q6k17J75
$$ y = [-108, 7, 219, 185, 305, -247, -84, 17, 145, -153, 23, -9, 158, 111, -122, -63, -34, 55, -147, -115, 62, 12, 107, 34, 169, 228, 133, 14, -60, -172, -68, 32, 231, 290, -134, 42, -71, -68, 90, -115, 20, 35, -39, 391, -66, 129, -186, -194, 68, 92, -52, -244, 220, 84, -105, -220, 205, -94, -127, 26, -132, 133, 327, -27, 4, -258, 62, -180, 91, -29, 41, -37, -141, 207, -141, 145, -62, -96, -157, 53, -293, 85, 44, -123, 29, 52, 169, 88, 33, 196, -23, -173, 65, -41, 33, -84, 88, -136, 98, 54, 76, -225, 46, 135, -117, 179, 84, 21, -288, 42, -83, 10, 127, 282, 106, -193, 136, -10, -139, -49, -66, 42, 68, 90, 165, -189, 123, 149, -172, 242, -16, 8, 185, 46, -280, -36, -200, 175, 97, 108, 18, 151, -222, -187, -14, 243, 82, 122, 67, -104, -85, -118, 70, 51, -74, 33, -78, -61, -92, -99, 266, 41, 165, -111, 219, -84, -195, 22, 53, -135, -195, -20, -263, 151, -146, 205, 105, -258, -85, 1, -216, -41]
6597d1J23j3j43O3N2Q6j07l9P5k1j24j35L24k05Q5J2k16K57k30J55P5P6m1k5q9
6622d6J47k73J96j49r1K74k8Q3J10j67k43J84J22q8J6J90l91Q5J09m3R5k70J67
6645a1j75J15Q1j46J26j76K31n1r7J32k8J10l20J16k09K59k1J59J60k46Q3j61
6667f9m3N0q9o9L78R4m58M42m91R1M62k87O6j60O2r8P8J30j80j1k3p0L12j01M5
6692F1k01l9P5J17M5N7j30K08k66K00j73j36R0Q8l1N7J16l27J46j51N73m85qQ0
6716c4J80j75J31N5k78O3j08J82k05L74j46j02J42k36L82k93J98k04K5L7r8M5
6738f5k5J75j51J61j92P6j4J13k68L74m15J30Q2j7J05r3j44J97K44m58K41km6
6761HJ50l69J68N5q1j48L58J8l4K6q1K4j43J81k10p7J46mj34J58l24L73r4p5R4
$$ y = [-41, 82, 69, -74, -11, 41, 127, 20, -19, 56, 35, -89, -224, 100, -105, -20, -8, -224, 33, -197, -42, 33, 109, 68, 43, -46, 101, -172, 24, -125, -216, 58, 30, 113, 223, 56, -187, -3, 119, 31, 47, 237, -154, -69, 40, -3, 92, -178, -11, -186, -71, 10, -136, -10, -186, 45, -6, -103, 29, 1, 111, -209, -93, -302, -43, -64, 95, 255, 9, 92, -69, -112, -62, -151, -220, 158, 252, -206, 236, -255, -164, 298, 11, 77, -83, -21, -119, -41, 89, -91, -102, -125, -195, 117, 16, 61, -140, -179, -104, 13, 58, 115, -15, 193, -73, 127, -46, -182, -92, -4, -35, 22, 138, -189, -43, -194, 379, -106, -114, -34, 146, -29, 102, 157, -121, -58, -166, 16, -189, 185, 39, -63, 79, -157, 225, -68, 130, -74, -49, -12, -110, -65, -90, 85, -66, 95, -97, -21, -35, 78, -190, 184, -231, -101, -19, -36, 69, -24, -168, 29, 273, -185, 56, 54, 8, 158, -211, -43, 12, -69, -217, 141, 159, 125, 151, 70, 94, -49, 132, -78, -155, -9, -13, -147, 11, -313, 60, -34, -109, -15]
6786a5J54j6r1K03Lk04p9K1J25j07P1j26J68J12k98J15j59J32k5K3j39K78M4k15
6810b5K1l9J56K8j43M5l19M09j1k44L7m5r2L9L88j39p1k62J16lJ59N5r8r6l3J24
6836d3j23J54J48N4j85J12J0m47J26J40n5J07R1k80M5L89l03J82o4P4J3l56K85
6859G4k86L17k9k18K52J97k18l7l4Q4q8K12l27J43N8L8M5k49K10j12Q6q2m1m4
6883d9M3J74k1j96J58j08l1L20n66J99J0K04j43L6O8n4j17K5J20K6k52J35J01
6906H2j54J70k20pj94L21Q8k73K35K8j01L9p6L30k57N5r4J13j70j19L00j97kJ26
6930B3p1O7J26j16J9n0J77j25J8o5j13k2J94j04R3k89K28N9k21N4Q1lR0q1J85
6955A54j38l1oK31j92k3O5q7J01J16qj61o6p1j39M00k37J17j16j47K46J51j04
$$ y = [-15, 139, 123, 32, 235, 238, 34, -45, -24, 101, -6, 65, -61, 107, 219, -79, 36, -123, 9, -16, 7, -132, 146, 190, -25, -4, -43, 113, 141, -2, 43, -276, 133, 122, -122, -85, -130, -222, -183, 205, 66, -5, -267, -151, -154, 5, 60, -38, -134, -167, -43, -166, -12, 136, 190, 5, 117, 127, -320, -194, -54, -109, -2, 89, -191, -146, 243, -60, 122, 58, 132, 145, -211, 74, -212, 105, 76, -142, 110, 307, 89, 52, 18, 102, 14, 226, -101, 42, 100, 138, 183, -66, 144, 32, 118, 36, -5, -49, -6, 168, 147, -49, 109, 1, -30, 290, -276, -77, -67, 137, -6, 30, 98, 44, -73, -48, 72, 98, -154, -19, 82, -72, 98, -122, -129, -323, -2, 86, -187, 48, 76, -25, 14, -62, 268, 11, 66, -28, 85, -85, -204, 96, -101, -103, 23, -48, 19, 145, 29, 48, -2, 175, 50, 68, 3, -110, -132, 62, -42, 51, -238, -10, 49, -172, -118, -37, -40, 50, -31, 154, 16, -15, -21, 210, 18, -5, 60, -27, 74, 190, 182, 21, -45, -116, -255, 145, -92, 25, -91, -238, 8, 159, 55]
6978E5m9l1j13J37mK5j90J83k11J76J12J50j57k03J40L9j39j27J45J8Pl3K30j44
7002A6k64M54k14O2P0j34J15m9j55mK13k42J3NJ62o2J6L5j21J75j79J26N0k4p0
7027fm2Q1O8J27j91r0K4L29j66n45N90k38j34J92P9j82M6j13J68l5j72L93k42
7050e9J10K63k78pK0K2j01L63m69j33J62K69j57jn8k2j65J29J45P1k85J36N4l9
7074c0J23j95o6J67j75J85l2q8K57l82K3L20j62J44j21j8K83j85l1k1k24j49N11
7097A34j81NJ63k12J26J10n1r2l3K62k09k81K83O6j40k59M16j53J9m4J35J32j21
7120G5j54N0r1K55l09J07J26Prn6K98m27P9J38o1k40L53k93J33J73P8j18n1%k
7145F1q3lm8J48q6K43k06KJ13r6K00l99K53k08J72j02j4J34J5L0P8l12P8l5q2
$$ y = [55, 6, -25, -138, -1, -5, 20, -170, 13, -198, -22, 90, 240, 83, -120, 20, 59, -80, -207, -62, -44, -37, -70, 160, 16, -248, 206, -8, 54, 124, -10, 105, 56, -99, -103, 110, -132, -119, -114, 48, -14, 2, 37, -84, 91, -88, 38, 88, 64, -6, -48, 33, 101, 228, 37, -53, -29, 300, 134, -411, 179, -59, -193, -1, 78, -104, -58, -171, -3, -38, -210, 183, -59, 51, 314, 36, 29, 49, 71, -30, 333, -136, -269, -107, 162, 5, 4, -54, -76, -241, -112, 33, 104, -181, -45, 9, -30, 93, -102, -168, -1, -176, 9, -23, -111, 146, -236, -213, 107, -55, 89, -32, -50, 233, 48, 17, -4, -228, -377, 134, -47, -42, 121, -91, 35, 145, 94, 2, -31, 231, 22, -259, 24, 90, -50, -309, 107, -46, -27, -71, 64, 196, 75, -79, -29, -120, 135, -174, -67, 59, 66, 57, 1, 299, -128, -49, 89, 28, -212, 141, -152, -19, 154, 232, 114, 63, 63, 61, -22, -25, -73, 75, -11, 232, 26, 28, 141, 45, 245, -154, 99, -109, 63, -39, -53, 81, 96, 126, 204, -108, -30, -65, -147]
7170a47J35K49m3j64p4J4M7k1nj85K65R9k02rJ9o5O6J43J89k66j75rJ06K28j40
7195E5r6j72K00M6j8j2J92j91J32j18j20m5L22Jj13%Q0j25kL2J95p6l13M14k82
7220a4L9j02J81j18R4j5j02J59j48J18l26K18Q0n9r0K93k74j3M1J39l74K08K2
7243d3J8J0J17j70J73j35j05N6P3j30J36Q8k65L61k55K14j54R5O4j83M7O4j81
7266a05L05n01M60j89N1P0q1j3KN6l76L59k21j52K77J70k22P7J3l9Q6n2ok26K11
7291d6K22o4j10o5L4P5n6Q5K59j63j01%k02R8j96M6K19j31N6L35j26m23M85l78
7315a47L66k42J26kL2j3k4j37r2J55J48j76J1m1O5J43k44J44N0k69K40q9K8N1
7339H3j02Q5j14O2j18m6K38o6K8n0k93N30k7l20O9r8K33k46J4J65O5k28K7m8O5
$$ y = [-147, -12, 237, 194, 30, -44, -30, 17, -4, -9, -194, 71, 170, -32, -41, -22, -87, -21, 122, 311, 45, -130, -139, -33, 195, 55, -41, -213, -13, 33, 15, 3, 195, 4, 136, 18, -102, -147, 175, 176, 63, 63, 143, 18, 16, 48, 243, 167, -146, 268, -14, 25, -77, 104, -14, 80, 65, -37, 122, -26, 92, -234, -16, 64, 5, -85, 208, -66, -79, -38, 101, -273, -65, -43, -25, -15, 102, -68, 105, -30, -135, -79, -6, -136, 0, 88, -177, 184, -71, 143, -11, 84, 148, -35, 12, 76, -105, 200, -301, 159, -30, 21, 91, 10, -3, -1, 55, -321, 38, -183, -335, -58, 112, -110, -33, -20, -59, 27, -25, -31, -257, -46, 176, 112, 2, -63, -29, 46, -10, 75, 334, 171, 70, 70, -132, -34, -230, -184, 35, -96, -40, 295, 169, -254, 231, -147, 219, -23, 103, 101, 133, 120, 96, -41, -133, 22, 170, -6, 5, -36, 29, 172, -72, 72, 122, -147, 93, 4, 32, 83, -19, 66, -48, 14, -104, -150, 88, 22, 50, 0, -293, 237, 210, -110, -41, -139, 94, -152, -138, 27, 92, -136, -109, -157, -92]
7364i2R8j59L70k81J71k72j26J19K56j45J07k39K54J13j91j24K97N3j41m5P7k05
7386a05L9k4K50k44K65r6m8M6k25J84L18l88KQ7P6l30L85j26j32K96l26J73k4
7409E3q7Q0K7L0j17j31%K78q4K5r0O0j26M6K41l65K51k06N0p1j03L56j04OJ0k
7435B7J00j55r7K33j9Q5k53L46l70J51K3L6k90J19j13J45J12o6j88K45o8k27K88
7458F4k06K83K78l36j36nJ95j57j08J57O4k36K80j69J71m00M05j34l2P7N2j67
7480f0M5j08m5J96j13L4m3M03k84j90J19P8M7j10K39k73J47j37P8o4N8J32j14
7503C5M5kN5k17P2K16Q0l49J16j23N9L1p5kJ69J2k97K65j82J25j52K57j14n7J68
7528A35L9q7k2k48M8L2n9L31j41J33l05L09k48l5L98k41L3m7O5r9k46K51J71P
$$ y = [-92, 6, -153, 217, -64, 107, -165, -291, -172, 84, -61, 46, -193, 61, 174, -17, -141, 156, 209, 68, 23, 100, -105, -66, -90, 160, -84, 181, 85, 37, 83, -142, 42, 360, -28, -26, 61, 137, -193, 192, 66, -66, 230, -96, 77, 53, -34, 46, 73, 103, -14, -145, -145, 133, 49, 74, -16, 44, -82, -36, 205, -160, 91, -115, -65, -136, -239, 117, 13, 19, 29, 27, 127, -28, -125, 108, 89, 174, -79, 267, -103, 48, 71, 107, -183, -64, -177, -32, 80, 14, -174, 71, 3, -224, 64, -142, 141, 419, 83, -53, -58, 137, -20, -128, 29, 93, -143, 137, -32, 139, -261, 144, 10, -22, 55, 107, -60, -15, -123, -168, 28, -85, -51, -94, 309, 25, -165, -46, 32, 79, -31, 208, -65, 82, -55, 23, -41, 17, 149, 35, 80, 78, 133, -84, -12, 204, 284, -65, 51, -72, -13, 18, -57, -59, 110, 122, -175, 90, -92, 33, -119, 138, 24, -33, 135, 174, 87, 65, -183, -135, -103, -162, 169, 28, 161, -144, 165, -83, -118, 280, 39, 72, 25, 90, -9, -255, -4, 167, 174]
7552A74p3j04k96M24R4k25J00K97k74q0M9Q1l13J16j02J41J11j32J19k17J63k02
7574a49k7J74l1n9J00o2m0J29jj52O6J13q9M2J35j11Rj07J72r5j54K95o9l57N5
7599b13J38O5j84J82K4P9j87J34j7l7L7q8R2o3J77j92J58k43K46k79O2J98r6N4
7623D7J11k10j06K50l60L67m06J30J61J2kJ47j7k45J63k19M1J05J09j79jJ91p2
7646A7j4Kk20L65j29J02j96k06M48R6j0j66j05j44J01K5k26O4J16M1J30j41P5
7669B5m5J79l60J24J40k03R2K91o8l21N3%L00o14O24k15P9P4j96O2P8m5m7J87
7693A94m39K55K9o2P6N7k36J81J92l30P0j2n0m0o1J3J49J36q8j40J05JM6N9k57
7718a52K34k7k8Kj16O6K41l8l38J51Q2j37j05J89K57k23j10J87k50kK64p9n0j02
$$ y = [174, 101, -3, -299, 125, 219, -6, 94, 391, 117, 37, 86, 167, -146, -30, -132, 9, 120, -12, 107, -110, 53, -149, -176, -2, -33, -92, 8, -54, -94, 35, 34, -118, -52, 61, -28, 14, 149, 38, 47, -60, 112, 17, -137, 158, 89, -268, -213, -75, -10, -194, -12, 12, 91, -96, 38, 21, -16, 21, -67, 25, -38, 139, -53, 105, -138, 108, -171, -109, 89, -7, 47, 158, -52, -158, 92, -268, 99, -307, -177, -16, -4, -6, 141, 124, -121, 42, -177, -136, -31, 78, -101, -102, 89, 17, 3, 5, -215, 150, 21, 123, -73, -279, 169, 265, 255, 89, -16, -160, -59, -34, -260, -196, -80, -39, 91, -50, 25, -20, 159, -201, -77, 63, -140, -48, 243, 175, -146, -93, -93, 207, -407, 217, 2, 81, 155, -41, 21, 99, 54, 7, 194, -245, 10, 39, -23, 53, 110, -126, 55, 247, -83, -13, -25, -75, -115, -176, -163, -14, 122, 34, -106, -1, 0, 46, 105, -152, 82, 55, 27, 29, -87, -21, 220, 182, -156, -5, 77, -60, -165, 24, 281, 58, -52, 135, -115, -117, 147, 68, 18, -84]
7742h4J91j38K69k10R9j02l15J66qL1q8J13p2o3J83Q4lL4j77K18j64m1K5J26k37
7767a63K16J12k07J59k18m1MK19O5jj48o7k13K40K8K0k39K89k28J35o7j30M26
7790A91j92J73K0J46k05j09J54j18k57K86q5J11j89KK14j03j33R1j58K7j11N2
7812a93J13o6o8j28L24K64k32l4J99n4J06k57R1j8j1p7j67K94j25J25o9mM2r0
7836c5J09k41m1L59k95J37pj41Q3n5J35M8j12O8J4r8K17J60j03l66L18j35qj1
7860@K37k64J19j22K6M5n6M6j49J20J38k67K11R3k5q7Q9k35k0L55k86R2j05K15
7884A70k16J02R2j44j10J54O6j97R3k60L59k2L7Rl28P9Q8J52j96K57k64N0j55
7907a84k4K66PK34l41P8k89K15J55Q8k2j23J34l13K21k12K84m0n1j99J62r4L0
$$ y = [-84, 107, -31, 238, 28, 127, 25, -290, -124, -132, -101, -189, -76, -148, -211, -28, 56, 53, 87, -90, 128, -36, -77, -52, 74, -163, 53, 165, -42, 117, -101, -142, -138, 81, 146, 145, -3, -70, -283, -43, -15, 5, -234, 55, -173, -38, -105, -235, 191, -1, 172, 192, 338, 133, 24, 178, 60, -197, 89, 4, 115, -74, -72, 142, 39, -94, -3, -161, -134, -245, -193, -80, -146, -214, -342, -18, 246, 14, -20, 179, 125, 231, -26, 65, 47, 36, -41, -208, 86, -39, 86, 17, 13, 55, -35, 74, -167, -208, 151, -144, -7, -14, -155, -72, -127, 8, 56, -56, 12, 26, -72, 145, 305, 202, -164, 154, 19, 11, 0, 237, -27, 92, -30, -4, 41, -15, 31, -118, 2, 140, -127, 84, 177, 152, 65, 154, -81, -101, 254, -32, 60, -45, 170, -46, 56, 148, 4, -106, 48, 114, -83, 10, -250, 109, 87, 124, 133, -195, -116, -28, 124, -72, 185, -79, -29, -184, -208, 58, 65, 299, -42, 36, -253, -38, 117, 205, 183, 60, 194, -119, 102, -110, 174, 134, 83, -116, 46, -48, -18]
7930a8K7N0K8j51N5q0L03j66J35j89k9j2L93n22J97m2j16Q9K66j95JJ17k55M8
7954f6r0J85l64M08j13J05k18n8K78j14kk14J50J2J40J24j67M4K43k78r8L32l55
7977a16P3j8O4k1k4L19j11k18Q5j14L3L80l20R0j41J14k36L35j51j95K75q9J97
8000B11k45N2J39j95N4m4L6p9O6p0O2J68q0j00J11p4l1N4j40K64k99J65M3k59
8024a91K23j13P2Q2kj43J19l15L46r2j09J36l4m2J97n5J8l71L66r9Q4Q2k34k3
8048i8J21k61K33mJ84j35l06RJ91N5l14K97j75J24L71m15J34n3k28L16M8N3r6
8071E1K3J33k27P0J50k55R2j21L40j02k03O3K08jk13J38j32PO0j15j42J0O9o1
8095a58J38J71k68q1J90J84j65L8j63k36M82k64OJ30LJ37o5j8j31j84J88O8L9
$$ y = [-18, 9, 59, 87, -64, -9, -89, 214, 48, 183, -6, -35, -47, 346, -176, 21, -21, -137, -48, 218, 23, 24, 141, -114, -66, -156, 29, -335, 73, -40, 65, -153, -211, 67, -47, -49, -263, -113, -101, 39, 163, -4, 40, 283, 5, -93, 239, -116, -43, -61, 3, -18, -42, 277, 166, -52, 33, -81, -48, 332, 12, 102, -39, 75, -161, 174, 23, -172, 103, 14, 211, -34, 18, 157, -38, 16, -28, 8, -71, -5, -75, -13, 155, 75, -25, 86, 12, -19, 35, -105, 159, -140, 25, 68, -191, 32, -81, -9, 73, 71, -72, 47, -268, 78, -14, -123, 13, -21, -63, 134, 79, 97, -274, 92, -7, 77, 159, -75, -98, 23, -238, -5, -9, 175, 40, -266, -257, -66, -11, -325, -28, -203, -79, 292, -123, 11, -42, -270, 46, 94, 147, 51, 74, 207, -20, 50, 200, -55, 37, -84, 256, 154, -49, 14, 222, 221, 8, 146, 14, 21, 81, -34, -176, -166, -97, -158, -20, 151, -117, -198, -8, 176, 11, 49, -114, -350, 132, -132, -126, 4, 7, 144, 79, 61, -70, -254, -66, 2, 41]
8118D1K35l10o9K63l7k22R6j22j45K19J06K43o11L94rJN7n9j97J84j09q2K24k69
8142a78k1R9J66j18K06k1j64l98L91n1J22j14J27K0n0n7L1K3R0k06Q5M0q9o5J53
8167B1J52j67J58m7j97L7K3N6m5L88k83q8j22J0rj00K04rJ14N2r5j36J82j72
$$ y = [41, 276, -34, -103, 160, 123, -99, -3, -125, -270, -51, 55, 298, -313, 81, 72, 73, 130, 71, -126, 58, -51, -133, 91, -178, -199, -100, 66, -52, 154, 133, -31, -429, -38, -89, 33, -81, 46, 66, 16, -41, -10, 13, 103, -103, -18, 22, -67, -132, 21, 173, 6, 164, 117, -80, -43, -20, 36, -9, 379, 96, 8, -114, -104, -113, -213, -9, -18, 96, 148, 53, -83, 99, -73]
8191g3
$$ Imaginary data points
##PAGE= N=2
##DATA TABLE= (X++(I..I)), XYDATA
0@%%%%%%%Qj6J6j6K3l1L9m7N6p2Q8j10J34j60J92k25K65l12L67m29M94n68O54
30C50p49Q53r69J098j240J396j569J758j964K191k440K711l006L329l681M065
46B133m485M945n450O004o610P278q021Q847r770J0810j1989J3340j4905J6742
60H869j8935K1604k4935K9223l4968M3091n5499P6918j23624L87214j34637n00331
72c26010O34584l61387P6523P2147j09513J42770j92844N4193J60315k49734J20261
83B1305M8218r4500k8709P6471M2231j58287Q3067j2159l369R0909j51473R9885
95A3589o2538J5144Q3336j14672J07038o3411m6298J14898r5726P4534j0036n8259
107d2401R4524j44106J52026J4975k04158J92259m7365j0045l950l3094R0839
$$ y = [0, 0, 0, 0, 0, 0, 0, 0, 8, -8, 8, -8, 15, -16, 23, -24, 32, -40, 48, -62, 72, -88, 104, -121, 144, -168, 199, -230, 264, -304, 350, -399, 454, -515, 583, -657, 739, -830, 928, -1036, 1155, -1285, 1426, -1580, 1749, -1932, 2133, -2352, 2593, -2857, 3147, -3463, 3815, -4206, 4641, -5129, 5681, -6308, 7032, -7873, 8869, -10066, 11538, -13397, 15826, -19142, 23949, -31550, 45368, -78256, 308958, 174321, -326010, 308574, -52813, 23710, 95857, -13656, 129114, -63730, -9537, 150778, -98956, 21305, 69523, -24977, -53686, 22785, 65016, -93271, -10204, -22363, -25732, 65177, -86296, 13589, -48949, -33805, 49531, -65141, 41897, -21514, -67812, 47086, -48640, 25894, 15858, -42401, 52123, -91983, 60043, 75018, -129140, 63119, 15754, 5709, 1759, -31335, 59504]
118E9504j20250P5891L3875r5489P1345m2889J651K1895l1080R7185j11191k0253
130e9806J05434o3571N2997p2794L6526L8474q5531Q8826n8072K6182J1469n3333
142c3199R1048p9124J2703P3486j26578P7958L6771p5040O7327r2651M5150O4421
154F2272r4375M8023N697m5083M836N8852n5845q844O9004p8335J8913K4662k2862
167a3085L0147n9628K4040O4200r1513N3169n079n9137R5674m5280K743k757n335
180a1841L0324n5310N7097R3l4299J3568j2287K6736p886p663K5498n8162L9815
193E683M4176q6075L8091P146l446l738j1529M3843n9604J6922L0799k8991Q964
206B241J2205r741l6493L3272L5466m3753p981K3455j4869J2530j0604J8019j7390
$$ y = [59504, -60746, 15145, 49020, -46469, 24876, -18013, -16362, 5533, -25547, 71638, -39553, -59806, 45628, -17943, 35054, -37740, -1214, 37260, -48271, 40555, -17517, 8665, 20134, -33199, 57849, -21275, -8572, 64914, -61664, 16294, 53065, -21975, 45352, -47299, -2149, 62272, -32103, 15920, 21617, -23466, -18630, 40222, -15623, -24467, 44537, -33798, -14885, 9777, -13085, 17062, -42566, -18526, 45674, -45839, 7330, 2251, -56886, 38788, -6492, -3749, -6506, -11841, 18483, -36827, 20270, 20363, -13936, -368, -12655, 14081, 6195, -1468, 24030, -34132, 5683, 49859, -36216, 1875, 9021, 5575, 1837, -9692, 34151, -25453, -8531, 22268, -6723, 2241, 14446, 4705, -31788, 1484, 36950, -6803, -14784, 8671, -6198, 6332, -4272, 13747, -3643]
219c643k2212O8536o6088J1896M3267n0645J2545K689K1900j5703k4131K3620
231B031k931j908J4009p082j9372o171M8631k6582l8425Q4970o8101l406N2551
244B8214n3342N2086l9538k724M1212n2061M3664j859n1640M7643J995j7290J0023
257F383j6741J8721j4622J1031O070j2615R273k3607K7549j7654J4316J3382n0254
270b8768L5067M1q427J2784k2210J0111P072q565R964j9190J5687k790j4008L1420
284A8188l2234K4327j7646j3182M1592l4805L0837k5581j6764M8900l5780J3311
296A163R546l1547L1906j6019m30K0676l5910L6908k2549o038L5411l1474J0336
309A979j3287J9295M14j4407K1146l2347J6802J5817k0209J4408j6577O838J4988
$$ y = [-3643, -25855, 42681, -23407, -11511, 31756, -18889, -6344, -3655, 18245, 2542, -21589, 2031, -900, -2808, 11201, 4119, -15253, -21424, 27207, 625, -37800, 47170, -20931, -24337, 28214, -25128, 26958, -12580, -15304, 25908, -26153, 17511, 15652, -35988, 11655, 13650, -3640, 6383, -10358, 8363, -6259, 4772, 10842, -1773, 7500, -16107, 11442, -6212, 8104, 21486, -28768, 6299, 6340, -2087, 10697, -11513, -1402, 5670, -2895, 7069, -12121, 3566, 776, -13232, 18188, -14046, 10281, -7365, -20547, 21045, -13760, 17077, -8504, -25268, 23632, -12148, 1163, 10709, -20838, 11068, -4951, -5381, 15295, -20615, 16293, -6256, -12294, 23117, -8357, 1979, -11308, 7987, 8401, -6006, 15140, -17207, -405, 15412, -4797, 9611, -6966, -128, 14860]
322A4860l9250M5613p022m0264M3297k0812K666O385r06o986j1463L1247j4927
335B438o728l507R134J0006l0175K8998L411m4563M1486n721k3019L7764l0616
348a1092J0245q292k76L6425m7990J7593R727j5134J0763k907N775j7954J3724
361F07J2989l0379K1927N903k8606K3101p516J3151q793k1812L8428l2706J5947
374B241J8085l4828J3522K124O014r401k365J7079j6757l325J7539p261l317j232
388a882O304l954m148K3485l0664O887J2005r194J5010k5248J8476m511j3980
401a1414K7041j7428o91P459j2943R823j794J501J044j8902K2508r898K15P727
415D248k3043K6662j6361N522Q871k3424K3432j2035k226J8827j7280M655L668
$$ y = [14860, -24390, 21223, 14201, -26063, 17234, -3578, -912, 5473, 4567, -2419, -13882, 17365, 2438, -4290, -7797, 1337, 11343, -18832, 10166, 13577, -30986, 10500, 4779, -18240, 19524, -11092, -847, -9139, -9415, 27010, -20980, -3387, 6340, -8794, 1969, -938, 4837, -13117, 607, 13596, -16783, 5144, 11047, -17559, 5542, -1974, 11177, 2384, -19428, 19000, -13706, 2241, 20326, -14502, -980, 1144, 7158, -2243, -4608, 12471, -4286, -7611, 9928, 2667, -650, -1882, 4422, 468, -3680, 19805, -10859, -3972, 8033, -1161, 13849, -11399, 7077, 2566, -11414, 15627, -1801, -2492, 4967, -7976, 1847, 53, 1554, 2598, -16304, 6204, -3694, -3479, 4248, -18795, 7867, -8494, -2972, 5899, -17525, 5907, -6128, -8354, 10473, -6807, -2152, 1516]
428A516j1450J7544l637l661j829k361J3537j1192R580r945K499P483j3413J9258
442A3929j8448M220J2117k1748J6358K551j4708P025m509N743K291r037J0242
455F026j6834R862P404r920M691r681J6367j5803K669J9749k5083R115M397n862
469b903P808p459O254m136r803K7425j7521r236J8979j3752P398n302Q948n253
483A447j3646K0862j1705m06P912o136m379j005J3176m488j5441J7118m075q960
497i726J6516j0694J434l231P066M004j6043J8581o135q330P413N846j337j0543
511e179J0344k286o816J4274n767r012Q681l549P202r754J088J2304k3005J6305
525D830J088j1806Q784n721K677k837M983O54j1502N703N796n048K108k240K414
$$ y = [1516, -9934, 7610, 3973, 312, -1517, -3878, 9659, -1533, 8047, -1898, 601, 8084, -5329, 13929, -4519, -299, 11818, -9930, 6428, 8979, -5729, 1296, -3213, 2530, 4821, -4216, 6026, -10808, -946, 6458, -3462, 1229, -8452, 7915, -7888, -5219, 14530, -10553, -1438, 2959, -2903, 4905, -2554, 3700, -436, -10239, 17186, -335, -9571, 9408, -4344, 3054, -2248, 6700, 1447, -12199, 8663, -3042, -3448, 4464, -1672, -6051, -7056, 6120, 1632, -13809, 3309, -766, -9726, 6790, -3904, -2470, -5701, 1365, 5369, -10674, 7907, 1772, -6558, 855, 6701, 5364, -5179, 5165, 2879, -3937, 10337, 4570, -4442, 4239, 690, 7892, -1862, -774, 11530, -11475, 4830, 5918, -5888, 2896, -2825, -148, -2985, 1998, 2652, -8850, -3147, 2649, -2399, -291, -2531, -117]
540a17l524q08J3043j5800P879J843r504J1738n921M021m001l046Q266k285q12
555I72j416j325K917O95j589R60l034K876m788O863r37o570R215j1444O967K006
571B368k770K334r301R791N9n260M566k685j025L549p52J253m475L360J095p275
587e168J2795q223k93J922l815R251r384O278k102q247J2325k373o522N038p94
602F88k211n54L535K699j1283Q024R88m579L363n40J694j0664J2783J723j3234
617g568Q798n60j767l33K673K778q433K676P546r944N290L197p131J854k96R127
633G907j1774J528P573j0193Q438k596j150n17k223P947o827n36Q564j1323K492
648b690O996o798M585n627M345j326l008J0311j0815J994L263n18q43k422O633
$$ y = [-117, -3641, -4449, 8594, -7206, 673, 2516, -6988, 4750, -1171, 2850, -1151, -4197, 4069, 1784, 972, -444, -1769, 1148, 1843, 254, 1214, -1820, 1056, -3732, 3131, 2194, -4376, 4839, -6605, 362, 2368, -402, 1932, -7369, 2422, 2481, -2779, 1787, -898, -1923, 1626, 874, 2127, -2348, 1012, 2107, -5168, 7627, -596, -889, 1033, -2782, 6469, -2915, 3363, 1261, -6986, 5339, 2966, -3556, 1482, 688, -1523, -2077, 1458, 4157, -7126, 898, 1886, -2693, 670, 130, 1824, -8840, 3943, 5666, -7568, 1230, 670, -1097, -1430, 1243, 4021, -4412, -1736, 5810, -4134, 1156, 4353, -2778, -924, -1220, 7907, -3867, -2339, 5234, -4959, 3479, 883, -267, -784, -3007, 4940, -1887, -2423, 6141, -5182, -2690, 4306, -2492, 2093, -3534, 811, -515, -3523, 6788, -4027, -2033, 1230, 712, -131, -2553, 4080]
663D080o498q88Q457n720j330L460l755M285l930M723j55j0341J2143l820q75
678a64R98j764L434o304O307m90m050L620k985J608J765l497M215n440Q23O631
694D707p478N734n268O89N173o685O445m844R30J513l059N096l736qK037l892
710b646M139N7l458L542n459N930j110l209N086p557O344j245j798L042m125K980
726E13k117J275L018m572P3K610k069K283j171Q40k047r22P116p418K815R22k285
743a136K357l652P235n465k295O365l726m5K943k433j137K57L320m4o057O337
759B824l088j105L337j791J909o107O668j231m764O324l118k257K203J748r16
774F36k684J360K353m734M681m88l920K342n71K998m848L868M71o113O205q30
$$ y = [4080, -2418, -3306, 5151, -569, -1899, 1561, -2194, 2091, -1839, 2884, 2729, -7612, 4531, 711, -164, 834, -930, 2504, -3800, 2507, 2017, -2033, 1587, -1398, 210, 1975, -1522, 2693, -2747, -1924, 4707, -2771, 2963, -2305, -1616, 3557, -3128, 3317, -1527, -597, 916, -2143, 2953, -783, -791, 1246, -2646, 1493, 1550, -1908, 1634, -3825, 2105, 995, -2214, 2872, -4685, 1659, 414, -1384, 1658, -2467, 513, -1604, -329, 2689, -1883, -1810, 800, -1269, 1014, -157, 683, -1364, -2286, 4830, -2588, 227, 1149, -1136, 1221, -2431, 4804, -661, -2956, 3409, -317, -362, 2581, 148, -989, -732, 2588, 2544, -3513, 2824, -264, -1369, 1968, 177, 2086, -4021, 2647, 1416, -3348, 2976, -142, -2399, -196, 1552, 636, -2048, -688, 1665, -3069, 1612, 1124, -2796, -454, -1025, 1973, -2875, 993, 1464, -4649, 1556, 726]
790G26p17j069P04J071k348K391J767n453K385K496k869J477j029K460m591K151
806d48M427o400L280j266M79k15l78L354n376J079L921l395J048O16k044K529
822A211l022M013j560l334N629m701K718L78j607P84k020L507j733M10O39k546
838a234J724M89r52J040k117J215M21k265M626m629J059M68j467L578l714J933
854A75j462k03K186j884J430j299o32K735j509k26J487l208L541k708K470J338
870B231n471N053k383J363L12j168J597l672L570P32l282J731J75j157R80p56
886a45K051l114n30M608m951L153o73j286N98r61L752m067R12K080l325J872R33
903I07j072m19l38K074j164j141L748m462J844J060o38L37k687M356l547L51L688
$$ y = [726, 9, -1060, -356, 715, -1633, 758, 2525, -2928, -543, 1953, -916, 561, -468, 1992, -2599, -448, 3979, -2421, 859, -407, 72, -143, -521, 2833, -2543, -1464, 2457, -938, 110, 726, -1318, 1211, -1811, 2202, 642, -2692, 2937, -1764, 954, 1332, -275, 509, -1511, 1996, 263, 673, 1312, -1234, 490, 979, 27, 1067, -1050, 165, 586, -1679, 2947, -1682, -623, -155, -1622, 1956, -1758, 175, -1287, -1490, 696, -1188, 242, -1057, -1689, 1046, -463, -689, 798, -2410, 1131, -1577, 893, 2231, -3240, 1813, -570, 793, 1105, -63, 1534, -2138, 1432, 2164, -1118, 613, 788, -369, 611, -145, 1906, -1208, -1738, 2870, -2081, 1072, 399, -887, -289, -1250, 2502, -1565, -653, 1427, -1898, -26, 907, -165, -584, -922, 1152, -12, -1153, 2595, -1867, -23, 1037, 399, 736, -1951, 2405, -1142, -791, 2897]
920B897m138O71P16L6Qo12J889j785k393M657j980j178J108p41J253k679M168
937A897k119k689M388k166R35o20J87N05k093K293R10k906J705J43j359J896q46
954F1J182k825K265O89k490L086k624P59j32R0J229k157J271o3j168J832m35j773
972a203J191n45J483j462M89J075l139L257j521O92j14j434K319j980J363L03
988G74j462M19L45j47J134k018J235j78p20K137k446K016j778m53K927k587J470
1005F68j272P53j54r26K377j597j026J319m44k0P82r12P98j948K619m21k152K858
1023A302k396J262p4L34J26k195K662j087l06J201q82m78M69N85O63k580K041
1040F47M34l084L634j311l60k45J34J469k802K719o93k120K073L22p55o35M73
$$ y = [2897, -1241, -570, 146, 182, 190, -422, 1467, -318, -2711, 1946, -34, -1212, -104, -845, 408, -2271, 1897, -222, -2911, 1477, -689, 246, -374, -187, 318, -1775, 518, 1428, -1478, 227, 370, -989, 907, 61, 1243, -1582, 683, 1372, -1118, 1968, -656, 103, -29, 61, 1290, -867, 404, 341, -827, 1005, 570, -1203, -12, -557, 926, -536, -47, 1028, -2111, 1146, -375, 317, 203, -1231, 1088, -892, 471, 774, -688, -269, 76, -71, 1063, -955, 280, 102, -618, 1519, -927, 1089, -689, -1142, 1785, -802, 668, -604, 149, -5, -931, 1446, -151, -1177, 142, -302, -322, 460, -452, 346, -1602, 1017, 596, -1556, 1302, -1094, 168, 94, 428, 554, -1641, 1021, -66, -372, 829, -53, -531, -62, 523, 1186, -1394, 647, 1081, -2003, 1631, 320, -40, -285, -151, 1318, -1484, 1235, 542, -1578, 495, 817, 62, -573, -100]
1057a00P61j740Q65J773l531K390k00n45Q49j341K365l097J643J093j958R20k60
1074a13K02l37M05Q01j580l55K070j898R87J17p28N76j327K827k431N3J657k131
1092a205J482k46r6j71o16J580o23o88J417j551L82Q15q63J678k160J431l56q52
1110f42K194k128R77p43K62R22j480J007m72l43J098m28k14N13j282J419p78K94
1128A76L66j569J838j768J491k25j167J183j000J113l50k47L93r43L51J297j533
1145e94Q12j72n49R38p94J278j482L60P75j375J435p89J12l06L78R04j231k4P63
1164D39j248N26Q69o05J19j105K069j134n08J885k301R58k5O71p41o35J396j140
1182e10M00J058j063l75P74k12K72n76R49q19j083K461j309M94n92N7P15j234
$$ y = [-100, 661, -1079, -214, 1559, -1972, 418, 218, -327, 522, -819, 1546, -1551, 92, 1185, -773, 147, -113, 89, -248, 157, 958, -622, -977, 1093, -805, 182, 299, -429, 147, -1180, 1647, -784, -731, 926, -1205, 277, 31, -65, -236, -852, 728, 105, -583, 834, -717, -335, 480, -383, 1295, -865, 566, 210, -642, 1552, -576, 401, -342, -80, 842, -638, 369, -103, -446, 652, 224, 10, 523, -759, 660, -118, 176, 542, -1027, 811, -957, 534, 309, -858, 325, -675, 438, 88, -159, 234, -709, -358, 939, -594, 218, 46, -503, 435, -359, 919, -563, -203, 572, -803, 632, -157, -45, -351, 27, 931, -300, -324, 439, -809, -283, 586, -19, 100, -1005, 1064, -70, -578, 1307, -994, -36, -61, 610, -131, -766, 630, -510, -110, 948, -115, -490, 284, 72, 344, -232, 717, -102, -1185, 1276, -33, 461, -131, -74, 641, -593]
1200e93J830j301m74Q18j0l09J2M26k22r05J083M40k026J896j087K70Q8j87J068
1219H17k303J998k82o87Q37m00O8o89M91P37j395M31Q31j169J356l48k56qr13
1238h84K118j547L73L75j139J131p08Q31q20n1N92m51p1Q88q49R6k9K3M71r12
1258e63R47q93L94Q28j236J231j280N97M69p72Q39p14l2L75j68O15n59l55R05
1277F28j093J030j19o76O79j281J553r27l2Q81j175O62m95M12Kn85M94J16m31
1296c57R55r23k01M43k59J085j749J119m8q04J122l44O3n73L87M46q38O99K48
1315D71r01L56L75k10P2n30J026j161O53O88j533J034n07Q14o92M3M62j012N74
1334B2L42m62J45R5p5n8j54J013j233k03J395j353O91J16j37l22r3J192j125L15
$$ y = [-593, 1237, -64, -538, 280, 270, -39, -27, 399, 177, -728, 355, 795, -1231, 665, -422, -152, -64, -251, 817, -1486, 512, 230, -457, 380, -20, 48, -641, -150, 587, -808, -377, 454, -715, 641, 293, 37, 29, -884, 1234, -313, 60, 435, -704, 427, -281, 550, -270, -321, 271, -180, -251, 637, -212, -116, -145, -122, 349, -563, 384, -509, -115, 713, -523, 708, -572, 25, 494, -278, 561, -153, -185, 190, 22, 637, 78, -277, 628, -465, 565, 446, -230, 449, -832, 721, -206, -238, 643, -532, 130, -365, 47, 49, -536, -42, 74, -357, 598, -325, -526, -83, -342, 743, -1006, 113, 65, -739, 383, 39, 102, -471, -84, 362, -476, 223, 471, -430, -74, 301, 91, 163, -367, 659, -502, 151, 839, -694, 340, -167, 647, -45, -2, 460, -552, 22, 364, -98, 47, 142, 67, 9, -145, 868, -365, -568, 827, -526, 165, 281, 144, -178, -271, 921, -204, 111]
1354A11O1k59QM10J90n60l31P73n1p01R93o86Ml37O53R4j009Q66n76OP54m72J13
1377E4m69K92K49k38P9J67q17Q69l19L70l46k39P60j067J085o2q08M32k44K71
1397A9n3R1L06n55P9N00l52Q4N4k00K95m40Q66q88J3L19j72N05p42K09Q5j31M04
1420B96p13N91k56l0L26k33J09L14q05M81k08K8M34q81J133n41J58K03n65K00
1440D1j13L63l56l52L48j7o5K12j38m9p5J15M33r70J213n97l61P96p47O55n32
1461a96L78l68j66O34k53o19P24j42j55K64j50M94j091J082j99p39Q13n11M82
1480B82o54Q01L3q47N03J11k64L89jk40J18m77R75j165K97M41r19J094o48L40
1500A69l68k64Q92q08L81K65m86J07Q6K10m27Q4K29j37j53Q79j299O96m22K78
$$ y = [111, 172, -87, -79, 331, 521, -39, -370, 403, 352, -349, 644, -42, -38, -375, 278, 372, -637, 229, -347, -341, 413, -59, 54, -415, -123, 126, -112, -33, 134, -683, 186, -133, 237, -109, -348, 412, -655, 430, 368, -440, -8, -252, 19, -34, 57, 363, -192, -113, 387, 35, 119, 173, -27, 268, -172, 694, -194, -181, 138, -34, 471, -271, -62, 23, -108, 296, -417, 174, -82, -112, 214, -19, 90, 404, -401, 80, -128, -100, 334, -547, 586, 45, 203, 406, -159, 41, -72, 291, -65, -417, -69, -86, -151, 61, -77, -126, -201, -86, 347, -623, 590, -7, -368, 428, -319, 336, -196, 182, -186, -352, 282, 29, -590, 134, -8, -163, 101, -49, 445, -646, 436, 237, -502, 311, -200, 282, -372, 429, 462, -385, 118, 229, -35, 354, 353, 113, 231, -246, 729, -436, -139, 302, -617, 477, -171, 169, -199, -463, 429, -379, 2, 267, -219, -112, -26, 184, -243, -159, 70, -67, -220, 659, -640, 56, -366, -88]
1520h8J70l40N80p71L27L14l63Q8M1J55p3j60M21l58m08M10MJ51j06j43N09q13
1542d53P03l42l2J37k89M84k41R6j10k5j3K29RK58o36K39R7m74P81o60L05j96
1564a33Q0L60n92N41l94%Q6J83K68n95K12p2n9J13K69o37M65q2OJ1k87N99p46
1587d04N82j14l51M16k61N02m74j44K37M5k72M04l51J13J00k17N09m53M29n34
1607b38K99J7l90M77m37N33l82J13K76k80j08J90j23J45k09O3Q0m69P95k76k07
1628a31O44o97L27m08N55n2j67Q4l43L0K54j23rj25mO09m93O1K43l50j13j31N64
1651B25l44K28K15n60N56l69M9j16K42p3j50O2J79k97J63M0k03K67k79J92Pm3
1673iL11n75N44m03J50o5j93Q5m6J37N29l44o07P58m47J80k13M53J2n66M42k66
$$ y = [-88, 82, -258, 322, -449, -122, 192, -171, -83, -42, 113, 40, -120, 301, -57, -465, -55, -51, 100, -6, -149, 360, -453, 250, -92, -124, 13, -276, 208, -33, 63, -47, -72, -85, 144, 153, 411, -225, 14, 111, -363, 418, -242, 63, -133, -53, 307, -285, 256, -138, -138, -52, 131, 399, -196, 16, -56, -115, -2, 267, -370, 95, 13, 19, 30, -257, 342, -404, 178, 64, -287, 129, -132, 370, -104, -248, -11, 34, -238, 166, -185, -72, 28, -189, 320, -133, 296, -238, 61, 78, -312, 165, -272, 261, -121, -8, 268, -12, -120, 70, -53, 92, -117, -54, 26, -443, 352, 76, -131, 513, -184, 143, -265, 290, 238, 71, 155, -188, -158, 96, -27, -36, -161, -165, 444, -49, 12, 255, -95, -208, -339, 225, -119, 109, 324, -236, 320, -49, 0, -116, 126, 53, -97, -35, 144, -153, 10, 50, -153, 114, -165, 27, 34, -9, 302, -273, 271, -132, 18, -47, -240, -155, -201, -64, 465, 121, -486, 272, -175, 5, -208, 245, 257, -309, 133, -133]
1695a33N38l06l61N91l86L85k38j21M6k18K09J64l56K61r7L5J98n27L15l96N90
1716A93j07j33K04m16L04K60j70J75l14kLm2J98J29n53O01m30Q9j6j71L10n10
1738c98P82m36N7J69j19p7Q9R8k26j7J43j07j40J62k6J62k70o3K64p2K10ol02
1761a23K71k11K22l74K20m6P5J31k93M5mk7M89j57n38N86l68J49j36N9J71k26
1783h5L81k87pM54m72J95r9k2l24L13m2K19l92L99k38j37jj8K72j08J86j94j98
1806b05M00j34p5O3J54n0l62K38J59j10J55k48M6k4k50L44j27P0J95n44N20l42
1828a27M8Q3R0m2j77J15j2J28L7Q0m81J42j30O38o72K78K68n70M10k30J12J64
1850A52m06N92l35K19l41n8Q0K40R6m5n00L1L52k90J92j59J38k30J46L38k23J67
$$ y = [-133, 405, 99, -262, 329, -57, 328, 90, -31, 15, -203, 6, 170, -186, 75, -22, 13, 211, -316, -1, -397, 193, 86, -47, 157, -259, 45, 305, 135, 310, -4, -6, -3, -45, 153, 282, -271, 330, -100, -11, -27, -198, 112, -398, 384, -52, 5, 174, 55, -22, 67, 165, -61, -78, 65, -42, -182, -20, -46, 116, -154, -217, 47, -25, 185, 179, -123, 148, -63, 159, -215, 5, -41, 34, 165, -128, -83, -87, -114, 375, 218, -320, 266, -102, 47, -89, -30, 141, -85, 296, 9, 2, 456, -16, 179, 80, 58, -266, 47, 5, 224, -168, 231, -7, -144, -145, -163, 109, 1, 187, -7, -205, 195, 61, -14, 49, 203, 153, -209, 29, 188, 78, 233, -15, 31, 7, -243, 101, -26, 44, 239, -305, 215, -127, -79, 4, 94, 52, -125, -10, -22, 106, 143, 223, -258, -116, -246, 392, -280, -2, 266, -304, 106, -124, -12, 152, -254, 338, 3, 222, -119, -177, -97, 143, 239, 194, -306, -275, 77, -213, -21, -180, -42, -272, -126, 212, -11, 156]
1872A56q4j23oK8J69k41Q6Q1k60K73p1j0l9L0L51k48l6J86j88k30K66r8L9k47
1896b16J86j03l9J47N6l56L45k72K13q4N9J29l46L69j05k6Q6p0J61k27L43m08
1918a58r8L54k04J18p4J22J19k1k40M64m66J77q3j84M61n55L37j18Q0j5j44K38
1940A10k20L9J9KL9O7m4J64l39M59m04J07Ll1L8q0pLP7J0r5J60j05l42L86K01
1966B17l41J81N1l03K06j05K50m04K26Lj06K54j7k49p2M87j71p7K8J6j95J82N5
1989A16k14J09JL01m38Q6Q0j06P7O9l1l0l8L58n0j97j70k36M58j44m4q3kM6m2
2014a24R6J02k12L22j98m9J32M5Ql10P8K0K67l48L8L77l67J43m5m0M9j14J41j9
2038hj64J43L47n37K19r9J12L0l20K97j65j17M19k41K1J29n3J53k14J05Q1j39
$$ y = [156, 72, -51, -57, -29, 140, -101, -15, 66, -194, 79, 8, -2, -41, -11, 340, 92, 56, 242, 54, -176, 90, -8, 31, -216, -30, -133, -172, -25, 31, -325, 20, -252, -39, -123, -64, 65, -281, 88, -17, -43, 43, -27, 134, -93, 250, -158, -256, 98, -106, 12, -62, 60, 179, 158, -82, 382, -84, 93, 10, -174, 287, -268, 69, -49, 31, 16, -128, 110, -110, -71, -52, -50, -11, 56, 12, 176, -163, 296, -108, -1, 2, -29, 9, -71, -78, -75, 2, 12, -83, 77, -28, -370, 16, 217, -124, 57, 108, -195, 11, -94, 156, -248, -22, -19, -125, 129, 112, -137, -209, 278, 107, 30, 58, 74, -121, 61, 116, -98, 11, 12, 313, -125, -39, 41, -65, 12, 81, 50, 20, -18, 340, 290, 93, -77, -313, 145, 1, -43, -126, -128, -82, -124, -28, 74, -138, 184, -14, -63, 69, 114, 122, -188, -110, -90, 177, -171, -133, 244, -123, 20, -25, -65, -16, -130, 11, -8, -172, -29, 318, -219, 0, -99, 13, 43, -277, 20, -145, -262, 157, -84, -63, 66, 13, 166, -48, 57, 138, -1]
2060aK01j72L17k56j43o4J8K01j63j61K07L81j46k34j4J07j5m0J00k25O1j16j01
2083b58K64m7O7j76LJ49j08K33p6K8k30J36K24k39j47Q4j23L47l45K36j77R7J40
2106H2l24J36j6J78j10ln9n6M17l16J96m1J77m38N3M02l68l8j56L80j47J00j41
2129i2k2K74m75J44K25j12j02K36j27J07J15k32j40J25Q6k04J13L46j79O5l27
2150a76K95k56l5M9J3J90p8L5Q7k87K78N8k30K1N7J21K2l45K83J3P2k41p3K32
2174A05j82R2Q0L0n2k49P3J96j38r8K75l52J5L25k12Q3J9j70L8J66J32k76L25
2197B25l15j79K98q2J90l87L91k75M8J4J46j20N1q4J77k65J64j81R7K6O6J03j36
2220b8j91K15J80nM7q7R9m28J92l4O3K76k18l46L26R7N5k53p2J25m5j54J63j6
$$ y = [-1, 200, 28, 345, 89, -54, -118, -100, 101, -62, -223, -16, 365, 219, -15, -29, 78, 63, 23, 123, -102, -41, -157, -258, 6, -41, 26, -150, -147, 2, -106, 127, 51, 79, -151, -15, 209, -30, -177, -93, -216, 131, -214, 22, -155, -58, 82, -242, -106, -122, 56, -54, -57, -116, -172, 245, -71, 125, 84, 261, -177, -124, 278, -90, -128, -284, 96, -51, 49, -92, -114, 160, -315, -171, 54, -58, -160, 76, -51, 56, 171, -61, -201, -76, 10, -194, -81, 265, 86, 151, -176, 119, -137, -172, -123, -110, 80, 2, 37, 124, -163, 115, 173, -57, -36, 21, 142, 164, -181, 102, 115, 187, -54, -127, 105, -77, 15, 95, 125, 73, -176, -103, 93, -45, -143, 132, -220, -205, 120, -92, -9, 10, -160, -122, 44, 176, -100, 225, -90, -269, 29, -53, 137, -250, 141, -134, -86, -72, 74, -46, 5, -79, 98, -167, -3, -184, -87, -61, 5, 108, -28, -219, -4, 176, 171, 218, 131, 230, -198, -6, -40, 23, 299, 81, -265, 61, 158, 213, -40, -112, 13, -32, -186, -23, -39]
2244c9LK87o0l42J91l9j84l1L64j93J29Oj35n1K08l98J49J16J4K2j83J44J58k40
2268a04J71q0J61n4r3J60j01j2J19l55L32k9pj5P4l25K0K49%k85K14R5l7k0J02
2293A80j83K3k19K89l8k15J42nJ58o6k10J05q8K3j21K38m1j8P2j13j34J12p5P7
2317a07J34j47L05k03k16K42O8j8P5m0m6j3l64L62QqM7m4J01j00J4j5J29l49J66
2342a9j72K11k73M25m04R7J08M1K85k88l8N2L8K6R0j9j22k0k20K12j98M06k78
2365f0k9M52m54K77j78p5k9J88m3q1P5J10Ql38L05k73K52k71J55l8j23J79n5j31
2389a77L08j10R4J06j61n4J29k23P3k77L73j7j61p3K48pj57j05K86j95j25L49
2411A24J21k60j11O7J00N5l3r1j78K40j58K58o3M5j34k2J8j41K77K8l38J04L8
$$ y = [-39, -36, 251, 191, -151, 40, 1, -183, -214, 150, -43, 86, 92, -43, -94, 114, -284, -135, -19, -5, 17, -166, -22, 136, -104, 67, -13, 148, 94, 1, 161, 60, 48, 167, -188, 144, 115, 108, 93, 167, -158, -138, 111, 111, -174, 40, 135, 98, 78, 180, -3, 20, -199, 90, 52, -163, -21, -26, 132, 66, -144, -39, -127, -104, -225, 13, -28, -46, 26, -87, -221, -109, -184, -107, 27, -120, 185, -18, -234, 8, 76, 58, 133, 93, 47, 34, -330, 32, 40, 32, 79, 35, 136, 36, 50, 35, 164, -185, -19, -191, 20, -253, 172, -232, -135, -27, 14, 299, 11, -27, 25, 63, 89, 179, 160, 38, 18, -202, 10, -188, 218, -60, -89, 363, -91, 186, 8, -67, -96, 92, 49, -32, 43, 153, 161, -177, 128, -145, 107, -164, -9, -47, -170, 9, -46, -177, 131, 21, 115, 221, 60, 6, 135, -88, -15, -292, 81, 64, -97, -170, 78, 71, -86, -191, 95, -100, -225, 124, 245, -15, -126, -59, 41, 96, 63, -28, -206, 34, -124, 134, 71, 116, -18, -40, -22, -163, 114, 142, -196, -92, -54]
2434e4J19j33p9K99j81M6k53J74L1O6J10o6j26K05k17j11N3K4P0nj14J4J14L1
2458A7R0J02l22K17k72J94j88J61Jq2K53j61p1j8p0j3O3J82k4n9J69J0k00n4J16
2483D1j3j30o7J46N5j20J66O1j35J61l3r6j5j74M48m06J37r1j13J39Q3M17l56
2506A05j76O7o6L1K26l8Oj85M0k5J96j77J65r4J3j58K22j43J28j13J14m8o2R1
2530A19l5p4L5k11P6J36k46L02j26Kj32k9K73j91J67l8k9J2L52l16J81j48j83
2553a03K87l65J1J63m6j19P3m8P4R3j11l3K43l7m1J5j42J4r8L05q3k59L86j01
2577G8J00j03L5J6%q4j98K37p6oj2r0O3N3k19n4K09K18k3l33J76J8r6j2J49o3
2603a7j48K17N6J4M6J0j75J41j21L0m6L93n13R6j51K95j14p6r0J84q0KK27j94
$$ y = [-54, 65, -68, -147, 152, -29, 17, -236, -62, -31, 35, 145, 79, -47, 158, -59, -170, -117, -93, -23, -28, -142, -128, -14, 17, 107, 209, -113, 104, -168, 26, -162, -1, 0, -82, 171, 10, -61, -79, -149, -162, -99, 83, 59, 0, 169, 179, -21, -75, 41, 28, -102, -169, -23, 32, -88, 78, 139, 4, 165, 132, 36, 21, -153, 295, -111, 26, -65, -178, -39, 44, 461, 105, -71, -4, -70, -39, 187, 149, 155, -30, 10, -15, 181, 4, 169, 75, 88, -70, 152, 9, 137, 24, 138, 90, 28, 119, 84, 10, 45, -166, -90, 46, -200, 102, -24, -22, -154, -183, 90, -101, 66, 28, -1, 11, 363, 47, 228, 80, -103, 184, -181, -170, -7, -53, -172, -99, -147, -73, 20, -91, -124, 119, 82, 41, 56, -86, -72, -170, 135, 52, -207, 179, 78, 178, 75, 110, 126, 126, 42, -156, 81, 5, -1, -13, -103, -40, 13, -206, -260, -51, 167, 144, -189, -13, 5, -91, -103, 46, -17, -165, 52, 108, 122, 168, 178, 3, 144, 23, 53, 7, 400, -113, -17, -168, 127, 13, -63, -153, 31, -49, -47, 180, -14]
2627a4j5L06k68n1PQ5M0j08o5l41O09j45m9j98K02o8k7J35K8l58N3M90j78o8n7
2652e5J24n6J58j3k87K94j46j56L04k04j4P6q3L17j84K4j4J4L4J56m55K15q0L1
2676@mJ77r7j30j04K46J07n5k04J41j18l6Q0j09J08K28n17K63j78l5J17j20K46
2699Fj0j96L49j99J75j10q3K41o0k66n1K43l8j6r6j53J51J87k06%R9R7K46k87
2723B3k45R1K84k97n0K02P3j72n8M8K14O3k27J11j55Q3Qj0n7OJ72k51J50J05J89
2748C00j62r9j94qO3NK7P0P1k56K8Qn7l0J71J76l92K16LJ63j0j84O2K23l66N5
2774a17L30l50R6l9K4Q8j17J60j02o7k3K18Rk88J19P8j23J27K13l90L27m8J84
2797C09m92J57Ok9K40k62Lo6N6J51Lo8K22l95K07j78l8K73j62O7k3p9K45j74j7
$$ y = [-14, -29, 277, 9, -42, -35, 50, 90, -18, -83, -424, 185, 40, -9, -207, -5, -73, -100, 35, 63, -295, -242, 248, 70, 2, -55, 69, 13, 171, 158, -129, 165, 19, -137, 167, -37, -51, 25, -58, 259, 75, 99, 85, 99, 133, 289, -166, 49, -31, 0, -4, 173, 76, -54, -158, 88, 195, 140, -64, 77, -41, -77, 3, -106, 2, 230, -287, -24, -202, -237, -120, -240, 6, -4, -200, 149, -50, 125, 15, -68, 173, 113, -153, -204, 39, 1, -15, -111, -264, -113, 74, -132, -132, -33, 64, 310, 23, -222, -131, 153, -144, -194, 8, 81, -91, -149, -101, 113, 176, -51, 60, -95, -12, -4, -14, -71, -65, 107, -144, 6, 111, 300, 138, 39, -155, -163, -100, -95, -68, 2, 73, -183, -155, -147, -204, -234, -63, 113, -279, -63, -60, 103, 93, -91, -29, 194, -172, -117, 213, -137, -41, -80, -56, 32, -85, 75, -27, -94, -117, 101, 110, -178, -59, 19, -104, 23, 236, -154, 173, 125, 309, -183, -26, -20, -49, 191, -71, -68, -134, -78, 73, 76, 8, 230, -165, 42, -136, -174, 99, -63, 4, -19, -98, 147, -27, -44]
2822d4j1K77j93k34J95r4K24K7k57J48r7J57o7q2L13j95j09q9L5P6j40L92j67
2845F5R2k94J07J12q5q1J12m2J0p6J66R0k03k9j7K22j54o7M1K03j26j41p0K63
2869I8j05j57N5OJ94r7J3j59O3m3J32N4J20j46k7m25J67M37k52M6l5J24j29K2
2893d4K23l28L92oj07k9j28o0J90O3k86J54k05l7K25l3J19K0j32J32k21K12k56
2916a42JJ54j17k28K61j21K83k69L67k8l25K68k38Q4J28k1j35P2r8K82k37J08
2938D9N8l8k6m9J00o9J82j70J6j59j26L01j22k2J81j1J8j93R4K7j8o7m6k10M14
2963A14j82K50n5j79p0J14j06J24j2m5p6R4o8J3P7m8r6K68j83R0qJ69j70J57k33
2988f1N5q8J79l02K31P2p1j24K36j99M0J73p6R6J32j81k61L94k11L3n1k47K28
$$ y = [-44, -55, 222, 29, -205, -10, -104, 120, 147, -110, 38, -59, 98, 31, -51, 262, 67, -42, -131, -96, -20, -160, 232, 65, 157, -137, -30, 82, -3, -84, 28, -14, -4, -80, 86, 176, -27, -56, -73, 149, -5, -72, -31, 172, 46, -95, -165, 98, -7, -164, -109, -103, 91, -6, 7, -152, -89, -132, 0, 54, 174, 28, 1, -424, -257, 180, -72, -26, -61, 63, -66, -44, 179, -149, 243, 237, 130, 101, -27, -87, 103, 166, -120, 34, -171, -208, 17, -16, 103, 123, -9, 123, -98, 114, -142, -141, 13, -104, -332, -71, -192, 91, -178, 189, 161, -164, 104, -134, -50, 78, 57, -78, -6, -104, 178, -59, 49, 107, 69, 43, -6, 94, 25, 207, 37, 53, -106, -232, 69, -53, -75, 106, 95, 113, -80, 14, 41, 23, -44, -90, -300, 114, -68, 182, 127, -52, -122, -8, -114, 10, -2, -47, -123, -29, -97, -84, -7, -55, -151, 117, -66, 24, 16, 185, 15, 172, -61, -6, -94, 85, -217, 14, 86, 15, -109, 127, -72, -32, 141, 65, 161, 293, 112, -149, 245, 34, 67, 16, -231, -3]
3011cK36k76J24q2j75J73K1O5k32J31k13K52K29j45j82K23r6j8J02j58j01K30
3033A05J62k41k1Q8k29R7P5j31l5J17J26Q7k55k9j57L53k20q2J29m9R0P2Qk50
3057a90K69O1Q2l01J66r1MJ0j20K21j03r6n3J54j19m9J86m8Kl9J14j01P8j66M35
3082C06o27L07n0J59j26J15k5K37l73J31j29N1j98K17J78l61J31J4J2K13l16J09
3104b5R6N8j33R8K1j38Oj7O4k19L25l03K20k14R2J85p8j1J9n7N7O9n6J34j94k11
3130b12L24j43PJ01J69k36N9M2l5l6ok74M11j73N2R9l17J91Q0j65K11k61P4L7
3154aM6J06k39J94l2M2j11J2m8L2J79j92j25Q0k1J42j92J36K12k55K50j70j09
3177f4J15K7K5l13K67q8K0j92K18j13J58k09OJ09K7m6n2Q4k2q6k7K77k55N9q1
$$ y = [-3, 233, -43, 81, -1, -176, -3, 18, 83, -149, -18, -231, 21, 250, 105, -77, 146, 50, 32, 134, -24, -125, 105, 267, 26, 5, 93, -136, -39, 36, -95, -130, -13, 113, 200, -55, -84, -241, 112, -108, -190, -61, -110, -20, 52, 60, -190, 79, 140, 222, -79, 87, -4, 0, 10, -110, 111, 8, -88, -141, 13, -106, -155, 31, -17, -15, -54, 60, -41, 37, -129, 306, -321, -14, -64, 95, -31, 84, 59, 296, -77, 54, -75, -24, -222, -5, 173, -188, -57, -43, -31, 182, -134, -25, 71, 129, -4, 94, 115, -23, -17, -34, 30, -189, 136, -167, 53, -161, -69, 116, 38, 27, 46, -11, 46, 115, 59, 193, -1, -212, 112, -31, -24, 77, 246, 10, 69, 111, 76, 40, 34, -240, 171, -2, 50, 149, -168, 23, 103, -62, 149, -112, -38, -1, 45, 151, -88, 106, 74, 116, 5, 17, -31, 1, 180, -12, -137, -57, -78, 64, -128, 8, 220, -35, 215, 45, -64, 51, 78, 103, -210, 57, -31, -11, -203, 15, -98, 60, -149, -143, -34, -7, -53, -105, -21, -43, -129, -156, 121, -134, -75, -156]
3202a56N3J35q0K08kj88q1J91J16j60J07j49q1N1L7R4l88J00J15K1K14k14k4K10
3226A29j76l4K1O8K45k04j80N7O5j95M12j33k03j58J55Q3Q7r1J20K9l87K23J15
3249D8j3j14K72j89R5j41O5l5J79p8j27L0j90P4q1J71n1K00j03j26K36p4l6j33
3273a21K36k36j35J89J6q2J00K32j38j51K85o3k83J15K51j58q0j85J15J95J8j63
3295d3J59N7j72oK08k92K29j52m4J70k37J53j28j3J22j81J7K22M2m9j14J26j94
3318a20J70j25M2j9j68J07R1j54K06P4j03k22J57P8r9J4J72n6j94L65k77n4J1
3341a04n5K8J10k17N77l52n9P3L09l15J22O1r1l56L72P5r0k48J53k47J41J80n1
3364A6r4N7R7k17N1J77m2p3l9j2K29l52K65N8k41j35M83k41L1k23R6L2j39L33
$$ y = [-156, -103, 32, -48, 160, 158, -30, -111, 80, 196, 36, 143, -6, -87, -36, 1, 95, -293, -193, -78, -57, 157, -57, -81, 129, -47, -81, -60, 8, 253, 49, -131, -74, -9, -204, 208, 75, -128, -286, -131, -48, 39, -52, 68, 97, -290, -67, 48, 35, -79, 193, 4, 99, -42, 23, -12, 167, 89, -38, -8, -198, -124, -205, -34, -85, 115, 12, -114, 122, 48, 12, -121, 115, -121, -256, -67, -51, -133, -33, 199, 61, -90, 195, 132, -151, -36, 215, 57, -23, -208, -93, 102, 120, -43, 116, 173, 1, -5, 203, -89, 140, -12, -56, 114, -123, 30, -98, -111, 11, -170, -153, 69, 111, 62, -52, 74, -120, 50, -75, -33, -52, -220, -113, -22, -176, 30, 104, 1, -221, -64, 14, -85, -71, 101, 45, -149, 216, -61, -115, -104, -159, -131, -21, -238, 339, -13, -72, 1, 310, -5, 117, 178, 87, -269, 103, 178, 88, -160, -7, -254, -113, 67, 16, -78, -21, 76, -141, -90, 87, 45, -28, -67, -79, 150, -202, 63, 121, -120, -255, 228, -13, 18, -205, -109, -77, -216, 117]
3388A17k05k0R8O6l6j57N2R6j54J80ok4M4j32Q5O6J55m43L61r1j44J9J20r9n0
3413a02J74k41p5J17K98l15J53j05K17kJ04k19l18K68R2P4j25l7J43k09O2J94
3435A48k69Q8L5R3j55k43L22j04L5L26J0k82J80K4l28J72j3j35N1j31K73R7kr8
3459I4m3j07L4o2K0L3p0J11L4j77J74J00k0k47R7Q8q1J8j87L61k71Q8J86k69K72
3484A76j82j89K33J17l11K88j75j05L52k52j1J20J6m8r9K23K6j48J12J5k21O8
3506Ek8J3Q2j15l9K00k68L41j65k9l48L14nj45K91r2R6pk03j8K32k05LK47m31
3531b74M52k37K04j47L06k73k3K07k40j84J44Ol9J77k91K33j3j72L17k21k8J3
3553h3r9J99k13J60j30L77m38J54j39N8J75m9K8j88L94p2K3J3r9p4L11l61J33
$$ y = [117, -88, -108, -10, 56, 20, -137, -85, 11, -143, 37, 31, 7, 51, -81, 4, 70, 225, -218, 143, 52, -92, -73, 47, -52, -102, 72, -169, -244, -127, 171, -144, 9, -96, 121, 119, 223, 4, -314, -46, 46, 120, -5, -42, 101, -108, -46, 148, -121, -33, 2, 95, -60, -303, 19, -85, -50, 276, 286, 4, 184, 208, -120, 52, 39, -96, -45, -176, 97, 194, 192, 94, 51, -56, -22, -84, -64, -31, -101, 10, 44, -133, 41, 141, 121, -126, -29, 59, -22, -4, -191, 170, -101, -13, 173, -96, 176, -6, -195, 38, 155, -156, 132, -43, -148, 204, -48, -59, 61, 77, 29, -70, 153, 179, 31, 143, 158, -63, 5, -23, -10, 72, -43, -82, 118, -150, 191, 26, -3, -351, -37, -42, -187, 104, 12, 108, 101, -102, -120, 112, -93, -90, 157, -274, 178, -59, 145, -2, 304, 31, 8, 215, -25, -209, -65, -59, -98, 79, -212, 21, 8, -164, 153, -68, -96, -83, -182, 17, -196, -36, -166, 211, -227, -73, -212, -154, 21, -28, 0, -188, 206, 134, 157, 170, 71, -3, 308, -53, 80]
3576H0j45J76k91J12J30J00k07j46M40n2q9k0j1o9p2J64Km4Q4j98j16j10M12J91
3600C21m11J08J65l15L05M8k18l0k09J15O5L79m91K40p8J16j06J42j77j49K53
3621G3Q8k47j36J5O1R1j5P0j81M23j89K26j46j07j27J51M0r1k4J26j14k9jP9l
3646C3Q6j06k8R3N2n4m07M63j3o2j17n1K02O8L0j93RLQ6j78JK91j86P6j70J56
3672H4m2j22Q3J01j08j83J01M9o3K04p8j32r8K99L5j52n4L7J03j06q4M16j61r2
3696C7J78j12l4J39k89J28j00J23k63J65N1m6n3K62K5k17K09j62n0rk16K56L21
3719C43j84r1j42J56j89M9P0J23p3r3J64j53Q8j66J14L03l65j37J05N4k0j02P8
3742f8l2Q6J23l7j20M5j77J86P7J03q9lj7p0J12p7k61N10l35L1J65J30l94J80
$$ y = [80, -65, 111, -180, -68, 62, 162, -45, -191, 249, 197, 108, 88, 77, 8, -64, 100, 102, 58, 142, -56, -172, -282, 130, 321, -90, 18, 183, -132, 173, 221, 3, -27, -236, -121, -56, 323, -168, 72, -6, 110, 4, 146, -31, -180, 73, 161, -86, -222, -207, -146, -55, -70, 0, -181, 242, 53, 279, 133, 26, -101, 50, 90, -1, -25, 101, -13, -42, -43, 36, 33, 119, 13, -15, 78, 130, 76, -331, 132, 119, 57, -60, -111, 91, 159, 189, -4, 5, 8, 94, -84, -83, 208, 22, 98, -72, 84, 42, -80, 3, 104, -4, -187, -86, -37, -100, 104, 26, -106, -204, 95, 130, -22, -76, -39, 64, -42, -126, 290, 129, 37, 215, 103, 69, 208, -81, 47, -53, 70, -193, -28, 23, -23, -76, 186, 211, -6, 203, 41, -9, -18, -234, 22, 343, 159, 68, -74, 82, -107, -58, 12, 135, 62, -31, 133, -20, 68, -98, 16, 319, -46, -183, -78, -24, -44, -146, -68, -100, -14, 109, 72, -48, -3, -180, 6, 83, 186, 97, 94, 77, 7, 119, 42, -219, 291, -44, -13, 152, 282, -112, 68]
3766F8K3R6j07n2J26k15k00K96K46k48j54R2K36j76J7R5k80K00L0j08j2o6K62
3789A69P3j81o6kk20K71k34J3J25L1j25P0M3l0J49j31J09m4L1j89NL80l74J80
3813E3k39J67j49K37o8L0J17k26Q0j60L19j06m8k01K23j02l9R5j87K44j64K24
3835A00j45K1M5j49L70k96O5J83l71K87k76K85K7j34K1l3J31j79k56J88k8K05
3857F1l11J60K61k57K33k0k26J15j18J28p8K13j00j11l3r6K37r3oj95K01o2K09
3880A12o7j2r1k05Q1N7J76r5J05j37p5K51j40M2k38m0K11n3J04K82m37J34O8j54
3904a21K59j52r2K04J00l21k3n7L59k80Q7J00j85R9J77l15J43J0R4j71j65L93
3926A43l76R3J87j17j79K53K88j20j99K5j43J64J27j26j32J50O0Q8k08N6j52R5
$$ y = [68, 91, 187, 80, 28, 154, -61, -261, 35, 281, 33, -121, -29, 207, 31, 48, 143, -137, 63, 93, -15, -27, -93, 169, 242, 61, -5, -7, -227, 44, -190, -177, -52, -21, -146, -76, -33, -63, 86, -45, 64, 20, 51, -138, -133, 247, -127, 53, -186, -19, -168, 69, 1, 31, 148, -78, 2, -158, 161, 55, 7, -194, 29, -73, -112, -17, -204, 40, -124, 100, -45, -24, 21, -128, 242, -54, 11, 194, -177, 110, -166, 119, 146, 12, 33, 0, 131, -48, -304, -116, -144, 61, -250, -90, 171, -86, 147, 127, -99, 16, -102, 26, -52, 161, 61, -50, -83, -179, 58, -35, -41, -236, -35, -97, 112, 45, 33, -58, -263, -182, -125, 51, -44, 61, -76, -151, 100, -40, 2, -236, -276, -65, -118, -14, 268, -169, -35, 33, -121, 138, -14, -106, 98, 198, -123, -146, -203, 156, -124, -37, 63, -122, -23, 154, -161, -18, -8, 86, -85, -250, 143, -233, -140, 47, -70, -249, 4, 292, 172, -27, -2, -145, 19, 146, 20, -112, 38, 98, 186, -22, 34, -118, -23]
3948b3j28j46J96J02k44O9P5j21L92l65J15R8J1K11l8l14J27k6J06k6l42K74O8
3971G1L4m16K85J95k29J36j91J84Q9l01j0L48l87j53M51j08L9Ln7j92K79Pj70
3994i3k43N38k04j72P9K95k70J79j24J08Lj20j6j29L41k31oJ24j14NPJ20k00O8
4018e5p7R4L2J70j82o3J68j70J56j44K21j31k21J71m05N48o1m1L9j63J32Q9l13
4041b06K15p2L7m2l5J80l8q0o5K87q6l4j87Q1J36k4j54j62K66l09K49QJ08j69
4065i6K55k48J15q4j0K44k72j4J60l64N00n8m17L55k47K54k69J38J09Nj66O1r7
4088a46L37j52o9j6J7J05p5N4M4R6k65K59m67L26m5j11j0K89j29J4n6j00J22j91
4112a69L63l91L32l4k13P8O7k60J67J50J06n3j38JJ30q1j23q0L12l07K44M5l29
$$ y = [-23, -151, -297, -101, 1, -243, -174, -99, -220, 172, -193, -78, 20, 31, 242, 204, -110, 17, -9, 97, 71, -271, 3, 71, 105, -311, -26, 169, -60, 76, -115, 69, 158, -143, -153, 195, -192, -345, 106, -2, 37, 40, -17, -209, 70, 77, -93, -336, 202, -2, -174, -95, 200, -70, 109, -15, 93, 96, -24, -40, -169, 172, -59, -65, 59, -55, -50, -43, 77, -123, -55, -132, -38, -6, 164, -18, -81, 87, -83, 73, -71, 150, 19, -202, -31, -436, 112, 51, 10, 49, -114, 18, 107, -206, 9, -63, -26, -68, -103, 77, 39, -41, -106, 181, 95, 61, -126, -45, 91, 67, -87, -249, 17, -292, -43, -35, 73, -96, 159, -89, 26, -58, -68, 176, -96, -110, 50, -314, 186, 128, -289, 66, -181, 73, -196, -58, 51, 56, -110, -49, -146, 191, 39, -30, -46, -29, 76, 1, 55, 99, 195, -70, 189, -278, 48, 3, -108, -118, 171, 42, 56, 0, -100, 22, -169, 194, -197, 135, 101, -112, -34, 33, -227, -60, 90, 196, 143, 5, 6, 136, 55, -68, -148, 164, -143, 101, 146, -183]
4135a83J75k09o3M76q3j87J51L3o2k81rJ27k8K75l5K9l9p5r9J54j97k2M03k02
4159D9j55K77j32Q6k9l50L04oL3l39K48J50k14r7N1L26j69o2K23l50L08k40K56
4182A68l29r5L90NK01k29j97k02K14J10O9M9k38J60j24K11j41k78K36m6N3k9j10
4205a52L53k33j85M62l74OK16L3l63mJ80N7O3k36J88J30j05RK2j98k9J52j9j7
4229d4nK24m34K66q5O2P7j05J41m1O6J24k13j63K08j76K64J2K1l39L98k66J84
4252A76k38J64Qj24Q1j24j9J04j21k01K17j87K54J35j50l1r4L9J41j6J0J19l12
4275a69K31j99mJ4j10M60j71k41J81K3K5R3j58j7m7J59o0M0q4pp9J41j75L31O5
4300B42j80j36q6J23r8J83j57O5J75j41rJ5j46L2J84j12K71k98J18k09P8K04j45
$$ y = [-183, -8, -217, -280, 196, 113, -74, 77, 110, 48, -233, -242, -115, -143, 132, 97, 126, 87, 12, -87, 67, -130, -152, 251, 49, -106, 171, 39, 125, 96, -254, 50, 44, 77, -262, -14, 136, -78, -175, -124, 202, 33, -29, 194, -156, 152, -88, 168, -161, -256, 134, 139, 340, 111, -86, -288, -74, 36, 105, 154, -84, 76, -48, 163, 22, -256, -20, -66, -13, -42, -152, 201, -32, -217, 245, -129, -123, 93, 126, -237, -241, -61, -4, 59, -177, 11, 141, 36, 45, 67, -131, -160, -8, -27, -44, -49, 175, -259, 7, -78, -16, 61, -44, 97, 56, 122, 246, 33, -130, 78, -98, 166, 178, 199, -140, 258, -8, 176, -62, 102, 110, -14, 67, -57, -76, 28, -93, -294, -77, -264, -10, 125, -25, -56, -150, -111, 30, 14, 24, 143, -169, 62, -137, -141, -127, -237, 223, 52, -189, -8, 15, 40, 133, -25, -42, -89, 70, 10, 50, -34, -41, -120, 21, -154, 177, 242, 62, -74, -160, -37, -135, 48, -109, -44, 131, -10, -19, -4, -150, -118, 66, -46, 225, -73, 45, -164, -86, 118, -27]
4323b7J1O2j26J08p2n7m3J62Pk69K64j29jJ34q9L19o4k62L7K16l14L6l1K30j44
4348d2J82J02p0l08K21M0j94M5L3J25j75O2M6K19m34J96m7O4k96M46l12n8J16
4371c9P8j01j03J41J74k46o9K77p5m7QmJ33J32k08R1j34j6K3o0P5K1K41j03l82
4396a93L32q8J06j54Q8o7j86J68L9j94J12o9N3J53M1j6j66M9J29J8j74N4J6j08
4420e7j7q1R9K5j06K46K6k1j86K58j41N6J4n1j54O1J5J05k18K24q9J46n6N6j02
4445E2Mo0j02K16k88K4M50j51l64J83N0j58J12j2R0n6J21O5n9o4k59L24Nl42L79
4470A60j75j8J45k19k9J1L8kK8l4o3M05k83O0l41L68j4J19k05N0J6k13n5K80k14
4495a85K43p3J10k07j9Q4j23J37j89J85n5o0J57j8p5R0k7o3K37k18J67N2l13J12
$$ y = [-27, -16, 46, -80, 28, -44, -101, -144, 18, 25, -244, 20, -109, -110, 24, -65, 254, 190, -72, -35, 181, -133, -97, -128, 102, -42, 140, 242, 172, -136, 85, 125, -69, -24, 9, 134, -41, 21, 67, 286, -148, 48, 1, 65, -231, 215, -97, -155, -39, 39, -62, -165, -24, 150, -96, -165, 112, 37, -10, -2, -6, 127, 259, 51, 142, 8, -8, 15, -45, 30, 51, 292, 189, -193, 139, 51, 157, 3, 91, 24, -162, 6, 45, -149, -37, -106, -53, 100, 141, 125, -41, 8, 137, 155, -19, 35, 51, -57, -74, -155, -56, -31, -137, 109, 135, 114, -72, 186, 45, 101, 115, 64, -90, -29, -14, 91, -127, 97, 8, 154, 98, 154, 52, 56, -4, -106, 110, -178, -154, 296, 145, -219, -36, 14, -144, -32, -44, 46, -10, 111, 176, 117, 53, -206, 118, 123, -219, 160, -15, -33, 112, -107, -136, -125, -87, -89, -61, -95, -158, 247, -36, 24, -317, 51, 37, 156, -49, 1, 17, -196, -251, 29, -185, 58, -15, 95, -112, -131, -47, -170, -33, -222, -37, -92, -152, 5, -13, -88, 2, -25, -88, 149, -69, 98, 150, -163, -51]
4519e1j9k1l0J11J6M6j99K81m7k52K60l83Q9J96Mr3Q3p1L68j47k61j34K10m6P5
4544a5n2J64p0n7J85j6j31j79L55l14K42j9J25j77K2l03L20m9p7K43j91k1%j42
4568a57K0J12J38j38K44l48K59k4n7P4o0k43J47k72J02L22l2j17J7J1K23m57J40
4591i6J03j88J62K30j77J96j97j35qJ53Q6l22M6l5J78O4j15K5n2j3J15M5q9o1
4615h5K8j15l9J12L03l03L5K46j46K21m89M52m21K89r3r0o8J67J34k75K45k32
4637a24L60o2k66J07N7j99K58j26J75j55j5j53R0J42k12R4L9K41j21P9k30j01
4659a22J78n3J07k59J81q2J46N0k98K92J01p3J59j02j87J82l98L04k55O2Q9J3
4681C5K44m35K16p1J11o0k7M9r7j0M0mJ44l17L29k18j21K93J7l6k2j09j33J53
$$ y = [-51, -70, -91, -121, -10, 6, 52, -147, 134, 87, -165, 95, -288, -199, -3, 1, -92, -9, -80, 288, 141, -120, -254, -44, -90, -15, -67, 97, 27, -30, 155, 139, 8, -171, 184, -130, 112, 93, 218, 41, 63, -240, 80, 31, -46, 197, 6, -15, -15, -157, -137, -25, 113, -25, 219, -129, 130, 106, 49, 123, 63, -180, -33, -305, -203, 119, 87, -30, -13, -2, 221, -236, -96, 7, -181, -19, 211, 34, 230, 33, -102, -110, 43, 129, -193, -147, -182, -4, 60, -55, -30, -82, -95, 20, 65, -24, -85, -57, -172, -211, -99, 204, -99, -64, 182, 36, 257, -232, 220, -201, 88, -5, -95, -163, 4, 138, -137, 108, -124, 236, 174, -92, 15, 72, -127, 131, 5, 180, 25, 10, -143, -53, 89, -123, -29, 10, 251, 130, 209, -21, -122, 56, 3, 110, -149, 32, -50, 96, 146, -152, 140, 241, 168, 327, 225, 38, 220, -178, 126, -129, -67, 22, 35, 279, -156, 60, -11, 100, 40, 13, 62, -35, -45, -5, -9, 135, -182, 147, -71, -192, 101, 118, 82, 60, -49, -182, -29]
4705b9o1J6j02K4L7K63q7J42l73L75j71J6J1l9k08K21r8J41j30n8L8P9KJ53j59
4730CM3O5j83m8lK44k38K96j32P8k17q1K87j73J74k45M02k61K27j10j42Q1j65
4753i8N1R6J62k22L1Jj65J9J03l6K19k22J02J05o5j31k8J64k22r1L96j81K90r8
4777A80l76L44j31L1k39K34j00N7k15L43n6k6l1k1r4J92j30L7k8j6K07k62L16
4800B16j72O9rO1J4j56l1n7J48r8J69j84P0l4j99J31J09J44k89kJ6J46k0j16Q7
4825A3o3J59k22J86n5J80l5r9r5O1r2Q4j38M4L4J99k02j26K65J41j68QK0j00J20
4850A19o3j02J5J46k62K96o7oj27J86o8m4j86J18j1n0m4K23p3N8l4J83m0k34m4
4875a11K02j24k41K89J98j51O0l6k35m7K02n2NP8L9L4m06M2K96j40Q0L9n3l35
$$ y = [-29, -90, -74, -176, -152, -115, 148, 61, 203, -170, 205, 34, 50, 61, 22, -186, 35, -63, 78, -52, -110, -72, 7, 9, 162, 3, 46, 111, -72, -120, -123, 121, -117, 179, 47, 125, -92, -173, 114, -59, 115, -130, 272, 11, 238, 128, -14, 67, -98, -47, 49, 211, -11, 20, 21, -144, -125, -22, -58, 161, -61, 41, 146, 81, -50, -78, 86, -136, -227, 169, -12, 278, 180, -196, 148, 17, 48, -191, 43, -57, 0, -215, 128, 72, 46, 15, -6, -100, 92, -38, -1, -29, -45, 162, -100, 216, 44, 113, 104, 165, 179, 23, -8, -65, 83, -15, 154, -30, 40, 6, -193, -62, 47, 191, -98, -100, -84, 62, 42, -74, 13, -50, 109, -113, 73, 18, 198, 163, 64, -31, 30, -62, 22, -116, -72, -38, 161, -41, -167, 98, 239, 71, 79, 99, -1, 119, 56, -46, -31, 115, -147, 149, 82, 76, -51, 135, 67, 23, -163, -45, -56, -106, -150, 73, 0, 58, 24, 207, 167, -67, -111, 91, -33, -274, 15, 213, 62, 122, 86, -149, -196, 6, -46, -41, 37, 76, 110, -296, -254, 42, -98, -18, 21, -32, -367]
4899c67M25P0O7k82J19j33R2q6Q8r8j00J70L34n10J6K05o5O8r5M66l31j2k0jj2
4924HK76l52J18m54L56J16J75k44%q9K19j28O6J20k66P0j67K62q5J83p7j08J10
4947A09j77M05k36j03j22R9p2J0O7N4l0n7K01j13j86q9R2L9J76k13Q7K03j59k75
4971b90J38k6L51k78K89j62k74L12k63J75k34J31k3R7P3L5L9k29L00k81R7Kq0
4994a01L40j89j41n0L29k81r3J25M2r7K00J23j60j59N5m6K24k48K59k1r6j0LO1
5018F9RN8m7j71O6J28K1l37L31k88N9M7r7l9J74R8l24J81L04j26k57J48k3M4N0
5043G8j82J91K19j41J74n12K78n2k6J20l15O7J51j12J16k30k1J62j25L73k30J90
5065A73k06q7J76j86J26L8j54M6J91k33M05l14J90l7m7j85P7j84K55j64j58L80
$$ y = [-367, 58, 128, 195, -87, 32, -101, -9, -95, -7, -105, -205, -35, 299, -211, -195, 10, -55, 13, -82, 384, 53, 41, 21, 20, 8, 284, -68, 50, -404, -48, 68, 243, -1, -1, -90, 129, 1, 67, 187, -79, -9, -176, 86, 1, 184, 107, -1, 109, -68, 337, 101, -2, -124, -25, -97, -87, -20, 34, 4, -53, 148, 35, -151, -240, -148, -109, 67, -146, -59, 144, -15, -290, -152, -178, 173, -105, 184, 22, -252, 60, -203, -28, -262, -131, -154, -57, 16, 51, 90, -139, 161, -120, -23, -21, -101, 239, 50, -91, -141, 188, -93, -186, -61, -19, -116, 84, 207, 47, -112, -57, -103, 121, -127, 132, 111, 15, 5, 8, 69, 78, 136, 89, -82, -16, 112, 133, -204, 127, -161, -102, -55, -152, -191, -17, 81, -243, -62, 242, 116, -141, 7, -16, 28, 78, -104, 87, 306, 165, 339, -173, 105, 53, 27, 147, -168, -101, 50, -62, 54, -176, -197, -35, -160, 213, -17, 173, -33, -120, 56, -130, -4, 34, -120, -74, 117, -116, 289, -25, 165, 128, 81, -104, -27, -211, 44, -120, -278, 102]
5087A02l9K8j95R2k04L49Q0k42P8oj05K97Q2k83k41J53r6J66O1J6k43K54j95j5
5111a06J13J1j30J6q3J51R4l45M83q6j1j61k71O11j97k1k42K13J66k03L7oR9j46
5135a4k9P4j55L3k74N44l49J73o9Q1Q9J32l41r2J89j24J22l9J97p5J16j46m2j7
5159a6R3K06j19k55L28j40L3j21j2nJ55q8q2j87K79k71J92j25j17K50K6j12J12
5182B4r6jJ08J49l84L17k07J70j90K14l07L46k50J4K62m50L35l4j67Q7M2j22K44
5205A04N2J07l92j41K57nj33Q8J10n2J63j59l4J99j42p2O6l7l3O9M2j93J25l8
5229d9J19RPl7l08K25J6j39J37N3j35J72o2j4J17j61j42K86q0J05p8P9j90J41
5253G1k21K27J14o5j27Pm0P3L0r6N8k1J17j11Rj43J05M0r5J43L2k10M20l87l1
$$ y = [102, 63, 91, -104, -12, -216, 133, 213, -29, 49, 43, -62, 235, 317, 34, -207, -54, -150, 16, 77, 93, -150, 104, -91, -106, 7, 18, -112, -96, -179, -28, 66, -279, 204, 118, 107, -54, -325, 286, 89, 68, -174, 39, 205, 2, 39, 33, 132, -14, -43, 31, -124, -91, -365, 179, -170, 3, -66, 15, 104, 236, -105, -197, -8, -132, -10, -49, 148, 73, 189, 43, 1, -16, 77, 283, 164, -91, 237, 97, 130, 9, -3, -8, 147, 59, -23, -210, 69, -202, -10, -135, -252, -2, 24, -88, 24, -72, -73, 35, 184, -200, 117, -90, 80, -110, 104, -203, 143, -107, -93, 169, -281, 54, 20, -147, -60, -18, -140, 104, 156, 263, -129, -270, -13, -18, -151, -63, 47, -5, 158, -1, -35, 164, 22, -50, 16, -21, -54, 15, 57, -136, -11, -49, 70, 79, 86, 49, -259, -34, -18, -157, -20, 33, -102, 70, 8, -6, 111, -50, -192, 94, 14, 119, 41, 120, -70, 71, -150, 77, 191, 126, -1, 6, -34, 39, 69, -27, 31, 10, 127, 16, 25, -118, -13, 27, -68, 75, 107, -103, 317, -70, -101]
5278a01K95l7l10K89o8k17L89P1j48k5l34L0P9o9R1PJ95N5k09J4J22j02N3j97
5302a27L20l53O3J40j64N6J76j19R6j57J23j50L33k69J18p6r8J57k41K11j92l6
5324a89N38m00O5k54P9N8K65m5p3j80K03R1M7k52O5N4J29p9j10j18o7N29l16j8
5348B2n7N2J96k24R9j70N1J5k1K32k55O3k19L47Jl84L20l07J91r7P8R8j76J70
5372B5J61J6j94J08j76ln7K28j35LK6j28p1K33j28R6M1n3j05J01j43R2J22j34
5396g5N1L33p8pj24j85j00J96O9q2J31k90j3L00O1k87J78j58L6P8J05R2j75l17
5420b61K48p9Q2M9k4j46p4M42l85L3nJ99j12M3M5k9J53k92M15k76k35jJ82J0n4
5445g2k7J04K82l31o3J57J70l91M75l03qP7k32J95j58K19P1k36J80j50k7j70L77
$$ y = [-101, 194, 157, -153, 136, 68, -149, 240, 311, 163, 138, -196, -166, -87, -156, -65, -58, 137, 192, -17, -3, 119, 17, 70, -127, 193, -160, -97, 43, -121, -65, 111, -8, 88, -69, 54, -96, 237, -32, 86, 10, -88, 69, -172, 39, -153, -189, 349, -51, 14, -240, -161, -103, 162, 117, 44, -136, 67, 158, 205, -47, 18, 72, 201, 122, 12, -106, -173, 356, 40, 22, -35, 17, 213, -11, 88, -82, -31, -16, -37, 195, -60, 3, -216, 131, 132, -252, 68, -239, -48, -145, -67, 31, -145, 25, 186, 202, 8, 116, -60, -63, -120, 108, -27, -24, 2, -126, -197, 36, -92, 4, 45, -8, -113, -12, -155, -63, 59, -75, -24, 309, 231, 224, 100, -85, -185, 11, 80, -2, 129, -161, -174, 126, 187, -100, 78, -80, -44, 34, 139, 231, 56, -261, -13, -92, -10, 39, 15, -131, -205, 237, -148, -115, -120, 79, -33, 10, 55, 26, 179, -113, 302, 26, -209, -210, -28, -18, -72, -99, 5, 287, -44, -107, 50, 220, -171, 304, 1, -7, 70, -162, 33, -125, 94, 165, -71, 109, -41, -68, -238, 139]
5468A39l25J42J16n6p5m5K69j63r6M7j38J97J3j3m7L03l16L18k93r6K95k11M4
5491Ij00L00q6m6ml06K32j43K63j08j2J5k2k5p4J0P0N1j33J25nj8J6rj6P9O7k91
5519a61J70J03j61q5l9K57J44j86j31J52j18PNJ9j42J98m1n7K18l96K52q1J37
5542F4k49K88l3k19J12J39k14K79L0l58K66m9j28P7K53n04K67q7J6k8K84j02j65
5565f1L30j39j12J80j62j35M9k9J05j66K27P1r9Kkn8J42j17or4J14k26L01K0j51
5590a6qK46n01K24J94k16J13L39n46MJ6K79R4j05j17J48o6l28J98jJ06P8j01L0
5614F4j01O4p3J81j35K03j33R0k35k94L71j56%J05J04k23M18l28j51K44J15p5
5636E5L1j34J37j79R2j5J42%k20L01j2k06J45Q7k25J27k09K18J27m11N0L73l27
$$ y = [139, -186, -44, 72, 16, -59, -104, 165, 2, -94, -47, -185, 12, 25, 12, -35, 268, -48, 270, -23, -119, 176, -35, 9, -91, 209, 123, 77, 73, -233, -1, -144, 119, 11, -1, 14, -8, -33, -107, -97, -27, 24, -109, 16, 11, -7, 9, 0, -16, 63, 130, -161, 9, 112, -49, -134, -173, 84, 228, 42, -89, 63, -55, -48, -43, -24, -166, 32, -9, -66, 152, -244, 8, -73, 64, -185, 103, 70, -149, -37, 102, -112, 167, 197, -161, 105, 56, -72, 5, 258, -246, 21, -66, -50, -78, 206, 104, -61, 269, 130, 18, 198, 36, -99, -50, -79, 26, -140, 87, 158, 59, 61, 59, 1, 143, 26, 20, -74, 40, -186, 115, 135, -16, -24, 222, -279, -55, 139, -77, 36, 375, -171, -167, -151, 128, 222, 117, 0, 148, 82, -246, -48, -49, 57, 135, 34, 64, -37, 27, -46, 135, 0, 203, 70, 160, -75, -369, 2, -154, -154, -49, 55, -168, 250, -78, -229, 15, 130, 55, 86, -48, 89, -90, 2, -13, 129, 129, -91, 210, 198, -8, 137, 224, -1, 126, -83, 135, 262, -149, -99, 274, -53]
5659e3n5JK18J5N5k09Q1j26R8l5K2n2M0o4J65q6j94K60K05l60K47l82J35j14K97
5684A09l4p7p9J20l1j58K37j65p7R5qM0j35J89k28J50J52k06R3J55j86N9R8k42
5708a29P7q4J61J51j90nK30l71J26j22L05p3K9k09J01J01j47%P1j71K73m01K52
5731b5p6K0P4j11K80m16M26j33k09K53j78N7K60l08l56M62Q1j9n1j72K1R3J96
5754A69j17m5K19j79j71J27K4J47o5j19L67m87j89M61j83K70l74J04K12j10j75
5775a14K84k91J58q3l8J83k57J79n2M6j25J40J82j94O2j34k60L10K60l19j15J67
5797a1J34L1k80k13L60j00n6J19r9k6L10j07j41K8o0L26j65l6J31N2l14P7N3o7
5821e4R4j52J26j71L45k93O7k21M30j47k6r5n2K7J55p1J79j35n0O1j33J26m3K5
$$ y = [-53, -108, -107, 111, 126, 181, -28, 53, -73, 25, -10, 12, -40, 0, -64, 101, 15, -179, 81, 286, -74, 173, -209, -74, -188, 109, 75, -2, -81, 39, 8, -150, 87, -78, -155, -60, -68, -28, -163, 26, -202, -52, 100, -106, -13, 142, -44, 15, 113, -129, -52, -136, 25, 176, -14, -19, 211, -160, -34, -156, 149, 76, 105, -104, -3, 98, -49, -49, 22, -149, 124, -277, -25, -101, -81, -7, -118, 162, -254, 172, 39, -170, 83, -95, -38, 222, -86, -442, 20, 101, 82, 31, -141, -120, -27, 169, 52, 7, 226, 47, -124, 3, 27, 174, 109, -10, 357, -130, -319, 142, -41, 229, -145, -41, 171, 61, -114, 170, -121, 37, -46, -84, 99, -158, 21, -31, 15, -110, 30, 212, 18, 80, -54, -314, -4, 256, -63, -178, -11, 123, 154, -126, -339, 21, -79, -135, -16, -115, -141, 169, 62, -79, -51, -111, 215, 50, 14, 145, 197, -117, -40, 13, -54, 40, -112, 14, -157, 188, -105, -38, -259, 171, 24, -2, -97, -149, -122, 33, -38, 141, 6, -44, 17, -116, 10, -33, -8]
5845hj98L46j27j30k3L41j73o9p6KK07OkL2l47M13k92K18K5j62R1j6k9O8l15K43
5871B5LK38j9k32Q9o1J65l29J96l6J9Kj36j03J48K13j1r3j3J57j63M7R4j72Q8
5896A16k88J78O0j35oJ35j42O8j5J09p8j79L36r4j83J1J04j83J37K50k03r3J25
5919C0J7n5K43j49p8J09q7N1j53J59l0Or6k76O33m35K56k59R1M2M2j32O8J84m52
5944b71N26m6n4l3j18po4L15k96N2l1MJ1O5O7k59O9o5k2J65L4kJ70J05l63L2K28
5971B12l21o0R1J03P9J03j56L9m3k2k26J58r6K61k25Ll4J28J47q6K6k59J33J74
5995A29j5j44O6o3K1J3k20M1K38j0j29L0L9k27J65Rq2j07J92K2j35K14j01J27
6019G3k66J63j21L14m06K99J31j24L6j84J61pj80N0q5K05J11l67J54Q8j16L03
$$ y = [-8, -206, 140, 13, -117, -140, 201, 28, -41, -117, -115, 92, 98, 96, 128, -219, 194, -98, 120, 145, -17, 74, 58, 29, 97, -218, 25, 28, 266, 247, 15, 104, 43, 208, -121, 75, 39, 58, 60, -76, -179, -31, 182, 171, 78, 65, 222, 59, 106, 200, 28, 116, -172, 6, 66, -69, -75, 60, -82, -14, -29, 80, 2, -177, 159, 65, -118, -107, -3, -186, -49, 201, -2, -95, 30, 47, -8, 235, 86, 8, 117, 30, 81, -72, 87, 57, 63, -33, -309, 324, -111, 145, -114, -23, 19, 61, -71, -3, 181, -271, 255, 209, 155, 122, 4, -3, -67, 248, -48, 4, -27, -23, -12, 53, 120, -139, -70, -135, -157, 8, 42, 40, 210, 315, -48, -16, 212, -109, -169, -78, 25, 104, 207, 51, 90, 47, 25, -201, -43, -139, 122, -103, -100, -134, -6, 141, 55, 81, -178, -45, 129, 114, -30, 36, -27, -6, 7, -213, -172, 66, 56, -73, -43, -4, -231, -66, -57, -139, -246, -54, -32, -167, 47, -54, 73, -193, -30, -151, 163, -243, 56, 187, 63, 99, -85, 76, 69, -111, -61, -146, 59, 170, -197, -43, 45, -71, 232]
$$ [...]
8191a49
##END NTUPLES=NMR FID
##END=
