##TITLE=1H_CA-8768x
 DMSO, 8 sc, 
 30.9.2020
##JCAMPDX= 6.0         $$ Bruker NMR JCAMP-DX V2.0
##DATA TYPE= NMR FID
##DATA CLASS= NTUPLES
##ORIGIN= UXNMR, Bruker Analytische Messtechnik GmbH
##OWNER= root
$$ XWIN-NMR		Version 3.5
$$ Wed Sep 30 09:51:18 2020 Russian Standard Time (UT+4h)  she@DPX200
##.OBSERVE FREQUENCY= 200.1315066352
##.OBSERVE NUCLEUS= ^1H
##.DELAY= (6, 6)
##.ACQUISITION MODE= SIMULTANEOUS
##.ACQUISITION SCHEME= undefined
##.AVERAGES= 8
##.DIGITISER RES= 18
##SPECTROMETER/DATA SYSTEM= spect
##.PULSE SEQUENCE= zg30
##.SOLVENT NAME= DMSO
##.SHIFT REFERENCE= (INTERNAL, DMSO, 0, 15.7039)
##AUDIT TRAIL= $$ (NUMBER, WHEN, WHO, WHERE, WHAT)
$$ ##TITLE= Audit trail, XWIN-NMR		Version 3.5
$$ ##JCAMPDX= 5.01
$$ ##ORIGIN= Bruker BioSpin GmbH
$$ ##OWNER= she
$$ F:/spectra/data/she/nmr/H-F/1/audita.txt
$$ ##AUDIT TRAIL=  $$ (NUMBER, WHEN, WHO, WHERE, WHAT)
(   1,<2020-09-30 09:50:17.18 +0400>,<she>,<DPX200>,
      <created by zg, POWCHK disabled, PULCHK disabled
       configuration hash MD5:
       00 E9 B6 7A A2 85 ED C7 34 08 36 98 17 FE 4E 26
       data hash MD5: 16K
       82 B0 6B D3 87 33 B2 71 C9 DC D3 A2 74 B3 99 39>)
$$ ##END=
$$ 
$$ hash MD5
$$ A1 C1 9E 95 A3 43 21 17 5E BE 1A CC 95 61 0D FC
##$RELAX= 
##$RELAX= 
##$RELAX= 
##$RELAX= 
##$RELAX= 
##$RELAX= 
$$ Bruker specific parameters
$$ --------------------------
##$DU= <F:/spectra>
##$EXPNO= 1
##$NAME= <H-F>
##$PROCNO= 1
##$TYPE= <nmr>
##$USER= <she>
##$AMP= (0..31)
100 100 100 100 100 100 100 100 100 100 100 100 100 100 100 100 100 100 
100 100 100 100 100 100 100 100 100 100 100 100 100 100 
##$AQSEQ= 0
##$AQ_mod= 1
##$AUNM= <au_zg>
##$AUTOPOS= <>
##$BF1= 200.13
##$BF2= 200.13
##$BF3= 200.13
##$BF4= 200.13
##$BF5= 200.13
##$BF6= 200.13
##$BF7= 200.13
##$BF8= 200.13
##$BYTORDA= 1
##$CFDGTYP= 0
##$CFRGTYP= 5
##$CHEMSTR= <none>
##$CNST= (0..31)
1 1 145 1 1 1 1 1 1 1 1 1 1 1 1 1 1 1 1 1 1 1 1 1 1 1 1 1 1 1 1 1 
##$CPDPRG= <>
##$CPDPRG1= <>
##$CPDPRG2= <>
##$CPDPRG3= <>
##$CPDPRG4= <mlev>
##$CPDPRG5= <mlev>
##$CPDPRG6= <mlev>
##$CPDPRG7= <mlev>
##$CPDPRG8= <mlev>
##$CPDPRGB= <>
##$CPDPRGT= <>
##$D= (0..31)
0 1.2 0 0 0 0 0 0 0 0.06 0 0.03 0 0 0 0 0.0002 0 0 0 0 0 0 0 0 0 0 0 0 
0 0 0 
##$DATE= 1601445016
##$DBL= (0..7)
120 120 120 120 120 120 120 120 
##$DBP= (0..7)
150 150 150 150 150 150 150 150 
##$DBP07= 0
##$DBPNAM0= <>
##$DBPNAM1= <>
##$DBPNAM2= <>
##$DBPNAM3= <>
##$DBPNAM4= <>
##$DBPNAM5= <>
##$DBPNAM6= <>
##$DBPNAM7= <>
##$DBPOAL= (0..7)
0.5 0.5 0.5 0.5 0.5 0.5 0.5 0.5 
##$DBPOFFS= (0..7)
0 0 0 0 0 0 0 0 
##$DE= 6
##$DECBNUC= <off>
##$DECIM= 32
##$DECNUC= <off>
##$DECSTAT= 4
##$DIGMOD= 1
##$DIGTYP= 9
##$DL= (0..7)
0 120 120 120 120 120 120 120 
##$DP= (0..7)
150 150 150 150 150 150 150 150 
##$DP07= 0
##$DPNAME0= <>
##$DPNAME1= <>
##$DPNAME2= <>
##$DPNAME3= <>
##$DPNAME4= <>
##$DPNAME5= <>
##$DPNAME6= <>
##$DPNAME7= <>
##$DPOAL= (0..7)
0.5 0.5 0.5 0.5 0.5 0.5 0.5 0.5 
##$DPOFFS= (0..7)
0 0 0 0 0 0 0 0 
##$DQDMODE= 0
##$DR= 18
##$DS= 0
##$DSLIST= <SSSSSSSSSSSSSSS>
$$ [...]
##$SUBNAM2= <"">
##$SUBNAM3= <"">
##$SUBNAM4= <"">
##$SUBNAM5= <"">
##$SUBNAM6= <"">
##$SUBNAM7= <"">
##$SUBNAM8= <"">
##$SUBNAM9= <"">
##$SW= 16.880792210976
##$SWIBOX= (0..15)
0 0 2 0 0 0 0 0 0 0 0 0 0 0 0 0 
##$SW_h= 3378.37837837838
##$TD= 16384
##$TD0= 1
##$TE= 0
##$TE2= 300
##$TE3= 300
##$TEG= 300
##$TL= (0..7)
0 120 120 120 120 120 120 120 
##$TP= (0..7)
150 150 150 150 150 150 150 150 
##$TP07= 0
##$TPNAME0= <>
##$TPNAME1= <>
##$TPNAME2= <>
##$TPNAME3= <>
##$TPNAME4= <>
##$TPNAME5= <>
##$TPNAME6= <>
##$TPNAME7= <>
##$TPOAL= (0..7)
0.5 0.5 0.5 0.5 0.5 0.5 0.5 0.5 
##$TPOFFS= (0..7)
0 0 0 0 0 0 0 0 
##$TUNHIN= 0
##$TUNHOUT= 0
##$TUNXOUT= 0
##$USERA1= <user>
##$USERA2= <user>
##$USERA3= <user>
##$USERA4= <user>
##$USERA5= <user>
##$V9= 5
##$VALIST= <valist>
##$VCLIST= <CCCCCCCCCCCCCCC>
##$VD= 0
##$VDLIST= <DDDDDDDDDDDDDDD>
##$VPLIST= <PPPPPPPPPPPPPPP>
##$VTLIST= <TTTTTTTTTTTTTTT>
##$WBST= 1024
##$WBSW= 4
##$XGAIN= (0..3)
0 0 0 0 
##$XL= 0
##$YL= 0
##$YMAX_a= 581918
##$YMIN_a= -549417
##$ZGOPTNS= <>
##$ZL1= 120
##$ZL2= 120
##$ZL3= 120
##$ZL4= 120
##$ABSF1= 10
##$ABSF2= 0
##$ABSG= 5
##$ABSL= 3
##$ALPHA= 0
##$AQORDER= 0
##$ASSFAC= 0
##$ASSFACI= 0
##$ASSFACX= 0
##$ASSWID= 0
##$AUNMP= <proc_1d>
##$AZFE= 0.1
##$AZFW= 0.1
##$BCFW= 1
##$BC_mod= 2
##$BYTORDP= 1
##$COROFFS= 0
##$CY= 11.3945322036743
##$DATMOD= 1
##$DC= 2
##$DFILT= <>
##$DTYPP= 0
##$F1P= 16.9975609425685
##$F2P= -3.02152046262296
##$FCOR= 0.5
##$FTSIZE= 0
##$FT_mod= 4
##$GAMMA= 1
##$GB= 0.15
##$INTBC= 1
##$INTSCL= 1
##$ISEN= 128
##$LB= 0.24
##$LEV0= 0
##$LPBIN= 0
##$MAXI= 10000
##$MC2= 0
##$MEAN= 0
##$ME_mod= 0
##$MI= 1.114404
##$NCOEF= 0
##$NC_proc= 0
##$NLEV= 6
##$NOISF1= 3.799351
##$NOISF2= 2.8
##$NSP= 1
##$NTH_PI= 0
##$NZP= 0
##$OFFSET= 15.70392
##$PC= 1
##$PHC0= -9970.538
##$PHC1= 13.60089
##$PH_mod= 1
##$PKNL= yes
##$PPARMOD= 0
##$PSCAL= 0
##$PSIGN= 0
##$REVERSE= no
##$SF= 200.130013532006
##$SI= 16384
##$SIGF1= 3
##$SIGF2= 2
##$SINO= 400
##$SIOLD= 16384
##$SREGLST= <1H.CDCl3>
##$SSB= 0
##$STSI= 0
##$STSR= 0
##$SW_p= 3612.71676300578
##$SYMM= 0
##$S_DEV= 0
##$TDeff= 0
##$TDoff= 0
##$TI= <>
##$TILT= no
##$TM1= 0
##$TM2= 0
##$TOPLEV= 0
##$USERP1= <user>
##$USERP2= <user>
##$USERP3= <user>
##$USERP4= <user>
##$USERP5= <user>
##$WDW= 1
##$XDIM= 8192
##$YMAX_p= 0
##$YMIN_p= 0
$$ End of Bruker specific parameters
$$ ---------------------------------
##NTUPLES= NMR FID
##VAR_NAME=  TIME,          FID/REAL,        FID/IMAG
##SYMBOL=    X,             R,               I
##VAR_TYPE=  INDEPENDENT,   DEPENDENT,       DEPENDENT
##VAR_FORM=  AFFN,          ASDF,            ASDF
##VAR_DIM=   8192,          8192,            8192
##UNITS=     SECONDS,       ARBITRARY UNITS, ARBITRARY UNITS
##FACTOR=    0.000296,      1,               1
##FIRST=     0,             0,               0
##LAST=      2.424536,      0,               0
##MIN=       0,             -549417,         0
##MAX=       2.424536,      581918,          0
$$ Real data points
##PAGE= N=1
##DATA TABLE= (X++(R..R)), XYDATA
0 0 0 0 0 0 0 0 0 0 0 0 8 -8 8 -8 16 -20 24 -32 39 -48 56 -66 81 -97 112 -133 156 -182 208 -242 278 -318
32 -318 362 -413 469 -528 594 -669 752 -840 937 -1044 1161 -1287 1425 -1578 1744 -1924 2121
49 2121 -2338 2575 -2835 3122 -3441 3793 -4187 4628 -5133 5709 -6370 7146 -8070 9189
63 9189 -10576 12348 -14697 17967 -22837 30934 -78715 581918 93341 -345853 -70098
74 -70098 -41740 315577 -165335 -241265 212595 168903 -89797 -226899 103193 295084 -35178
85 -35178 -140712 -58385 228987 112348 -165364 -33035 105968 165585 -115093 -201589 174255
96 174255 118469 -67936 -161899 5529 178166 -77159 -131252 -5151 183250 34685 -346717
107 -346717 125124 242522 -119343 5098 -77031 57232 155245 -94143 5226 47244 69089
118 69089 -41475 -125681 161637 83002 -103541 -97659 -242 129951 -44177 -100612 -35069
129 -35069 59647 33680 -214006 79361 116448 -151201 37491 -69278 40185 143159 -175222
140 -175222 38632 121033 -41427 -300 -7541 97481 29051 -28164 35684 -36959 72407
151 72407 57275 -44486 -7775 21907 62133 -85348 -10712 142608 -52550 -74767 2338
162 2338 52537 69289 -49815 -53465 45827 84136 -74477 -20894 157279 -67890 -21199 49375
174 49375 -53636 150803 -40127 -105299 130134 -36353 -5102 20277 -32225 50236 -40118
185 -40118 -2347 -14569 -21046 85187 -58966 -54883 41287 24755 -16875 -59519 82728 12825
197 12825 -75362 35545 -9691 56394 16247 -81017 40612 17439 146 864 -6845 26538
209 26538 -37604 3158 -499 -546 53353 -67016 -20778 32272 -2397 29381 -46413 8456 26856
222 26856 -21392 20655 -27792 54997 28404 -95324 43963 62967 -33070 -22959 36508 11441
234 11441 -49303 37185 -11823 -13139 52518 -79324 16065 21520 -52513 66811 -48330 -22659
246 -22659 43322 -49235 36009 -8905 -6769 41765 -60746 14538 39576 2388 -950 -30434
258 -30434 34006 -1079 -4114 14337 -17737 42608 -50289 -29448 84363 -38912 -32368 32338
270 32338 -18296 -21179 19684 11556 -34849 20365 3094 -33916 37536 -12367 13232 14954 -49028
283 -49028 45937 -3255 -9840 27271 -33190 36502 -22281 -33780 58881 -22410 -14784 -3845
295 -3845 -16468 15491 -16465 4713 -10906 -2422 -1447 -36841 53948 -9225 -34970 45406 -30682
308 -30682 5206 27527 1403 9765 -29550 39825 6810 -34429 52903 -5521 -16025 7929
320 7929 -6158 23846 -9451 -929 -5831 355 15697 -40166 36232 15865 -48638 33748 -5143
333 -5143 -8682 31489 -9297 3083 7559 2030 1503 21350 11695 -24256 31060 -7280 -19296
346 -19296 42540 -13506 -826 -15685 -6387 37532 -52881 14397 27852 -61192 16402 1835
358 1835 -13422 12775 -20606 -562 -7306 6834 -4067 -7191 31982 -39538 7039 32227 -38301
371 -38301 31477 4735 -21363 17178 -10581 15587 2093 -6866 8649 -11602 12699 -8882
383 -8882 2119 24701 -23708 -4810 12077 11647 -9960 -4917 35096 -32928 -1952 38738 -23775
396 -23775 14489 5521 -13765 13749 -2856 10448 1005 882 -2501 -10829 27380 -15779 -3278
409 -3278 23249 -26474 5975 -471 5705 8716 -27951 22958 -10504 -13883 27177 -25689 13104
422 13104 2043 -34712 25736 -744 -18476 2951 4875 -13240 -22303 30934 -13609 -23817
434 -23817 25944 -26289 -890 10768 -13374 14539 -13225 -3819 9090 -1272 11048 -9472
446 -9472 11129 5425 -15009 18500 8508 243 -6984 7388 10632 -19193 23531 -1872 -16625
459 -16625 21867 -23541 5630 18564 -24742 7672 3764 -9802 -4057 11920 9325 -26341 18611
472 18611 7350 -21225 25657 -2226 1230 4382 -9585 19863 -7906 6768 5848 -16155 19264
485 19264 -16814 -2857 24220 -26606 -2601 6655 -11051 -4014 378 5186 -21279 3408 5020
498 5020 -16878 18751 -11012 -7074 16656 -15682 6211 11749 -347 -4272 -1972 19092 -11005
511 -11005 -806 21193 -12636 -1753 3889 4395 -710 -4751 10843 -16490 5953 5950 -18894 25324
525 25324 -11629 -17392 25703 -11943 -2470 12012 -717 -3397 -4927 16692 -5577 372 13151
538 13151 -15886 12826 -707 -7936 17608 -10031 -1533 -1801 1458 6474 -18307 15576 -1402
551 -1402 -23972 19271 -2418 -9315 6525 -2389 -3014 -3347 9511 -5979 1804 9078 -19612 14761
565 14761 5687 -16038 15687 -2462 -8540 1516 4015 3203 -12150 8405 -2100 -12162 11401
578 11401 -6294 985 1175 -8798 4101 -2368 6674 -8025 1154 13729 -24299 13544 14583 -22922
592 -22922 14068 1951 -9603 5949 13 4017 -6507 2513 -2022 -6621 13207 -13601 589
605 589 9424 -17221 4664 4024 -927 -4205 -4130 11618 -12800 1852 14343 -13648 5575 2217
619 2217 -6175 8734 -120 -1533 -472 6152 -7532 -2955 18904 -16597 -2714 14215 -15323
632 -15323 2955 4748 -3261 -762 -4821 6147 -5070 2520 5374 -10878 10140 -3657 -5522
645 -5522 13236 -3460 -1544 -912 6447 -1839 -8115 18461 -10330 -8256 16220 -13012 2826 6613
659 6613 -10483 4513 -2059 -2285 -460 4405 -109 -11689 13191 -2506 -9483 14381 -3689 -3101
673 -3101 2088 2425 3539 -5272 9114 -2401 -5421 10929 -8287 3587 6775 -11206 3272 3824
687 3824 -2922 -4079 7936 83 -14924 13543 -602 -10248 13084 -6126 -2078 5313 -4114 4689
701 4689 161 2113 -3312 384 9528 -11026 6042 7149 -13124 4884 2391 -1243 -2566 755
715 755 4003 -11963 6593 2256 -10628 11125 -7634 -5353 10941 -8317 -415 4951 -1918 -5663
729 -5663 1807 8766 -10615 3216 6656 -10887 4865 1286 -2391 1114 -2970 637 -4306 3892
743 3892 -1486 -7520 9717 -8723 -6139 11372 -7227 -3369 3512 -37 -6014 176 8279 -10452
757 -10452 2531 4402 -11580 8964 -1589 -7095 7524 -5392 -3525 562 2092 -2985 -7510
770 -7510 8047 -7058 -6845 9290 -6974 -2293 219 -2294 -700 -2389 4191 -6546 1105 3895
784 3895 -11563 9376 1791 -11987 8548 -743 -6505 2505 3032 -3243 -5841 6252 -5533 -3742
798 -3742 6916 -8781 477 1331 -7212 2204 410 -1738 -5045 2268 2112 -10165 7576 1856 -10410
813 -10410 6311 -672 -3225 1647 822 -1017 -4218 5481 -5157 -935 8452 -12176 2089 5626
827 5626 -11018 3235 2378 -4166 -2970 318 2692 -7705 4076 2228 -8907 5636 -1741 -2545
841 -2545 4418 -1954 -1437 339 4021 -4281 -48 9030 -9924 742 8626 -8658 2488 4000
855 4000 -3785 -207 1230 1370 -3356 4731 -1187 -5329 8928 -4691 -2015 8022 -4482 -1706
869 -1706 2898 2721 -2336 -958 7462 -6021 -746 7545 -5940 2768 2467 -3865 1736 1392 66
884 66 -2900 5594 -1915 -6661 10899 -3975 -5043 9745 -4623 -1652 4058 46 286 -609 3637
899 3637 -3237 1436 5307 -6598 5228 1937 -6241 5209 2050 -2686 -522 4551 -1358 -4895
913 -4895 8162 -1633 -4553 7364 -3526 -829 4710 -1533 590 1745 1677 -3334 4069 4128 -7562
928 -7562 6809 2200 -6539 5654 1285 -1640 122 1510 792 -3763 5343 -1136 -4081 6776 -5268
943 -5268 -270 6515 -4674 -148 3686 -146 -4024 4245 4181 -7689 5283 2931 -6549 6055 420
958 420 -2690 3352 -793 -46 350 3039 -2456 -1813 6373 -5969 261 6114 -4951 -254 2566 -450
974 -450 -2105 1879 3034 -5345 2984 2058 -5618 6021 -585 -4512 5173 -1019 -2837 1635 2955
989 2955 -4479 -1557 6392 -6584 -363 5545 -6091 450 1760 -2659 329 455 422 -3407 2637
1004 2637 718 -5584 6668 -1133 -5373 6065 -819 -2585 2040 2009 -2448 -743 5060 -4107 485
1019 485 4526 -5828 2185 2735 -4546 2773 1558 -2214 -1815 3834 87 -4650 6404 -1097 -4561
1034 -4561 5572 -547 -1371 2178 506 -1510 96 3617 -3492 950 4481 -6909 2567 3836 -6368
1049 -6368 2139 2045 -3276 -1354 3036 -466 -4007 4579 -2085 -3471 5248 -3629 -988 3282 -3052
1064 -3052 -959 1628 1076 -3440 1048 3611 -6528 2459 3868 -5559 2428 1424 -2674 283 1849
1079 1849 -489 -1820 3990 -1456 -2147 6578 -3225 -1254 6157 -2884 -571 3744 893 -2251 2031
1094 2031 3383 -4469 3126 2796 -4162 3535 116 -2404 2294 601 -1690 -560 3769 -2751 -2136
1109 -2136 6692 -3902 -1929 5984 -3730 -446 3260 -714 -1318 1118 1112 -3315 2872 1035 -5035 4158
1125 4158 -443 -4168 3308 -243 -3317 -443 1609 -2567 -2582 4521 -3742 -2421 4261 -4271 -210
1140 -210 2514 -2416 -332 1836 -119 -2751 3964 1187 -4618 5662 866 -3992 5214 711 -2172
1155 -2172 2157 1536 -1131 -216 3586 -2990 -222 3623 -4360 1238 2716 -3824 127 1942 -1184
1170 -1184 -2047 2739 828 -4394 4327 712 -4013 4188 -726 -2025 2636 -100 -1177 1339 2165
1185 2165 -3581 827 3594 -5064 1060 2864 -4844 275 1800 -2219 -1277 1407 -613 -3699 2569
1200 2569 -1013 -3554 3939 -2402 -2515 3348 -1308 -1933 1888 1438 -3168 1072 3694 -4121 1330 3446
1216 3446 -3987 2106 1781 -2048 1024 1326 -907 -1078 3344 -1189 -2252 4315 -2403 -2032 3741 -1451
1232 -1451 -1561 1744 607 -1925 835 2552 -3428 1110 2470 -4479 2759 1452 -3428 1780 1201
1247 1201 -2124 -379 3178 -1969 -2018 4467 -2126 -1861 4221 -2141 -1060 2203 -878 -1041 1209 930
1263 930 -2776 1790 1343 -4361 2883 1106 -3884 1959 924 -2258 -11 2187 -1479 -1949 3145 -1809
1279 -1809 -1421 4125 -2767 -268 3018 -2092 -165 1934 -153 -2438 2192 1223 -3897 3158 998
1294 998 -3651 2373 378 -2282 903 962 -1409 -626 2724 -2641 -908 3780 -3531 -146 3242 -2683
1310 -2683 -316 2128 -734 -1731 1976 993 -3014 2721 548 -3105 2972 -139 -1989 2384 149
1325 149 -1751 347 1957 -2394 -38 3584 -3244 41 3036 -2614 -51 1950 -1124 -796 1476
1340 1476 133 -1968 2740 -324 -3097 3592 -968 -2558 3037 -663 -2109 978 1258 -2324 -33
1355 -33 2348 -3248 240 2403 -3325 621 1280 -2465 -71 1471 -1263 -1390 2589 -782 -2896 3539
1371 3539 -888 -2385 3224 -846 -1412 1360 426 -1763 707 1578 -2699 1256 2204 -3376 1771 1820
1387 1820 -2925 1312 1712 -1065 -532 2684 -640 -2167 3530 -711 -1835 3448 -1300 -1212 2258 -111
1403 -111 -839 1533 1153 -2318 1487 2317 -3469 1513 1750 -3250 1317 1192 -1870 -274 1419 -1170
1419 -1170 -1437 2387 -1846 -1246 2963 -2021 -1383 2667 -1475 -1531 1580 -20 -2498 1043 1379 -3689
1435 -3689 1511 1150 -3151 1558 712 -1832 858 1403 -1531 -275 2178 -1693 -618 3057 -2059 -588
1451 -588 3495 -1525 -591 1665 127 -914 1612 1117 -2107 1789 729 -2507 2529 513 -2324 1777
1467 1777 944 -1835 686 2243 -1725 -376 3221 -1989 -620 2918 -1831 -115 1719 -1089 -723
1482 -723 1310 -23 -2206 1723 21 -2809 2077 -89 -2638 1524 -113 -2119 313 365 -1955 -878
1498 -878 1753 -2418 -414 2017 -3013 -140 1629 -1960 -335 1650 -1020 -1646 2319 -270 -2417
1513 -2417 2774 243 -2470 2421 -17 -1654 1198 605 -1562 229 1715 -2037 235 1529 -2652
1528 -2652 416 1717 -2278 -55 1484 -1137 -648 1368 -235 -1493 2259 -834 -1836 2762 -913
1543 -913 -1372 2365 -345 -1357 1017 916 -2551 544 1765 -2976 383 1522 -2427 260 963 -1780
1559 -1780 -701 1039 -919 -1698 1551 -1372 -1735 2234 -1423 -1400 1879 -813 -1198 1057 283 -1783
1575 -1783 881 1142 -2103 1009 1179 -2361 1457 828 -1960 717 1136 -1366 -754 2245 -1338 -1290 2630
1592 2630 -1604 -1422 2432 -647 -1209 1439 56 -1489 853 941 -1955 1134 1089 -2425 1309 495 -1882
1609 -1882 1021 928 -1364 60 1504 -1076 -493 1902 -1738 -458 2048 -1488 -573 1973 -933 -863
1625 -863 1491 -261 -2021 1516 726 -2907 1704 847 -2424 1512 922 -1832 495 1305 -1133 -199
1641 -199 1969 -1381 -425 2250 -1638 -90 1708 -1359 -483 1174 -76 -1137 1597 243 -1836 1896
1657 1896 37 -1881 1930 229 -1369 1532 414 -1580 744 1492 -2285 74 2372 -2325 -63
1672 -63 1937 -1750 -452 1803 -651 -1113 1682 31 -1583 1760 34 -1644 1885 -84 -1373 1404
1688 1404 308 -1140 977 1244 -1269 486 1752 -1664 700 1588 -1892 633 1213 -1552 168 1539
1704 1539 -1064 -1126 2146 -723 -1738 2488 -522 -1731 2120 -64 -1396 1028 707 -1728 473 1414
1720 1414 -2103 738 1249 -1906 412 1228 -1498 333 1093 -897 -519 1285 -825 -862 1831 -915
1736 -915 -922 1834 -823 -814 1431 -109 -1267 1386 399 -1722 1304 1145 -2348 1179 1045 -2349 494
1753 494 1406 -1282 -270 1640 -685 -873 1979 -571 -902 2095 -915 -856 1613 -268 -741 1186 206
1770 206 -1358 869 756 -1793 1117 388 -1808 1256 472 -1288 494 859 -1508 19 1643 -1637
1786 -1637 -356 2236 -1616 -1048 2107 -1355 -842 1428 -415 -1778 1218 507 -2284 939 668 -1787
1802 -1787 1011 565 -1225 555 511 -1235 -165 1143 -1345 -30 1464 -1557 -16 1494 -1225 208
1818 208 1441 -877 -596 1291 -400 -1341 1734 -103 -1668 1776 388 -1772 1311 893 -1587 501
1834 501 1204 -1383 7 2115 -1548 -271 1683 -1251 -135 1034 -384 -417 1014 -28 -673 1375
1850 1375 -323 -1172 1467 -385 -1227 1432 -165 -1173 1028 183 -1404 821 744 -1764 661 1342
1866 1342 -2170 362 1114 -1601 81 1499 -954 -800 1634 -373 -1162 1680 -24 -1592 1350 -93
1882 -93 -1090 1042 200 -1064 810 947 -1300 334 1027 -1359 617 931 -1525 388 803 -1260 189
1899 189 1027 -799 -403 1732 -1094 -739 1912 -807 -978 1673 -621 -1100 1374 484 -1469 690 752
1916 752 -1551 649 1146 -1447 79 881 -1345 107 727 -637 -392 1371 -1022 -817 1302 -875
1932 -875 -543 1098 -500 -650 1084 -274 -924 952 213 -1347 1129 462 -1683 1320 515 -1683 621
1949 621 544 -1454 58 1434 -1237 -489 1574 -971 -636 1481 -647 -590 1153 -168 -978 1012 109
1966 109 -1249 913 156 -1455 1234 125 -1233 858 513 -1005 605 940 -1155 309 997 -1235
1982 -1235 124 1486 -1504 -211 1401 -1260 -410 1424 -479 -1276 1472 -145 -1680 1455 103
1997 103 -1290 953 229 -1188 613 667 -1118 464 931 -1043 71 1121 -1275 252 999 -1131
2013 -1131 -65 979 -624 -785 816 -435 -711 1545 -558 -837 1380 -395 -1365 1289 -63 -1390
2029 -1390 686 672 -1461 517 1121 -1326 303 1188 -1141 -135 1081 -762 -230 1081 -496 -813
2045 -813 1279 -196 -682 1210 -587 -899 910 -200 -774 795 263 -1066 466 835 -1205 721
2061 721 774 -1255 345 829 -1339 322 1007 -1030 -415 1582 -644 -827 1586 -619 -749 1356 -272
2078 -272 -1137 871 -6 -1246 653 247 -1377 743 528 -1129 393 653 -1190 400 750 -962 -201
2095 -201 937 -706 -372 1416 -1096 -296 1522 -761 -651 1248 -290 -871 1251 14 -1098 1041
2111 1041 474 -1890 928 647 -1457 431 725 -993 46 1055 -796 -149 1060 -838 -335 1011
2127 1011 -717 -330 1142 -712 -527 833 -159 -568 986 -34 -1425 1287 20 -1174 1052 48
2143 48 -1296 701 446 -1153 178 934 -1294 -29 1028 -1206 -223 1064 -761 -363 1291 -349
2159 -349 -481 997 229 -976 1099 -190 -783 1217 22 -866 851 252 -1058 527 459 -969 522
2176 522 781 -1303 262 972 -954 -38 1077 -968 -350 1207 -561 -745 1270 -405 -1095 1308 -266
2193 -266 -1117 1051 264 -996 882 427 -1014 475 780 -1158 128 973 -880 315 570 -749 -203
2210 -203 1019 -664 -347 1277 -621 -388 1205 -376 -740 1015 -236 -779 604 62 -829 820 189
2227 189 -1299 648 503 -1259 622 937 -1030 390 976 -1021 62 860 -719 -696 1172 -874 -757
2244 -757 1147 -511 -683 781 -169 -635 793 117 -886 646 422 -1193 515 469 -951 496 523
2261 523 -1232 584 616 -740 -80 908 -1025 -334 1279 -731 -715 1390 -602 -514 1090 -78 -836 978
2279 978 412 -1163 735 66 -901 515 286 -770 474 413 -702 -66 987 -687 5 840 -1059
2296 -1059 -254 773 -664 -467 1005 -472 -593 947 -144 -835 942 -198 -1066 750 14 -1052
2312 -1052 527 307 -911 281 490 -1007 199 625 -975 -328 760 -754 52 848 -572 -421 1013
2329 1013 -248 -898 1101 -204 -611 860 70 -964 649 -78 -901 648 515 -1191 386 825 -960
2346 -960 150 960 -1022 259 696 -960 -130 844 -702 -415 1003 -454 -720 891 -325 -811 975
2363 975 -207 -779 772 -65 -764 363 420 -1004 347 629 -1045 257 686 -881 -50 964 -484
2380 -484 -217 699 -728 -407 1012 -339 -699 883 -483 -687 1064 -259 -806 730 237 -1119 598
2397 598 523 -1207 491 445 -991 316 414 -716 141 770 -582 88 801 -514 -411 1005 -541 -730
2415 -730 912 -468 -572 729 -67 -901 826 1 -762 679 99 -1036 451 566 -817 312 570
2432 570 -884 -15 714 -598 116 865 -654 -507 960 -626 -332 978 -267 -597 832 -68 -531
2449 -531 656 256 -951 538 409 -982 434 337 -1003 253 709 -591 -9 786 -978 41 803
2466 803 -584 -95 972 -671 -401 995 -398 -625 1043 -62 -544 702 -24 -780 444 328 -678
2483 -678 292 389 -719 234 846 -870 239 743 -743 107 815 -522 -245 779 -436 -387 840 -306
2501 -306 -597 664 -186 -532 962 -312 -742 614 94 -463 454 477 -910 366 606 -915 263 604
2519 604 -768 -221 680 -198 -254 905 -269 -189 1049 35 -514 1002 -229 -589 663 -107 -678 635
2537 635 300 -768 264 627 -858 342 780 -934 317 596 -456 -91 430 -727 -358 1004 -399
2554 -399 -286 506 -341 -649 862 -354 -722 864 31 -644 478 320 -699 563 305 -977 618
2571 618 542 -1035 212 581 -774 -66 617 -487 -423 936 -728 -364 699 -504 15 473 -443 -553
2589 -553 624 34 -755 749 200 -734 620 264 -942 397 601 -692 345 564 -646 -177 653
2606 653 -480 -302 821 -533 -215 857 -337 -372 739 -149 -661 542 -52 -622 737 103 -751 322
2624 322 299 -651 524 589 -652 230 664 -655 -113 606 -559 -65 593 -639 -352 547 -231 -576 518
2643 518 -163 -483 607 222 -590 751 218 -644 484 220 -697 196 520 -799 320 586 -992 -2
2661 -2 649 -658 -78 652 -735 -206 630 -299 -423 695 -277 -551 578 -36 -398 578 26 -613 468
2680 468 330 -735 66 360 -877 -42 674 -623 -107 502 -732 108 786 -349 -336 550 -247 -130 626
2699 626 -217 -306 807 7 -582 411 117 -669 522 58 -652 510 473 -700 237 331 -684 55 571
2718 571 -406 -34 776 -417 -473 662 -184 -307 451 -307 -524 516 -74 -560 453 -9 -814 372 282
2737 282 -572 258 341 -432 -87 414 -684 101 506 -584 -125 526 -374 -181 695 -400 -273 633 -183
2756 -183 -78 735 -49 -913 528 260 -434 321 168 -539 423 395 -645 400 487 -366 30 812 -550
2775 -550 -58 721 -368 -293 701 -469 -110 608 -213 -258 847 -71 -563 569 170 -364 340 305 -541 340
2795 340 247 -688 92 308 -742 90 437 -519 82 679 -393 -25 490 -174 -164 767 -136 -644 666 -185
2815 -185 -493 567 64 -709 574 168 -384 237 376 -583 162 383 -523 258 467 -602 61 660 -286
2834 -286 -44 551 -328 -525 829 -234 -302 561 -112 -521 549 -164 -746 280 -34 -696 402 418 -525
2853 -525 216 280 -636 148 600 -514 204 436 -613 -71 602 -286 -346 680 -135 -317 550 -112 -157 319
2873 319 -66 -708 348 135 -531 477 252 -673 351 433 -593 7 208 -513 80 649 -366 -113 471
2892 471 -467 -208 555 -104 -388 594 -84 -451 405 -264 -397 241 164 -587 566 316 -581 229 394 -436
2912 -436 169 329 -399 -131 512 -527 -354 474 -364 50 199 -215 -391 683 -157 -504 256 44 -520
2931 -520 286 37 -630 296 208 -274 150 270 -471 57 606 -564 -124 622 -308 102 598 -325 -454 245
2951 245 -347 -235 456 -240 -718 311 61 -754 452 99 -527 418 191 -496 354 221 -472 153 559
2970 559 -720 128 692 -577 -178 428 -169 -66 765 -308 -292 549 -177 -297 473 -22 -475 454 65
2989 65 -340 373 119 -268 181 504 -603 -88 503 -515 16 523 -502 -56 222 -326 -220 689 -207
3008 -207 -277 413 -87 -501 476 -6 -518 611 18 -654 447 258 -589 154 319 -385 67 400 -534 94
3028 94 757 -436 -121 370 -301 -309 424 -464 -211 443 -136 -467 558 2 -206 509 -29 -569 364 465
3048 465 -529 442 139 -456 122 267 -551 81 598 -468 -214 566 -601 -274 399 -99 -215 536 -251
3067 -251 -386 538 110 -245 126 20 -419 322 254 -464 462 466 -352 108 340 -546 42 622 -392 -65 427
3088 427 30 -227 429 75 -245 311 -29 -392 272 -252 -411 433 275 -556 187 208 -632 -86 318 -341
3108 -341 146 257 -473 -149 133 -527 59 458 -330 -205 528 -267 -265 245 -118 -476 416 -42 -377 490 -69
3129 -69 -359 544 3 -536 242 137 -588 191 433 -249 73 283 -297 -169 276 -302 -95 296 -270 -112
3149 -112 549 -164 -244 235 -51 -380 649 84 -335 376 122 -394 429 535 -420 93 312 -535 14 301
3169 301 -377 165 416 -278 -378 380 108 -238 479 -157 -350 369 -324 -524 413 77 -422 279 116 -478
3189 -478 215 407 -774 85 308 -574 98 288 -295 -109 581 -220 -188 335 -76 -295 504 -123 -16 319
3209 319 -86 -324 297 -11 -439 417 142 -258 209 190 -495 240 206 -375 -2 407 -143 -99 286 -239 -103
3230 -103 361 -208 -334 401 -286 -391 356 52 -525 356 -82 -382 592 356 -435 196 -8 -675 271 154
3250 154 -350 23 364 -283 31 340 -393 -26 422 -447 -148 253 -52 -369 449 -409 -340 233 -145 -355
3270 -355 299 372 -445 179 205 -234 252 302 -430 62 429 -359 -72 567 -318 -190 384 -163 -179 351 -242
3291 -242 -215 623 -110 -474 425 79 -177 392 156 -290 215 139 -208 494 260 -705 57 431 -277 -158 591
3312 591 -449 -2 481 -153 -359 372 -346 -71 337 -181 -379 293 4 -417 325 158 -322 580 222 -289
3332 -289 238 408 -155 -145 300 -384 -164 151 -139 74 326 -15 -281 652 -20 -324 170 -59 -561 234
3352 234 -58 -464 334 234 -395 99 132 -270 1 166 -386 262 338 -268 -6 271 -318 144 183 -157 -263
3373 -263 561 -9 -260 518 -52 -133 338 60 -367 157 270 -383 179 289 -265 132 275 -419 233 519
3393 519 -238 123 265 -272 -196 325 -206 -376 319 -78 -180 186 -97 -303 275 -180 -307 281 202 -60 225
3414 225 362 -323 -120 193 -436 -87 487 -462 183 380 -278 -65 457 -284 107 394 -69 -268 333 -226
3434 -226 -247 308 16 -189 234 2 -549 239 163 -120 180 82 -304 284 411 -273 -99 416 -412 2 406
3455 406 -221 -204 395 -148 55 255 -232 -197 460 180 -87 545 -129 -148 276 157 -305 -30 125 -244 193
3476 193 175 -246 -28 341 -193 -264 255 -199 -95 81 -158 -188 511 -327 -119 495 301 -319 321 -24 -370
3497 -370 359 -58 -518 149 345 -412 164 414 -289 77 241 -71 -96 102 -457 -216 311 -359 -210 115
3517 115 11 -166 284 8 -393 71 -101 -353 315 242 -339 257 204 -231 314 342 -298 106 225 -325 205
3538 205 491 -303 168 190 -247 -131 197 -307 -298 300 -147 -565 503 -43 -627 320 290 -315 512 214 -721
3559 -721 268 202 -387 256 518 -44 36 461 -116 -142 488 -161 -178 422 0 -103 415 104 -193 521 -197
3580 -197 -610 177 116 -401 173 57 -304 389 343 -389 8 344 -164 61 138 -134 156 323 -558 -161 351
3601 351 -16 -98 397 72 -165 82 114 -187 390 289 -403 74 74 -494 216 143 -207 157 294 121 -61 222
3623 222 -398 -76 83 -91 -304 518 -107 -70 347 -16 -247 410 183 -260 504 177 -246 83 27 -270 124
3644 124 202 -119 164 336 -225 -130 318 -142 -63 142 -1 -44 -67 -2 -178 202 -220 -170 297 -144 -386 339
3666 339 72 -415 195 111 -235 181 242 -451 7 130 -288 122 191 -289 27 222 -152 -114 181 -125 -224 276
3688 276 24 -117 138 145 -377 346 30 -415 10 152 -324 -28 219 -297 -95 379 -294 103 206 -460 -64
3709 -64 198 -179 -115 278 -93 -177 333 48 -240 197 120 -263 201 118 -185 348 136 -324 30 306 -401 -119
3731 -119 348 -263 -34 94 -28 -167 319 -136 -232 128 -149 -291 492 -153 -26 490 142 -202 88 80 -394
3752 -394 301 422 -384 29 245 -567 -55 445 -299 -76 330 -236 62 150 -302 -198 120 -116 -140 243 29
3773 29 62 159 27 -182 309 -57 -340 165 -153 -552 162 115 -292 89 291 -94 0 264 -337 -85 367 -163
3795 -163 -68 445 -46 -8 373 -96 -193 93 169 -334 496 178 -453 65 205 -244 43 99 -326 -124 204 -360
3817 -360 -6 190 -135 56 453 -212 -19 20 -161 -336 125 -82 -190 160 213 -322 59 367 -324 334 203
3838 203 -206 76 198 -548 -32 68 -312 -283 -25 -153 68 170 -207 -11 331 -119 -359 303 153 -192
3858 -192 212 23 -375 472 128 -132 7 53 7 270 74 -468 22 251 -407 18 302 -193 -67 199 -291
3879 -291 -121 273 -33 -185 132 116 -271 18 -55 -408 101 75 -84 396 -105 -192 179 82 -388 160 250 -17
3901 -17 -237 128 -289 -4 199 60 -266 429 -121 34 198 -143 -33 159 409 -242 254 27 -21 257 152
3922 152 -94 255 128 -266 105 68 -233 -80 253 -72 167 320 -267 -14 259 113 -55 171 -144 -219 421
3943 421 -312 -371 140 -159 -323 511 295 -266 282 -42 -340 122 217 7 -127 270 -278 -50 258 -226 -109
3964 -109 85 -40 22 329 6 -161 133 -25 -353 110 -9 -153 363 116 -214 232 217 -191 263 253 -181
3985 -181 -65 54 -306 -31 227 -375 -186 341 -411 33 99 19 -173 201 -25 -316 217 157 -129 -2 49
4006 49 -194 195 -32 -51 18 268 -73 -118 220 -528 0 288 -116 -227 67 -219 79 317 -78 -227 252
4027 252 19 -132 121 -104 -150 132 18 -372 454 155 -143 71 173 -114 -158 189 -263 20 178 -125 68
4048 68 241 -295 -97 7 -359 -272 305 12 -55 26 35 -280 37 53 -74 64 228 -185 104 527 -231 159
4070 159 308 -425 -118 -6 -250 129 84 -77 -42 372 202 -133 192 66 -226 369 5 -301 114 -148 -281
4091 -281 101 205 -30 -138 274 -96 19 275 -181 24 73 -306 22 290 72 -117 41 -313 5 124
4111 124 -6 -199 249 -171 -269 217 28 -217 51 112 -244 325 126 -276 -124 73 -16 149 -128 -94 -239
4132 -239 210 -406 -10 196 -158 -301 176 71 -30 119 -269 -214 225 -185 -291 -12 112 -319 -101 199
4152 199 -60 103 319 -126 -124 251 -273 -1 282 -218 -174 -10 -103 -325 191 -107 -150 180 26 -56 430 82
4174 82 38 81 289 -229 8 104 -226 -26 -186 -12 36 129 -266 -377 282 -258 42 273 -266 -307 51 76 -414
4197 -414 265 63 -186 -59 75 -310 130 219 -435 208 69 -338 117 70 -190 184 135 -194 2 58 -411
4218 -411 -221 506 -2 -41 343 -199 -239 292 -85 -269 104 -115 -360 192 71 -245 -26 -63 -357 188 259
4239 259 -280 150 82 -414 -173 433 -6 8 178 -18 -146 272 -53 -437 378 115 -60 13 117 -257 -16
4260 -16 -11 -109 -111 -57 -438 -88 112 -263 -126 -18 -210 28 151 -211 9 259 33 -148 138 -131 -63 189 52
4283 52 -83 429 -303 -270 49 219 -141 -49 182 -178 -59 -3 -258 173 400 -272 293 244 -164 81 146 -89
4305 -89 -298 51 -29 -104 -15 53 -55 247 26 -146 -73 93 -213 125 191 -252 15 344 34 137 341 -186
4327 -186 -10 245 -52 -24 214 -122 22 301 297 -108 510 -102 27 89 176 -371 218 -253 87 79 131 -163 260
4350 260 174 -139 -312 297 99 -166 165 -55 -222 62 -2 -71 282 -146 -355 11 140 -172 230 -16 -269
4371 -269 149 267 -129 -297 74 -84 76 99 -340 -73 152 -243 17 338 -197 138 301 -182 -93 433 -209
4392 -209 181 355 26 -121 144 -125 -282 287 143 -205 3 -4 -309 181 127 -153 -145 179 -165 17 -47 -202
4414 -202 -224 5 132 127 231 -61 79 161 66 71 111 270 -340 421 -133 -328 -71 -20 -183 169 262 59 367
4437 367 22 5 1 404 -242 -75 82 -44 -155 260 -120 1 199 67 -50 257 236 -182 262 -25 -378
4458 -378 211 54 -122 91 -47 41 130 348 -427 -103 202 -101 68 249 -123 94 73 16 -124 82 -141
4479 -141 -63 34 -167 -177 107 122 -147 382 144 -133 13 227 -275 86 141 -46 -26 -113 -126 44 277 94 -48
4502 -48 122 108 -271 219 -265 36 260 102 -201 195 62 112 431 -102 52 30 65 182 93 70 -84 -114 110
4525 110 42 -186 -117 -52 -45 85 -155 -280 191 153 -159 194 50 -99 127 56 -176 160 -31 -152 210 125 -185
4548 -185 -16 -5 2 -45 -47 -167 -132 216 -214 -183 566 -253 -152 141 5 13 279 91 -79 -99 -21 -233 35 309
4572 309 -50 277 144 -192 -122 105 -244 42 180 56 176 169 44 -203 211 -139 -160 155 177 -81 63 -182
4594 -182 -7 63 154 -80 51 262 -189 140 39 -188 -66 300 -179 -114 203 -140 209 52 -138 176 234
4615 234 -243 -34 322 -113 -279 220 10 -192 157 -29 8 106 414 150 187 210 -69 123 127 -26 33 282
4637 282 -73 123 176 -17 -25 -64 137 -281 132 -46 109 -24 -27 -138 183 363 -263 282 186 -237 420 -62
4659 -62 -25 37 335 -106 1 149 -265 128 376 186 221 -19 -67 -57 155 -13 -260 -47 177 -90 280 101
4681 101 33 290 -286 -290 -164 92 -145 7 98 -249 92 189 -199 -90 244 -183 -175 215 8 -30 36 -40 -104 186
4705 186 15 4 13 6 -180 254 75 -47 55 114 -75 2 438 15 138 59 -147 8 308 10 85 42 166
4728 166 -257 -12 118 -130 286 -193 -201 118 115 -33 13 247 -59 287 27 101 178 137 -67 87 -19 4 -86
4751 -86 405 -103 -170 232 40 -28 283 -276 -328 207 275 -32 69 58 -214 297 127 -108 24 218 -313 63
4773 63 211 -335 27 224 73 -176 144 -32 -44 252 48 8 18 -110 -381 194 -41 -200 7 167 -296
4794 -296 88 -67 -208 7 228 -192 -153 30 -63 -138 301 53 -233 227 -139 277 8 58 -127 141 116 -92
4816 -92 94 -121 -81 -114 -96 -14 -100 -20 -246 156 188 -146 78 43 -131 -73 232 -235 -136 192 -125 3 4 205
4840 205 -122 55 -181 -250 135 -21 -179 140 -66 -94 -58 121 -59 162 124 -159 -48 48 -30 -54 230 -192
4862 -192 -107 -3 -181 11 307 158 -117 161 79 -141 -46 -171 -168 -294 -75 -50 -12 -79 -158 -136 165 -103 -173 108
4886 108 -56 99 293 -297 -292 -152 200 -224 307 -119 -215 329 0 -111 14 115 -99 -44 253 158 46 208
4908 208 -254 -220 90 -438 -4 -22 -306 159 -99 3 128 53 17 14 -55 73 -21 -5 -24 -32 163 96 -183 307
4932 307 37 -302 50 -99 -53 4 -110 -251 50 -146 152 -28 -115 59 -130 58 -140 14 259 -288 -69
4953 -69 134 -185 -176 -77 68 -208 299 -13 -210 321 12 -26 -103 62 -30 -97 -20 -176 -55 -185 -230 -288 148 -144
4977 -144 -74 228 -39 -164 -37 -136 -14 225 -243 4 196 22 -109 11 -14 -41 59 94 -171 135 205 -143
4999 -143 -179 -14 -149 -82 -112 -26 134 -54 -180 -11 -69 -43 -278 160 44 -163 176 65 -208 160 -16 33
5021 33 118 -18 26 271 41 6 0 36 27 134 220 78 71 -180 -146 -283 174 -101 -261 101 -31 39 106 -301 -129
5046 -129 -75 178 -325 173 -8 -48 45 -14 -217 -71 191 -162 163 237 -107 -31 131 -209 35 -97 -123 -353
5068 -353 -57 -48 -85 128 214 -295 153 -99 -297 -14 104 10 -68 372 -182 161 85 -122 170 284 -76 34
5090 34 -21 -16 -57 -14 -214 -307 -76 48 -46 -135 326 -218 37 -123 13 -9 197 -113 -28 -25 41 193 240 -81 -10
5115 -10 161 -195 222 11 -43 26 123 -120 -296 184 110 57 -12 33 -77 163 175 -2 -65 213 -236 -46 161
5138 161 -88 96 299 -69 -94 96 -148 18 -133 -75 -104 10 223 -126 412 -74 -298 150 81 -182 -102 74
5160 74 59 -18 51 -315 14 -73 -170 -157 234 -40 -152 23 -130 -168 5 -80 -88 -1 184 43 179 -18 -155 -101
5184 -101 60 -316 -9 -42 -42 108 -40 93 -38 18 -26 -262 -32 -279 82 107 -397 -117 223 -35 56 124 68
5207 68 74 215 119 59 119 -260 -157 216 80 -155 139 29 -191 73 125 -193 19 42 -27 14 64 -68 -28 95
5231 95 47 -76 94 -144 -43 184 63 -72 21 -101 174 69 43 -7 -74 -12 -59 131 108 -40 121 -142 -109
5254 -109 -165 -170 53 132 4 -146 -92 176 -60 -224 146 233 -49 173 33 105 13 -79 -5 -165 347 -162 -7
5277 -7 28 31 11 20 135 -225 -161 -248 -48 -102 -187 152 126 -160 -51 138 -150 -273 292 -25 -213 278 -75 -219
5301 -219 -57 -76 -134 -40 169 65 74 160 6 50 130 -129 -99 141 -90 27 165 -20 -158 122 62 92 161 -148
5325 -148 -207 253 311 -57 281 -171 -209 342 125 -86 97 298 -17 170 -87 -128 -50 64 -134 8 21 6
5347 6 -48 148 138 -145 -152 195 -68 124 -85 -313 -144 237 24 -197 -142 -149 -24 221 -110 -10 146 -237 41
5370 41 42 -30 53 149 -122 12 354 -120 -129 563 -5 -175 -91 -2 -199 -178 224 -213 44 196 -206 144 109 -27
5394 -27 9 83 5 -178 47 -121 158 -37 90 -133 154 187 -127 71 4 -174 -68 19 38 130 -218 -69 16
5417 16 318 212 167 158 -138 169 -43 -35 -113 -8 -36 -52 -36 74 -52 201 60 -307 102 -173 136 20 85 -305
5441 -305 -120 -23 70 -136 33 -172 125 222 -38 89 264 -21 -84 94 146 26 114 -26 -39 91 -117 -26 -217
5464 -217 -62 17 268 -337 153 343 215 -105 30 105 -31 38 333 -60 -144 -12 -87 79 -26 -66 -216 186
5486 186 -278 -46 60 -24 137 34 207 -58 178 -117 -189 307 43 -112 173 217 -56 76 155 -198 -303
5507 -303 80 -13 -164 131 160 -143 265 -8 -224 27 -134 -255 -115 217 -263 127 -122 -45 -27 4 193 70
5529 70 266 -214 66 -90 -138 -211 -40 -191 164 202 -129 -210 253 -51 123 162 -55 -166 100 149 -241 42
5551 42 95 -378 -196 112 -126 165 7 -5 -66 71 -139 131 142 -96 -303 89 -36 -154 193 74 -220 50
5573 50 -238 79 12 -319 -242 36 6 -73 139 -27 -359 33 40 -52 12 -37 110 -96 262 -184 75 -66 -47 -49
5597 -49 -96 -95 -99 105 -154 -98 20 65 -78 13 113 -249 69 129 -213 26 10 -115 -34 -213 -176 49 -209 -83
5621 -83 -172 152 -38 67 73 -137 -117 -127 -37 -33 185 141 -64 73 -110 106 72 -77 22 320 158 -160 -96 -120 -132
5646 -132 -162 39 34 -66 106 -106 -94 32 -42 81 -33 169 -237 -43 199 -5 144 211 263 30 65 179 40
5669 40 -62 -200 -110 285 -139 -197 318 161 -173 361 -61 -166 163 -54 45 -37 -108 -150 62 -77 -218 98
5691 98 154 5 17 281 102 320 67 75 177 76 -36 -243 47 -32 74 66 30 -112 -31 -53 86 123 123 -93 -49
5716 -49 -146 -80 -86 247 -72 119 184 -31 -128 104 -154 -272 134 11 -20 -8 -87 66 91 -11 -57 145 53 -96
5740 -96 124 32 -330 87 209 -187 61 29 -148 -5 321 -25 303 66 -74 -89 -89 24 -6 -53 -227 27 -13
5763 -13 -142 -28 189 29 107 274 112 170 175 -101 -98 -92 -98 104 147 -33 -239 298 283 -191 -77 203 97 -50
5787 -50 -163 -41 -145 188 -265 -39 17 -34 -223 107 141 -304 42 -108 79 229 -112 245 64 154 166 -1
5809 -1 152 -29 418 20 -141 72 299 -235 -139 115 106 -140 -166 157 -62 246 108 -243 10 5 -206 -241 107
5832 107 38 98 -162 -84 -10 140 -63 41 100 3 32 44 -319 150 208 -128 111 275 -191 122 284 226 -15
5855 -15 -84 -138 -150 86 161 -70 255 143 -90 229 217 -125 -6 202 -163 -116 -139 8 -34 -7 31 337 170 -120
5879 -120 -72 -304 -178 28 78 5 105 24 240 -52 152 11 83 57 151 -222 33 251 71 188 -131 -158 -57
5902 -57 111 -190 -1 69 -161 65 116 36 -185 76 169 -81 -24 -60 81 71 -60 -306 150 40 -122 64 -35
5925 -35 -247 -218 7 -257 19 -48 -6 10 314 -14 137 122 -199 -130 -71 -68 -274 105 -105 -183 149 -274 -457 76
5949 76 -27 -114 -51 80 -3 -114 -29 -193 -95 216 -134 -412 -55 -162 51 132 -197 -191 -69 -245 -140 258 -47
5972 -47 63 108 -15 -278 -95 142 -324 -217 48 -356 34 133 -44 89 256 -130 45 -88 -26 -54 -41 -19
5994 -19 6 -47 -237 142 268 61 -78 -19 -46 -151 -307 -298 -147 -46 -78 -126 -106 -93 -204 -42 194 -78 248 96
6018 96 202 -329 189 -89 -155 -69 122 78 109 -2 -238 -60 100 -61 -121 -96 -131 200 -30 -148 -272 236 80
6041 80 -63 64 -130 -29 -13 131 60 -14 189 -183 115 -313 159 -28 -159 -57 -58 53 118 132 31 62 -177
6064 -177 180 190 178 18 23 84 -105 -135 7 65 -274 -173 -149 -73 -145 8 153 -70 -168 -7 -139 161 144 -239
6088 -239 127 -89 -36 -63 3 -168 -1 39 33 -168 -72 -77 -132 214 65 -95 -92 -69 -155 37 59 -64 194 -132 0
6113 0 -230 -60 17 -72 224 -301 -165 -55 -67 25 66 127 -315 33 -154 28 -75 108 -85 -303 -160 -237 96
6136 96 -19 -53 195 65 4 126 405 6 -149 -114 -314 -4 -83 12 -48 113 -79 73 -140 66 102 36 -36
6159 -36 -59 -260 -51 145 151 172 -295 -277 211 -115 71 -25 -233 247 -169 -245 200 70 17 -116 234 -8 -39
6182 -39 180 -175 83 -54 33 58 -156 243 -129 145 59 207 -22 -84 -152 0 186 -38 -48 -9 -182 -270 59
6205 59 -8 -207 26 102 -96 78 -130 -174 93 157 -227 75 -127 -31 -37 -142 -87 -16 247 260 32 -54 -77 269
6229 269 142 -301 227 -41 -69 14 5 -71 -33 51 8 97 81 -116 -13 99 -94 2 -174 33 -119 -10 77 -306
6253 -306 148 253 -279 -56 15 -65 73 -126 161 163 -59 126 -171 -33 103 -321 37 83 73 48 50 -45 -25 -148
6277 -148 -222 -242 -146 82 30 176 -162 39 -79 42 -16 168 111 13 15 45 86 -6 -9 90 181 181 120 -97 277 -102
6303 -102 24 112 -155 287 -89 -163 121 -167 -56 107 -14 133 -86 36 107 -86 150 -172 304 -136 -69
6324 -69 -147 203 -184 -103 212 220 -52 -12 -22 -61 51 77 -231 -42 52 -7 -82 129 -129 273 127 -296 95 -1
6348 -1 -84 61 -118 34 152 -102 4 -193 229 -24 -130 121 104 -80 42 56 -84 -41 193 26 -95 43
6370 43 97 174 -9 -19 -154 1 -226 38 115 34 -67 22 -371 -85 -51 -179 -92 170 258 -39 -132 -75 -219 52
6394 52 13 10 87 94 29 177 39 261 136 99 -130 61 262 4 -22 25 136 -77 -7 271 -243 5 -58 -117 -18
6419 -18 79 201 -77 -78 -55 97 -11 10 -19 -33 -9 -221 166 -233 -102 71 -176 65 183 -7 -304 47 160
6442 160 -99 6 -47 -136 69 60 -95 -40 72 59 -65 -164 137 -94 28 10 -33 -8 -239 226 56 87 40 -135
6466 -135 112 41 49 -79 -14 -93 6 -203 230 -83 -128 -13 71 195 -171 121 -71 149 -70 -345 -177 26 -348
6489 -348 -122 153 90 -17 107 -61 184 -32 43 12 435 36 -21 39 225 -315 105 140 -13 334 184 -61
6511 -61 35 -75 104 27 33 -154 13 -130 119 141 137 -119 -1 231 140 -156 209 43 -16 -23 -70 -209 115 140 -257
6536 -257 -14 126 95 -88 1 -95 119 -163 -54 78 -81 68 -296 -251 81 10 8 -261 -56 268 151 -88
6558 -88 159 193 89 -120 15 -6 -68 88 -29 -158 -135 150 -1 -23 310 134 84 -33 -35 220 -86 -298 -10
6581 -10 -63 -180 -81 -46 99 172 93 -291 -144 214 132 97 57 -172 -30 11 94 -30 231 -35 98 66 -96 15
6605 15 -76 98 -96 70 -10 -56 93 -150 -151 155 -23 248 -196 258 38 126 -195 -85 -84 58 -135 -39 112
6628 112 115 -176 51 -97 45 -17 39 -104 -90 -64 32 297 -84 -75 -61 189 64 91 95 210 -36 147 -45 2 121
6653 121 198 -90 17 -209 -56 173 57 -351 186 167 134 232 -74 -83 -43 -23 -201 94 -180 13 227 11 -182
6676 -182 -108 -69 -158 352 81 -2 -121 63 -26 288 66 20 -181 31 38 26 -7 -208 130 14 -188 -352 -159
6699 -159 -218 -30 76 14 -311 -44 250 48 155 -120 -153 -16 -173 -64 167 68 127 51 -41 -191 -86 418
6721 418 -22 171 117 67 -83 44 36 -74 -40 -119 -99 114 225 -87 30 -35 46 -123 32 -99 -195 -53 155
6744 155 10 125 220 -97 68 -289 -58 8 1 23 252 -73 50 -136 -59 -40 201 -150 -245 12 57 17 -118
6767 -118 118 15 39 73 55 -46 76 90 33 -36 -23 -150 320 -194 -33 9 -27 -307 276 -40 47 -137 -106 -72
6791 -72 46 201 -288 74 171 -81 229 326 -172 210 102 13 -206 482 -114 -40 1 -94 122 -136 37 -251
6813 -251 223 224 23 91 207 27 38 18 80 143 -15 3 -44 -71 -16 -11 7 198 -69 126 301 -228 115 -59 -1
6838 -1 140 -62 -210 104 191 -137 -41 -37 168 -103 122 -44 178 -101 -96 -73 174 106 -77 86 -90 -67 -77 28
6862 28 188 -20 111 93 168 196 -162 -66 -174 -41 155 146 0 6 -13 -72 123 136 -156 68 -17 9 -103 -152 -26
6887 -26 -73 176 -56 252 78 -70 -156 4 -19 -74 151 -80 -23 -1 24 -22 -19 50 91 30 -7 106 77 -134 -118 -4
6913 -4 142 215 -112 -54 -66 -101 139 -96 115 -41 30 66 -126 62 28 86 -62 -238 298 -183 45 75 113 -151
6937 -151 -78 14 64 -105 72 -54 -251 -194 -102 24 177 -9 -148 138 -27 -304 189 64 -78 -74 52 -73
6959 -73 -18 -67 36 68 -15 -12 -19 298 -78 159 248 63 -42 124 73 142 240 -170 217 55 166 -217 15 -8 -130
6984 -130 232 -37 -202 48 19 40 -185 23 -164 -4 -104 -20 90 44 96 1 17 -61 34 78 -226 -39 109
7007 109 -120 128 26 155 -79 -149 56 -94 404 -23 -72 26 -22 54 -95 156 -146 -177 138 51 -39 -143 -70
7030 -70 -129 171 83 98 -34 -57 24 341 41 -107 -146 0 -93 -181 -117 -221 -101 -79 -92 99 102 -93 -140 298 -244
7055 -244 76 78 -18 281 -3 43 -167 96 -249 -73 125 231 -189 -84 62 46 -84 34 -18 -148 1 38
7077 38 -200 189 -103 351 -83 44 -13 -55 -124 -304 63 34 -100 59 131 -35 139 268 -43 -40 50 -209 269
7100 269 105 -11 92 63 -11 174 -161 25 97 -104 -59 -84 140 -94 -20 -101 43 79 189 93 -271 -44 -27
7123 -27 143 -68 65 -150 -75 13 -146 -82 2 -163 32 -66 44 -17 -110 -194 120 116 36 -39 12 -18 -220 146 -3
7148 -3 -118 -37 22 -152 -4 -37 125 25 122 -152 -95 249 -117 115 -21 83 41 -143 150 -190 -3 -61 -22
7171 -22 209 73 -18 -98 211 -29 123 -112 67 -57 -35 68 60 21 -110 -126 -37 59 -110 10 -18 -110 -75 -74 -28
7196 -28 70 9 -251 39 -158 -61 -5 -134 -57 54 70 -119 -87 145 -120 128 59 -32 211 -200 -164 -103 39 175
7220 175 104 -15 22 23 -27 -41 -18 -98 35 -114 241 -117 -130 66 144 199 -34 -74 -129 -41 9 -191 -13 60 47 66
7246 66 88 -190 -47 -122 129 -61 217 -23 33 52 122 167 216 39 24 69 204 87 88 -241 -22 -102 -63 -41 48
7271 48 340 -135 -65 212 78 -8 -2 -58 214 -45 55 -49 68 -240 184 -4 42 -61 -34 285 -7 29 7
7294 7 -150 -141 62 -17 46 -77 51 138 61 76 -159 366 198 -36 113 -1 -221 92 -79 132 69 39 -57 -57 81
7319 81 -128 -131 41 -33 165 -161 -79 -202 -11 74 64 -92 23 168 43 -78 76 -95 -90 -27 136 -123 -80 63
7343 63 -136 -163 24 62 -53 85 123 0 177 64 -101 34 217 -31 -166 -22 54 -21 4 37 -48 -90 195
7366 195 92 -58 -42 -300 68 7 -41 -217 -70 -173 154 17 -155 -37 254 -61 166 -18 -7 -30 78 -11
7388 -11 -85 39 -295 -136 120 -49 259 80 -70 158 76 54 -141 79 -28 -103 -84 -174 128 -16 111 -195
7410 -195 -22 307 -3 28 120 23 -221 -44 1 234 76 261 -209 160 -32 6 -191 -69 -57 -133 -33 -129 -76
7433 -76 106 -65 284 203 -94 148 68 -18 60 -84 -51 209 53 16 110 193 -6 -108 131 50 -4 221 -99 -30
7457 -30 206 27 5 24 28 -205 143 -69 -20 95 380 117 493 2 -201 126 -57 -17 140 98 -52 0 -100
7480 -100 -4 59 155 126 -12 94 147 218 -213 40 -185 305 0 -80 2 87 172 31 106 -136 96 -135 -58 -276
7504 -276 20 13 44 -1 213 160 102 99 -115 163 -37 -148 107 17 -230 -105 218 20 -184 54 -34 -221 -164 79
7528 79 -286 -24 -27 -141 43 125 -3 -157 -133 -121 -8 -61 -70 116 48 195 -90 -113 -31 112 43 11 47 82 -155
7553 -155 150 104 -100 46 39 87 26 22 -43 -89 36 -210 -188 109 -65 127 118 92 -101 -92 184 -128 126 -54 -115
7578 -115 121 -55 -318 162 -28 104 -123 -54 -36 -143 107 -106 -108 183 10 67 64 195 -160 -3 -119 68
7600 68 -127 -191 -31 -6 258 -2 -18 -166 -45 -55 82 -67 36 -33 -150 -55 -142 25 -50 20 99 44 -170 -198
7624 -198 -227 171 211 45 61 187 -69 -77 -56 -108 85 -83 65 -78 251 -164 -107 -2 -27 -5 166 -37 -224
7647 -224 -369 -67 79 15 45 -149 168 39 -2 44 -39 -193 99 201 53 99 118 21 -52 -85 77 -78 170
7670 170 -125 -134 256 -58 -113 23 -139 -147 218 -4 70 -7 -107 62 -80 69 -117 3 35 -1 -24 111 -2
7693 -2 -92 -27 137 -255 141 -59 -36 34 -134 -96 -70 -183 -238 -30 211 186 -62 -65 83 -224 -1 113 232 27
7717 27 -51 91 104 -24 17 -40 -58 -2 -62 -123 74 -2 5 117 168 99 -101 -7 156 -155 201 44 -181 234 -228
7742 -228 1 -138 6 -58 154 -9 193 -169 101 55 -173 150 71 -71 66 -28 61 243 -228 124 -6 9
7764 9 100 166 97 20 -62 -33 83 -11 312 -117 140 -113 -159 -251 -90 -21 14 75 52 28 90 185 -150 -85 -115 -13 152
7791 152 -113 -300 -158 -215 -94 -169 -16 -149 -114 15 158 155 72 -187 -22 163 -241 26 -60 -17 112 -263 -91
7814 -91 -122 -95 82 72 165 45 -53 -68 71 78 184 -18 180 41 -263 32 33 48 39 200 88 -254 -116 -115 -276
7839 -276 46 213 119 193 86 -149 -67 -72 31 31 189 -21 45 227 194 -5 112 69 100 -7 66 6 -56 -42 5
7864 5 278 132 -277 -68 -37 -34 -28 -69 -102 -145 184 88 170 -166 -124 -83 -210 30 -65 78 142 103 -343 -202 90 26
7890 26 49 46 -140 44 -178 -147 -137 -2 -27 -77 -82 -16 76 -363 56 -6 -147 -147 11 -146 111 211 181 238 12 102
7916 102 37 77 48 -121 -106 173 150 -55 125 36 -39 259 11 78 -38 -130 -171 -52 -192 -363 123 46 7 -47
7940 -47 -44 71 -132 -86 -51 135 -35 4 -102 52 -46 -70 80 -56 202 -8 -46 -3 -63 179 -135 153 -193 102
7964 102 -37 14 -188 204 -53 -74 -109 302 -112 262 26 -25 -117 140 -11 94 13 144 -92 37 -48 -225
7986 -225 426 141 -154 86 -38 -62 87 -83 -31 197 75 -112 3 49 6 -166 -29 137 206 197 -98 9
8008 9 66 -240 -24 -294 -197 166 -71 130 47 29 121 101 8 15 -143 308 67 -143 -66 51 -103 0 65 160 -146
8033 -146 -69 196 105 -16 -91 -78 235 2 -155 84 -143 73 8 -25 -106 -138 -110 67 -209 -79 35 -1 152
8056 152 78 57 137 -41 -222 -151 73 18 129 -122 -138 127 -118 111 15 -163 -66 138 144 2 77 223 -130 33
8080 33 141 -11 47 -59 20 127 12 -222 32 -104 -297 -109 -275 -100 -349 -122 -218 6 46 73 -347 263
8102 263 199 14 12 16 -27 104 -24 -346 30 -9 -146 -3 189 29 42 31 54 70 -73 -284 -31 43 -54 177
8126 177 276 -123 -284 -1 -17 4 116 -1 12 114 -4 -237 -18 52 -205 174 138 -212 -67 195 206 69
8148 69 118 1 38 9 57 60 63 -193 87 -30 32 -126 87 -1 -12 26 95 177 227 -20 -146 213 -284 34 332
8173 332 -139 -91 -39 36 19 1 110 -102 58 274 -65 -3 307 174 162 -81 46 -163
8191a63
$$ Imaginary data points
##PAGE= N=2
##DATA TABLE= (X++(I..I)), XYDATA
0 0 0 0 0 0 0 0 -8 8 -8 8 -16 16 -17 24 -32 40 -48 64 -80 96 -112 136 -160 185 -217 256 -296 341 -393 451
30 451 -515 586 -664 751 -847 952 -1071 1199 -1337 1490 -1659 1842 -2040 2257 -2494 2756
46 2756 -3040 3348 -3692 4064 -4475 4931 -5437 5999 -6630 7345 -8158 9095 -10186 11475
60 11475 -13031 14947 -17367 20540 -24888 31230 -41356 60026 -105600 440510 389872 -549417
72 -549417 71601 103978 278541 -23376 -277779 232562 210328 -149534 -168565 75997 299922
83 299922 -92682 -202481 -14806 181326 110988 -204433 -51432 148172 98605 -69521
93 -69521 -192055 185585 177176 -111144 -105610 33605 200219 -30647 -147029 62258 132931
104 132931 48790 -280015 33203 332220 -168406 -107188 20048 -12927 150390 -101463
114 -101463 -73218 75333 7425 -17428 -109559 117061 119743 -145687 -63583 48552 134506
125 134506 -5700 -115547 28885 66085 62883 -131475 14136 206293 -147579 -18540
135 -18540 59505 -28484 153920 -121744 -50863 181587 -59070 -28121 26465 57223 48830
146 48830 -67467 33997 5470 30790 77252 -61633 -10487 32844 42377 -37038 -49853 129949
158 129949 -34627 -119696 34322 44796 34074 -64236 -73785 36994 57048 -55544 -74051
169 -74051 124671 -30113 -110916 89718 -38627 58810 29525 -159423 116785 29881 -74519
180 -74519 56116 -35814 28383 -8107 -39450 26932 -32429 53594 -28447 -90805 53995 16892
192 16892 -28773 -54407 35607 40928 -103997 22195 29404 1196 31604 -83656 24388 58120
204 58120 -21015 12202 -7024 25561 -10557 -10142 36743 -10927 37225 -36094 -48019 62164
216 62164 -7630 1511 -29097 -27969 41591 -35389 -423 -8763 752 37476 -91159 9376
228 9376 85290 -45277 -34371 31771 25269 -43177 17753 33157 -37242 49876 -36552 -26101
240 -26101 71803 -54905 32060 2141 -66779 61697 -32614 -5526 24442 -44489 34350 -39838
252 -39838 -18668 58641 -19253 -11079 -22225 19228 24579 -23814 24481 -12049 19674 -3402
264 -3402 -45292 84629 -5104 -62358 44981 -516 -25206 16780 14250 -32860 -4118 20846
276 20846 -42169 18297 7742 -27056 22868 -45844 17183 29619 -40412 31495 -19252 6911
288 6911 19435 -44317 58281 6702 -37295 22564 -6671 20993 1147 -5193 8300 -12533
300 -12533 14000 -24158 27270 21168 -60517 36693 -2948 -24544 40543 -11924 451 -16524
312 -16524 13752 32931 -43258 35176 19407 -37441 21375 2091 16834 2531 -14084 9841
324 9841 -7269 18435 -23118 4393 35658 -58004 11050 20301 -32909 23599 -9417 -18252 6861
337 6861 -6039 -1455 4776 8731 -27606 8174 14851 -33556 34257 -422 -26444 7240 -15429
350 -15429 34561 -26724 -21807 49423 -53794 -6099 32102 -28161 10244 -13685 -10246 6372
362 6372 -3083 7585 -14938 23333 -13590 -17644 51900 -26731 7082 32816 -31117 20764 7277
375 7277 4102 16146 -13966 11445 -3960 3507 5703 -12002 20210 -19630 -18703 17024 554
388 554 -9040 -18122 21626 -16302 -28204 43400 -18458 -12596 19612 -21035 11217 4897 232
401 232 6713 -8016 4536 -9041 17839 425 -23465 24974 -20270 -11737 13326 -12598 6523
414 6523 -29021 768 7417 -33466 21671 -15364 -15299 17589 -35396 14698 17329 -25943 7638
427 7638 9122 -1813 -11999 26394 13640 -30802 30934 635 -12494 30062 -10289 8103
439 8103 1778 -12068 17149 -2821 3445 -5212 -4636 10847 -18200 8414 10818 -12069 -5133 -711
453 -711 13769 -14971 7118 15021 -26088 19585 -2665 -10046 30234 -19761 -2753 16101 -11758
466 -11758 -77 6796 8750 -22357 280 20372 -28952 11128 7136 -19900 6618 -13719 8872
479 8872 -74 -12369 11605 -18664 8892 1669 -16851 27473 -15732 -13854 20918 -8075 -1187
492 -1187 3945 5630 -10506 -4556 18200 -15360 9007 4006 -19113 19229 -7839 -4796 16852
505 16852 -6370 -4000 -2432 13925 -1343 -12076 22331 -7297 -10043 12167 1719 2678 -6796
518 -6796 8015 -5725 -6065 16851 -18340 10144 4792 -29751 22636 -1278 -17719 14006 -5258
531 -5258 -6515 -5346 9386 1269 -12851 13763 -11867 -55 12107 -14854 13925 -3028 -10719
544 -10719 7540 -2878 8277 -12399 2010 11454 -26551 11527 9354 -19504 6121 -1708 -5947
557 -5947 -2665 4618 -895 -9035 10665 -13673 1432 16900 -19518 9108 7404 -13534 6437
570 6437 4810 4305 -7890 2179 8521 -13489 9452 2244 -7776 5799 -9673 2559 894
583 894 -814 -1323 -8665 13445 -15530 -3062 24527 -23697 1404 14035 -15161 6895 3338
596 3338 738 -1820 -1962 6458 -6945 10698 -2463 -9212 15858 -12795 -1793 11520 -6058
609 -6058 -1649 -5592 8337 -4536 -8569 16542 -11281 -4908 9964 -9411 6042 2603 -4873
622 -4873 1057 3104 -127 -6200 16493 -5875 -12899 20331 -8883 -4924 12439 -5938 -1077 -3249
636 -3249 3093 188 -5196 7022 -10458 1851 4465 -12090 10892 -1341 -7732 2167 1959 3169
650 3169 -9451 11832 896 -16887 18197 -3652 -7139 14103 -9849 1026 4181 -4565 2231
663 2231 735 1486 -10834 5176 6000 -15350 10630 1159 -10763 4666 105 2807 -5008 2560
677 2560 3504 -9961 9696 -1300 -4852 10756 -9737 -369 8095 -4257 -2655 3625 3558 -14041
691 -14041 5925 8285 -16602 8460 -206 -10704 7088 -4500 -272 1082 -3688 -756 -3520
704 -3520 7907 -6473 -3245 11826 -12580 473 8337 -4984 -641 -1500 4426 -7534 -320 9065
718 9065 -12740 4849 678 -12134 10868 -4324 -7128 6519 -3634 -4988 -586 7491 -6904
731 -6904 -4710 10753 -9827 -162 6960 -5469 1813 -1815 318 -875 437 3498 -8323 5741
745 5741 -168 -11183 11600 -2860 -9092 5186 -1024 -4496 -2481 7365 -6527 -5363 9489 -10358
759 -10358 3010 6369 -10740 6945 -314 -5910 4710 1583 -26 -5905 6072 1828 -9800
772 -9800 10753 -1387 -6525 4715 -1838 760 -1483 2178 -1949 -3870 7309 -7977 2624 8821
786 8821 -13336 5333 6222 -8578 3994 4391 -1487 -4469 5567 1743 -6413 9061 -3315 -3280
800 -3280 6992 -5432 1952 3991 -2300 -1841 869 5213 -7020 2447 8136 -10672 4141 5608
814 5608 -5080 3478 1515 917 -2244 4202 1832 -4439 10102 -5202 -3303 12237 -7480 791
828 791 7954 -4595 -392 1833 4525 -3291 137 7531 -7482 3605 5043 -4767 5874 320
842 320 -1578 2620 3776 25 -1687 9554 -3571 -3976 13175 -4881 -1453 8871 -3828 77
856 77 2935 2070 -1745 1728 2950 -6281 6858 712 -6981 8651 -2191 -4269 4618 1674 -608
871 -608 -1910 6224 -1175 -4497 10121 -2970 -1413 6212 -3855 2055 2742 103 -1077 2524 2367
886 2367 -7679 7601 2279 -9966 8882 -568 -6427 6132 -246 -872 -343 1933 -408 -2137
900 -2137 6437 -4300 511 6324 -6815 3316 5038 -3628 -320 3600 1076 -5183 5682 2796
914 2796 -7925 6047 314 -4963 5407 -1648 -1877 1401 185 -2363 111 5170 -7032 1091
928 1091 6108 -8314 3343 4188 -4242 570 1062 1273 -2737 2053 2409 -6286 5170 -910 -4986
943 -4986 7207 -3749 -3354 3711 -629 -3827 1111 4699 -7076 -9 6188 -7659 2590 3724
957 3724 -5845 2630 363 -1623 859 1396 -280 -3330 5377 -2100 -4058 7284 -3986 -3501 3936
972 3936 -1236 -2453 -84 2261 -4157 -1241 4245 -5866 2087 2564 -6875 3750 997 -4011 1618
987 1618 2550 -2355 -3515 6447 -2587 -4408 7354 -3841 -2359 4399 -2426 -133 819 5 -1982
1002 -1982 333 3078 -5182 3184 2835 -7789 4985 1970 -4653 2243 2124 -1588 -1830 4608 -955
1017 -955 -2856 5674 -3229 -917 5562 -4336 810 2979 -2647 -1233 2204 1570 -5412 3041 2352 -6984
1033 -6984 4052 1298 -4205 1895 231 -1563 -704 2822 -1825 -2367 4955 -4249 -1192 6430 -5608
1048 -5608 -275 4128 -3495 -1319 2394 984 -4523 2641 1382 -5618 4578 -500 -3970 4218 -1650
1063 -1650 -1960 2806 796 -1652 -385 4650 -3681 -617 6982 -4469 233 4663 -2339 659 2850
1078 2850 581 -1807 2625 1405 -3538 4911 -202 -4642 5457 -1413 -3458 3386 111 -3015 -277
1093 -277 2999 -3740 -457 4524 -5139 711 2644 -3906 1453 1306 -1956 -874 2204 -516 -3747
1108 -3747 4667 -883 -5598 5758 -1870 -3614 3682 -1323 -2427 242 1060 -3075 -129 2423 -5085
1123 -5085 1198 2314 -5270 2314 1606 -3593 278 2202 -610 -2364 3797 -116 -3628 5298 -1001
1138 -1001 -1796 4410 -1464 -905 2687 1146 -1890 1984 2661 -4773 2795 3796 -5733 2924 2276 -4173
1154 -4173 1159 1395 -1469 -1284 2081 -1403 -2503 4327 -2883 -1822 3909 -3446 -1479 2435 -972
1169 -972 -1989 1271 1469 -4254 1307 3261 -5313 2384 1325 -4140 2329 312 -2153 362 1549
1184 1549 -2305 -1541 3697 -3689 -2080 4296 -3848 -1571 3207 -1983 -1372 1028 668 -2740 1473 2074
1200 2074 -3893 3003 737 -3598 3920 717 -2305 2357 2154 -1870 153 4501 -2478 -1033 4909
1215 4909 -3075 -303 3566 -2684 286 1544 -885 -1184 1767 176 -3952 3246 -145 -4391 3784
1230 3784 -40 -2950 1591 823 -1981 -75 3054 -2035 -1095 3745 -3231 308 3258 -3566 666
1245 666 2205 -1979 -812 2515 -422 -3273 3187 116 -4266 3537 -449 -3164 2237 -497 -1427
1260 -1427 1002 821 -2019 219 2934 -3602 1150 3261 -4051 1213 2658 -1945 -288 2407 -238
1275 -238 -2067 2726 -105 -3092 3818 -1379 -2822 3370 -1691 -1565 2050 -127 -2240 872 2048
1290 2048 -3705 916 3119 -3977 1219 2161 -2727 487 1351 -1171 -648 2082 -614 -2010 3707 -1733
1306 -1733 -2526 4073 -2000 -1890 2869 -534 -2090 1283 1640 -3024 835 2149 -3505 1748 1454 -2823
1322 -2823 1920 805 -1710 604 1559 -989 -1557 3547 -1914 -2267 3760 -1949 -1579 2453 -1094 -1418
1338 -1418 1173 315 -2638 1005 1180 -3662 1838 1095 -4104 2339 738 -2962 604 1679 -1517 -1217
1354 -1217 2438 -1735 -1661 3389 -2090 -782 2852 -2125 -398 1505 -626 -1316 1733 666 -3180 2335
1370 2335 1602 -3863 2657 900 -2524 1660 1473 -994 131 2610 -1503 -488 3081 -2403 -376
1385 -376 2899 -2545 65 2382 -1374 -1027 1897 313 -2647 2025 693 -3410 2488 -10 -2439
1400 -2439 1999 -42 -1690 780 1130 -2196 -78 2626 -2933 -484 3033 -3377 -278 2010 -2155
1415 -2155 -552 1077 -551 -1955 1532 -329 -2678 2557 -713 -2714 2667 -819 -2315 1398 395
1430 395 -1924 518 2558 -2387 13 3055 -2644 604 2448 -1735 652 1817 -875 -644 2219
1445 2219 -479 -1640 2961 -594 -1989 3053 -683 -1715 2015 -41 -1495 636 1267 -1964 330
1460 330 1767 -2927 912 1679 -2855 829 1551 -1739 -331 2147 -1124 -2044 2414 -812 -2309 3076
1476 3076 -1406 -2084 1809 -975 -1487 520 23 -2349 116 931 -3269 903 1185 -3400 1037 960 -2395
1493 -2395 -36 1127 -1190 -1014 2056 -909 -1238 2768 -1259 -700 3021 -1211 -963 2254 13 -1497
1509 -1497 1820 989 -2633 1615 1637 -2982 1505 1379 -2372 806 730 -1296 -191 1664 -1089 -1269 2344
1526 2344 -1727 -954 2366 -1660 -924 1839 -751 -1254 1318 344 -1576 1488 595 -2396 2036 595
1542 595 -2391 1805 145 -2025 726 1005 -2140 -533 2358 -2215 -1010 2423 -2309 -1080 2260
1557 2260 -1327 -771 1316 -187 -1322 1458 580 -2271 2195 487 -2031 2214 607 -1599 1525
1572 1525 1083 -1239 418 1873 -1313 201 2243 -1850 427 1901 -2008 654 1655 -931 -875 1922
1588 1922 -409 -2084 2547 -93 -2063 2160 90 -1926 1701 537 -1349 465 1358 -1254 112
1603 112 1957 -1761 459 1926 -1873 559 1494 -1074 -21 1479 -378 -1212 1668 -443 -1479 2052
1619 2052 -463 -1306 2035 -410 -1205 1678 466 -1604 920 1673 -2509 1022 2202 -2253 638 1869
1635 1869 -1545 74 1872 -516 -760 1875 -859 -1283 2185 -502 -1292 2338 -915 -1214 1512 -53
1651 -53 -1044 691 913 -1693 1000 1228 -1809 1332 812 -1916 1099 848 -1505 47 1774 -1354 -545
1668 -545 2719 -1458 -1348 2637 -1001 -1380 1740 31 -1301 917 679 -1675 865 1116 -1802 1042
1684 1042 871 -1656 1153 843 -1506 473 1110 -939 -508 1639 -1280 -679 2019 -1345 -440 1666
1700 1666 -1185 -528 1374 -779 -1484 1669 -30 -2369 1508 485 -2547 1509 591 -1990 869 890
1716 890 -1511 -441 1632 -1491 -410 1756 -1427 -711 1627 -1191 -591 1273 -562 -467 1062 100
1732 100 -1523 1348 6 -1854 1820 -204 -1329 1397 151 -1334 1096 1117 -1673 534 1715 -1815
1748 -1815 -158 2364 -1719 18 1951 -1033 -718 1655 11 -1771 1731 275 -2048 1519 301
1763 301 -1511 1139 117 -1343 715 600 -1153 134 1124 -1452 98 1173 -1705 373 800 -1403
1779 -1403 232 1092 -1061 -515 1614 -1023 -1205 2020 -682 -1629 1978 -292 -1657 1339 452 -1515
1795 -1515 846 1528 -1600 138 1682 -1565 537 1193 -1209 172 1253 -705 -257 1357 -387 -634
1811 -634 1568 -764 -748 1819 -741 -532 1593 -564 -927 924 127 -1354 1183 745 -1994 1377 1004
1828 1004 -1969 893 1250 -1614 96 1545 -967 -847 2053 -723 -1316 2122 -731 -1076 1346 -580
1844 -580 -934 811 53 -1307 786 72 -1306 966 555 -1635 934 504 -1260 794 921 -845 290
1861 290 1288 -1303 -134 1685 -1307 -637 1870 -1176 -628 1642 -366 -1294 1452 260 -1715 1013
1877 1013 767 -1912 852 609 -1412 792 220 -802 131 691 -1136 -195 1434 -1183 28 1132
1893 1132 -1177 -187 1063 -960 -722 836 -710 -672 1405 195 -1344 1775 -37 -1702 1246 359
1909 359 -1721 940 933 -1931 342 1440 -1685 -186 1420 -971 -168 1461 -894 -366 1229 -387
1925 -387 -635 1180 -210 -1351 1224 -117 -1120 1263 -110 -1153 994 156 -1244 642 650 -1292
1941 -1292 812 1123 -1391 690 1442 -1510 246 1257 -1107 -261 1585 -720 -1039 1995 -217 -1411
1957 -1411 1443 76 -1460 1292 257 -1198 742 325 -930 324 941 -1376 305 1045 -1249 482
1973 482 567 -918 111 730 -778 -129 1109 -660 -623 1403 -750 -781 1594 -685 -1198 1337 5
1990 5 -1293 965 783 -1723 765 1072 -1320 665 1099 -1151 276 996 -808 -321 812 -811 -692
2007 -692 1592 -681 -572 1317 -701 -643 1025 -69 -964 855 203 -1117 884 211 -1195 1198 515
2024 515 -1405 977 793 -1072 622 1025 -1270 -203 1411 -1292 -709 1713 -978 -770 1367 -434
2040 -434 -823 1018 92 -1100 1127 -81 -1131 1140 173 -1330 843 184 -1190 313 631 -751
2056 -751 63 849 -1310 24 1227 -1302 -71 1385 -1027 -201 1487 -663 -523 1227 -111 -1380
2072 -1380 1242 180 -1205 1265 440 -1156 736 526 -1099 222 697 -1408 215 893 -985 -37
2088 -37 966 -964 -38 964 -682 -257 1104 -451 -838 1244 -341 -875 1226 -84 -919 934 -13
2105 -13 -1060 757 392 -1431 223 917 -1420 424 1308 -1367 -6 907 -842 -41 872 -794 -538
2122 -538 1238 -302 -911 1172 -465 -834 1183 -119 -783 863 178 -908 357 497 -1150 579
2138 579 721 -1143 778 569 -1117 346 671 -964 -78 1301 -1086 -342 1026 -775 -698 1213 -474
2155 -474 -1025 1101 -71 -943 758 371 -1076 604 764 -1437 812 679 -820 526 614 -1123 68
2172 68 795 -859 -104 1185 -968 -677 1253 -801 -669 1116 -777 -491 1105 -262 -1060 899 321
2189 321 -1263 1000 295 -1135 631 406 -1258 266 893 -859 -26 1069 -689 -445 1214 -719
2205 -719 -134 946 -770 -381 881 -274 -583 1233 -153 -827 770 121 -1060 683 398 -1367 714
2222 714 311 -1075 383 679 -1058 8 1139 -1274 -315 996 -1007 -202 1052 -687 -687 833 -552
2239 -552 -740 647 133 -808 931 149 -831 834 48 -921 668 482 -1126 315 906 -1176 109
2256 109 973 -995 56 869 -818 -114 910 -750 -219 1143 -351 -896 1173 -160 -917 1177 -1
2273 -1 -937 836 464 -1146 370 868 -1042 223 591 -1184 251 1001 -938 -44 907 -844 -340 805
2291 805 -727 -599 979 -373 -627 845 -187 -673 829 -28 -807 586 410 -817 509 391 -1073
2308 -1073 514 458 -1104 452 544 -1064 68 980 -727 -273 1103 -747 -618 1079 -522 -702 976
2325 976 -192 -654 867 13 -688 680 251 -1237 786 391 -1028 465 338 -852 37 1084 -878
2342 -878 144 964 -1147 -254 1014 -620 -306 1178 -859 -484 1036 -61 -705 862 -88 -869 859
2359 859 395 -981 1002 312 -1039 452 620 -1005 234 843 -749 134 975 -804 -62 1180 -687
2376 -687 -70 1135 -241 -566 850 -243 -826 1141 28 -634 800 130 -884 862 444 -949 498
2393 498 570 -944 320 900 -850 228 786 -931 75 922 -546 -285 910 -285 -727 668 -267
2410 -267 -939 852 99 -667 736 139 -720 405 252 -759 296 512 -1014 289 834 -890 339
2427 339 920 -643 -54 853 -362 -303 1080 -285 -818 1019 -442 -636 1000 54 -766 516 323 -749
2445 -749 782 334 -962 396 624 -923 282 596 -820 172 803 -874 -14 707 -322 -266 833
2462 833 -167 -469 977 -356 -371 730 -209 -727 744 -140 -664 616 304 -915 409 426 -971 287
2480 287 391 -879 345 557 -683 -167 729 -595 -150 864 -491 -315 795 -291 -722 683 -225
2497 -225 -503 544 78 -803 701 147 -937 570 378 -782 492 307 -850 253 657 -559 -124
2514 -124 625 -609 -82 739 -207 -619 693 -398 -579 843 -131 -671 724 12 -988 500 321 -867
2532 -867 629 486 -683 142 571 -679 16 777 -712 17 941 -829 -243 667 -709 -642 795 -265
2550 -265 -217 477 -370 -678 583 -86 -810 954 295 -942 349 352 -540 166 321 -432 98 702 -686
2569 -686 173 305 -739 -42 863 -519 -255 768 -103 -406 863 -314 -858 647 -63 -480 547 184
2587 184 -699 168 401 -752 403 481 -902 115 635 -639 -287 818 -631 53 524 -286 -347 781
2605 781 -258 -503 768 -10 -579 583 -53 -357 680 508 -676 479 324 -706 376 593 -715
2622 -715 130 371 -673 63 408 -743 -207 856 -295 -204 777 -333 -612 743 -187 -420 320 -124
2640 -124 -548 552 38 -659 453 284 -826 200 206 -721 228 486 -657 -184 663 -642 -14 748 -874
2659 -874 -189 742 -433 -281 625 -268 -329 614 74 -835 418 350 -882 539 250 -698 234 330 -817
2678 -817 32 682 -807 212 677 -491 -187 826 -542 -189 881 -439 -289 609 -338 -734 680
2695 680 -71 -528 589 -152 -638 565 43 -583 289 568 -841 278 475 -618 85 680 -758 -256
2713 -256 836 -614 -298 687 -354 -434 695 -100 -368 574 176 -562 699 -36 -476 516 -18 -511 315
2732 315 214 -540 224 566 -697 -42 605 -476 64 562 -496 -33 785 -117 -576 534 -254 -506 591
2751 591 -194 -772 472 -35 -401 288 133 -405 468 351 -531 274 690 -659 104 699 -474 -196 663
2770 663 -381 -308 533 -453 -481 918 -180 -411 704 -181 -513 376 123 -677 436 62 -982 542
2788 542 239 -637 231 531 -656 115 469 -411 -77 531 -507 -137 569 -2 -376 453 -205 -188 668 -42
2808 -42 -656 539 83 -546 426 104 -671 348 477 -521 75 304 -377 114 534 -319 63 531 -300 -298
2828 -298 783 -349 -241 527 -128 -404 516 -208 -394 731 -120 -775 211 -37 -586 489 477 -664 315
2847 315 307 -447 -47 603 -551 -317 694 -609 -231 438 -200 -79 474 -118 -213 366 -50 -473 493 267
2867 267 -513 413 144 -484 307 339 -753 490 227 -180 16 442 -473 115 445 -718 -201 585 -201
2886 -201 -287 691 -438 -355 571 -113 -461 612 30 -551 467 76 -468 551 298 -598 145 390 -612
2905 -612 50 73 -374 -161 544 -363 -58 683 -184 -364 384 -327 -342 463 -230 -372 747 360 -688 569
2925 569 -41 -570 309 341 -725 74 419 -926 239 625 -557 -135 529 -359 -53 436 -459 -189 417
2944 417 34 -244 498 -230 -415 365 91 -271 513 224 -741 252 295 -517 456 392 -472 37 647 -259 121
2965 121 588 -704 26 381 -341 -522 501 -306 -121 645 84 -419 277 -37 -628 386 -87 -644 255
2984 255 31 -662 285 546 -483 146 370 -354 -71 292 -521 -160 554 -373 -215 472 -448 -148 719 -72
3004 -72 -196 570 -53 -320 118 162 -656 210 92 -519 112 331 -479 271 575 -338 -58 442 -454 -16 450
3025 450 -242 -180 618 0 -166 266 -134 -308 539 38 -359 449 97 -555 495 145 -441 241 137 -526
3045 -526 261 380 -568 -60 310 -460 -155 549 -312 -274 225 -133 -308 754 -166 -584 373 -368 -589 635
3065 635 221 -337 72 185 -312 348 198 -566 -2 241 -463 -140 406 -639 -171 307 -556 -390 696
3084 696 -435 -306 589 -279 -625 491 35 -405 336 264 -243 181 129 -584 289 435 -397 391 458 -554
3104 -554 103 334 -261 -204 486 -237 -97 558 -94 -316 432 -129 -241 464 105 -562 635 56 -469 63
3124 63 291 -352 427 203 -496 73 133 -396 316 300 -264 -138 267 -243 -142 452 -170 -100 570 -265 -368
3145 -368 475 41 -386 280 -17 -222 316 161 -254 6 154 -195 224 347 -515 -69 190 -435 -255 335
3165 335 -267 -126 418 -100 -294 590 -15 -246 304 -27 -576 232 -128 -408 187 118 -404 448 133 -658
3185 -658 443 364 -306 75 227 -368 -9 258 -168 102 527 -375 -267 670 -252 -275 300 73 -91 212
3205 212 29 -455 314 305 -557 196 387 -524 32 572 -502 234 476 -369 -70 254 -322 -238 267 -254 -101
3226 -101 485 -49 -416 360 204 -297 408 86 -717 224 212 -344 215 82 -304 203 169 -529 -133 200 -460
3247 -460 -76 215 -408 -164 463 -335 -120 620 189 -262 492 132 -459 531 173 -473 313 327 -367 332
3267 332 256 -242 -57 273 -313 229 327 -53 16 238 -260 -259 299 -479 -269 112 -253 -360 444 -336 -536 333
3289 333 -143 -344 212 239 -487 296 265 -498 151 273 -419 155 233 -243 -120 315 -359 -26 577 -145 -112
3310 -112 519 159 -363 695 -59 -318 531 7 -403 181 -73 -546 130 264 -241 268 156 -283 255 415
3330 415 -386 -147 519 -248 -144 563 -338 -57 315 -501 129 258 97 -206 338 3 -277 501 -56 -108
3350 -108 456 115 -321 18 123 -373 -11 332 -241 -88 401 -425 36 8 -179 -21 440 3 32 375 -86
3371 -86 -274 227 17 -269 287 -3 -546 -88 44 -358 301 295 -394 39 200 -319 105 366 -284 -359 456
3392 456 -156 -175 313 -242 -325 451 -279 -346 320 31 -277 345 -28 -212 157 157 -331 229 293 -435 146 409
3414 409 -349 -81 61 -190 -84 365 -335 -322 250 -88 -252 499 8 -348 486 -95 -625 446 -54 -300
3434 -300 207 160 -505 170 165 -514 125 320 -518 -5 261 -96 -98 619 -388 -137 431 -72 -43 378 -281 72
3456 72 490 8 -382 208 49 -108 173 -93 -532 91 70 -467 163 217 -289 57 283 -474 -37 531 -342
3477 -342 -17 443 -182 -366 415 -104 -182 489 -188 -306 333 -4 -381 279 -113 -429 238 223 -311 25 161
3498 161 -374 255 225 -275 -129 389 -185 -202 373 -259 -192 381 187 -173 376 134 -434 277 221 -374 272
3519 272 -22 -598 104 143 -247 98 445 -345 19 287 -233 41 477 210 -121 150 -356 -268 347 -131 -117
3540 -117 237 117 -474 402 94 -188 447 -113 -464 259 72 -254 290 159 -245 -87 470 -354 142 289
3560 289 -95 -184 601 -172 -167 443 -6 -95 115 -123 -415 139 -167 -299 245 131 -547 166 46 -359 127
3581 127 145 -318 22 333 -16 35 319 -398 -113 184 -347 -171 198 -156 -388 459 -27 -229 479 -256 -19
3602 -19 383 62 -240 75 72 -289 397 156 -308 -1 62 -340 -17 186 -320 2 384 -200 -326 172 -200
3623 -200 -112 378 50 -345 240 252 -446 115 137 -391 439 239 -179 74 144 -188 62 266 -198 44 378
3644 378 -319 -132 287 -28 -210 146 -169 -280 299 13 -431 400 122 -38 430 -46 -668 92 93 -316 183
3665 183 81 -99 20 120 -391 -25 377 -150 23 286 -398 -228 488 35 -437 118 -163 -338 144 -5
3685 -5 -76 294 187 -273 142 108 -360 -35 118 -219 18 267 -389 58 510 -114 -44 450 -237 -165 340 -362
3707 -362 -243 64 70 -242 245 215 -99 78 85 -178 301 -37 -202 -136 294 -287 -35 223 -584 94 358 -142
3729 -142 -29 306 -389 -219 27 -191 -413 357 -62 -219 281 -139 -171 185 339 -220 177 156 -239 123 316
3750 316 -250 109 313 -289 -28 417 -75 118 294 67 -191 334 -138 -475 143 139 -113 382 -16 -247 347
3771 347 -76 -441 213 8 -318 260 210 -218 446 277 -398 -189 178 -283 -33 238 21 -119 329 63
3791 63 -374 257 -141 -359 361 -52 -97 241 126 -434 413 270 -232 -217 52 -265 46 139 -428 -51 164
3812 164 -288 -43 547 -59 182 391 -230 -170 349 -82 -421 533 48 -305 180 -126 -327 159 -9 -234
3832 -234 281 552 -314 59 342 -348 -96 204 -270 -62 343 -211 -83 200 -71 -88 257 -25 -250 189
3852 189 -102 -82 104 128 63 144 -54 -6 302 127 -340 258 153 -450 108 362 -307 -225 319 -198 -51 229
3874 229 -86 -343 448 266 -253 87 -89 -326 414 92 -220 44 17 -383 388 129 -342 80 374 -352
3894 -352 103 252 -372 -228 166 -388 -235 362 118 5 202 -169 -89 384 -223 -336 202 148 -333 354 172
3915 172 -263 5 284 -10 -36 343 -350 -87 83 -245 133 313 -173 170 285 -154 -350 88 13 -38 126
3936 126 178 -257 248 41 -365 -45 50 -164 144 187 -138 -91 106 -117 -83 140 -290 -207 251 -176 -52 226
3958 226 -190 -157 200 -248 -323 225 -7 -281 457 -37 39 280 126 -265 291 100 -188 198 139 -154 -115 193
3980 193 -302 34 109 -231 -93 414 -109 228 458 -194 -347 312 -92 -282 220 -143 -338 383 94 -285
4000 -285 335 279 -433 113 199 -11 73 226 -196 29 148 -129 -189 235 53 -139 249 -239 -368 178 -87
4021 -87 -346 494 53 -160 37 -36 -31 142 -37 -240 0 363 -220 -68 349 -482 53 294 -104 248 293 -236
4043 -236 -199 171 52 -183 183 -8 3 134 181 -438 304 -176 -516 271 -15 -206 207 248 -314 331 274 -220
4065 -220 109 111 -14 -122 370 -25 109 350 -139 10 45 -33 -144 -37 -53 -144 318 181 -67 297 65 -265
4087 -265 142 211 163 66 277 -341 77 182 -311 -52 285 29 -274 373 -202 -90 304 -121 -25 89 -94
4108 -94 -355 -18 -42 -255 256 -25 -145 263 51 -154 9 465 -190 -4 159 -119 -92 144 5 -420 324
4129 324 -256 -39 497 -17 -297 101 98 -135 250 299 -237 132 33 -309 188 16 -142 -7 113 -209 -48
4150 -48 19 -297 122 228 -239 -125 390 -19 -210 297 -132 -106 74 -142 -138 -16 -186 -250 353 -109 -155 313
4172 313 198 -137 -109 -53 -202 255 313 -271 -79 38 -84 -44 50 174 163 250 -151 141 177 113 -86 277 197
4195 197 -259 106 8 -421 -157 132 -106 53 77 -207 -58 235 -154 -144 278 -105 -332 -73 28 72 301
4216 301 -32 -41 372 13 -224 188 -38 -86 215 82 -191 100 -28 82 244 613 -65 -56 -27 -121 -103 53 -303
4239 -303 -187 358 -237 -216 147 -172 -49 33 -31 -252 307 -59 -266 46 27 -248 248 -47 -89 -83 83 -154
4261 -154 244 433 -262 -81 265 49 -58 194 -36 -124 198 42 -81 168 -41 -133 189 185 -276 166 199 -59
4283 -59 238 40 -307 204 70 -368 59 205 -98 153 265 -11 -203 360 -274 -132 23 49 -37 188 -43
4304 -43 -285 209 -42 -161 204 116 -174 -75 85 -310 -244 363 -246 62 146 178 -60 168 -361 135 161 -176
4326 -176 -247 122 -318 -433 44 92 -97 51 -45 149 219 69 -198 77 -24 -263 45 153 -198 -23 139
4347 139 -346 -103 97 -108 -204 101 92 -285 124 -140 -45 215 -258 -112 -1 -125 -292 49 89 -258 182 -36
4369 -36 -146 -163 192 -104 231 333 -205 279 279 212 -5 126 -130 -76 403 0 -2 94 -253 -67 68 170 -195
4392 -195 298 -30 -285 35 150 -160 162 215 -94 93 78 -145 -133 245 -274 27 287 -57 -125 218 -5
4413 -5 -203 198 -170 -128 168 -40 -164 336 118 -2 412 32 -241 6 1 -216 18 85 -79 72 6 -192
4435 -192 -246 94 -101 -357 151 187 -139 185 262 -242 113 -71 -58 137 240 -256 -41 44 -201 69 148 158
4457 158 -45 18 -171 42 190 -43 -27 21 -141 -67 48 -102 72 228 -231 -178 318 -15 22 284 108 -233
4479 -233 229 2 -88 -195 -33 -96 210 146 41 -150 230 -105 -39 207 141 -48 283 -242 -195 264 -160 -175
4501 -175 274 -117 -183 241 146 -183 -87 243 -76 178 215 -355 63 303 -342 10 258 -135 92 85 -163 -45
4523 -45 44 145 -55 181 -32 -255 153 -69 -203 101 -17 -166 90 152 -252 168 61 -391 -61 -185 -214
4544 -214 110 232 -421 -149 393 -162 -86 209 -17 101 151 -35 -275 167 138 -19 169 -69 -241 13 1
4565 1 -240 9 206 -341 30 13 -359 98 160 -105 54 68 -269 -4 160 33 -212 126 -13 -116 -63 53
4587 53 152 -18 252 -515 275 26 -85 208 80 -94 322 -42 -314 -7 155 88 -157 403 30 -6 10 -126
4609 -126 -60 343 -84 -124 46 7 -282 285 9 20 40 -95 -30 107 140 -138 -59 353 -283 -128 106 7 61
4632 61 375 2 -323 26 -77 -234 263 -111 -176 224 23 -513 288 15 -7 248 100 -19 -122 104 -342
4653 -342 -70 155 -193 -89 286 -191 45 313 -34 -58 255 160 -270 104 -206 -200 368 -10 -37 -179 -76 -147
4675 -147 -84 150 -192 -22 77 192 221 -106 -203 -6 -3 -53 129 403 -55 -160 130 -18 -35 113 268 136 80
4698 80 26 -187 265 162 -7 67 142 -170 42 -74 -203 21 61 -132 87 174 -157 -23 113 41 -85 51
4720 51 -108 -17 246 -73 -277 203 5 -293 -8 232 135 61 72 -181 -62 -40 -182 27 -43 181 -25 -112 -220
4743 -220 -57 159 -137 -82 26 92 -375 200 207 -57 267 121 -256 20 -46 -223 90 73 -252 255 -189 -260
4765 -260 311 230 -158 31 97 -214 -184 342 -64 38 266 160 -36 -44 139 34 252 247 5 19 257 32 136
4788 136 118 -370 448 78 -450 86 49 -115 -21 339 -18 -158 12 -146 147 -26 -279 -120 151 36 24
4809 24 106 138 -269 88 122 -299 329 -103 -353 -56 -47 -326 -37 255 0 -132 293 -185 83 111 95 -181 -45
4832 -45 209 -327 161 67 -223 143 -68 -135 126 -168 -99 -38 101 -292 31 -199 -296 40 -54 -5 -148 248 -192
4855 -192 -222 107 45 -111 28 182 36 122 -140 -356 198 -60 -4 6 82 -93 251 23 -53 142 33 -140
4877 -140 -250 151 -169 123 235 -194 -86 13 36 24 199 -167 -38 261 -279 -49 237 90 -130 -107 3
4898 3 -75 -91 71 13 18 110 -31 261 -83 78 36 220 27 21 472 65 -258 -34 260 -220 211 -118 -88 1
4922 1 386 -360 -176 111 -133 93 -40 -29 8 250 148 91 209 -144 59 5 -120 -246 123 -96 -144 345
4944 345 115 21 103 28 23 131 -90 50 53 -23 -120 158 -85 -53 -186 417 -122 239 164 -153 42 175 -123 -147
4968 -147 237 -176 -216 -64 -84 -6 -10 49 -147 -226 95 -209 364 -193 -204 123 -19 -247 224 69 -259 114 30
4991 30 -222 170 -80 -30 -93 100 -37 -9 93 -226 -96 175 -111 -244 55 -71 -80 284 -105 -311 212 17
5013 17 -104 143 -57 -182 104 -203 -76 21 40 -80 -129 266 -115 -376 -186 -167 -103 -12 106 197 262 -136 -93
5036 -93 -25 165 -132 235 139 -176 49 224 -317 268 175 -175 -216 102 -51 44 -64 -79 -148 -28 139 -4 218
5059 218 -59 108 232 -188 -98 49 208 -36 -126 -19 16 -38 220 -364 117 96 46 -19 282 -206 78 26 -229
5082 -229 204 77 114 37 154 114 -117 206 -44 -223 223 -68 -9 -166 102 -197 127 213 78 92 -65 -33
5104 -33 -96 104 -188 -32 193 74 7 236 -161 -113 241 128 21 225 14 -129 65 -42 77 10 91 -27
5126 -27 22 -54 -72 -54 -68 -225 547 35 -364 -27 -15 -144 -391 -16 -122 -52 274 129 -58 211 33 10 113
5149 113 -184 -87 26 51 -161 140 -161 86 33 217 -59 -84 208 -283 169 200 2 -184 94 -70 27 147
5171 147 -102 72 345 -76 128 112 8 108 186 234 93 142 148 -224 -84 86 -119 -96 -24 -208 -220 -22 2
5194 2 -82 194 -27 -171 -69 266 -212 272 -69 -13 86 -19 -74 68 -12 120 160 116 57 242 133 -319 -114
5217 -114 227 -213 71 95 -254 101 -8 -27 -17 60 -106 -43 169 19 -124 136 92 -91 15 -65 -121 18 -48
5240 -48 -62 85 63 62 45 128 -53 -137 219 289 35 317 -112 -2 278 -83 -56 -29 144 0 122 284 -17 144
5264 144 63 -312 83 226 -226 -186 266 3 70 191 -130 66 60 -89 178 254 23 55 -66 -32 -235 46 -136
5287 -136 29 98 286 -117 87 134 -130 88 -165 -77 134 178 -156 345 96 -34 159 -96 -63 -26 137 -84
5309 -84 66 87 -189 -8 -51 311 37 126 35 201 9 -8 -48 -17 167 -228 -50 -31 88 61 -150 8 43 192
5333 192 -231 96 132 99 -30 302 30 -39 143 -37 -148 -11 214 -186 176 -166 -284 143 236 -302 50
5354 50 151 -64 67 3 168 178 -96 37 194 -53 -15 -199 45 -160 133 340 98 54 -70 -58 -338 -126
5376 -126 -1 131 -47 -61 -143 -63 324 -104 -28 88 -87 39 279 -235 -52 -27 -165 -76 68 144 138 -222 -140
5399 -140 -106 -119 80 -291 -73 -26 -114 30 -318 -273 -86 54 -209 -56 128 -31 -83 93 60 -81 62 185
5421 185 179 122 56 -143 79 -112 -191 473 81 -24 96 -37 26 -60 -170 356 -32 62 -178 49 -147 -54 -31
5444 -31 45 74 0 250 -202 86 -61 20 -403 83 -13 -107 146 -39 48 13 193 -57 -58 -6 62 -53 -55 -20 51 140
5470 140 -19 -171 231 98 -133 221 -73 -75 172 -20 117 -273 -72 79 -17 -79 -110 148 295 -15 201 -17
5492 -17 49 -7 -14 -26 9 -76 10 123 -8 -317 2 -48 158 -168 251 -109 -2 230 -259 -66 170 203 -202 15
5516 15 45 81 58 -8 -239 130 34 19 64 18 -236 -118 127 -161 318 24 -148 -23 120 132 190 43 -223 -201
5540 -201 323 -86 -272 174 -182 -113 335 124 38 125 -99 -144 -55 60 -336 -24 335 -15 73 201 24 -90
5562 -90 198 71 -6 229 83 -136 -137 -37 -267 -4 129 60 155 87 -95 -162 138 -130 49 -80 -263 -109 -60
5585 -60 -182 106 -3 42 -211 196 87 22 137 -124 30 -78 -60 -12 94 117 -200 214 -24 131 -39 126
5607 126 103 -46 -156 -225 78 -17 44 61 138 -35 310 258 15 90 301 -255 -166 198 -76 148 107 -155 -22
5630 -22 49 89 -222 56 113 -53 117 -137 -74 239 48 -64 276 57 -128 313 79 92 2 -95 7 -147 181
5653 181 -168 -267 -136 67 -68 279 240 -70 -33 -93 -123 134 85 -125 -6 208 147 -240 194 35 5 248 163
5676 163 -147 -1 82 -59 276 119 -59 2 276 5 123 146 -180 7 40 -27 25 -111 -47 -67 68 -148 -58
5699 -58 113 -163 69 38 117 29 116 -95 -145 120 4 -57 92 9 -96 97 67 -37 -148 38 -35 108 161 -40
5723 -40 -220 87 13 32 45 -279 214 105 -54 -275 97 -83 -179 17 71 -113 172 -76 -65 147 72 -106 -212
5746 -212 -26 69 -57 -117 -15 81 84 -135 -32 -33 -124 -36 -17 -106 -60 180 -186 -248 176 -190 -30 64 -27 -215 -78
5771 -78 -85 -254 102 -98 -88 176 64 -82 -199 72 12 -94 185 18 -196 66 229 -34 56 289 -121 186
5793 186 -102 147 -8 -150 19 -94 18 -325 119 -39 140 30 -121 13 -51 -147 -270 -358 55 21 -40 17
5815 17 -100 -49 79 -43 -52 32 95 -244 26 115 -265 137 157 -156 -17 45 18 109 79 -75 51 112 -37 -225
5839 -225 138 -81 16 71 150 -125 86 -34 51 66 -20 94 10 65 -144 -87 18 -138 -59 -170 -76 34 5 -53
5863 -53 37 -2 -165 147 268 194 106 219 -120 106 421 -43 -58 -89 181 6 126 -48 -210 75 53 -195 -31
5886 -31 87 -190 -63 258 -247 -40 64 10 162 5 -97 -156 238 -102 211 55 -29 32 -81 -129 -289 -21
5908 -21 -27 -16 193 21 -100 64 44 -13 -198 106 -5 154 12 46 -55 143 -181 47 193 54 -172 102
5930 102 -78 -2 -68 -78 17 -112 -69 -150 196 101 1 89 -45 -97 -113 -185 -111 -105 -69 -278 -27 1 119 25 339 -107
5956 -107 46 -129 -233 54 205 -11 -45 150 127 -57 51 -279 -226 39 127 293 52 69 -114 144 226 305
5978 305 -40 105 32 -99 137 203 101 154 266 41 -200 -103 -210 101 17 -68 45 -28 -33 112 54 -143 92
6001 92 168 -26 82 -18 -22 -51 -3 35 -11 289 100 -196 110 -23 137 -38 -9 -193 -46 -45 -231 -105 334 -182
6025 -182 -36 -62 -173 -202 182 19 -5 30 -91 -97 -129 -92 -16 28 -209 -222 89 69 20 69 143 -46 55 230 -258
6050 -258 152 22 38 18 94 -38 33 156 -79 64 128 70 -88 -3 -125 172 102 -13 14 76 51 -134 32 -153
6074 -153 102 23 -235 145 49 -75 -242 -19 56 -147 80 -2 115 29 -10 -170 -7 138 212 -58 -79 -40 7
6097 7 299 -191 -142 29 12 -84 361 252 37 -30 92 172 124 16 79 -9 -68 107 -263 112 -215 55 -190 -90
6121 -90 -111 53 -72 -73 1 87 -329 -44 176 -303 -52 -21 -120 -53 -261 124 75 140 -182 71 -92 -16 93 213
6145 213 144 27 139 -251 130 -45 46 22 -144 199 -30 166 193 22 -49 -302 -19 -68 -55 -181 116 66 -24
6168 -24 180 75 -222 181 -110 31 41 10 251 15 242 -145 -20 253 56 -136 264 79 24 -148 -43
6189 -43 -157 133 -62 -100 -106 37 -125 -32 -52 -196 32 -260 -246 1 -74 96 -73 -182 143 50 5 -324 215
6212 215 168 19 -234 73 -19 -254 213 213 141 233 46 35 -39 93 -46 16 138 9 91 44 -198 -89 0 53
6236 53 51 27 28 39 147 214 -270 -128 -32 -67 127 56 -222 174 153 -249 144 -17 -56 76 80 -361 -129 -60 -118 74
6262 74 193 29 -82 -176 -148 -95 -224 -44 112 185 12 39 202 -120 -26 92 134 -95 290 176 -83 -6 138
6285 138 -14 -214 -37 -3 18 142 -17 -173 236 24 44 -53 -111 71 136 -11 56 -78 102 -195 61 230
6307 230 -59 10 194 -314 -169 176 -233 -24 135 -132 2 168 18 120 164 -180 84 301 -88 208 192
6328 192 35 -41 -172 -82 108 155 -107 140 -51 -80 38 171 96 -60 279 -171 -92 0 293 246 -162 -78 -6
6351 -6 36 18 69 67 -95 168 -265 -5 -31 -57 72 164 212 -51 -50 -226 92 266 186 187 -11 -46 -186 51 -106 -108
6377 -108 31 -15 -39 133 110 -65 115 -14 139 53 5 38 -76 -25 -155 -49 -35 122 68 -63 -30 144 58 -177
6401 -177 -208 3 174 16 -40 -122 -94 18 73 -23 -29 -17 165 208 25 -175 -156 -170 -106 -42 45 -106 -51 34 84 -111
6427 -111 -92 -203 -73 272 365 -260 -137 101 36 -86 203 -94 -133 -13 -176 -300 -178 -191 10 65 -85 70
6449 70 -111 214 -47 -94 -31 38 134 71 52 279 -206 -208 106 153 -31 164 120 -89 103 -89 170 160 31 95
6473 95 47 -11 -72 158 11 147 -94 94 -51 148 373 -139 227 -54 -27 -88 81 -111 -6 216 276 -9
6495 -9 143 37 22 170 -39 223 185 25 -64 226 -116 -8 -4 -77 -25 69 -34 41 -142 -19 -110 120 69 40 -192
6520 -192 -33 -150 -44 269 71 -246 101 23 -201 210 -29 110 347 81 -40 -90 -207 323 89 308 70
6541 70 -223 88 -53 -270 -120 -106 89 17 -95 -95 72 39 121 220 -198 9 206 74 -374 -102 -73 -56 -31 -52
6565 -52 -226 -77 -35 60 52 179 -63 -222 -155 122 -122 71 57 -162 -11 -15 -327 -75 48 -54 32 131 -57 -150
6589 -150 123 80 142 -4 -38 -274 -148 -19 46 32 103 300 211 -15 192 -2 -49 162 85 70 -72 1 131 -10
6613 -10 220 -201 136 1 151 25 55 127 -217 -163 -39 -84 -27 165 -36 -26 -168 105 -13 1 124 -158 91
6636 91 -6 -385 -226 10 -80 135 98 -45 -32 122 -304 6 -147 -407 21 -144 9 -23 309 246 -32 -59 215
6659 215 116 39 50 -35 19 85 -3 -208 123 -142 -202 98 -45 224 151 -22 -39 -55 34 65 -11 38 67 218 -56
6684 -56 -12 264 78 6 229 -18 -57 109 -54 117 93 -52 131 46 26 -13 34 -96 -22 63 150 -26 18 -213
6708 -213 147 -127 206 -149 136 70 163 185 -139 -22 -215 -58 374 95 220 -84 -310 -58 32 -11 -15 -24 -117
6731 -117 121 191 127 -170 106 -13 -94 131 -87 -124 102 -166 175 -152 -41 28 94 -142 18 258 132 -52
6753 -52 181 128 -189 30 -120 -57 27 -110 -88 24 108 33 131 -85 -78 -112 21 2 -168 74 160 -14 159 40
6777 40 60 54 -136 -8 252 120 -166 184 157 85 44 -84 -56 -280 -101 -86 -106 102 -55 -81 -114 -180 4 -93 -204
6802 -204 -17 14 42 76 134 86 -80 59 11 241 245 -13 -151 -1 350 -135 -2 35 -147 -20 147 164 -74
6825 -74 198 -31 -213 91 -93 -123 -18 96 -11 -33 77 282 130 -56 -57 53 15 -130 -39 -169 -6 39 -3
6848 -3 -172 193 -259 -162 -32 -35 5 -40 -72 -179 -56 -137 59 169 -264 -23 -45 9 130 -151 90 1 -118 -5
6872 -5 74 68 93 94 0 -30 240 -192 -29 27 63 -18 57 -30 -33 5 -50 27 130 -155 -96 12 -112 -82 -112 238 179 -177
6900 -177 78 33 21 -243 -49 46 -105 -174 154 -150 -33 -126 -15 80 -159 -18 99 -141 131 136 29 41 -44
6923 -44 137 12 246 172 -46 199 -29 -414 -73 29 -14 -71 -109 -222 193 -32 -66 -11 86 105 -108 94 192
6946 192 -29 -225 -122 102 60 -154 18 208 -32 -6 183 -83 -83 87 136 -8 235 -219 -49 274 85 -14
6968 -14 -215 41 -141 37 -12 -27 60 172 207 82 -63 -60 352 231 -216 95 262 83 67 327 -164 -95 141
6991 141 -30 -84 232 29 -397 290 -86 58 -6 -125 -1 30 -73 -134 26 175 -43 175 -32 23 203 -169
7013 -169 -141 109 -121 -73 121 -25 247 249 140 -153 -42 228 -52 -96 -129 -27 -224 118 -68 -67 74 196 150
7036 150 -223 27 7 -18 -81 33 270 178 -213 53 -48 -60 -20 129 -228 -97 121 47 23 108 -208 185 141
7059 141 -54 -89 -9 -89 -164 225 166 47 -67 -68 -91 34 -32 -92 -91 101 1 -76 52 62 -53 109 79 141 -113
7084 -113 68 -147 107 229 100 63 17 25 371 331 -86 134 1 -71 237 -123 1 85 15 -5 -91 107 92 -172
7108 -172 -70 228 -164 49 235 5 -32 91 -114 46 -122 -46 61 -16 -9 -169 -22 -111 -118 73 33 32 146 -3
7132 -3 136 -33 -129 79 -187 -172 -37 108 169 113 -47 156 -52 -157 179 110 -195 -62 -264 126 28 54 -1
7155 -1 74 -261 2 13 -165 -48 -14 -162 217 -3 1 -115 -55 -91 104 122 -5 -210 -119 142 83 -64 -190 102
7179 102 -205 193 -46 -154 -105 -51 137 211 -30 179 -162 -92 -98 -60 -10 -310 208 144 -97 61 120 -31 -49 -226
7203 -226 -138 -104 -206 -5 119 103 20 269 182 -90 167 8 14 -31 108 134 -225 -68 -66 41 -100 128 -87 45
7227 45 75 -107 66 -267 157 -63 -29 -146 54 139 60 95 -43 135 -218 -161 -154 -2 -3 142 -5 -11 -107 52 83
7252 83 -55 -304 179 -160 -362 -194 -185 -47 -13 195 -22 -122 10 -62 96 232 -88 -201 85 -40 14 227
7274 227 26 -99 8 -25 -66 305 -210 50 -51 -189 148 -96 36 -81 56 -69 -89 196 -63 132 -204
7295 -204 83 -81 -79 -42 35 -96 39 -17 81 -36 132 31 34 2 -48 153 36 144 85 -84 -120 82 51 -191
7319 -191 -178 95 42 -54 -20 146 -30 114 -5 -132 -131 -2 -164 -45 -112 46 43 -137 -311 20 222 -13 21
7342 21 -42 -9 8 5 -12 -194 -94 -107 163 56 106 103 -177 -45 0 391 115 -34 113 62 -95 97 -116 -63 14
7367 14 -122 -69 65 125 -372 7 -131 -220 132 -117 -126 -134 54 129 108 -56 -346 -36 237 -262 -56 -164 -232 175
7391 175 142 -16 -342 185 241 -92 -54 108 -127 156 31 149 135 178 -33 -106 -68 167 156 221 -158 17 125
7414 125 -352 11 -22 30 23 63 142 35 125 80 -17 14 -178 -116 72 159 -34 -106 48 136 -20 170 157 120 -7
7439 -7 -186 -153 101 -61 178 -145 -21 121 126 -135 -114 109 105 -67 106 -6 -37 113 265 198 47 204 19
7462 19 -9 -55 -101 149 9 63 129 -62 1 5 54 -314 18 -82 27 -113 15 175 -168 110 -43 -40 -89 -83 9
7487 9 -160 145 -7 -5 128 166 103 -157 336 76 -194 11 76 109 69 -130 -68 -103 -218 -251 130 -37 17 110 100
7512 100 137 197 -38 282 -77 271 -136 136 -55 -166 -65 194 -106 51 133 -133 44 -183 99 -46 67
7533 67 -433 -152 283 -116 -73 -48 -8 -47 26 26 -128 -101 107 -5 122 -26 -313 -43 -98 203 137 -121 -214 -223 -53
7558 -53 181 10 -216 80 6 103 -82 -241 -61 95 88 69 -208 51 -21 -164 81 -26 -150 114 0 89 45
7581 45 124 -118 158 -63 -3 64 21 128 281 63 -55 -41 60 7 -114 219 -77 -6 -108 193 -9 59 -184
7604 -184 -154 15 -63 -126 113 -67 -383 97 244 -111 -74 -106 -8 -37 -20 -71 -19 68 -110 -129 -195 316 173 -87
7628 -87 -287 17 -139 96 18 -33 112 135 24 -7 -117 107 -41 149 -34 86 -24 98 -164 -253 -84 -159
7650 -159 -110 -142 289 93 -30 55 163 -107 107 74 198 152 283 -105 -103 118 -43 147 -12 65 -92 75 110
7673 110 -44 118 75 40 71 -100 0 -10 99 -192 97 234 -82 115 110 143 -35 134 21 -10 229 -41 -59
7696 -59 138 -247 -229 -190 72 83 -32 109 -90 48 105 -61 -42 -77 -180 -32 86 96 160 229 -58 -76 6 116
7720 116 -32 15 -106 -58 202 -127 -48 -19 -204 179 -17 26 128 28 16 -54 73 69 -233 -4 -117 -111 -48 185
7744 185 102 368 -64 -179 150 65 -150 -200 86 61 -240 82 38 -64 127 103 -104 123 104 48 -108 7 -114
7767 -114 225 46 -161 -95 -263 -135 292 223 26 -122 101 152 -143 -59 7 -172 245 131 -59 278 13 -49
7789 -49 32 -145 213 303 21 -75 -137 56 -71 159 -3 -324 95 119 -33 -63 -2 40 17 305 13 -117 137
7812 137 -160 -342 -119 104 -2 117 -126 -3 -78 -19 -48 -82 82 -8 -240 8 -35 -71 321 -163 -104 97 -9
7835 -9 -148 177 -74 -134 208 -29 70 146 153 133 -45 -161 2 145 22 53 222 153 -62 139 180 69 2 112
7859 112 145 84 85 69 -14 102 103 -174 176 -17 -186 -61 -52 73 -5 -24 -8 19 60 -76 -124 121 -225 128 303
7884 303 66 103 137 -115 44 -38 -77 -47 117 -117 26 -44 86 226 95 262 -17 40 -285 0 -37 151 30
7907 30 -334 58 109 -60 -80 -114 -2 -9 -117 -119 4 -421 35 -146 -105 121 77 299 -267 108 175 -128 104 -22
7931 -22 -102 -31 -128 -34 -215 179 -334 134 47 66 -74 222 -101 29 -128 -120 -227 -142 -4 158 -54 -163 6
7954 6 132 -6 -84 117 -292 -4 129 165 61 48 10 -57 23 -3 -259 108 86 -301 34 85 37 23 162 -93
7978 -93 108 61 41 -17 86 -147 60 95 -54 -109 77 128 -129 -161 199 -191 16 28 96 50 -131 96 90 -127
8002 -127 68 152 -195 79 111 -44 -284 44 98 -126 48 -21 -118 89 18 -13 -184 -18 132 116 -30 51 75
8025 75 276 -44 -218 -87 189 35 -115 104 42 -15 -156 -65 -157 29 87 -125 -174 46 72 -142 48 209 292
8048 292 7 37 -179 -187 -204 25 238 -94 22 233 55 -142 110 -186 23 46 -48 128 97 78 57 313 -121
8071 -121 -58 133 -170 92 113 131 10 -339 -270 18 -89 1 -8 -158 137 -44 22 -156 -164 -70 -61 36 91 -86 -343
8096 -343 91 25 -168 56 -100 -3 -384 92 -30 -168 -66 -27 -111 -161 5 -236 148 104 -100 -14 84 -330 -77
8119 -77 -70 -107 247 -183 -19 -59 6 -76 -140 99 -120 -77 -101 112 -37 -160 92 161 -66 -22 -88 -12 -14 146 92 34
8145 34 73 -111 226 -35 -5 104 32 -42 163 -6 18 25 198 28 157 45 -67 -77 -42 -24 116 211 66 4
8169 4 246 1 -438 59 -227 -44 -21 44 -164 73 109 256 2 109 93 72 -22 7 39 77 -64 -251
8191b51
##END NTUPLES=NMR FID
##END=
