##TITLE=1H_CA-8768x-Y
 DMSO, 8 sc, 
 30.9.2020
##JCAMPDX= 6.0         $$ Bruker NMR JCAMP-DX V2.0
##DATA TYPE= NMR FID
##DATA CLASS= NTUPLES
##ORIGIN= UXNMR, Bruker Analytische Messtechnik GmbH
##OWNER= root
$$ XWIN-NMR		Version 3.5
$$ Wed Sep 30 10:58:46 2020 Russian Standard Time (UT+4h)  she@DPX200
##.OBSERVE FREQUENCY= 200.1315066352
##.OBSERVE NUCLEUS= ^1H
##.DELAY= (6, 6)
##.ACQUISITION MODE= SIMULTANEOUS
##.ACQUISITION SCHEME= undefined
##.AVERAGES= 8
##.DIGITISER RES= 18
##SPECTROMETER/DATA SYSTEM= spect
##.PULSE SEQUENCE= zg30
##.SOLVENT NAME= DMSO
##.SHIFT REFERENCE= (INTERNAL, DMSO, 0, 15.7039)
##AUDIT TRAIL= $$ (NUMBER, WHEN, WHO, WHERE, WHAT)
$$ ##TITLE= Audit trail, XWIN-NMR		Version 3.5
$$ ##JCAMPDX= 5.01
$$ ##ORIGIN= Bruker BioSpin GmbH
$$ ##OWNER= she
$$ F:/spectra/data/she/nmr/H-F/1/audita.txt
$$ ##AUDIT TRAIL=  $$ (NUMBER, WHEN, WHO, WHERE, WHAT)
(   1,<2020-09-30 10:57:50.57 +0400>,<she>,<DPX200>,
      <created by zg, POWCHK disabled, PULCHK disabled
       configuration hash MD5:
       00 E9 B6 7A A2 85 ED C7 34 08 36 98 17 FE 4E 26
       data hash MD5: 16K
       21 C7 F4 1E 6E 32 81 3D FE F9 63 DE 62 AF FB B4>)
$$ ##END=
$$ 
$$ hash MD5
$$ 4A 95 0D FA 00 10 17 50 AD 10 F1 C0 9D 26 BF 18
##$RELAX= 
##$RELAX= 
##$RELAX= 
##$RELAX= 
##$RELAX= 
##$RELAX= 
$$ Bruker specific parameters
$$ --------------------------
##$DU= <F:/spectra>
##$EXPNO= 1
##$NAME= <H-F>
##$PROCNO= 1
##$TYPE= <nmr>
##$USER= <she>
##$AMP= (0..31)
100 100 100 100 100 100 100 100 100 100 100 100 100 100 100 100 100 100 
100 100 100 100 100 100 100 100 100 100 100 100 100 100 
##$AQSEQ= 0
##$AQ_mod= 1
##$AUNM= <au_zg>
##$AUTOPOS= <>
##$BF1= 200.13
##$BF2= 200.13
##$BF3= 200.13
##$BF4= 200.13
##$BF5= 200.13
##$BF6= 200.13
##$BF7= 200.13
##$BF8= 200.13
##$BYTORDA= 1
##$CFDGTYP= 0
##$CFRGTYP= 5
##$CHEMSTR= <none>
##$CNST= (0..31)
1 1 145 1 1 1 1 1 1 1 1 1 1 1 1 1 1 1 1 1 1 1 1 1 1 1 1 1 1 1 1 1 
##$CPDPRG= <>
##$CPDPRG1= <>
##$CPDPRG2= <>
##$CPDPRG3= <>
##$CPDPRG4= <mlev>
##$CPDPRG5= <mlev>
##$CPDPRG6= <mlev>
##$CPDPRG7= <mlev>
##$CPDPRG8= <mlev>
##$CPDPRGB= <>
##$CPDPRGT= <>
##$D= (0..31)
0 1.2 0 0 0 0 0 0 0 0.06 0 0.03 0 0 0 0 0.0002 0 0 0 0 0 0 0 0 0 0 0 0 
0 0 0 
##$DATE= 1601449069
##$DBL= (0..7)
120 120 120 120 120 120 120 120 
##$DBP= (0..7)
150 150 150 150 150 150 150 150 
##$DBP07= 0
##$DBPNAM0= <>
##$DBPNAM1= <>
##$DBPNAM2= <>
##$DBPNAM3= <>
##$DBPNAM4= <>
##$DBPNAM5= <>
##$DBPNAM6= <>
##$DBPNAM7= <>
##$DBPOAL= (0..7)
0.5 0.5 0.5 0.5 0.5 0.5 0.5 0.5 
##$DBPOFFS= (0..7)
0 0 0 0 0 0 0 0 
##$DE= 6
##$DECBNUC= <off>
##$DECIM= 32
##$DECNUC= <off>
##$DECSTAT= 4
##$DIGMOD= 1
##$DIGTYP= 9
##$DL= (0..7)
0 120 120 120 120 120 120 120 
##$DP= (0..7)
150 150 150 150 150 150 150 150 
##$DP07= 0
##$DPNAME0= <>
##$DPNAME1= <>
##$DPNAME2= <>
##$DPNAME3= <>
##$DPNAME4= <>
##$DPNAME5= <>
##$DPNAME6= <>
##$DPNAME7= <>
##$DPOAL= (0..7)
0.5 0.5 0.5 0.5 0.5 0.5 0.5 0.5 
##$DPOFFS= (0..7)
0 0 0 0 0 0 0 0 
##$DQDMODE= 0
##$DR= 18
##$DS= 0
##$DSLIST= <SSSSSSSSSSSSSSS>
$$ [...]
##$SUBNAM2= <"">
##$SUBNAM3= <"">
##$SUBNAM4= <"">
##$SUBNAM5= <"">
##$SUBNAM6= <"">
##$SUBNAM7= <"">
##$SUBNAM8= <"">
##$SUBNAM9= <"">
##$SW= 16.880792210976
##$SWIBOX= (0..15)
0 0 2 0 0 0 0 0 0 0 0 0 0 0 0 0 
##$SW_h= 3378.37837837838
##$TD= 16384
##$TD0= 1
##$TE= 0
##$TE2= 300
##$TE3= 300
##$TEG= 300
##$TL= (0..7)
0 120 120 120 120 120 120 120 
##$TP= (0..7)
150 150 150 150 150 150 150 150 
##$TP07= 0
##$TPNAME0= <>
##$TPNAME1= <>
##$TPNAME2= <>
##$TPNAME3= <>
##$TPNAME4= <>
##$TPNAME5= <>
##$TPNAME6= <>
##$TPNAME7= <>
##$TPOAL= (0..7)
0.5 0.5 0.5 0.5 0.5 0.5 0.5 0.5 
##$TPOFFS= (0..7)
0 0 0 0 0 0 0 0 
##$TUNHIN= 0
##$TUNHOUT= 0
##$TUNXOUT= 0
##$USERA1= <user>
##$USERA2= <user>
##$USERA3= <user>
##$USERA4= <user>
##$USERA5= <user>
##$V9= 5
##$VALIST= <valist>
##$VCLIST= <CCCCCCCCCCCCCCC>
##$VD= 0
##$VDLIST= <DDDDDDDDDDDDDDD>
##$VPLIST= <PPPPPPPPPPPPPPP>
##$VTLIST= <TTTTTTTTTTTTTTT>
##$WBST= 1024
##$WBSW= 4
##$XGAIN= (0..3)
0 0 0 0 
##$XL= 0
##$YL= 0
##$YMAX_a= 514338
##$YMIN_a= -369595
##$ZGOPTNS= <>
##$ZL1= 120
##$ZL2= 120
##$ZL3= 120
##$ZL4= 120
##$ABSF1= 10
##$ABSF2= 0
##$ABSG= 5
##$ABSL= 3
##$ALPHA= 0
##$AQORDER= 0
##$ASSFAC= 0
##$ASSFACI= 0
##$ASSFACX= 0
##$ASSWID= 0
##$AUNMP= <proc_1d>
##$AZFE= 0.1
##$AZFW= 0.1
##$BCFW= 1
##$BC_mod= 2
##$BYTORDP= 1
##$COROFFS= 0
##$CY= 11.3945322036743
##$DATMOD= 1
##$DC= 2
##$DFILT= <>
##$DTYPP= 0
##$F1P= 16.9975609425685
##$F2P= -3.02152046262296
##$FCOR= 0.5
##$FTSIZE= 0
##$FT_mod= 4
##$GAMMA= 1
##$GB= 0.15
##$INTBC= 1
##$INTSCL= 1
##$ISEN= 128
##$LB= 0.24
##$LEV0= 0
##$LPBIN= 0
##$MAXI= 10000
##$MC2= 0
##$MEAN= 0
##$ME_mod= 0
##$MI= 1.114404
##$NCOEF= 0
##$NC_proc= 0
##$NLEV= 6
##$NOISF1= 3.799351
##$NOISF2= 2.8
##$NSP= 1
##$NTH_PI= 0
##$NZP= 0
##$OFFSET= 15.70392
##$PC= 1
##$PHC0= -9971.824
##$PHC1= 10.80089
##$PH_mod= 1
##$PKNL= yes
##$PPARMOD= 0
##$PSCAL= 0
##$PSIGN= 0
##$REVERSE= no
##$SF= 200.130013532006
##$SI= 16384
##$SIGF1= 3
##$SIGF2= 2
##$SINO= 400
##$SIOLD= 16384
##$SREGLST= <1H.CDCl3>
##$SSB= 0
##$STSI= 0
##$STSR= 0
##$SW_p= 3612.71676300578
##$SYMM= 0
##$S_DEV= 0
##$TDeff= 0
##$TDoff= 0
##$TI= <>
##$TILT= no
##$TM1= 0
##$TM2= 0
##$TOPLEV= 0
##$USERP1= <user>
##$USERP2= <user>
##$USERP3= <user>
##$USERP4= <user>
##$USERP5= <user>
##$WDW= 1
##$XDIM= 8192
##$YMAX_p= 0
##$YMIN_p= 0
$$ End of Bruker specific parameters
$$ ---------------------------------
##NTUPLES= NMR FID
##VAR_NAME=  TIME,          FID/REAL,        FID/IMAG
##SYMBOL=    X,             R,               I
##VAR_TYPE=  INDEPENDENT,   DEPENDENT,       DEPENDENT
##VAR_FORM=  AFFN,          ASDF,            ASDF
##VAR_DIM=   8192,          8192,            8192
##UNITS=     SECONDS,       ARBITRARY UNITS, ARBITRARY UNITS
##FACTOR=    0.000296,      1,               1
##FIRST=     0,             0,               0
##LAST=      2.424536,      0,               0
##MIN=       0,             -369595,         0
##MAX=       2.424536,      514338,          0
$$ Real data points
##PAGE= N=1
##DATA TABLE= (X++(R..R)), XYDATA
0@%%%%%%%%%%Qj6J6j6K4l2L8m7N7p2Q9j09J32j57J85k17K57k98L44l99M59n28
32b82O04o89P82q82R95j120J255j408J573j754J954k168K404k660K938l247L584
49A879l950M352m793N279n815O409p072P813q650R604j0696J1970j3475J5279
63H134j7495K0291k3944K8948l6298M8542j08602N25966k65876J3785R3972n90738
75c03315R7139j34352K20369L57593k0893K7053j36765j55232j70668p1785K81546
86i310J05297J84581J2463j72783k07499k55940J69389J64120J15816J95262j18304
97A83092j03302k53525j34660J67848J26574J87874k812K3902j54112l53987K44397
108f8711l2073m8398M15587q5911o2458o6578k29949L4384j1627J96411J44205
$$ y = [0, 0, 0, 0, 0, 0, 0, 0, 0, 0, 0, 8, -8, 8, -8, 16, -16, 22, -25, 32, -40, 49, -60, 72, -85, 100, -117, 140, -158, 186, -213, 246, -282, 322, -367, 415, -467, 528, -592, 663, -745, 828, -926, 1028, -1140, 1264, -1396, 1542, -1705, 1879, -2071, 2281, -2512, 2767, -3048, 3361, -3711, 4102, -4548, 5056, -5640, 6330, -7145, 8134, -9361, 10930, -13014, 15934, -20364, 28178, -80424, 445542, 179666, 193451, 287423, -303315, -206176, -340528, -120159, 237434, 216541, 243594, 106829, -48403, -219071, -290856, -9310, 95987, 280568, 293031, 120248, -87251, -343191, -173802, -9682, 106134, 301396, 183092, 79790, -173735, -308395, -140547, -13973, 173901, 171089, 194991, 40879, -313108, -68711, -100784, -149182, 266405, 180494, 118036, 51458, -178491, -144107, -155734, 40677, 184882]
119A84882l0693K0447k31198j02164L207L2484J91864O6128L5915j25628q8323
130d3079o9869j59188K83602O5237l2089J80676k67931q468K7787k09212K34834
141B300Q6713j5398Q3893q8921q0576j44174N4451J38992m354J28198j3152j19300
153B8672j09248m4531J09497r167R3191P8751j03691k1159r3245l8277P3776K8786
165f645M2993N3922J2367j49682j1818L4536j20612J85314N3531o4033J19886
176A49759k14516l2573J05551j11290J41510O7720m3986l0148q5552M2666o2073
187g2932J5609J25984l7007J3081k4087l7414l3577m0618R4613k046L8324L4498
199G4428r7091K5327o1884k4138J03048J047L4585r866l9280l0866m2880O0507
$$ y = [184882, 154189, 174636, -56562, -158726, -155519, -123035, 68829, 134957, 170872, 45244, -43079, -112948, -272136, 11466, 76703, 44614, 225290, -42641, -51109, -23322, -232534, 2300, 89013, 73615, 157508, 68587, -11989, -156163, -101712, 37280, 32926, 161124, 147972, 28672, -80576, -125107, -15610, -24777, 68414, 147165, 43474, 22315, -70930, -109207, -35431, -6645, 36348, 90270, 102637, -47045, -58863, -24327, -144939, 40375, 93906, 29873, 149759, -64757, -97330, 8221, -103069, 38441, 106161, 62175, 32027, -53525, -10859, -72932, -57323, 68661, 31654, 44735, 20648, -16766, -50343, -90961, 3652, 1606, 39930, 74428, -22663, 2664, -59220, -83358, 19690, 20737, 55322, 45456, 6176, -24690, -67570, -7063]
211g063Q129L4665K5256o6045L2088n3624k7976O2988j9783L2504K512J2310j9438
224A6523q9288O1818m405k3837R1520q782m2590j9684j904k0473J8542O8584m5853
237A71L3434n972q8491Q0809m1621q706Q5175o4302L8495j2017m9064M4127n0974
250c8936K8874L3699j6635K8391m8841j442r76j9052M5839K101J4698l1062j0875
263a4217K9740o4613M4221M3133n3816L1702P625l5629l196J4778m679J705L4066
276C0820l2708P328J3045n8001M2062l602j2763M4601l5125J5087j9424k6572
288c5252M5466k5606K3485J1981l0883K2481l1230L971K6194j1751O225k969J9108
301B1220l1432l842M1231n1841K4324K5629l0307K3924k2954j28J111j4239L6313
$$ y = [-7063, 1066, 35731, 60987, -5058, 27030, -26594, -54570, 8418, -11365, 21139, 23651, 35961, 16523, -72765, -10947, -15352, -39189, 52331, 43549, 959, -18725, -20629, -41102, -22560, 46024, 171, 33605, 27633, -60858, 19951, -21670, -30376, 54799, -9503, 28992, 16975, -32089, 12038, -38936, -10062, 23637, 7002, 35393, -13448, -14890, -15866, -34918, 10921, 13022, 27720, -3342, -14217, 15523, -49090, -4869, 38264, -15552, 16150, 23775, -11854, -15050, -272, -4951, -3246, 30820, -1888, 5440, 18485, -39516, 2546, -1056, -13819, 30782, -4343, 10744, -8680, -35252, 10214, -15392, 8093, 20074, -10809, 11672, -19558, -15587, 10607, -1144, 5081, 2112, 21220, -10212, -14054, 27177, -24664, -340, 25289, -5018, 18906, -4048, -4176, -3065, -17304, 19009]
314A9009j5620N425K029l5087K6172p003r7J7600j0474L569j7110J6086l964j5766
328a5231L2831k5176Q789J9927l4584K1169n004k2056K5301Q713j2485l908J4732
341A3018k7022l469L4117k6019J4229K976k1198J9366k3492J5767P378k3348L1807
354A4110k0796j326J9726k9411J6903K413p286J0983l322O337j8568J0440L064
367C267j6465L3034j9413l614J9327l3712J7790Q935j6176J3418k427j921r103
380g060O831O117j7548J6263j220p672Q505n521L081j0080Q625L624j1550K2401
394A4796j6073o214J6457j9542J1083P583q113K856m859L332p671Q041K305j3371
408i390J7983j3557o28J4608k0055J0709k093k368R189j1327J4634j2282q066
$$ y = [19009, 3389, 8814, 10843, -24244, 1928, -5075, -5172, 12428, 1954, 5523, -11587, 4499, 535, -15231, 17600, -7576, 1213, 21140, -13444, 7725, 2721, -19335, 5966, 14679, 2194, -1714, 13018, -14004, -17473, 16644, -9375, 4854, 7830, -13368, 5998, -17494, -1727, 5651, -17697, 14110, -6686, -8012, 11714, -17697, -794, 1619, -5667, 5316, 1994, 8331, -10237, 203, 3267, -13198, 19836, 423, -3191, 16136, -17576, 214, 9149, -7027, 6391, 3964, 2043, -7060, -229, 5888, -11660, 4603, 3383, -4289, 4216, -1305, 1776, -8304, 321, 3945, -7605, 14796, -1277, -7491, 8966, -10576, 507, 8090, -23, 2833, -2026, 1306, -6365, 1676, 3981, -9390, 8593, -4964, -5592, 9016, -11039, -330, -2423, -4791, 4398, -6929, 7705, -4577, -12643]
421a2643K2073j7861P071J1179j4603L874K5J704m577P053L362j6096J8101o704
435A958j0452J9473j5447J489R100r018O676k492p58k219p69O082o628Q121k750
450B366o777O967n353M591k196J868L336j2820J4234m219r551J6167j1762o31
464c780R132o622J629q67K551p573L451Q963j3914J1398j818j1446J3185q052
478c763K914M039o241N957p331N503J015q132J1192q590K74R693r121K572J2j546
494a553j452L541N161j0550P917r17j0601J3441m865l153P724n182J41k73J981
509A360k189j505O775o594K979L068o185L503l914L079M7m20N778j0133N115N80
525A344r163J3256m803m392Q266o748K13J271J196k066o9O584q874M562K911j0165
$$ y = [-12643, 9430, -8431, -1360, 9819, -4784, -910, -885, 819, -3758, 3295, 6657, -9439, 8662, 1958, -8494, 10979, -4468, -2979, 6121, -2897, 3779, 1287, 529, -1690, -2459, 3623, -3005, 5116, 2366, -4411, 2556, -2797, 1794, -402, 1466, 4802, -8018, 6216, 1997, -7554, 8613, -3149, -3780, 5352, -1270, 359, -508, 2043, -5530, -2079, 6884, -7030, 4368, 2550, -8896, 4289, -3763, -849, 3190, -3051, 2906, -4425, 1078, 2093, -6039, 5153, -3437, -3163, 6530, -2591, -19, -7, -1553, -3005, 536, 5697, -4853, 3064, 2147, -8454, 4987, 122, -3031, 4693, -489, -348, -621, 1360, -829, -2334, 4441, -2153, 826, 3894, -2291, 1212, -2702, 377, 424, 4, 5782, -4351, 764, 1344, -7819, 5437, 634, -3758, 4508, -2240, -2027, -756, 440, -1626, -1695, 4889, -3985, 577, 3488, -6677]
541f677Q693j913k678O198l280R72l726R19K823n219Q202k017m594M524m614Q09
557a578J450P71r40j07L978p303L575K695q515P798R0l512M673k942j433n94J933
574C9P72j393N403n911m82L513n765M639P91q78M65k470L709n953K152M835q028
591d562O882J97n481M926l466j053K616Q50L41j616L659o193K54N897o374M785
607A662J736m437K020j810P02p30O47K725l577L105j055l840L999k412O8K425
623A228O15j699j994L790n111Q21O112n681L309Q97m847K953r15j09R24R67K73
640A533l438L837k646k051N067l542J247K096j934Q9k480K382j217j13N005n464
656a629J837J308n231L981P17j864J786K20j070k128L617k085j190M619l452O40
$$ y = [-6677, 2016, 103, -2575, 3623, 343, 1315, -2411, -1492, 1331, -3888, 4314, 2297, -2297, 2227, -2387, -1578, -128, 643, -297, -404, 3574, -3729, -154, 2541, -5974, 1824, 1914, -1598, 3075, 133, -1300, -1894, 39, 811, -582, 4821, -1090, -1572, 1941, -3824, 815, 1606, 728, 1193, -1277, 2432, -3521, -1369, 3466, -4562, 2320, 2517, -2964, 1962, -1504, -2557, 59, 909, 1250, -366, 3293, -2900, -2646, 3251, -3123, 1662, 3398, -1039, 981, -829, -127, -857, -210, 2515, -1062, 2043, 988, -2852, 1147, -1265, -1197, 1228, 1843, 144, -1850, 1940, -3171, -2350, 3762, -1919, 1390, 2287, -2560, 393, -522, -631, 293, 1260, 1533, -1905, 1932, -714, -2765, 2302, -1240, 7, 2103, 169, 258, -2222, 160, -1057, -1170, 3835, -1629, 208, 1516, -3715, 266, 983, -881, 905, 1125, 55, -2073, 1544, -541, -1731, 2888, -564, 76]
672G6J878l766J403p3J80R15J38J098l583J269R96l000L326K73j265L53l04j5
690a01j811K859j089r26M005l951K53K616m026J904J338q59J5L03M49l215K181
707e5O84k273L775j681j252J432k122J394l6R52m70j373K762k785l21K966l084
724a487J623J449j504K35k32K90j651K067O5j740K984k257j255K465j666M42J111
741I39J10j123n12J644k170N63K173k349J330j14j169Q48l71J60m86J684l27k241
759a411K967j859j320L325j989N08J044j358j05K3P05p48O07P04k261K047m45
776D34j715J820n97M8l7O84R8j859K030q23q33K347j517k63Q28j350N03L56M31
795E85j078J045L64k125J885k14j508K021n00p06N77l29l73j95J033p99j3J562
$$ y = [76, 1954, -1812, -409, -482, -302, 613, 751, 1849, -1734, -465, 531, -2469, 857, 1130, -135, 218, -86, -101, -1912, 947, -142, -1068, 2937, -1014, -761, 1855, -2171, -267, 1071, 212, 227, 530, 979, -2236, -55, 629, -1644, 2131, 450, -802, 630, -1492, -98, -134, 818, 348, -1025, 1737, -1048, -1369, 1597, -1487, 136, 1585, 81, 316, 84, 374, -1277, 790, 855, -885, 2099, -158, -1413, 1052, -614, -172, 939, 1049, -74, -586, 1058, -1112, -549, 1624, -725, 605, 491, -678, 170, -201, -41, -527, 1157, 830, -1411, 1556, -303, -1623, 1702, -287, 221, 1265, -93, -198, -175, 530, -218, 389, 1093, -1168, 879, 434, -1281, 539, -58, -10, -47, 637, 735, -1124, 906, 83, -750, 1597, 80, -183, 645, -705, -202, 154, 585, -493, 552, 916, -1209, 676, 462, -1046, 975, 475, -231, 346, 17, -356, -551, 482, -317, -330, 1232]
813A232k126N56O31j100O30N71K9q00K98N20j652J622J42j619K045j255l07J015
831D32q41J06K86K98l22l21J204k185J193N72j030R16P8o45j43J24L15q04J238
850D71n44p76J739j240k40J242q41m4K55L90q12K34Q26j738J094O20j581J427
868D82m74m80N40l65j56K13Q00p24p20J616j270r9J273r03J12L8K45m95j99J021
888D55j034M90Q85j744J318k64q30J055o2k45k53N75q23p2J205p53p0P65j157
907e59M51L13n64K53L20L89j104O16J17j044J046l4j018J306q3m07j38J88m36
926c88P3Q20r59M43Q36j532P28M05q73P71k00Q6l63M69m11n12R01j61k09N60l56
947A28j35J15Q2n99L48N83p00J14M07j036N44N84n99L75m0l24m5M35j98m05R10
$$ y = [1232, -894, -338, 293, -807, -177, 394, 423, -377, -79, 441, -1211, 411, 553, -1066, 979, -276, -583, 432, -409, -303, -17, 281, -41, -362, 842, -1343, -150, 422, -608, 308, 386, -259, -402, -278, 37, -767, 471, -73, -849, 890, -350, -590, 652, -189, -233, 22, 412, -400, -166, 660, -1078, 16, 636, -945, 482, 8, -472, 68, -297, -453, -240, 560, -164, -884, 732, -538, -637, 636, -267, -155, -117, 128, -367, -566, 455, -579, -89, 796, -948, 370, 106, -724, 331, 269, 24, -229, 346, -477, -549, 656, -97, -167, 598, -559, -108, 205, -359, -106, 214, 603, -501, 115, 232, -812, 234, 200, -818, 488, 405, -2, -140, 48, -388, -315, 505, -454, -11, 825, -707, 21, 426, -447, 324, 124, 210, -153, 316, -95, -607, 294, 133, -76, 484, 128, -7, 108, 190, -409, -61, 522, -178, -64, 343, -693, -149, 435, -164, 211, 171, -153, -198, 237, 39, -366, 544]
968E44p39j03J276j307P8O76o02M22j4J38r83M59N34j015J004o0o51M47J37n84
988c43J66J56J27l54P64m12m03Q00j015K37N68j88J49n1j20k10L65l1m75R45j62
1009E13q03M01k23j42L17K56j30l14M13m47j1O63q92L79O88j034K68P7l41J78
1029a84N85k40l72M44k78m81O09o6k04O15l40o2p6K41j55l30M80l66J19M46q69
1050d84N58J1k67J88K79j62m68P76m68n88Q85k97j65M62k72j43L5K89k55PL53
1071B74l50J15K00n34N5L72m40L28J23j52j35O4j66l12Q82m33j71N97l53j15K95
1092A44m48J57K27K74n79K57K96p49O34J07k44K85r2m47K73k1m8k09L66l21lL57
1114B16p26L58K27M1l35L07J10j61N6J56m10L76k41j08L44l12k32L97K07m44j7
$$ y = [544, -195, -298, 978, -329, -251, 425, -177, 245, 231, 369, -614, -155, 379, -636, 368, 308, -343, 104, 241, -343, -177, -21, 106, -248, 516, 104, -299, 501, -514, -277, 291, 103, 252, 201, 81, -129, 236, 205, -270, 675, 513, -290, 111, -112, -254, 63, 319, 189, -125, 288, -159, -170, 493, -399, -20, 668, -366, -98, -21, -362, -184, 401, 161, -211, 233, -45, -526, 83, 17, -187, 428, 88, 26, -50, 191, 36, -294, 186, -180, -61, 385, -484, 74, 85, -182, 6, 285, 123, -345, 431, -37, -625, 260, -37, -202, 260, -12, -155, -120, 169, -86, -79, 274, -76, 39, 239, -295, -240, 132, -308, 20, 143, -9, -144, -80, -246, -558, 324, -109, -280, 317, -36, -151, 144, -304, -147, 80, 354, -225, 32, 328, -421, 213, 320, 76, 361, 269, -178, 95, 74, 26, -183, 183, -138, -141, 216, -510, -152, 75, 116, -219, 88, 198, 37, 93, 249, -161, 215, -26, -134, 210, -102, -334, 63, 270, -174, -191]
1135a91N47l43j00L91k33kJ45m36L26p5q1j65J91K48m94M81k54o2N09n29P3J22
1157F8J33l52K52K99o51J9M47k83K82J02o78M27l2n2L1J40j31j89L46k03j62L86
1179A99j97m9j4OJ26LJ71l13L5J57l23K60l1m58N77j52O2j33J22j50J31Q9k41
1202a23j17L41m06K07L25o7l08K81l7j91K68o4lj14N5k61K29L2r7L4L6l5O3j5
1226C3m10K75J40J58l34J32p0J17Q4P4j63k3L58l01J10jn33N55k01m3J78j03k57
1249b25J16Q1k0J20P3k17j19M13n66O46k77j43J46M5J17q0k9j16k1L9j85N9J77
1272C4k92J34K01j64j20J55K8m7K11l9j99J0P6j12J70R8m8p8j05l85M94M9l81
1295c10J88J9K14l19P5J71j72J03J99k61J90Ql92L05j4lJ12m8k05J86q1K6J06
$$ y = [-191, 356, 13, -87, 304, 71, 69, 214, -222, 104, 29, -52, -217, -26, 222, -272, 209, -45, -107, 402, -127, -54, 68, 201, -151, 101, 400, -251, -232, 215, -68, 214, 316, -362, 65, 33, -19, 12, 152, 21, -168, 178, -25, -187, 199, 2, -47, -61, -55, 71, 74, 245, -68, -33, 124, -199, 61, 30, -428, 149, -3, 59, -74, 48, -102, 29, 118, -123, -240, 101, -305, -98, 227, 160, -148, 133, 96, -95, 173, 109, 106, -8, 47, -214, 15, 47, -50, -16, 20, -15, 48, 33, -377, -102, 38, 196, -138, -6, -76, 41, 125, 199, 36, 13, 371, 70, 180, 179, -354, 201, 0, -43, 135, 32, -225, -109, -28, -48, 72, 145, -72, -191, 222, -344, 302, 25, -118, 28, 73, 190, 110, 81, -35, -56, -17, -202, -143, 34, -258, -124, 77, -87, -207, -52, -24, -71, 140, 101, -98, -88, -12, -124, 46, 144, 96, 18, -87, -472, 22, 71, -310, -122, -103, 111, -208, -133, 38, -134, -31, 168, -93, 97, 105, -287, 18, 4, 1, 113, 65, -140, 46, -35, -9, 97]
1318I7k07M1p8L98m07J93Q8k68L45l10k04R1K53J42n74L17J77k15J93Nk02L40
1340B15q9j18p4J50l1Mm6j43J00J37k46K9Oj5K55j56J9k14J98L0l1L18l27R2Q4
1365A47M0l81J14J70k23K83l3k41j01J84k03K9L30j79j8L5j18p5L68l50K11M6
1387C5j44OK29m21L72J59j67j85J60J55l77K54Q1j67J78j9l75L24k00J48p0K31
1409B07j49MK8n3M0j56J51r9J74r8l0N0k88K37L6J31l28K55k15N0p0J83J1k35
1433a64L63l12M3J9p3K04K23n49O7K04p5O1L2m08L20J58p5k51J39K36m60J65J01
1456c2r3J48J22m59L33j4j02M52k06k66K76j47j6K36j15j75J24j39O4R0R0l15
1478a44L07M8m35R2J72o0j63J9K43KL2k4j90J25K17l46J67R4k56J26nJ0j83J79
$$ y = [97, -110, -69, -147, 251, -156, 37, 125, -143, 202, -108, -312, -221, 32, 174, -400, -83, 94, -121, 72, 77, -125, 215, 126, 8, -66, 84, 53, 57, 11, -132, -32, 105, -141, -112, -106, -121, 134, -22, -3, -217, -19, 11, -20, 298, -29, 63, 147, 187, -194, -80, 90, -133, 150, 117, -124, -225, -41, -244, -215, 115, -64, -82, -47, -165, -240, 128, -222, -11, 35, -109, -103, 126, -295, 77, 236, 69, -116, 44, 199, -178, 76, 157, -10, 168, 149, -226, 98, -102, 46, -24, 207, 58, 62, 90, 37, 77, -79, 72, -27, 147, 49, 19, 69, -219, 18, 54, 185, -143, 112, -103, -53, -123, 60, 71, -164, 199, -113, -70, -51, -124, 80, 303, -246, -179, 25, -50, 11, 43, -365, -45, 113, 38, -213, -74, 162, -298, -133, -32, -125, 23, 145, -314, 19, 5, -97, 355, 149, -117, 159, 12, -4, 232, 117, -58, 66, -73, -9, 81, 171, -144, 163, 211, -224, -132, 40, -20, -183, -164, 79, 81, 113, 89, -101, 24, 241, -105, 62, 156, -100, 26, 21, 31, -152, 27]
1502B7N3m39K88q5j1L78k89OL38l82jJ25J31j24J19K02m89K03k00K39j63K85k97
1525h6pJ89k21qJ23p6Q1J6r9J74J03j42j37J22j13J45J01p1k67K33L7k67J08J26
1549F4k9N2R9j5r8K12l18J1J90k99J91K9k46J73J38k39K08q0j62L20l03Lj7J83
1573F7nk06J82J32j45k84K98j3l8R9l73N04l3k13j7L53l03j98K15k8J16j19j71
1596a80L73j94L0L1oq6l0n5M3j13J48k11K00LN3n5J26q2O9o5L0j07K4J01M5j47
1622e5J31K42m96M39l51K86R3k23l4K23k97rL08n2j30M7q7j67K03j70P3K06k25
1645d5k64L57M6j82K43k8l79L0J54K01Oj9J69m88M37l21QM28j82j74k2r9j55N69
1669B90j52j28J3n4j38m4K01O0j14J17j92K7J71m1p3K83k86p3K02N6R9k08j69
$$ y = [27, 80, -359, -71, -156, -167, 211, -78, -72, 266, -116, -117, 8, 139, 15, 134, 336, -153, 50, -150, 89, -74, 211, -86, -93, 96, -125, -133, -10, -86, -5, 11, -88, 86, 189, 47, -90, 32, -81, 64, 165, 94, -173, 60, 97, -170, -62, 64, 35, 87, 186, 171, 73, 285, -33, -22, 168, -131, 60, 89, -157, 16, 154, -85, 123, 43, -119, 201, -102, -99, -116, 67, 62, -144, 38, 170, 25, -259, 39, 26, -12, 87, -286, 218, 185, -28, -45, 308, 5, -193, 22, -6, 110, -9, -180, 193, -1, 29, 60, 54, -32, -62, -117, -74, -187, -39, -250, -50, -47, 6, -49, 77, -5, 64, -1, 29, -78, -54, 47, 92, -55, 76, 318, -178, 261, -90, 196, 289, 66, 32, 255, -42, -51, 257, 205, 75, 122, 35, -132, 71, -99, -26, 180, -45, -309, 48, 94, -88, 155, 127, -252, -222, -68, 133, 139, 120, 289, -199, 238, -83, -75, 353, 171, -3, -25, -124, -279, 290, 138, 10, 23, -31, -169, -213, -12, 48, -66, 51, -141, -114, 57, 16, -57, 226, -60, -133, 69, 125, 224, 16, -153]
1692a53M7O6j9j58K70o6r0J37K1o5R4Mk14L44nk69n2M44o82K52N38n66K49P4l5
1717A66j51L0r0j68J63N5l0mprj5K14l49NM12n25K01J48j3J0l10P2K35J60l18
1742a18M3L00j28j63J02P4j67N7M0k45K73R8p1k7j83K81j75j14J40k22J66J86
1764A47J36k88q8J1j19m0L63p3j23R0R0k0j95J34j56J74j3p3J20j28J61m24N60
1787B46l07K16m15K37k31M8N58n00L14l23K40k4j0J01j04J21k34Nm4j08L7L26
1809A49j28k1L9j15Q7K87j04j71K18k42J23j35n2j42K74j97j70L84k80K73j39
1830f2J28R5l92L87l4q5K51n65K86q0P8J76k43m3K60j37J96q8q8k2l1L0J7N3J01
1855A88J28n08L2L15k20J49J37m19N62k57k5k2J20n0Qk82J36O6J6j40J13l7j9
$$ y = [-153, -106, -40, -59, -217, 53, -13, -103, 34, 55, -10, 84, 88, -126, 218, 213, -56, -108, 336, -346, -94, 444, -122, 127, 201, 166, 15, 45, -45, -213, -50, 5, -25, -29, -36, -45, -60, 154, -195, -190, 222, -303, -102, 46, 33, 43, -267, -195, 40, 200, -118, -75, 225, 97, -66, 36, 110, -57, 0, 40, -205, 68, 166, 95, 68, -115, 166, -9, -123, 17, -205, -39, 147, 283, -5, -93, -82, -201, -241, 122, 49, -74, 16, 106, 86, -109, 25, -131, 43, 30, -43, 77, -51, 110, -314, 246, -61, 155, -260, -23, -254, -206, 352, -148, 166, -157, 83, 59, 49, 150, 46, 167, -67, -62, -106, -214, -177, 149, 21, 0, 39, -76, 11, 298, 194, 23, 241, -1, 122, -13, -65, -207, 67, -130, -300, 84, -196, 77, -62, 66, 161, -231, 156, 122, 37, 288, -277, 9, -71, 7, 183, -60, -103, 157, 20, 216, 128, 40, 18, -13, 17, 34, 87, 188, 316, -192, -160, 155, -65, 84, 221, -198, 364, 107, 82, 60, 180, 130, 138, -144, -8, 58, 74, -66, 47, 10, -9]
1878iq0o7J82j92K66j49J73k26K24n4J8L02n61K62j59j71P6J46q0j1J06J12n4
1901E4L1k21K23l51J44k6J17J91j38q3O9k61M80l7k93J28k11J76K56j83k08k9
1923a72R3J32R9k01L28n19J88J5J02J5j73J15P8j04L9j48J86K8k65J25J19o3J78
1946A95m91K47L1j70J11L04k35j23K18o5p3P8K2j60o1P9K6M1j57K73p4J48k40
1969g6OR0q0J94K8p4n1o7J66k9k00k7K87qk78K59k66K50k5j36j8J95l42J16K35
1994A49l08J64j57L03j44J60k15l3j95K76P5p3J94r7l40K76K09l6l27R5J37k69
2016a56J59K34l86R3J22j45r0K96j37K0J5k4l3j59K12n6J65j33N8m1j72L01o9
2039G4pP3rk58K99j9l05N1K72j81m0J35p2j07P8K7K19j70P2k79J22J91k33Q6k34
$$ y = [-9, -89, -156, 26, -166, 100, -49, 124, -102, 122, 68, 86, 388, -173, 89, -70, -241, -165, -19, -99, -110, -4, 108, 54, 85, -136, 87, -264, -120, -146, -29, 162, 24, -59, 10, -251, 229, 192, -101, 27, -184, -8, 248, 65, -143, -172, -79, 53, 152, -49, 279, -240, -52, -37, 65, 80, -93, 22, 100, -4, 35, -113, 73, 101, -164, -39, 80, 17, 195, -296, -49, -18, -188, -77, 227, -8, -131, 87, 22, -51, 27, 49, -111, -172, -93, -67, -26, -183, 90, 16, 164, -76, -70, 20, -60, 134, 162, 88, 37, -30, 136, 107, -93, -120, 167, 159, -119, 140, -126, 124, 99, -37, -55, 140, -202, -86, 149, -159, 5, -152, 151, 7, 167, -48, -81, -276, 0, 75, 2, 196, 99, -241, 35, 244, 208, -119, -24, 113, -156, 3, 237, -149, -56, 66, -79, -169, 127, -10, 10, 25, 1, -32, -191, 21, -35, 130, -3, 55, 14, -158, 143, 74, 67, 140, 131, -127, 172, 153, -152, -101, 171, -10, -50, 85, 13, -94, -16, 11, 230, 60, 132, -147, -25, 166, -67, 19, -215]
2064b15K73n9k8j04J10q3l0L40n72M83O4k74jP1p6L3m3J06m1L09m26N03n16Q5
2088i1J09O1q1n6J62o0O6p7J01l94L29n0m0N7Rr6o6K12j49L33k69Rk2Q7j87J41
2114C8M0L4p9J4J84m46K79m8J12q5J1j7j33J30j4N0l03N67j01k23l4k4Pl3K35
2139A61M3j42N4j51Q6K2k46R4J43m7Q5k33J00K89l26l1J38N3k24J60J35k01j17
2162a55NR8j64O7L25j81L2L7r6m7J30j37k19M63l66O3J93j97M4K96j45q7R5j33
2186g9J37oj46N0j15J21R0p8k7l4K04q3j18R3j03K45k86K62k02P0k31jK75p1J79
2211A46n0n4j52J02J35l35L66n1L4j53P2j4k42K81p3p7j28J86J48R2q6l96N67
2234C18l64j2l3J32j4J10l9j22K34l28K53l01L02r2j28n4M0J82j21j86L54j29
$$ y = [-215, 58, -1, -29, -133, -23, -106, -136, 204, -368, 115, 179, -95, -96, -25, -101, -68, -111, -5, -46, 263, -163, 340, -176, -91, 18, 79, -2, -58, 104, 44, 110, 33, 134, -260, 69, 19, -21, 36, 45, -51, -117, 95, -54, 279, 10, 19, -3, 84, -103, 38, 78, 112, 33, 47, 231, -215, 64, 16, 128, 43, 54, 37, -96, 34, 20, 70, -233, 334, 233, 10, -24, -48, -41, -74, 161, 204, 62, 116, -35, 51, 73, -173, -79, 64, 17, 102, -131, -31, 258, -68, -99, 39, 92, -132, 28, 163, -38, -155, -150, -52, -216, -149, 176, -5, 27, 64, -32, -79, 51, -86, -305, 158, -208, -145, 48, -149, -105, 191, 46, -41, 54, -79, 58, 52, -94, -44, -159, -38, 52, -26, -53, -87, 117, 34, -84, 9, -94, 151, -135, 127, -75, -5, -236, -237, 38, -33, 146, 96, 42, -110, -8, 127, -208, 158, 107, 141, -12, 60, 46, -196, 85, 12, -65, -193, -7, 141, 233, 147, -249, 318, -46, -58, -91, 41, 27, 137, 98, -24, 210, -118, 135, -166, 136, 44, -84, -138, -98, 84, -37, -223, 131, 2]
2256Bm4J26R8j05J1K04k18K2j2l5j38Q5Q8j46K4M2K32j97J56k20J96m4j25J67
2280A69j88M9K5J89j79l0k58L30j06J30J97l47J63j44j04K22k80J62j26O9k6K41
2302A58j18k6K31l53K7J60j19k3Q9l3K4p8J61j79j2K95O2k24l07K54J69l51J56
2325c7m4R9p9N3RJ3Q1J58j39ON4j69p7L5L2K15m21P7J40J52K5j71o7Q1r1R0M9
2352G4k79K22J40j09l4l73N07k15K15Ql53K02oJ21j07q8O6j3J40l34K55k37K30
2375C2j56J90j33j96J53K13J04j66j89P9K6l3K55j82J6j1R9j77L11r4k2j67p2
2398a20L43k63J34n5j51J05J8j16r6J46r2kM09k71J45j24LM3J9M6l38J79P9J6
2422E7j05j95K12P2M7p7N6n1P1J3o3j10L1J85k78N6R2j72J95j39o0K69j42J3j9
$$ y = [2, -42, 84, 182, 77, 88, 292, 74, 96, 84, 49, -89, -4, 84, -62, -38, 4, 236, 39, 195, -25, 171, 127, 2, 169, -19, 30, 55, 244, 65, 35, -223, 107, 1, 131, 328, -19, 144, 0, -104, 118, -162, 0, -126, -57, -83, 158, 40, 14, 245, -108, -81, 79, -40, -63, 26, -7, 17, -61, 100, -79, -91, 204, 266, 42, -265, -11, 158, -193, -37, -81, 18, -61, -8, 1, 14, 95, 253, 114, 120, 174, 5, -72, -37, -5, 210, -211, -134, 6, 158, 183, 12, -55, 26, -65, 25, 74, -205, 17, 157, 48, 14, -359, 148, -67, 148, 156, -197, 5, -1, 120, 13, -75, -9, -22, 118, -216, 39, -198, 32, -124, 66, -67, -263, -110, 103, 207, 41, -148, -69, -43, -76, 179, -3, 13, 2, 101, -76, 235, 141, 119, -48, -120, 223, -40, 94, 39, -112, -7, 11, -105, -201, -55, -147, -149, 260, -11, 134, 10, 13, 56, 75, 121, -217, -38, 41, 57, -48, -243, -31, 41, 88, 11, 67, 16, 87, 100, 37, -73, -42, 143, -135, -79, 13, -159, 36, -103, -163, 106, -36, -23, -42]
2447d2J22j16J86M3r0j96j26L18k40K23J0j74J24J15l59K82m2j29K4R0J12j00
2469C5o1l7J42k03K52j9m9M6o0r7K6r6NK7J69J7p2j43J22p1N8j2J44J50m56J0
2495a73J61K03k74K12j19j6K80k35j5K90k19p2l1j34J46m9J07N9q4j77J39Q0o4
2518A5J63l26J66J87k47Q8J87j83J97j53l57J02N7J19j63K96j07p6O4j55L28k00
2540BK9j29O4Q6k1q8oN5J53j95J21o1M1k30J45J22%k7q2J26J66l66J65R4j29k25
2566a90MK84J1j65k21L31J05m99M78k66K09J6p9j4k00K55q6k5RJ88l08J09L49
2589B95o5l94L15j06j72l7L02j63k24J75l4j07K92J3J64m8j33j05J72k5k99J00
2611h4P0k15P5K04k56K24J33j52J86q5j66J42k80L02j11J31k07L1J19j85K12j01
$$ y = [-42, 80, -36, 150, 193, 103, -93, -219, 99, -141, 82, 92, -82, 42, 157, -202, 80, 38, -91, -67, 23, 135, 35, -26, -63, 79, -124, 128, 109, 60, 106, 46, -51, -25, -121, -116, -89, 80, 97, 25, -118, 4, -67, -9, -21, 123, 273, -183, -173, -12, 191, -83, 129, 10, -6, 274, 39, 24, 314, 95, 23, -8, -142, 4, -45, 62, 121, 37, -140, -1, 79, 15, 178, -148, 18, 205, -42, 46, 233, 50, 247, 94, -263, -161, -104, 15, -148, 148, 41, -35, 29, -126, 202, 2, 31, -98, -34, 52, 31, -57, -63, -8, 145, -50, 71, 10, 51, -179, -34, 88, 88, 61, -21, 105, 271, -95, 70, 164, 35, -190, -186, 98, 109, -56, -277, 54, 159, -340, 138, -128, 81, 97, 18, 4, -196, 59, -27, -52, -43, 145, -163, -54, 295, 230, -164, 151, 45, -127, -164, 138, -25, -249, -74, -108, -215, 77, 90, 254, 206, 73, -32, 140, 115, -184, -84, -14, -229, -154, 50, -206, 18, 151, -1, 185, 100, -66, 76, -204, 98, -13, 118, -89, -58, 61, -124, 88, -13]
2633a3J63j67qp5m1J48K8l36L45m2K6K58j62M3o3p9j75J53J21p7K51l51k63N61
2657B45k53j13k09L68p3J23j03j41L02p7J24k15j10J5R7N1j08j23J77p9p6M3L8
2680i7jJ14p5j83K1J35L32r7k19o9J29L19n72P8J13J37Lk56M10j20K0j56N0L6
2704E2J16K1j98J05j04m5r2J06q7J22k29K57j2mk12K86k7j75P4M9j34J46j96J39
2728d2M9k97K99j70L13k53J96J26j75PQ3k78L09o3k32J30M9kk9J32n3l05J29q0
2752a57K48K35l36rj18M69m64K28K3o9K1p7J7J31p9j09nn9q5O0J58p6K41K4k10
2777Bo2Q2k12Q5J08j16O7J13j08O1L3j36mK56m4r0O7k6j69N4nKJ25q4J13j43M1
2804A0j47K34j40J43k19J29j15J75j23P1q5R1l3l6q9J81j6L1j79K5j7K6j8k66
$$ y = [-13, 150, -17, -25, -100, -141, 7, 35, -301, 44, 2, 28, 286, 124, 167, 104, 25, -150, 3, 124, 47, 298, -53, -316, 245, -8, -121, -330, 38, -35, 88, -15, -156, 146, 69, 193, -22, -132, -117, -20, 31, -77, -200, -23, -102, -178, -135, -97, -98, 16, -59, -242, -221, -86, 246, 149, -70, -139, -10, 309, -263, -185, -72, 65, 68, -188, 222, 102, 122, -34, 16, 52, 168, 189, -9, 96, -8, -53, -145, -39, -126, -4, -233, 24, 12, 8, -204, 82, 55, -120, -46, 3, -131, 15, -181, -42, 7, -290, 9, -161, 152, -101, 95, 221, 46, 53, 136, -142, 167, 104, -128, 2, 51, 49, 20, 152, 99, -206, -77, -157, 91, 326, -10, -19, -137, 332, -132, 96, 119, 50, 71, -6, 11, 142, 63, -46, -51, -110, -195, -135, 23, -53, 188, 212, 2, -60, 22, -190, -105, 3, -113, -46, 67, -41, 20, 53, -83, -87, 169, 125, 35, 102, 76, -93, -39, -44, -42, 83, -1, 112, -31, 10, -137, 97, -43, 100, -119, 10, -105, 70, -53, 18, -67, 24, -9, -45, -134, 47, 31, 62, -117, -92, -109, -83, -101, -367]
2828c67M11j51J84k18J44l6L1J7L44k35j62J62j32J3j06K58k19q4J53k01Q7K19
2850A12jj28N2l7m9N0J11lp9J07k53J01r3m6K31k7q2j38J69j63K42Q6j72LR9J24
2876B16j39k15N6J2J70O6k21r0R3J65j78k2N6J60J15k64j1J6P3j8J06m13K92J95
2900B20j20n6j03K84m20Q0J74k15L35k76K76k06O3j65K9L56n23M64m50M19L5l87
2922a86J74k45M64K7j83j44qK63m1k13M7j47J59Q6j94M8O4n2J0K9L39l36J11o0
2946A2n1k16K72m4J32l4j83o1K98k3j60J22n1j16J37j04j87L0K00m7j33J81j0
2969c6n8L05l14P3m8j4j4K19nk54J70RQ1j47j01K9K44q7n4K4p2j55Q8L59l30J58
2995G0K31m42k5L9l03M77K02l14m9P1n0R9J10k7n7o7J7J06Q3l5j37J2p2J31J3
$$ y = [-367, 44, -107, 77, -141, 3, -33, -2, 15, 359, 124, -38, 124, -8, 5, -101, 157, -62, -146, 7, -194, -107, 112, 111, -17, 35, -2, -51, -1, 110, 107, 28, 135, -118, -17, -110, -156, 75, 48, -34, -172, -3, -166, 76, 162, -10, -7, 92, 216, 77, -138, -82, -70, 100, 166, -55, -145, -52, 113, -65, -87, -31, 129, 244, -20, -31, -15, 58, 40, 146, -267, 25, 220, 100, 44, -59, 225, -195, -115, 59, -156, 179, -97, 179, -27, 36, -129, -100, 256, -267, 197, -253, 166, 201, -186, -12, -257, 207, 234, 51, -93, -101, 162, 121, -92, -45, -192, -33, 53, -141, -93, -29, -81, -71, -42, 297, -39, 72, 12, -39, -255, 17, -27, 105, 71, -112, -173, 125, 102, -58, 64, 13, -103, 34, -70, -257, -227, -27, -74, -207, -26, -36, -94, 211, -103, -30, -78, -92, -106, 113, 108, -146, 24, 33, 114, -33, -134, -105, 139, 52, -2, 22, -50, -205, -117, 242, -88, 70, 301, -141, -166, -127, -430, 47, 249, -65, -114, -43, -93, 6, 116, 89, 32, -35, -18, 88, 171, 136, -1, 11, -61, 70, 83]
3020H3J5k24L5J71L7l4R5j11k20J57M1J02l17J75J56l66L21j80J31Q7m04L57j01
3043Fp5J29P9j47p6L23j93k14J62K52k04j11j25K24o9p1N3j34J23J9J42j06K91
3066B78k13J11k93k2l2K51Ol23J95J33j76O9j6K74j37J8J17n5j73J59k17K1J03
3089G8n8%J7J4Q4n2M6m5l8l5J14k16jO0J66j66K6Q2j96J03k8K5j26J82K6o7m6
3116e1O8j02k3K50j98Q5r4K35o8j99O6pL00k00m9Q4k52Q4J51m2q0J97k12J86J8
3141A47Or3r3qK70l22L9J76k14J60k41M00j91k45J38P5j75N3O8J69k92J51k92
3164c14L19K7k7j15j26J91n1L41r6N2j58k48K41N4k1R2k68m2J52K27k36k04K11
3187AL2J77k96O6k42L70k26J15N1Q8N3j05k76J0J73J63m63J81o7L56k2l81J05
$$ y = [83, 98, -126, -91, 80, 117, 83, 178, 67, -153, 4, 45, 147, -170, 5, 161, -205, 116, -64, 67, 154, -250, 107, 6, -69, 60, 139, -8, -84, 239, 46, -168, -6, 246, 42, -69, -194, 30, -39, -110, -57, -191, -68, -49, 93, -13, 278, 65, 176, -117, -139, -171, 80, 86, -237, -42, 91, -85, -16, -32, 242, 105, 123, 240, 185, 12, 171, -46, -25, 78, 20, 20, 37, 51, 135, 83, 129, 84, 46, 11, 125, -91, -92, -32, 134, -32, -6, 76, -120, -17, -45, -20, -146, 36, 62, -5, -51, 17, -85, -108, 142, -56, 29, -65, 170, 102, -97, -31, -38, 262, 62, 13, 97, -155, -71, 80, 38, -42, 155, -57, 129, 147, 153, 60, -33, -41, 229, -93, -54, 122, -92, 68, -173, 227, 36, -209, -71, 4, -171, -118, -50, 119, -173, -22, -314, 5, 32, 5, -110, -236, -45, -96, 245, 149, 201, 43, -205, 36, 90, 69, 161, -107, -149, 3, 230, -6, -210, 1, 33, 210, -86, -20, -262, 108, -118, -3, 48, 136, 189, 84, -192, -182, -9, 154, -309, -128, -195, 161, 139, -242, -137]
3210a37K1N1J94n47K50J33K7J75Mk41J3L4l6J24j81L73n12J50m7J09j45N14j27
3233A99j11k44m8J74q0J15J44j98K98k23r6J3O7j49j05L91k02M8k69K29o0N8n0
3256i9n0J47K52j11p9j35k4L08k39Oj36J11j65J47k36N39l7k97J88k05O8K39j18
3279G4j03J45o4r1j58K88j42r3J98o6J07J65k89k43M02j97K86k16K42n00K98J98
3301B41k06r8r3L2J98p2j91J60L2L3J67j33J38j79j34L8o0j39J1K35J11k09K23
3324A05k3k30J00O3O3m1k06N9J64J32k02K01j76l9J8J8q1J70k06J34K57m79J59
3347d0K85k32Op3J59LJ27j32j54L06j41l4J9p3j26J84k81K28K46l61O1p1K75k42
3371f1Q1n4q3L16l39J30l6N8J69k63Kj39K93p2j00K7K80n48L38m5K5J18j09J8
$$ y = [-137, -116, -65, 129, -418, -168, -35, -8, 167, 171, -70, -57, -23, -59, 65, -116, 257, -255, -105, -152, -43, -188, 326, 199, 88, -156, -204, -30, -110, 5, 149, -49, 249, 26, -70, -57, 10, -139, -244, 147, -55, -7, -276, -47, -107, -49, -99, -149, -2, 250, 139, 60, -75, -99, 209, -30, -24, -160, -49, -214, -67, -303, 236, 199, -98, 90, -115, -47, 192, 74, -29, 116, 52, -39, -197, 91, -51, -144, 54, -12, 95, 260, -29, -272, 130, -67, 219, 3, 245, -255, 43, 241, 35, -63, -156, -124, 74, 2, -189, -29, 3, 36, 203, 70, 208, 29, -105, -67, -127, -266, -255, -20, 91, -118, 105, 82, -148, -48, 15, 78, 37, -169, -110, 54, 186, -16, 185, 9, -30, -12, 6, -75, 95, -111, 23, 280, -199, -40, 245, 13, 19, -54, 105, 108, 235, 103, -51, 255, 114, 80, 99, 26, -100, 84, -197, 31, 277, -84, -23, -94, 181, -61, 20, -34, -117, 199, -140, -10, -46, 12, 181, -82, -80, -219, 74, 2, -98, -71, 209, -339, -1, -46, -21, 97, -12, 6]
3395Fj71J77J14j19Q7k12OL27m15K59j93m1pK14j5k7J1P0m20L31O2k42M27k52
3419b3J29j36O8L1P3j38jL4r2J13k34J26n9K89l24J50o8j68K69o3MR5O5j98P1
3444A3J41k88L1J11l4q4K8j44Q3j40K84M0j67Q5j49J79J68k21K0R0q2K3j24M50
3468C13j73l28J48Q5N9l00K66pm7j94J43J22K2k13k28M64k27Q7k03K33k92J59
3490a11M9n5K0J36J6n6J3L5R5o8j34J76qk26M3MK25k23J15L4k75L06n7n6Q9p5
3516A2j9j71J49j03K03m5R0O6q6k73J62L2k04L80l05O1j19J00m0J67j28k25M08
3539A12p9K2n8L5o6k8m1J83j13N0P3j25k83L43J04m13M94l09K74j3l99Q3K46o
3563H6l36J13K42o7J22k61K48k32J9L17k56qJ53m45L48j91Q0j68L06O8N6j16j75
$$ y = [6, -165, 12, 126, 7, 94, -118, -112, 215, -200, 59, -134, -175, -182, 32, 17, -10, 1, 71, -349, -18, 44, -198, 229, -23, 106, -30, 38, 69, 142, 4, 3, 37, -55, 58, -176, -50, -109, 180, -144, 6, -62, -230, 39, -24, -20, 75, 140, -58, 13, 154, -134, -103, 8, -26, -110, -82, -226, -143, -283, 1, 41, -126, -41, -190, -11, 157, -64, -44, 46, -36, -13, -137, 313, 140, -188, -40, 45, 104, -196, 70, 63, 16, -178, -35, 87, 109, -104, -332, 132, -95, -8, -211, 22, -270, -111, -62, -117, -97, 39, 55, -1, 12, 47, 142, 74, -60, 116, 108, -118, -75, -71, 154, -69, 46, 80, -195, 111, 54, -2, 87, 12, -7, -178, -29, -132, 71, 26, 116, 182, 96, -177, -15, 17, -187, 193, -112, -51, -170, -70, -110, 57, -71, -296, 112, 33, 55, -3, 32, -34, -62, -103, 80, -33, 17, 90, -35, -318, 25, 129, -284, 210, -99, 175, 162, -237, -154, 92, 86, -250, -137, 105, 38, 160, -101, 147, -85, -66, 251, -5, -13, 140, -305, 43, -148, -68, -236, 70, 138, 194, 78, -97]
3586i7J53j10Kj7K05k42RP2m4j15LL22j50J77j58nn7J2J78j51j42L94j64j10J36
3611A01j38K17m11L73j82m0n1M8K5j82K96j51K11n3RL3o8j22L09j76mQ4k9l80
3635b81K45J3q1LK54k35O9o9n8L4K14J20p1l06p0L24j34J36K4k03J76j03K6O4
3659I1J8k32R6k7r8oQ7K6O0j11Q4Q7J67l24J46Q4l69J11J65J05j83j06K38p8j43
3684a12P1k15L38j77J14o5J02j68J35n7rPK27k82nj16J57L1R8j83j09K58r9Q7
3708B8n4O6P3K15m15L2K8K35j05j31j18J23J3l2Q6j6o0l0o6J94J08j96L7L1j21
3733g5J32j47K56k19J8j4j0R5j85J70n3oJ28j67K79l06M25l75j01J89j67J56K9
3756E2r4PJ07J71l64P9J64P0o2j99J25r6K56j37O0q5n8K98l99J14k2R3k74P7j04
$$ y = [-97, 56, -54, -52, -69, 136, -106, -97, -25, -69, -184, -181, 141, -9, 168, 10, 5, -52, -40, 138, -13, -155, 239, 75, -35, 101, -37, 180, -231, 142, -40, -80, -131, -83, -58, -240, 56, -95, 116, 63, 72, 105, 37, -85, 224, 48, 44, 128, 99, -281, -36, -23, -104, -101, 153, -82, -13, -82, -140, -106, 108, 228, 157, -149, -219, 105, -29, 107, 131, -72, 104, 1, 27, 91, 109, -123, -27, -54, -152, -158, -71, -45, 15, -96, -12, 75, 242, -82, 64, 148, -221, -110, 55, 160, -23, -129, 109, 31, -112, -41, -256, 82, -95, 19, -46, 56, -112, 23, -34, -43, -36, 191, -91, -96, -212, -55, -24, 74, -109, -218, 40, -59, 28, -26, 40, 113, 328, -87, -55, -27, 208, 103, -28, -146, -23, -10, -42, 44, 28, -32, -62, -128, 66, 174, -22, 15, 46, -75, 57, -90, 166, -53, -35, -49, -59, 36, -149, 21, -32, -38, 90, -77, 202, -104, 321, -54, -155, 34, -133, 23, 52, -42, -35, 72, 243, -121, -42, 122, 192, 130, -69, 56, -40, 216, 79, 139, 54, -4, 294, -105, 9, -13, 80, -194, -117, -221]
3781b21J78k37J91O6l5K11J7O4k16Q5l42K26J16J03l70J09j1Q2k6J0l49K72K80
3804B03n5k73K2o9L06r6p1j7J83M4q3J64m05Q1J73p8j34o7R7J44m13L77J50j07
3828G6j27K6r1L08l3n4Pm6k47J0L5M0K70k06n4Q1k77J37K34R8l43P1J22P3j39
3853b9M2J58p8j42k71J94L22r8l7l6L5k40K67o0q9K66m35K02K60p9l54K73j29
3876e8p0n6L24j57J87nl38J31J51p4J10m1j07L46k91R3l50K52P9j24j04J65k13
3899a50m8K73O9j03j0kN7K58l21j00R9J10k26N3M2L1J12j55oK44k97j64K21l5
3923d8L16l00n5N3k04M17o1l2j94K08k43M9K4k38K48J0l1K07j47J74k59J75q7
3946a8j12K02N1k98M30l01M3K6n4J71q4J3r3K47j19j42Q5J11j79J79l32M01j07
$$ y = [-221, -43, -280, -89, -23, -58, 153, 170, 234, 18, 103, -239, -13, 103, 206, -164, -55, -66, 16, -10, 0, -349, -77, 203, 148, -125, -103, -172, 134, 38, -33, -50, 133, 177, 94, 258, -147, -66, 107, 29, -105, -172, -75, 69, -344, 33, 183, 76, -51, -25, -116, 192, 159, 105, 112, 66, -181, -171, -136, -96, 174, -32, -86, -5, -282, -145, 89, 187, -156, -85, 37, 110, -29, 13, 171, 93, -49, -320, -126, 196, 98, 61, 25, 60, -180, 87, 27, -62, 204, -231, -29, 231, 152, -202, 71, -58, -128, -184, 140, -17, 170, 165, -173, -42, 109, 35, 145, 104, -3, 343, 52, 145, -205, 47, 126, 2, -102, 63, -150, -198, 75, 144, 41, 31, 29, 86, 344, 23, -77, 22, 132, -94, -41, 1, 32, 144, -11, -17, 227, -70, -234, -13, -48, 268, -32, -87, -34, -238, 179, 118, 86, -108, 100, -143, -94, -70, -308, -60, -50, -81, 126, -21, 153, -106, 69, -18, -130, 72, 123, -175, 255, -46, -3, 23, -31, 140, 56, 69, -24, 223, 104, -38, 47, 158, -21, 158, -174, 227, 120]
3969A20p1r6J69k04J82j22n4L21k80M9k31K46j28j2Q2J9O9k47J58J34R2j68N4
3992H2r5Q0j16p6M2J22p7J19J45k64K84k36LN9n5j84J84j23mM02j65P9j89k1O7
4017F3m5O7j78J66j14J72M7j89J54J0r5O3m7j43O4p0J04k9q7Kjn2k9K21n0N4k05
4044a47J5R0L9o3Q4R6j95J44o9pk72J92K43k97L02j02J35k30l2J08o5J92j25j63
4068a27J91j09O3p4J87j46j3N5J15k08p9K62n7j78J28k64K74j47J72j0n1N2qN5
4092H3j88L72k24j9PK5M8o6J7o6j33K21j82L50k10k44L45r0J95m07N0nJ26K8k20
4117a87O6r3M29l11Q1R0r1p7J23mO9J28j70j21J50J7q5R0l80J85q5L25R8k38j3
4142dk8L08l01K50j56M3K8j36J40k07qm4k5m2J20P1j40J55N9q3K41l24R9j5r2
$$ y = [120, 49, -47, 122, -82, 100, -22, -76, 245, -35, 14, -217, 29, -99, -111, -29, -10, 59, -188, -30, 104, 196, 28, 82, -13, 67, -49, -125, -83, 39, -38, 81, 226, -38, 246, 10, 13, 72, 17, -167, 17, -106, -110, 292, 127, 206, 17, -4, 63, 18, 85, -93, 73, -41, 131, 178, -11, 143, 153, 58, 121, 74, -69, -5, -75, 29, 0, -87, -85, -86, -138, -167, 54, 4, 58, -147, -132, -42, -3, -66, 18, 114, -81, 63, -6, -13, -285, -93, 150, -147, 155, 53, 188, -42, -74, 34, -31, 161, 36, -127, 64, -45, 18, -56, 131, -15, -28, 27, 142, -66, -145, 117, 60, -118, 10, -254, 20, -127, 45, 35, -16, 36, 28, 83, -105, 267, 43, 24, 31, 56, 104, 38, 55, -11, -144, 77, -105, 245, 35, -209, 136, 46, 241, -166, -116, -121, 5, 33, -187, -121, -214, 215, -96, -15, 75, -16, -93, 30, 26, 95, 223, 53, -68, 82, 99, 14, 104, -276, -91, -176, 149, 247, 9, -4, -32, 276, -25, 225, 69, 112, 140, 4, 144, -63, -71, -115, -140, -182, -62, 9, -131, 24, 83, 0, 241, -83, 16, 1, -91]
4167i1J34O2j83J59j98J93l07L87o5o2j71J87q1J00P1k89J72j2J5j33K48N0l02
4190a16K57j26p8J13j95J47J21k05pK9o6O5N3J2J79m2o6r2o2J62l4Q2j42r9K22
4215A12l99L81K2k41K00k50L58k21j09J75p2j9rJ4P4n2K7P9m4N8K4k26K82k8Q2
4240B18j4k50kO0n0j54K66r6P2k34K70j75lK35J76m54K0J46J74l87M67j41o5r5
4264a6K65k15O1r9R4j06o8L8nJ05m2r7Q3p6L33j30k37j3P5k8J55k10L4J32j50
4289a17J14J04j78Q8j58J01jK78l0l16J10N7p2L3K0L57l11k0k42P7k2J62l89K39
4313a16OK35m15K90k02Q7J03j52K36j16k0p9M18o57K44J03K46k29j46M9L39j53
4335G1L4k10K07J88l62nR7r5K11k56N1k4J82j65J50k6R8j29j6%k7j30K51k6j02
$$ y = [-91, 43, 105, -78, 81, -117, 76, -231, 156, 91, 29, -142, 45, -36, 64, 135, -154, 18, 6, 21, -112, 136, 186, -116, 141, 15, -63, 50, -145, 2, 123, -82, -89, -60, -126, -61, -8, 4, 183, 141, 75, -17, -79, 83, 49, 131, -11, -110, 112, -287, 94, 116, -125, 75, -175, 183, -38, -147, 28, -44, -63, -72, -58, 16, -36, -9, 70, 26, 84, 108, -118, 164, 136, 218, 204, -46, -48, 12, -38, -192, 74, -22, 50, -184, 86, -89, -92, 143, 319, -135, -115, 31, 205, -182, 285, 144, 79, -16, 249, 34, 95, -4, 90, -16, -84, -46, -51, 54, 12, -85, -2, -78, 255, 125, -112, -125, -50, -78, 77, -133, -99, 33, -117, -3, 101, -77, 11, -147, -46, -47, 231, 201, -115, -5, 52, -20, 13, 33, 390, 79, 59, -183, -106, -128, 34, -355, -116, -110, 125, -290, 0, -202, -115, -12, -164, 72, -44, -64, -143, 275, -382, -138, -35, 211, -18, -164, -115, 224, 71, 105, -105, 102, 290, -72, -77, 20, -75, 136, -120, -69, -93, 89, -76, 74, 48, 146, 17, 1, 1, -26, -156, 95, 69, -33]
4360c3L49k93k21J39J13l87L43K4j6nJ86k40K28l9j76o1P6M9j97N0k2Q6K61j48
4384F6J28m24L67j5Q1l46K49j72l9J4J08m5K81j87j1l08J49P3J22j04j9O0J0O
4408D4p6r1K55j34K52j97k36K24m9K08j95O0p9J4P9j25J68j62P5k9j09j07J10
4431a00L26l86L14j15M9j52K13r2l47K09L00j66n2K11k23O8M0R8k67J66M1k33
4453i8O5j48Q7nK49j85K57k22o0J29J67o4j26k72K48q2N6k66M13j62Q4j60J88
4476I3j99K49r2%j05L8k24R2J46l1K98n55K06l7J14J60l11K61k54J47J82j53j31
4499a06K14j45N6j22K39k51J66k1k42L15r2K2j82K93l66M29n5Q6k55q7K69l46
4521a81N2L36Km7k2j72J80j91J85j58K47L1m20K87K21k38o9k37K75j61k8m6J05
$$ y = [-33, 316, 23, -198, -59, 54, -333, 10, 34, 18, 13, 199, -41, 187, 148, -28, -89, -13, 36, -161, -111, -133, -47, 214, 66, 194, -230, 137, 122, 203, -143, 106, -66, -105, -91, 17, -28, 253, 66, 55, -253, -104, -31, 91, -13, -32, 28, 38, 44, -32, -123, 132, -2, 250, 53, -183, 41, -8, 200, 5, 65, -14, 0, 79, -46, 122, -40, 35, 6, -103, -210, -100, 226, -160, 154, 39, 88, -64, 149, 57, -290, -81, 219, 53, 1, 212, -11, 57, 97, 195, -72, 94, 135, -98, -33, -181, -94, -99, 150, -35, 222, 0, -60, 69, 236, 172, 46, -226, 22, -60, -4, -270, 143, -19, 65, -95, 93, -106, 143, 51, 51, -54, -16, -240, -148, -2, -33, 265, -290, -84, -121, -7, 153, -158, 103, -151, -4, 178, 25, -106, 108, -37, 19, -103, 136, -115, 51, 30, -212, 103, 11, 33, -149, 144, -222, 207, 152, 238, -17, -104, 165, -181, -129, 207, 209, 162, 140, -32, 148, -43, 142, -16, 231, 262, -158, 129, 350, 112, 43, -194, 81, -80, -108, -154, -49]
4544d9J26q5J25om58J81K46j51N99n12j09K63j86m9j6pQ8jJ74j72O6r5J00J9P
4569I8j00j8MJ72k51P3j81J35J11P5j94O2J07k89K05l9k3Q1j78M12k09j90J79
4592D2j7J2J77l15J78Q1R6k42P1k43J81J78l41N6J62L3l3j44l8K51l39M70k46
4615C0j95M30l07O1K5j51J84M7l27J66K1j34J28N6P7j6l58J51O3O6Q0j19K05k04
4639b1j37L20k41P4j24k5M75k93p5J45J07m77J64K34j91M8J34p0q9L2r6J38q8
4662e6K73l2l34P1J13j2J8M8j53J85p1j96O6J54j03J40k08n4M7K07k72j9L21l08
4686a75J56n8N2J12k15L15J0m7j46P9k87J68o5m0J47J1K7l13K62J2j68J39L8R3
4710A07O4O7k94J5J92Lj45J6K2K50m73q8O1J33J6J15j6l8p9P5J06L7j74m4J95
$$ y = [-49, 77, -8, 117, 111, -347, -166, 80, -71, 528, 16, -93, 170, -16, -65, -81, -88, 0, -1, 173, 1, 67, -28, 72, 91, 98, -2, -20, -16, 156, -95, -22, -203, -68, 43, 118, -76, -14, 93, -196, 9, -30, -53, 28, -150, 262, 53, -137, 42, 25, 37, 214, -101, 77, 158, 254, 12, 83, -160, 21, 199, -142, -86, 76, 109, 76, -68, -106, 145, -194, 276, 30, -165, 265, -42, 19, 44, -107, 77, 124, -203, -37, -16, -150, -22, 34, 111, 95, -263, -112, -49, 17, 97, -22, 183, -21, -158, 162, -79, -5, -129, -154, 321, 28, -47, 98, 205, -272, -108, 126, -65, -17, 117, 47, -42, -10, -106, 32, -56, 217, 185, -149, -78, 35, 23, 41, 89, -64, 121, 50, -146, -80, 74, -29, 111, -97, -151, -104, 103, -169, -188, 133, -175, -19, -77, -25, 87, -128, 187, 197, 150, 4, 83, -204, -36, -101, -141, 6, 17, 44, -269, -7, 5, -163, -24, 14, 107, 171, 238, -56, -41, 151, 154, 9, 25, 47, 297, -176, -264, -203, -70, -54, 61, 45, 7, -72, 3, 109, 146, -28, -72, 123]
4735A23j48J53k15n0K55q6j63L04k38m3K40m42M08j31J40j0j65J12j71N2j15P5
4757a15K54k48R9N7j95j29K82j62K66j18J75j84J25n8L48m51P4m7k8J16j96Q7
4779d8J4J65l99R7P2j41K33R8j66n4J25j78J94J27Q7l31J15J49l50L75k3k2l1
4802A08L5j72J60k54K7K01K22l97M1M3l1j71O2K99j63p6K10j89j94M33l59j32
4824b97M70L0k10J70j49p1Q3P7j98K36n7pk8MJ0j36j9l6J21Q6j47M9L11o08K48
4849f8R8O4J16o9r1O3j33p1K92l44l0J30l7Q2j23K57k48J9K01p5l1j14J87k3O6
4874A18J33k22P8ml02K05j4J66j80M9k7k0J55l08O1j30L73j65K11j97r8P5N2m5
4898c6J17J32j59j10Ol1K20l04L2K82m4j26J5K41j21k95Q3K02J0l9l1J71L7k05
$$ y = [123, -25, 128, -87, -137, 118, 32, -131, 173, -65, -108, 132, -310, 98, -33, 107, 97, -68, 44, -127, -75, -190, -115, 139, -109, -10, 47, -148, -277, 5, -157, 109, -9, 166, -18, 107, 49, 397, -54, 20, -27, -55, 61, -135, -48, -34, 131, -268, -171, -99, -240, -7, 91, -75, -129, -4, -182, 12, 139, 226, -105, 10, 159, -191, 184, 161, 139, 108, 143, -29, 131, -123, -96, 105, 327, -70, -29, 14, -17, -188, -126, 173, 10, -66, 144, -45, -239, 194, -165, -297, 173, 203, -7, 163, 14, -57, 26, 103, -95, 141, 84, 77, 49, 53, 63, -73, -92, -128, -7, 79, -68, -19, 292, -316, -68, 30, 94, 210, 141, 50, 113, -20, -91, 201, -143, -173, -43, -80, 2, -121, 136, -112, -93, 108, 33, 2, -112, 75, 52, 118, 251, 29, 107, 103, -199, 6, -8, 158, -22, 27, 0, -20, 135, -173, -112, -242, 131, -34, 177, -20, -118, -43, 9, -36, 81, 213, 54, -56, -50, -81, 139, -165, -133, 149, 105, -21, -6, 235, 114, -181, -98, 104, 114, 75, 44, 215, 252, 47]
4922D7Nl90K00J11J33oK04j89R0k69j47L10OK0j23N8m5j55J88K9l6P3m0j9q6R6
4948F5k50L9R4M8P3o5q2J00r0j67J75O6m0l0J82L8M2l28K32j62J65p2K45j39k44
4973a05K52k76J91K7n5J76k38m0j32N7J83L6j41J05l9J9L3LK5l7q3j32L86j46
4997F9j52J76k29K89R6m32j60J78J29N0L0j05K67j41j98J51o3J51r3k19K40J91
5019B25k05J55K10l68j36J7L34n67L82m9k0j36J60p4p6N6j62L81k70lJ15K26k76
5042h1o7K34j40r8JJ29k64K79j26K96J25j35r9Q8k42K38j66K45j04j64k02J57
5064i6J98J11l25K44N4l56K22J95Kl35J64n1JN4k2R4l29K2M11m20K67l75J15l4
5088a89J07P4R4J44l94J95Jk48K11KJ01q0K0jl80M30n1J5j42j49qL77j69J02k05
$$ y = [47, 52, -338, -138, -27, 106, 100, 304, 115, 205, -64, -211, 99, 105, 125, 2, 60, 15, -140, 48, 77, 41, 114, 74, 55, -31, 65, -185, -146, -52, -4, 69, 4, -78, 22, -68, -235, -60, 6, -34, -64, 118, 156, 198, -130, 102, -60, 105, 33, 278, 139, -105, 147, -129, 62, 89, 34, 210, -28, -68, -200, -143, 40, 76, -65, 40, 1, 20, 53, 56, 81, 44, -39, -171, 215, 69, -83, 93, -136, 153, 249, -183, -343, -165, -36, 14, 44, -61, 206, 65, -133, 18, -45, 106, 13, -206, 34, 225, 20, 175, 385, 17, -119, -102, 232, -335, 47, -2, -22, -158, 2, -72, -148, -92, -254, 127, -143, -146, -31, 195, -81, -148, 86, -54, -152, -151, -22, -286, -7, -133, 163, 288, 153, 54, 142, -100, 138, -28, 217, 113, -51, -253, -96, 102, 213, -112, 132, 186, -170, 52, 247, 249, -86, 78, 27, 28, 82, 60, 154, -175, -153, 258, -162, 105, -270, -155, -189, -82, -8, 86, 230, -164, 31, 32, -216, -5, -3, 98, 18, 38, 37, -343, 87, 36, 51, -91, -240, -248, 129, -40, 62, -143]
5113a43L14L7m8k19j9R6J9j45L32j92n4J43l5p4jk9K0lp7J42k89L33j10L1j2K2
5139C9k33m9K35J58k32L5J36l7j36j97J01J43m9j26J84P6n1J2J94l40J33K06k9
5162A73l66JK36k11P6Q2kj42J84j44m0J11K24j07m2J1k9j0m1K03o1Lk81K26k14
5187a60K04j37P1m6O2m9j6P2p4q6o1K53j21QP9J3k7J32j75N1J34j12PO2R9jM3
5214B25q4n3q0K90k37m4j24J90o1k80L19Q7j78j65K67p6mK06j27j3J63l31N8O
5238d6J33j02K77j95r9l6J53Jj06m0j49L49J11k64J34l30J33M4R5p4j39K29j45
5261f6J90l70J90j3n8K83j13K4Q6l26L92k40kJ65k46M0j43Q4j04RJ76J20j2o3
5285CN5o7Q1M5l5j99R3l8n9Q1q9n4L63l32N9J40J27M7q1m70L25K05l82J87q6j77
$$ y = [-143, 171, 208, 160, -59, -78, 18, 37, -108, 224, 32, -22, 121, 86, 12, 11, -18, 2, -1, -78, 64, -225, 108, -2, 29, 17, 39, -194, -243, -8, 150, -82, -47, 89, 52, -84, -281, -180, -37, -86, -212, -28, 48, -3, 9, 203, -137, -4, 202, 173, -193, -192, 44, -167, -91, -9, -11, -153, 31, -113, -153, -42, 182, 75, 33, 44, 15, 5, -36, 167, 106, 109, -172, 54, -160, 44, -93, -22, -68, -6, -55, -71, 1, -73, -159, -220, 33, -88, -80, -1, 12, -15, 117, -58, -7, 127, 15, 22, 84, 183, 182, 225, 141, 88, 8, 298, 61, 17, -107, 83, 22, -258, 61, 148, -30, -195, 72, -4, -8, 198, 71, 58, 221, -110, -52, -46, 87, -15, 262, 67, -32, -68, 85, 86, -20, -60, -209, 140, 251, -13, 121, -209, -76, -32, 63, -11, -150, 79, -66, 124, -246, -56, -69, -127, 156, 43, 67, 153, -173, 219, -21, -23, 142, -104, -64, -207, -123, -227, -218, -42, 78, 66, 3, 58, -9, 72, 117, 82, -117, -24, -62, -121, -40, -129, -183, 180, -152, -93, 47, 174, 221, 140, -330, -5, 200, -182, 5, -81, -258]
5311b58K31LJ52j95j7J62j88J48j99K12l9R0L1j89K05m8L1k09K06j49n6R5K0J24
5335A63j08j65Q1j29J35M4N1j44m3R9nQ1J71l23n0K94j81k64L84j29N1K5j43K73
5359A68j81K52j92QL1r7q8n5P3O6j09K5N4L40j58j17J00k37J12p3j42R4J48L8
5383F0J10k71J59l4O2j06J39o9j27J2J15J34k20Q5k49K71q8q2J07J39j26K95l37
5406b1j64J72j25J30j67M3J17p5K04j90K1j76J91q2L24q0j25j67k8J09K58k57
5428h8k0m7K26J23O8m07K11J17l08N9K4L70l03M2J7k26K47j78L8j12L1P4N9j20
5452a03O6K38j37k3J2J51j97q3J63j17r9L87k41j69K38k36K04q6N7%Q4j24Q9K34
5476C08l88J6O8k6J16o8k88J17R2M3K80k13J5l6k99L69j4j01O8j93K11j27q1k4
$$ y = [-258, -27, -24, 128, -67, -84, 78, -110, 38, -161, 51, 12, 102, 133, -56, 149, 101, 132, -77, 129, -20, -76, 19, 39, 163, 55, -110, -29, -158, -23, 21, 72, -72, -115, -16, -21, 60, 231, -92, -142, 152, -29, -293, 91, -38, 13, 38, -105, 168, -13, 239, 47, 55, 86, -11, -99, -154, -81, -15, -124, -99, -45, 295, 137, 20, 120, -117, -5, -78, -220, -126, 22, 60, 170, -101, 58, 24, 86, -20, 119, 50, -77, -65, 50, 184, -36, 49, -200, 71, -17, -99, 8, 147, 21, 316, -21, -185, -13, -138, -8, -175, -132, -15, -90, 114, -76, -55, -231, -40, -122, 202, 122, -3, -170, -198, -89, 169, -88, -108, -155, 71, 194, 262, -145, 66, 183, -125, -66, -42, 328, 25, 67, 84, -142, 105, -73, -35, -147, -116, -42, 17, -103, -37, 201, 64, 41, 53, 204, 7, -76, 87, -30, -129, 258, 17, -152, 86, -150, 54, -32, 25, 25, 109, -15, 74, 308, -80, -64, 4, -22, 94, 26, -262, -145, -53, -10, 270, 57, 72, 36, -263, 106, 92, -9, 59, -134, 77, -50, -131, -155]
5500a55Q0K70k21j16K72J4j02j66K21j35K42K7k30j20L2K63k90q3L32j02N8rj96
5523a14K16m7k23L9J91j54j36K23K5J06m28L17J3k29P7J34j20L04m6j24o0J82
5545A46j09j61N7N1j5J76j09m4l1M2J25j98L02m07J71K02l05j4K13r6M2o1M1J35
5569A53r8l82L94L0M5p8j53J79k93L02k19K58j47L5j39J49J24j41N9j27N2j22
5591a19n9K19k0o5L02m60K17q1J88R5k63L54k26j3j99M4K17j54M5O4R5l68M98
5614C11l81n1J91j29Jk1R6K9j41l9K69M3n7l1o4R5m5j75m1L28j64j89K79o4j49
5639i9l7K21o8M%j74K95l23Q4K2K16l2R6O2k99k3rLK74m12J75j83L05k55K8RJ21
5666Ak0m5l0J42p6o1O8J41j65o6j13J78M9L0p2r7Q9m5J82n9j48j4K05j90J67O3
$$ y = [-155, -75, 195, -26, -142, 130, 144, 42, -124, 97, -38, 204, 231, 1, -119, -87, 176, -114, -197, 135, 33, 91, 82, -114, 102, 55, -168, -129, 62, -92, -228, -5, 20, 126, -302, 15, 28, -201, -124, 10, -110, 194, 148, 24, -36, 146, 37, -124, -67, -16, -31, 145, 36, -8, -39, 3, 128, -70, 232, -175, -4, 198, -107, -121, 92, -4, 38, -23, 18, 153, 55, -327, 67, 97, 142, 64, -89, 90, -203, 99, -120, 138, -9, 26, -113, 36, 160, 19, 78, -49, 3, -119, -178, 41, 21, -44, 258, -202, 15, -66, 122, 217, -46, 308, 82, 69, -130, -86, 131, -23, 22, 86, 181, -187, 311, -70, -121, 70, -59, -58, -79, 17, 46, -95, -134, 135, 178, 121, 90, 26, 121, 76, -99, -140, 188, 24, -165, 114, 50, -99, -136, 85, 17, 21, 21, -153, 142, -181, -97, -75, 141, 109, 205, 267, -32, -55, -64, -61, 213, -199, -24, -207, 98, -157, -129, -120, 1, -19, -64, -94, 48, -28, -89, -21, 120, -45, -111, -224, -46, 3, 33, -39, -136, -47, -92, 90, 31, -117, -131, 74, -116, 51, 114]
5692A14k73PM21l45K5j0J18j42M0o4L38o7k34m1q8N2J06K8J4N5j06K0j05K73j60
5717b4K09k81K71m31R5Q7P2P2k2p4J05k16K13j53L4J15Lj6j18Q8j54J60j76L1
5741a10R1O4J03k22K38k83N9J10k7J80k08k58K73J07j84L44l01j06k8JJ01J96
5763A40k06K20j03J34j16oO6j31J05k13Q1N6J6J79j76p4M5j21j6K95k01j4J55
5786A15p9k28p5K96j29J82R9j37O9n5R6l61K60K8l26L50r4K9K01j19l34J97M3
5809B8n8j98L53k39N5j45O3L7p3l8L13k06J41%J64r3k65J78M3j22m9K50j80P0
5833B9J11j92J20K6q0J21J3j46k0k8J03N9j79j19R0J45R4j66k07J26Kk0k3k0K20
5858E9j90J93j23K58j54JLj71q0K26J2k16K41qm6Q5j77O8O7Q0l3p5L41n07n3P4
$$ y = [114, -159, -152, 269, -76, -51, -61, 57, -85, -45, -109, 229, 162, -72, -113, -201, -149, -43, -15, -1, 54, -52, -32, -137, 136, -24, 185, -96, 175, -256, -161, -74, -2, 70, 48, -26, 79, -137, 76, -77, -43, 72, 75, 59, -59, 29, -125, 35, -141, -110, -19, 45, 148, -74, 164, -119, -60, 50, 23, 203, -5, -263, 10, 117, -67, 277, -24, -130, -158, -157, -56, 140, -66, 154, 51, 185, 69, 63, 129, -2, 103, -110, -29, 27, 43, 222, 46, -28, 17, -104, -120, 175, -26, -40, 115, 36, -192, -267, 29, -100, 82, 181, 44, 113, 58, 154, -207, 53, 81, -245, 105, 11, 40, 241, 122, -212, -15, 28, -30, -228, 125, -114, -59, -204, -141, -104, -177, -215, 98, -108, 33, 33, 197, 104, -161, 17, 60, -62, -111, 139, -41, 29, 140, -52, 68, 94, 14, 135, 148, 2, -18, -46, 57, 116, -63, -182, -92, 53, 147, -19, -226, -100, -98, -118, -141, -161, 59, -131, 62, -61, 197, 43, 44, 47, -124, -204, 22, 34, -182, 59, 51, 5, 90, -87, -19, 48, 128, 95, 20, 361, -146, -199, -125]
5884a25o6L36n5R0n9J8k60K12m5k92L02K31l97R1j38J95o3q3N4q8J38j33J33l1
5908c5q4JL29q3j87p1K20j01j46J12L99j32m84M72l21J49j62R6R6j00j13J99j30
5931g6K70k04l2P7j94K49m8K60l54J7Q1R8j39M5K36l54J01L9n8K0J31m7P2m0P4
5956B24j90Rl06K03K47l44J56M0K01k59j4k24N16r5k25J58N8k95J13j3J79J04
5978B43m46J42j30L75j70j50J48K5JK0O6l6J02n5Qj56q3J81J55k96Q7J54m3o8
6002G4j71J84Q7o2O3k34J09j56J33K1k09R9M5j3K32k16q2K70k40j90N03q9k31
6025g3J01J08k4p5j65R8m9l0L4J04j49j74K01L31l08J61K7k7j00P7j06nJ02p1
6049a2J53j21J71k84P2j00K89Qj40p9J29j97k7J24O0k20J54P1mk22P2J14J81l8
$$ y = [-125, -191, 145, 90, 180, 121, 139, -121, 91, 46, -246, 56, 287, -110, -19, -157, 38, -25, -108, -54, -142, -4, -137, -4, -35, -119, -118, 211, 128, -59, -130, 90, -11, -157, -45, 354, 222, -262, 210, -111, 38, -124, -28, 68, -32, -145, 54, -76, 194, -10, -42, 35, -159, 90, 42, 302, -52, -35, 46, 144, 5, 50, 286, -68, 33, 72, 14, 34, 165, 118, 190, 150, 224, 34, 43, -263, -60, 187, -157, -1, 39, 240, -19, -33, -257, 259, 164, -61, 97, 155, -140, -27, -40, 139, 243, -203, -61, -191, 184, 14, -136, 12, 37, 38, 58, 124, 88, 190, 135, 143, -13, -96, 85, 240, -56, 31, 185, 142, 74, -97, 87, 174, 112, 175, -59, 50, -106, 27, 48, -161, -62, -17, -30, 202, -14, -96, 174, -66, -256, 247, 158, -73, 28, 136, 112, 37, -128, -30, -79, -109, -75, 29, -120, -294, -93, 238, -70, 91, 118, 91, -9, 68, -38, -43, 59, -12, 141, 20, 191, -93, -21, -121, 168, 176, 36, -43, 86, -111, -138, -14, 46, -174, -20, 51, 47, -175, -103, 11, 192, 154]
6073A54j24j93K85K34m80O8J42o5l7m0J22j84L20m64K95n1O4J32j15L7P6j50P6
6096A02P4k66J08L9j61J67Q8J1Kq3l5m0r0l7K75m44L17j95r3J69J60j94R8M3J33
6121A48l24K70k36N7R9j82M5K49M3O8k01M8j44j72L17p2P3P7M4m21M62j47j2n2
6145C7m0J85k83P7Q3j97K45j31O1K5j43J5J67m7j91J29R2j13J48k19J58K17k55
6168B0j45P4L39l10k3K08k15K29m54L83k62L44k41L4R2k31p6Q9K06j20j6K4K46
6191A95k58J57k68K32j70J67j13O7j12J96l6p0m2R7L2J08j76rO8j98O3M6J31j10
6215cm8j0J56j11p3Q5J1p9J86k73K41j14Q9Rj41k8K9JJ42j04K25m19K65j14J01
6240B3q6o5qJ21Q5K6J51m80L53M3k13N1q4rJ87m3J26j18m5K2j14P0l6P7O5j54
$$ y = [154, 30, -163, 122, 356, -124, -56, 86, 21, -16, -56, 66, -118, 202, -262, 33, -18, 46, 178, 63, 100, 176, 26, 102, 176, -90, 18, 57, -104, 63, 151, 162, 164, 81, 46, 6, -84, -121, 154, -290, 27, -168, -261, -92, 68, -126, -28, 15, 148, -176, 94, -142, -85, 14, -168, -123, 126, 169, 237, 36, 84, -60, -232, 85, 13, 86, 163, 207, -214, 248, 101, 89, 37, -3, 182, -101, -24, 59, -138, 107, -24, 37, 62, -81, -66, 101, 54, -137, -8, 84, -29, 119, -100, 58, 275, 20, -125, -51, 288, -22, -45, 163, -52, 177, -277, 106, -156, 188, -53, -19, 73, -158, -234, -145, 61, -59, -75, -51, 195, -63, 94, -174, 58, -112, 55, -58, 9, -103, 93, 57, -13, -55, 42, 74, 182, 6, -3, 65, -133, -70, -24, 107, -3, -51, -61, 95, -16, -89, -4, 7, -72, 114, -159, 82, -32, 57, 66, -75, -103, -74, -73, 69, -35, 190, -229, 36, -78, 23, -63, -128, -136, -15, 70, 96, 247, -233, 120, 163, -50, 1, -83, -92, 95, 52, 178, 60, 15, 37, -77, -7, -43, 34, 99, -55]
6266e5j59K51q7J80n0k70L49j34R9o5p2O9p7k4K04j49j68K8p1K2K82k89J89r6
6290i3M65j39j11j87n5L02m3k65Q9R0j37O5J4N1p0LK30k73j30K40j88L92j34o6
6314E0j78J1J80R4j02j31L03j88JRn0M5n8j12J29k13J71J31j25K50j60N3j55q2
6338a27R5J38n3J42m84K74J19k75J11qL8l8P1j95J80L8J36j65K09j73j2o5J36
6361I2l44L03J7j52K9L54n21M7J67J11j89Q7p4R3J43k36J08j20KP8k42J53k4Q8
6385c0O1j26L64l78K72K3j00%Nj82Qj9J0J03j82J93j50K2K13k85K91r7j05J14
6409B5o2o0r3K84k46Q0J64l02L71j01J05j64P5j86J67j00R9J14k38K08j78o3J58
6432E7j94L20k01p6L18k62j06P3j81K40pJ06n5%J29j82j5J36J27l75M07k30N9
$$ y = [-55, -214, 37, -50, 130, 80, -190, 159, 25, 124, 59, -13, 56, -21, -45, 159, 10, -158, -130, -201, -179, 103, -186, 3, -93, 372, 233, 122, -65, -120, 182, 139, -126, -37, 53, -84, -19, -5, 46, -24, -21, 209, -64, -194, 46, -142, 250, 116, 50, -128, -117, 63, 157, 55, -76, 227, 39, 40, 49, -1, 44, -14, -126, 3, -210, -39, 92, -33, 217, 57, 110, -45, -127, -32, 106, 53, 195, -289, -15, 104, -171, -60, -68, -30, -68, 3, -192, -12, 26, 162, -3, 206, 33, 21, -44, 92, -252, 51, 68, -84, -55, 299, -222, -175, -8, 103, -86, 1, -73, 20, 163, -73, 35, -85, -83, -5, -247, -94, -118, -30, 31, -95, 269, -109, 163, 186, 86, 86, 91, -91, -83, -102, -92, 11, -171, 22, -128, -106, 107, -178, 113, 16, -89, 25, -37, -97, -190, 94, -152, -72, 92, -210, 161, 60, 165, 1, 76, -110, 57, -43, 56, 170, -68, 140, -38, -101, 57, -137, 183, -18, -94, 224, -38, -144, -71, -252, -12, -19, 87, 32, 32, 161, -21, -36, 100, 227, -148, 259, 29, 88]
6455H8k7l10M00j48jP3R8l27N0o3J15L2J97k14k0L9j11K07m31L15P6J45k75k2
6479a14j4J3NQ1J8Rj48J73R9k9j54K6k61L06J87k95q3K94j62j33K57R9k39Q9j60
6504a36K01K9l1K04k92l7O3J71q6j37K85j72n3j31K06K7l15K54j9pl8L5j39L12
6528A94k89J98q8J66j15r0qN0J06k55j0K18P6k26Q2QR0j04j39J30J25p3k38l3
6552b25J75J40k42L27j81J96j05k42J53j54K87p1Oj06M5p0m9J32J2k00P2R6k15
6575b19J62j53J13J47J86k67N2J67k99j2R3Q2P9j49r5n9L30m79K50J94r1q9j7
6598g4J86j99p1J58M7k34K09K62k04K0n7Q2o0O2l56K51M9k15O9J91j59J1J20k16
6622a28O8o2J43k9k37K79j62J49P3M4j02K13k95M7N5J10n3N3k81O4Q0R3k19K47
$$ y = [88, 61, -249, 151, 3, 2, 75, 173, -154, -104, -167, -52, -20, 177, -37, -57, -18, -129, 78, -353, -38, 38, 183, -92, -114, -128, -115, -110, -29, -11, -2, -150, 23, 122, 93, -61, -35, -296, 10, 197, -98, -181, 113, -49, -182, 75, 174, -65, 24, -136, 65, 94, 63, 267, -25, -62, 1, 172, 86, -51, 234, 62, 9, -122, 84, 111, -204, 50, 31, 24, -14, 21, -118, 194, -95, 103, 15, 181, 66, -24, -32, 18, 124, -131, -141, 77, 153, -73, 9, 17, 107, 3, -136, -6, 119, 46, -192, -225, -50, 90, -152, 175, -6, 190, 85, -157, -4, -158, 129, 58, 64, -42, 3, -67, -116, 16, 28, -172, -100, -4, -219, -57, -210, -97, 50, 236, -31, 21, 188, -111, -123, -30, 52, 131, -18, -113, -172, 158, -321, -71, 123, 32, -57, -74, 112, -87, -158, 0, 47, -187, 22, 284, 80, 100, 43, 125, 65, 127, -229, 22, 71, -144, -75, 116, -43, -32, 88, -128, -60, -122, 21, -8, -245, 34, -128, 21, 94, 138, 36, 249, -46, 1, 56, 166, 113, 166, -115, -51, 29, 122, -97, 150]
6646A50j95j53K74J1m18M16j61j54J52R8P0l12M51l19L06j24L0l10J4J38J49j46
6668c3j9q1M33l97p5N0K32J3k06M13o12K53K23r4k95J08J34j11j2o0J26O7j21
6691f4P8K62j70N4j32pn2j22q5Q8K35j3r6J62R7j94l17L11J12r0L4J31j21k87
6715a86J57P5j65J41j44L54k71K6M5J67%k31KK4L5J3l4q4j11J51l2J45M4j17K12
6740B16j15J68l18J22k03J07K0j26J65rJq0K51k89j28K01J33l59R1K04J15k36
6762f9O8M5K8q6J20R7k20J77J0j13J12k03J94j44P6O8l05R3j21OK56o9Oj90k3
6787a87K22p3J8j1Lj82N6LJ02N7Q1j46O9J78n5q8J41k61P3n0j9P2j61M3K8J52
6813F5K4nj53O2M3j5k8J06k51k3N4J6p9L48k70o8J86P7j41J03J59l62j65L79j65
$$ y = [150, -45, -198, 76, 87, -331, 85, -76, -230, -78, 20, 90, -222, 229, -90, 216, 92, 122, -188, -174, -36, 113, -33, -52, -133, 300, -97, -172, -122, 110, 123, -83, 330, -282, -29, 194, 100, -195, -87, 47, -64, -76, -136, -10, 57, -64, 14, 276, 106, 160, 28, 21, -31, -153, -238, -150, 85, 72, -24, 138, 235, 41, -276, 35, 147, 57, 91, 222, 101, -186, -29, 46, -119, 22, -122, 232, -39, -13, 32, 199, 199, -32, -30, -6, 29, 42, 8, -76, -187, -36, -68, 77, 121, 4, 216, 101, 269, -49, 73, -130, -23, -3, -129, 36, 27, 28, -52, 199, -90, -218, -17, 116, -243, -152, 52, 167, -69, -1, 44, 72, -14, 106, 203, -17, 160, 170, 57, 169, -34, 160, 16, 92, 160, -145, -52, -173, -167, 89, 20, 26, -164, -187, 35, -38, -20, -31, -28, -210, -154, -151, -49, 8, 89, -57, 12, 190, 135, 47, 188, -73, 0, -50, -69, 3, -158, -115, -87, 65, 89, 84, -69, -7, 36, 21, -7, 99, -152, -175, -121, -105, -184, 164, -106, -174, 12, 89, -52, 51, 210, -152, -317, 62, -103]
6838a03k6J73m4j67J77j48K69j85J08j3k27K54P2k71K9J64R3k05J22q9J10P3k04
6861c8K33l70K17p6j12J88k08K22P6k7j28Nj61J97J62k48N3J16k00lR2o6J46q
6885F2Q6k09L17m55R8j44J72K04N5l64K10M9k75J91K1J09p9j1n0J40k70J66k0
6908Cj29O8K16q6m3o5J79j59j58O0N8J33j57QK59j51kk8M0J04m64L79J45l30K17
6933I7k99K35j16J25l2j13K82l92L78l19K65j28J02K5j35J18r0L35n08L17l81
6954b34K02k6l2KJ4N3MQ2j22k00J99P7j2p7L11J0k12Q0k60J57k14K6M2OK87l13
6980a50P1k51L31P1Q4J9k86J11M1l81L64j54o4J39R4k48L65M9j40j64K55O7j95
7003B8R9J93k17l92N99l18K31j43N6Qk41Jk52J82K44k10J84K8l23J68J1kp0J12
$$ y = [-103, -129, 44, 0, -167, 10, -138, 131, -54, 54, 41, -186, 68, 140, -131, -102, 62, 155, -50, 72, -17, 93, 166, -38, 195, -175, 42, -34, -146, 42, -166, 56, 132, 105, -23, -18, -179, 18, 180, -68, -15, 101, -99, -102, -10, -76, 70, 62, 148, -61, 256, -199, -101, -245, -73, 131, 186, -178, 32, 81, -194, -3, 18, 127, 48, 37, -13, 127, -143, 23, 3, -126, -58, 158, 72, 29, -36, 143, -16, -174, -114, -56, 77, -80, -72, 187, 36, 34, 6, 46, 150, -314, 65, 210, -120, 97, -202, 33, -83, 42, 10, -103, 179, -213, 165, -154, 111, -17, 85, 110, -25, 93, 3, 338, -170, 147, -234, -32, -58, -90, -88, -74, -21, -17, 65, -57, -257, -58, 19, 7, -70, 241, 251, 39, 119, -141, 16, -198, -172, -130, -124, 163, -150, -79, -330, 1, 72, 156, 175, -111, 0, 41, -340, 24, -130, -194, -55, 39, -209, 156, 205, 65, -99, 156, 223, 28, 127, 320, 103, -289, 310, -8, 223, 80, 136, 144, -97, -96, -348, -166, 78, -132, 52, 80, -243, -75, -64, -66, -136, -24]
7027b4m6J28Ol73K59j03K61Km5J07k69N9l2J21K5j27j13K60k37N0J44L6k87R4
7051a04K67j41J7j01J1p8m6R4O8j84Q8J73L5l51J60j57P2L13l2k45j73K78M8k43
7075b31M6J31N9k06K32n5J31j20j88J27O1L6k7J72k98K37J64q6K38n40N4J41p8
7098@QJ9K5M2k66J05N8%k15N7M18r5l72K58j7j3R3L3J38k03K6m7k7o2Q7Q3k10
7125g7J37J72k68J93j08J60j32j47j82L19L3j35J50J10m23kP8J5N1J8N0P8m23
7148c33O46l78j47M27k98L0K51o6j8l67K40o5J8j29K24LKj43L50j57j04r5l4J88
7172D5J74q8l38K06k60M55l26K89j68P4q1j56J71M8j6L5k67L03o1p4k38K02O1
7195a0k19J20NM0J60j28K73q0J49q5k54p0j08J87K26k93Q0Q8l60L56j74K0J31
$$ y = [-24, -70, 58, 64, -309, -50, -153, 108, 110, 65, 172, -97, -38, -70, 51, 76, -51, -164, 96, -141, -91, 53, 89, -198, -104, 163, 22, 39, -62, -51, -129, -175, -81, -13, -197, -109, 64, 99, -252, -92, -249, -177, 136, 104, -141, -314, -36, 12, -231, -185, -54, 5, -201, 31, -24, 107, -13, -201, -74, -13, 23, -4, 168, -130, 107, 271, 185, 423, -117, -63, 78, 0, 8, 27, 52, 94, -172, -67, -9, -9, -224, -167, 251, 156, -216, 42, 25, 12, 105, 138, 276, 73, 99, 52, 25, -37, 50, 133, -77, 60, 232, -36, 157, 49, 209, 77, -70, -252, 67, 100, -35, 115, 225, -198, -200, -122, -107, -56, -38, 12, 90, -333, 313, -65, -212, 215, -83, -53, 198, 132, 114, -253, -13, -78, -60, -189, 35, 38, 40, -103, 247, 90, -14, -109, -143, 45, 219, 131, -207, -1, -261, 194, -132, 157, -11, 63, -18, -174, -3, 45, 29, 64, -203, 100, 39, -35, -273, -71, -10, -229, -109, -104, -64, 96, -32, 241, 161, 310, 225, -29, -99, -207, -20, 206, -87, -7, 81, -279, 77, -97, -77, 54]
7218E4j61J75P4j05q4j3l7J60Q8o2r6p5J67r4o4j5K46k30j07M72k46n1P1K4k8
7243F3j85L19j39p9k22L77m3j57J01j07MO0j48l3k15M09Kj65K42k09K50p4p7m3
7267f9J06J08J5j97J28K31k17l08K82j51k80M86P8Q0M0l27Q2k25K06n8j06J96
7289A00k92J65K51l17K66m4k74J20q7L08l06M7K4q3J59J0o3R7j29J49j15K33m94
7312b75L28n9J60Q3l75O4q1K58j14k31M14j56P2N7k9k01KJ73j25M1J10k24J15
7335GO0j44K09pl20K13K16k25j03L9J94r1J31l03M86k66j51J08M0k34O5R2p1k52
7359c07L69K73n23J75J6J61j95j15j35K08K37p5j16j80R6K28j21p5j21J79M8Q7
7381A14p3l58M03j2m38K72J75K02m44P9J38l54L51j34K5L53m97J20J56m70L89
$$ y = [54, -107, 68, 142, 37, -47, -60, -97, 63, 151, 89, -7, -82, 85, -9, -73, -88, 158, -72, -179, 293, 47, -4, 67, 91, 63, -122, 197, 58, -21, -243, 134, 91, -66, 35, -72, -68, -8, -156, -189, -404, 5, 7, -158, 84, -125, 125, 51, -26, -69, 37, 145, 160, -37, 91, 322, 105, -203, 79, -72, -352, 134, 212, 292, 332, 5, 87, -138, 68, 10, -96, 100, -192, -27, 224, -93, 173, 129, -145, -25, -112, 196, -110, -63, -39, -122, 37, 47, -16, 81, -48, 101, -14, 219, -275, 53, -6, 154, 237, -138, -74, -155, 103, -11, -242, 172, 16, 88, 145, 116, -85, -83, 90, -35, 6, 116, -108, 7, 67, -77, 132, 125, -195, 18, 234, 9, -94, -55, 139, 48, 179, -124, 362, 96, -55, 53, 93, -141, -76, 16, -55, -307, 62, 335, -188, -13, 3, 164, -31, -146, -281, -73, 164, 89, -27, -207, -111, 117, -4, -79, -200, -21, 27, 114, 41, -317, 86, 74, -364, -92, 83, 285, -159, -80, 58, -296, 55, -79, -54, 299, -198, -78, 78, -392, -3]
7402ck9l8J36j87L9L2N6j64r1L63j38J39j07N4o1L9j12k00K56MJ19J44l15J24
7426F0n4q4N1J29J29k36N8n1k83N05l42J53q5O9k15K50j8o6m3K14p8k7j34K6N7
7451a5J55j40RJ05m8p4K47Lj83J67j44P5o4l45J50j47L20p5m8N0N9q6J8k88L28
7476B9j5K49j49Mo2k26N24m98o5J14L20l18j48K82j69K2K33l5j58R6K8p6m8J28
7500F2j19K95j44mJ40j70L2j26rLJ61j78Q0j7k09J61J11O8l53L18r3J46r0O9l2
7525A02o1l6L0o5q0J50q2L2j38Q1q8K9K44j3m7m25K76K3j5J34j76J32j0k2j1N5
7551A9nN3p4p7K3N5l0J48l45m6L59o3j69MJ11j63J26J45k0mj14Q4L5j30J55k1
7577E6Q5l3m68K96l4R9J16j5k65P8%K29k63K11L22l43nj05J05p5k35J89J31j07
$$ y = [-3, -32, -70, 66, -121, -82, -50, 6, -158, -249, 114, -24, 115, 8, 62, 1, 40, -72, -272, -16, -12, 107, 251, -64, 60, 6, -78, -27, 102, 231, -5, 53, 2, -281, 224, -118, 35, -50, 19, -196, 54, 36, -30, -73, 141, 63, 36, -98, -72, -15, 140, 0, 9, 114, 66, -8, 239, 242, 59, 226, 82, 157, 93, -252, -102, -249, 71, -4, -52, -2, 57, -29, -11, -299, 29, 14, 263, 114, 118, 56, -170, 354, -144, -209, -95, 225, -93, -241, 41, -128, -106, 127, 92, -66, 30, 58, -18, -66, 62, -57, 238, 94, 90, 230, 60, 92, -34, -43, -40, 121, -57, 23, 6, -203, -42, 69, 137, -216, 102, 9, 155, 65, 134, 102, 41, 5, 35, -30, -110, 40, -42, -10, -148, -67, -155, -126, 118, 105, 58, -367, -91, -68, -83, 51, -125, 7, -3, -25, -36, 19, 14, 67, -7, -84, -61, -6, -36, 112, -233, -279, 80, 17, -152, -148, -37, -200, -74, 71, 51, 47, -67, 17, 52, -78, 77, 56, 141, 108, -360, -64, -98, 1, 117, 102, -163, -85, -85, 144, -119, 92, 414, 71, 66, -39, 66, -9, -244, -55, 76, -31]
7601c1k61L64k01J30J0j21p7L68j30k44L48k83J45om2p0j7J88N1j64R7N8k44K01
7625F9J1k9o5j6J57j00R3k44o2J34J63k32K38km5k75K96m71J11N24k52K14l74
7648a57K02J3j31L89k75M6j77K86M7j80o0j51P5J23N2l66K19Q3q8J60k92Q9k09
7671c02K79K00l49K38n1Oj32J50p8J42P2k61j45K92j09j23M03o4k07J47m8LL9
7694A02J11k78p7K75r2J94l38Q8O9j15J05J77l94L21O3k58J05j37J48j08J89M
7716A54J17l01K70j91k37J21L7m7J67j74Q4k29K96j7j01J19n0K7Lo1K81k35m8
7739a5P0jj0l18J40K86J2j52J23j61M7p6Q9J65j36k30O6L60k79J70l59M62q3l05
7763a35J79J8k06L34M9k16q9m1K57k68J18k9o1O4J2k7J60n5j31J72l79L52j21
$$ y = [-31, -292, 72, -129, 1, 11, -110, -187, 181, 51, -193, 155, -128, 17, 11, -31, -101, -118, 70, 121, -43, 54, 112, -132, 69, 80, 51, -14, -30, 127, 27, 120, -124, -186, -52, 111, -121, 117, 115, 70, -205, 91, -380, -269, 255, 3, 217, -157, 45, 58, -73, 316, 41, 87, -90, 196, 243, 63, 3, -148, -73, 50, 102, -264, -45, 38, -50, 110, -182, -93, -302, -23, 177, -172, 66, 15, 21, -111, 39, -39, 103, 175, -86, -231, 61, -48, -171, 232, 168, -39, 108, 60, 63, 102, 213, -65, -142, 133, 41, 235, -103, -15, 54, -61, 44, 221, -173, 148, 211, -47, 58, -79, 69, -39, 150, 154, 271, -30, 240, 49, -188, -67, -30, -77, 90, -84, 0, -229, 67, 50, -51, 68, 18, 45, 48, -13, 268, 33, -15, 55, 54, 44, -274, -134, 152, 164, 12, 135, -26, 21, -55, 34, 199, 63, -167, -101, 259, -20, 150, -209, 253, 170, -135, 44, 62, -144, 190, 239, 23, -66, -107, 150, -118, 0, -29, -90, -26, -14, -41, 119, 64, -67, 105, -274, 78, -43]
7786d3J61k2r8Q2j65Q6k2j05Q5M8j22q2L19j01L3M6q0m3j53j4N0K2J7L1J93j8
7812A05k94K6l8J42J39J73m21K80j95m1L38n05K30J23j76J09n0J64j59J52j83
7833h1Q2J37k38K25L6k4n37L63J8J84j12M8j01nR4k24J30o1j09K68j10j51K68
7856A00r0p1L1jl14J37K95o2J71r9J0P6O1k16k27Q4J70Qm13O14k95K35k08O5j65
7881a04O9J95m82M49J87k06Q3l20K57k10J84k25J55K0Ml74L74J7j12p0R6L4R2
7904A13k03m9j66K88k7M8J14k43P9rL00l23K99m04Q1J73K5j03r7J75k10l9J94
7927A6k61O2o2L65k23K19l6k57J59K32j41k45K06o1O9k18K16K1q0j70J16K34k91
7950a30R7J37l39J47J3j31L26j26j86M25k70%R1p9J86j80k0P7J41m0k57J59r1
$$ y = [-43, 118, 96, -2, 80, -85, 1, -21, -126, -41, 7, -115, -197, 122, 21, 54, 100, 20, -23, -176, -190, -140, -118, -101, -70, 123, 105, -189, -163, -201, -59, 80, 253, -168, 112, -83, -124, 214, -291, -61, 62, -114, -5, -55, 109, -50, 102, -81, 1, 138, -100, 125, 161, 137, -400, -37, -19, 165, 53, 101, 0, -5, 89, -135, -5, -66, -175, 93, -17, -168, 100, 10, -61, -30, -31, -345, -208, 87, 25, 196, 97, 107, 183, 244, 28, -199, -115, 55, 63, -350, 264, -31, 204, -4, 61, -104, -35, 160, -322, 127, 314, 108, 191, -129, 128, -82, 102, -123, 32, 52, 56, -318, 56, 73, -39, -109, -13, 21, 113, -90, -139, -305, -17, -44, 4, 118, -125, -46, -55, 245, -78, 221, -183, -102, 71, 96, -7, -104, 71, -139, -178, 16, -245, -183, -245, 120, -103, 116, 80, -177, -18, 214, 73, -172, 34, -27, 42, -176, 40, 61, -19, -189, -73, 161, -130, -33, 104, -235, -88, -75, -206, 120, -6, -192, 233, -37, -37, 54, -25, 161, -19, -39, 38, 179, 139, -118, 41, -50]
7973e0L5lj48K71j57l5k7QL2J2J31p9l2J68j14K58k74J84o4o6J69j50L1k25N0
7998g5K16k03o0J08k47K68J82p5j46J16j18P2k65J46j15m9K62J6j61N07j89j52
8020C8L7m5p6J40L4n0j6j17q9K47k18lK47k19O8L05m68N5J62j4l7P1n1Q0P4j64
8046iJ7R8K92l64j70oj9L30j09j1j60L90j46j28l9K91l30L2J25k64Q8J52j24k9
8070i3J61J24m5m4k39M4j7L2K08q0P2l70L24M4j97J62j78M1pJ96m4j37j78J58
8094f3J12j05J70m7j93J21K3q8J02P4O7k30J07k1k5j24J79n1j22K80j76J52k38
8117i6K51m9J92j13k09K54o6j08L08l59Q8l51J34K64j78J83j97j4j5O3J92j83
8139im3j98L25j80P5M2n1j78K48J4j91O8r2K62Q2p3l31K15N0k32L05q8j33J12
$$ y = [-50, -15, -18, -166, 105, -52, -87, -114, -106, -74, -62, 69, -10, -42, 126, 12, 270, -4, 180, 116, 50, 219, 69, 100, -125, -75, 141, -62, -122, -14, -261, 7, 189, 114, -32, 84, -34, 38, -227, -81, -196, -245, 17, 33, -128, 379, 190, 38, 75, 30, -46, 94, 128, 78, 62, -55, -144, 103, -115, -118, 129, -90, -22, 283, -185, -130, 32, 18, -19, 52, 1, 81, 155, -9, 8, 106, 398, 34, -136, -142, -161, 169, 60, 49, -111, 279, 133, 5, -34, 257, -73, -41, 84, -180, -92, 60, -64, -93, 68, 192, 147, 103, -136, -92, -109, -77, 131, 51, 123, -247, 77, 121, -76, 86, -92, -51, -58, 138, 94, -43, -221, -63, 49, -56, 114, 67, -126, -5, 18, -70, 32, 106, 173, -57, 50, 29, 4, -120, 59, 8, -114, 166, -10, 142, -96, 155, 106, 298, 185, -24, 230, 164, 56, 364, 5, 93, -258, -124, 140, -38, 145, -52, -66, -81, -18, 174, -9, -52, -250, 75, -105, -30, 12, -39, -217, 31, 45, -146, -78, -170, 92, 174, 101, -230, -15, 35, -197, 108, 20, -113, -1]
8163am8P4K00j64l23K60q6J12l6j44J00J6O6m8m4J56q5K16j50l01L07j37M6J34
8187A20l87M99l92m6
$$ y = [-1, -49, 25, 225, 61, -262, -2, -88, 24, -12, -156, -56, -40, 26, -22, -66, 90, 5, 221, 71, -230, 77, -60, -14, 120, -267, 232, -160, -206]
8191b06
$$ Imaginary data points
##PAGE= N=2
##DATA TABLE= (X++(I..I)), XYDATA
0@%%%%%%qJ6j6J6j6K4m0M8n6P2q8J12j39J71k08K42k90L44m00M69n43O28p28Q36
30D46r56J090j238J404j586J786k009K253k520K811l130L480l859M274m727N218
46B737n759O354p003P714q494R355j0311J1373j2558J3895j5412J7150j9162K1520
60A1399k4337K7766l2051L7574m4984N5500p1676R9950j63228N46643P1782o82128
72a67790L39021n40826J43381K06129Q0432L38635j33588j99866j18490k09276
82b62238L9148N2555L46184R3008p4595p2720k48708j02721n6637K06360K99771
93B19407j8581P1563j97820k24490q4816j8763L10070J59307J7583p9558j57896
104c994n3789k55443K09958K24968j69127L18484n6385l21331J1506j54001J17710
$$ y = [0, 0, 0, 0, 0, 0, 0, -8, 8, -8, 8, -8, 16, -24, 24, -32, 40, -48, 64, -75, 96, -112, 130, -160, 184, -216, 253, -290, 338, -390, 446, -510, 580, -658, 746, -840, 946, -1063, 1190, -1330, 1481, -1649, 1831, -2028, 2246, -2481, 2737, -3022, 3332, -3671, 4043, -4451, 4904, -5407, 5966, -6592, 7303, -8109, 9041, -10121, 11399, -12938, 14828, -17223, 20351, -24633, 30867, -40809, 59141, -104087, 442556, 514338, -167790, 171231, -369595, -226214, -20085, 60347, 398982, 265394, 65528, -52962, -262238, -223090, -170535, 175649, 268657, 194062, 121342, -127366, -230087, -286724, -80364, 219407, 200826, 272389, 74569, -149921, -234737, -253500, 56570, 215877, 233460, 153902, -3994, -57783, -313226, -103268, 121700, -47427, 271057, 214672, -106659, -95153, -249154, -131444]
115a31444J51396R0318J17202j70458n9757j33804r1591J59227P7230J64263K4657
126A97239j08924j25338j25036P2680l1479K10984J61671k20909R4858j62046
136c6300j47681J96981j43106J62641J88499j64857J0981r9426r3137r906O7503
147f7808J93800l9632K756j4020j68024m2751J8556J46587M8796r003N7633j47984
159b1094o0457N668j4321J16541L5868k696M010k9912j16754m3338J24155n6507
171e8837R4977J22861j81642M8529r5909j06896K17373o0845M4283J08499j29645
182B748l3749n4391M0330L4143j8117J30304m3563o3853L880n1223J4503r599
194d8587Q2368L2661m4882L3374j01800q362K7683l5911J17199O917l7148o675
$$ y = [-131444, 19952, 110270, 227472, 57014, -2743, -136547, -228138, -68911, 8319, 172582, 197239, 88315, -37023, -162059, -89379, -120858, 90126, 251797, 30888, 125746, -36300, -183981, 13000, -130106, 32535, 221034, 56177, 67158, -32268, -125405, -135311, -67808, 125992, 86360, 89116, 75096, -92928, -135679, -117123, 29464, 78260, 69257, 126890, -21094, -81551, -75883, -90204, 26337, 62205, 59509, 63519, 33607, -83147, -126485, -2330, -58837, 36140, 159001, -22641, 25888, -70021, -176917, 40456, -20389, 23894, 132393, 2748, -31001, -85392, -45062, -10919, -29036, 101268, 57705, -6148, -2268, -53491, -38988, -48587, 33781, 66442, 21560, 54934, -46866, -55228, -27545, -63456, 53743, 60660, 23512, 16837]
206A6837o1795n89q510N9328M0478k1412K3475p3019j11J1792m2982Q5357j128
219B7721j0471J5902l2190o57o7540M5348N8783n2895O4764l555p8169o219J1731
232b7447J2348Q649N7872l4952l2369L5157q6136N5516L5768o1548R3532m4237
244A2153k7051L8396o9283M7874m036r113O0885m0473M508k4149k3827L6660j8232
257a5688L7154P638k1097j2161l0681M2131l0561O076O9943o2597j045K9673m2241
270b3456O61K4147N672p901K3764j7423k3708L3770m3416J8708L8487m0356L8818
283B7767k1492k0243J6877l5640M6726j293j5037K9131m3320J1209j647j3859
295b0821M0165j5149l948J526K987q264k2290M8168k7120j0458N0994m1267O650
$$ y = [16837, -44958, -45547, -54057, 5271, 45749, 24337, 47812, -25207, -25318, -13526, -56508, 28849, 27721, 17250, 33152, 962, 305, -67235, -21887, 36896, -15999, 48765, 45210, -32959, -39178, -27447, -15099, -6450, 51422, 16470, -15899, 19258, -66878, -11362, 24406, -37142, 56390, 12153, -14898, 23498, -45785, 2089, -1947, -11060, 49825, 9352, 13860, -10289, -34116, 2544, -15688, 21466, 29104, 8007, -4154, -34835, 7296, -23265, -17189, 52754, -9843, -10888, 18785, -23456, -22795, 1352, 7024, -877, 22887, 5464, -18244, 15526, -27890, -9182, 29305, -11051, 27767, 6275, -13968, 2909, -32731, 13995, 12702, -2335, 26796, -16524, -5315, -6962, -20821, 19344, 4195, 247, 1773, 4760, -3504, -25794, 22374, -4746, -15204, 35790, -5477, 1173]
308A173J182j9380K3758j5030K5189j171k3551J6501l0919J6501J6775j8097K0334
321A3265j3454n000m442J893J4422k3808K5947n208j7755L1898l1030K751J9166
334H645k7004K2167J4135j8853p854J1995q834j3928L8788j4529j2202K0832k8917
347a5559J4981k380o047K5605k9503J7858J591k4621K9732k0792R36K0756j7957
360e400J1146k857j113o705j931J9110j9641J9993j21k6640K7901k1600k76K6821
374A8687k3769P532L601r215j371J1J2275j5612N778J0509j7012R622k811j944
388c719r17J75J2483j4783J2304j478j9860K2922j0387j096J7153j4299R59j254
402a797O77J53n98R750j5448R634J234j4478J9838j4789o23J2148j2059J1864
$$ y = [1173, 2355, -17025, 6733, -8297, 16892, 15721, -7830, 8671, -22248, -5747, 11028, -7069, 13265, -189, -5189, -9631, -7738, 6684, -17124, 8823, 3615, -14140, 17758, -13272, -10521, 8645, -18359, 3808, 17943, -910, -8764, 3231, -5603, -19531, 19257, 4728, -7474, 13358, -15559, -578, -2958, -9005, 16600, -12903, 4955, 6546, -18075, 11657, -9135, -8199, 12557, -5400, 5746, 2889, 1776, -4929, -6860, 12250, -7391, 12602, 12481, -14159, 13742, -7858, -8134, 18687, -5082, 2450, 6051, -3164, -4535, -4524, 7751, -7861, -2083, 8426, -8586, 1036, -1775, -3719, -4636, -4461, 8022, -6761, 5543, 4065, -15795, 7127, -3260, -4356, 12797, -1502, -543, -1797, -1120, -967, -1565, 8185, -7263, 2371, 3605, -10873, 8965, -5824, -6447, 5701, -6358, 5506]
416E506q496K516L068j6946K3288o617q493J8791j5842j57O528j523J81l92Q292
431I704j5080P931P407j9699J8136m752j1204J6209r355P25K409n710K156k852
445c975O755m031K74M118j1420Q082q00q35L861m288O247r974N927O963j5959
460i055J4083k294r807J4238o430k513K538m89j723j889J1055j0879N94Q443j5938
475a0066J1239P24o656R446q117L252p57j744P054r999P680K41p633J2982p487
490A59k740N261l630J875K02N275q222M86P030j2657R366L009j0184Q992l770
505D52l382K872m21M81l248N939k890l088O986p074J835J071q46M132l891M862
521C790n986j643Q618j0073Q187K564j0779Q727l137l586M388o26J1k256N771
$$ y = [5506, -2990, -474, 2594, -14352, 8936, 2319, -6174, 12617, -3225, -3382, 3146, 1623, 1804, 1412, 9704, -5376, 2555, 9962, -9737, 8399, 3647, -7557, 8652, -703, 22, 2431, -3279, -1123, -3975, 2780, -1251, -977, 3141, -8279, -197, -997, -1832, 2029, -2259, 3988, -5986, -59, 6904, -9055, 5028, 2734, -7073, 7165, 735, -1778, 760, 271, -1452, -3341, 7714, -3165, -2571, 5872, -10066, 1173, 1897, -4759, 4687, -3430, -178, -935, -2679, 4375, -5624, 2056, 2297, -5336, 7646, 159, -2581, 2680, -950, 925, 1127, 6402, -1820, -1334, 5696, -6961, 2405, 5414, -4770, 4222, 452, -2930, -58, -479, 2, -3246, 2693, -197, -3285, 3701, -3373, -1538, -467, -1313, 2819, -1072, 3790, -2196, -3839, 4779, -5294, 2893, 5457, -5322, 3405, 268, -3318, 1070, 444, 455, -1801, 3970]
536C970m841l013Q632j0102M208N215p647O541k386k027K32j426N648m353L532
551B183K395q937N338q02j976M392j403K43j988L042l483j838P129p854L470N291
567E202p877L622m18l581K174J215K051l115L123k586m079O465l924J703L960
582C935m350J366k430K216j369k179P574o128J023N423q684L613L71l196M583
597A768l41j06k736J896j572l250Q179m259m15M964o259J452N65j046J930j118
613c48K894k835J27J966n030L754M50k314L165l01j437k463K550o50k292O923
629D159m194j539M041n594J864K172j744J705q9K50k788J636J107m339N711j397
645I61j910L096k666J97r85R63J647k011L718l067k297M481n184K620L165l365
$$ y = [3970, -871, -3884, 4748, -5354, -1146, 4069, -3578, 2963, 577, -1450, -1218, -2644, 3004, -1349, 2183, 4578, -4359, 979, 177, -1799, 2593, 1190, 1433, -555, 2487, -996, -2834, 4295, -3559, -89, 5202, -2675, 947, 529, -3052, -878, 337, 2388, -727, 2396, -190, -4269, 2196, -1728, -25, 3935, -415, 951, -1479, 737, -632, -2811, 4763, -1365, -342, 5081, -3603, 10, 381, -2815, 1768, 1427, 1321, -1415, 481, -1091, -4341, 3838, -421, -836, 4128, -2131, -679, -114, -1160, 770, -348, 2546, -289, -162, 1804, -3226, 528, 978, -1336, 1829, 1528, 91, -2372, 178, -472, -2764, 4159, -35, -1574, 2467, -3127, -1263, 909, -835, 870, 781, 1031, -1757, -121, 986, -3353, 2358, 961, -949, 2147, -519, -322, -1307, -344, 1303, -708, 3010, -57, -2354, 2127, -3057, -437, 2728, -637]
661f37J186R1j254j199J976R75l348M374j183k647L430l149J54K374j297R85o5
678G66L58k158p26L445l027J909K038l113L72m6M9j144J825R74k928L282j970
695i4k249M076l072L59L195k112j09j9L92j448L57K985l238K084L70l283K382
712E76j169N73J198p05M33j711J337p25j791L825j744q94K818k156o09N12R0m71
730f13Q13J416k585J827k43k807L088m16r99J468o17k65j150J486l39r51K649
747A762k098k06J489k052R34J51j57L38J12O01k377J760M57k668L505o59j904
764a012J890j395J6J41Q21m4n40J069j580K74J391k521J619N17j318Q23m87K06
782a30r33Q33J119k098K243p42j404J293j108L72Q37k9l73j99J122j959P16J533
$$ y = [-637, 549, 640, -614, -1813, 163, 1138, -2210, 2164, 981, -1666, 1764, -1385, -1231, 1143, -154, 831, 766, 1124, -1034, -1760, 1685, -1342, 567, 2605, -508, -136, -182, -133, -1277, 548, 1522, -1406, 1876, -94, -2343, 1733, -1339, -980, 2215, 103, -6, -25, 367, -1081, -724, 2261, -977, 1107, 1477, -1806, 576, -593, -20, 1178, 473, 906, -805, 532, -193, -1984, 1841, 97, -797, 2021, -135, -744, -232, -142, -613, 200, 1616, -969, 858, 615, -2192, 896, 480, -519, 949, 332, 67, -1083, 403, 64, -887, 1762, -336, -542, 947, -1105, -171, -20, -177, 161, 273, 874, -1503, 257, 714, -1954, 1551, 892, -1012, 878, -517, -501, -360, 461, 417, -123, 946, -634, -360, 1031, -1490, 129, 646, -672, 151, -336, -130, -1063, -230, 889, -1209, 1034, 292, -1112, 181, -927, -555, 282, 253, -120, -319, 803, -1156, -440, 1093]
800A093k350J728J40j510Q46k69k09k92J139K1j252J853j534p19J920j391N80
817b06Q38k35q60O8Q55j558R14J469k197J372J23j606J786p52n93O70J19l69m77
836f39J355j306k48J872j351lP60q43Q0QO06o25K99M99j674J340J6j272J787n36
856A25n83O12P2m71m91J435r84j87J457j657N80M65j291J101L8N1j25J26k97r08
876i32J528o30p12J394o30k70L25r3j68m08J155o26j05J239j545K86R36j428J007
895C23K16p51J70L90k27n75J196k33j085J074p08j84J001p06j80N92q8n95N43
914A73J89j068N73N92j010R38m9m72K33j82Q2j3N37m92m07Q59r12j10J305j029
934b63K39K99l93J7K11J48o10M89K26r04N33K36o99Q09k73q5J97K53k89o57J151
$$ y = [1093, -1257, 471, 611, -899, -53, -322, -531, -823, 316, 337, -915, 938, -596, -1315, 605, -786, -206, 632, 397, -463, -395, 460, -1098, -184, 1285, -912, 460, 583, -1023, 763, 11, -582, 88, 207, -162, -639, 716, -590, -838, 1034, -317, -320, 440, -403, -323, -315, 291, -334, -35, 464, -1210, 130, 146, -1126, 661, 125, -458, 154, 226, -245, -736, 699, -285, -472, 985, -672, -92, 373, -918, 183, 221, 272, 147, 273, -24, -932, 596, -34, -746, 648, 18, -252, 73, -20, -188, -596, 559, -67, -172, 1067, -478, -192, 744, -684, 323, 539, -212, -42, 348, 121, -454, 742, 509, -576, 498, -210, -394, 607, -99, -279, 313, 225, -370, 173, 362, -706, -133, 459, -551, 387, 338, -134, 99, -83, -1, -14, 523, 31, -376, 483, -429, -539, 766, -263, -24, 275, -118, -101, 110, 258, -352, 137, 363, -541, -8, 228, -471, 338, 65, -20, 177, 430, 141, -516, 635]
955F35r14M3J046r90j23P42n81m4L33K45p98P77m5j144J077l52m28R15l68k76
975b50N79l24j00j92P35o16J05N11n14j9M41n74K39M33m31j41L03k23n95O98j43
996g8m24R21n93k01M14j31l28K82M26l87K19M70j162P05K16p25K93K04j68l6L17
1017B34m55k38Q46l77j70O05n27j35J80j70r9O03j10m87M63J33r24O84J71p27
1037e00P26o4m30L71n3j1m94O38l03j63P05q00O1P82n62J77J44po12L78J49m77
1059c45N46J67o71M53k36l22P19m03L25r1K62l97p5L58o90L61L89m46J86J25k76
1080f1k1K70k28j29M68o2o51P46m47M5L72j89j18J53K56o93J72L88n78M68J28
1101B89l66J65q0L4j72K14j49j30L56j79k42N63m79J14M11m10m7L86l75j20K87
$$ y = [635, -279, -236, 810, -180, -303, 439, -142, -186, 147, 392, -406, 371, 326, -818, 259, -93, -521, 394, 26, -250, 329, 5, -95, -287, 448, -168, -63, 448, -66, -85, 356, -218, 21, 454, 23, -118, 185, -38, -633, 65, -78, -502, 419, -174, -375, 39, -92, -420, -138, 288, -99, 120, 590, -572, 133, 349, -376, -83, 121, -47, -83, 234, -221, -459, 387, 10, -160, 445, -82, -217, -37, -207, -306, 297, 187, -300, 163, 296, -628, 56, 227, -500, 226, 162, -268, 103, 50, 39, -455, 183, -120, -283, 422, -378, -317, 465, -97, 80, 224, 217, -395, -17, 132, -345, 201, 368, -303, 150, -86, -408, 311, -92, 233, 142, 404, 7, -68, 290, -400, -39, 350, -96, 90, 215, -61, -82, 188, -40, -169, 299, 237, -414, 332, -115, -70, 302, 113, -5, 148, 404, -289, -117, 271, -307, 161, 289, -77, 88, 8, 42, -130, 84, -65, -195, 161, -18, -260, 303, -176, -62, 349, -61, -108, 278, -97, -217, 70]
1122G0L10p73O49j19o22M13J1j95K48j21L1J32J56k87k16M76k00p4K38n24K43
1143a54L68k27k1j72M80l34l1J88l73K65j27k30L68K00l44M7K38l60Q1L58k85
1164f5K39P5l37J06j3k88M75M6l10j05J71K44l72K9J67j49L19k0l46M8K94n89
1186c81O66j19j31k11L07l85K34K52l57K14l2N8k6n6j42n8L58k01n2M45k12k79
1208a08J70K5k26J81j28J13J46on21N89j14l09K02K58k99J28Q4j12k45L90k41
1229b3j29L68k82Q4J46m46K49J0J11j12k7J28l31M73k2k57Q7J82l72K78J1j00
1251B6J6K29o45O1N44l32m8M70l49l1J26J04L5l43J75k87M02O1l61J85o0j39J67
1274Fj20R6j15K72l47K6K40p2l03N27k98J65j58M3q0J52J96m49L69o7j36J26O6
$$ y = [70, 380, -393, 256, 137, -485, -72, -61, -256, -8, -129, -98, 34, 190, -97, -313, 163, -37, -111, 127, -397, -154, 214, -13, -34, -206, 274, -60, -91, 97, -276, -11, -138, -368, 0, 200, -144, -97, 141, -219, -138, 220, -65, 174, 249, -88, 18, 5, -283, 192, 238, -72, -177, -6, 238, -134, -105, 62, -87, 232, 212, -134, -86, 208, -381, 285, 166, 35, -176, 131, -254, -20, 232, -125, 89, 57, 115, 89, 33, -109, -167, 191, -10, -62, 383, 171, -108, 62, 87, -139, 42, -86, 27, 173, 167, -354, 235, 121, -188, 14, 272, -27, 101, 185, 73, -172, 218, -23, -152, 216, -66, 18, 164, -282, -33, -23, 88, -24, -51, 77, -254, 219, 197, -60, 27, 209, -163, 115, 126, 26, 42, 271, -374, -313, 231, -101, -149, 321, -28, -59, 67, 171, 206, -137, 38, -249, 153, 214, -147, 38, -22, -161, 6, -114, -18, -133, 139, -208, -182, 58, -14, -317, 210, -88, 77, -81, -38, -118, 34, 230, -219, 150, 83, -53, 73, 139]
1297A39j2l26L23k32K25J40m04R9O0k15J38O6o5j21K24q4R2J50j18L9J7lk17K49
1321A64l41M7J46j15q4J30kj13K54J47m17J89Q5l39O46n66J86j2P2j98j05L63
1343A37q8l1j4K8k88L02J92m03K62Q8j47P8K9j87L11l80j47O57j76k03n8Q5m01
1366c54L07P0j43J95j09k1K34l99K42l16L62j99K09n6Q0k25K02L26n27K40J3l46
1388b15Q3K25l18J92Kk7K04q6q0j59L49l94J64J64l59L40N3k68J24J92l07J46
1410B5J84j65k54L55k34K26j64J11j91J52J71j38l62L73j24N1pm1K34j19l22J44
1432i5kJ85l6Oo6j65J85n7m69O79o5j65J88j57M4q0K47k99K32L3M3j34j08J93
1456A37j61J77j93j73K81k72K49J60l99K17J54p9j57j0K47j49O8P5k67K13n7j33
$$ y = [139, 127, -199, 124, -108, 117, 257, -147, -48, 12, -203, -65, 1, -64, -185, 39, -45, 47, 197, 79, 118, 135, 132, -85, 164, -177, -130, 16, -99, -183, -53, -55, -168, 86, 233, -184, 5, 90, -249, 397, -169, 17, 5, 77, -121, -226, 137, 49, 18, 4, 32, -256, 46, 238, -165, 97, 185, 38, 116, 145, -42, 269, -111, -258, 399, 223, 20, -38, 47, -354, -47, 23, -120, 75, -34, -55, 179, -220, 22, -294, 68, -131, 78, 22, 102, -123, 79, 405, -122, 118, 131, -215, -132, 93, -225, -33, -31, -58, 146, 60, -20, -179, 170, -224, -60, 104, -255, 85, 138, -130, -6, 186, -121, 25, 209, 44, -210, 145, -89, 137, -27, 84, -107, 45, 216, 78, -284, 89, -35, 16, 9, -32, 202, 83, -239, -95, -97, 88, 52, 58, -8, -173, 12, -45, -514, 165, 100, -65, 123, -34, 10, -70, 177, -122, 110, 143, 186, 52, -56, 137, -24, 153, -40, -213, 68, -204, 45, 205, -194, 23, 177, 98, -59, -69, 178, 29, 97, 172, -95, 118, 61, -72]
1478g2j3J02j04J77N8l67L49j06l16K02L05k46j46M11l38K8q9J62j53K0K65j29
1500@P0k15P0L23j32qN3j10L4K2j38L2J99k68j7J34k55J31K27J7j39q6L4j87j15
1525c24M39j56k2j5j7l8J95k32Q0J83k66N5q4Q7Q3J80ml77K45j1k6K75l59j0K70
1550A51l04M3K13k07l7J17K75k89lJ27L8k45K5KK27l20L70j64j2j74J17K40k16
1573b6k0L9j3j12K95o6j50j50N64l08q4o1J21n5m2L5P8L3L5j63K31l89J99n5J27
1598F3p0K02j41j93N1J09K10l52L67m34L01j48n2J6K28k39nJ08r7J96J9k19l0
1621a10K55L8q2J55m47N1K00k72P6M63l11J43n8o7Q5K25m70K34K8q0k27K9K89
1644A47l07J67J32j68n6K46l90K14J82l00J01J69o3p1rl06R4L27j24k93K04K78
$$ y = [-72, -85, 17, -87, 90, 148, -219, 130, 24, -292, -90, 215, -31, -177, 234, -104, -76, -165, -3, -156, -136, 129, 0, 70, -145, -75, 248, 116, 108, 161, 51, 85, 107, -31, 1, 200, -68, -85, 49, -206, -75, 152, 169, 30, -56, -22, -209, -324, 115, -41, -63, -78, -95, -133, 62, -170, -90, 93, -173, -118, -202, -115, -32, 148, 144, -233, 12, 1, -25, 250, -109, -119, 151, -153, -110, 103, -104, -141, -24, 251, -38, -41, 86, 124, -121, -96, -94, 133, -187, 183, 19, 7, -167, -50, 190, -26, -46, -7, -20, -132, 163, 97, -53, -203, 361, 53, -31, -92, 29, -26, -68, -33, 45, 78, 113, -50, 181, -208, -9, -64, 63, -7, 195, 54, -139, -88, 21, 231, -121, 246, -188, 113, -35, -87, -71, 157, -82, -87, 21, -76, 120, 139, -80, -110, 145, 183, 101, 256, -191, -140, 60, -212, -136, 327, 16, 159, 101, 34, 119, 344, -126, 108, 136, 56, -171, -142, 147, -160, 7, 139, -29, -85, 161, -229, -15, 167, -133, -32, 137, 74, 3, -6, -312, -218, 109, -15, -308, -104, 174]
1666A74l37J39rJ95j16l9j83J40Q8j97J72J16j94J03J27k56N8Pq0L11k56k8J54
1689H9N9j55k75J98J65m6m2k04L86k29K11j01r6L05l64pJ75k48K73J38l91J73
1711A4j36J57j09P1JK16k04J8K72l56J6j7j57K77j94J49O0j35R3j32J89j58J33
1734F8n3P4J0K5O8N0j89lL4kk61K99J60k98J33Jk66L87j90q0KK24k13Q8N1P0k17
1761b8K2j14q5M72k80J0K63r7j50j51K03j75J60j25J3J34Nr3k46M69l54j19J28
1784a38J36L8J54j72r0J52k03L84j81l40K81O9J3j36J41k32J48J97k78J50J26
1805B19l4k55K11k32o4K41o8j56L70l37j2K74O0l85K90j75J03j67j13M43j46J40
1827B07l66L3K54n8q9r6K56j31R4k0k14J55K8O8j24o6m4K17m23K34J64k14%J54
$$ y = [174, -163, -24, -33, 162, 46, 7, -176, -36, 52, -145, 27, 143, -51, 52, 179, -77, -19, -12, -92, 219, -37, -65, 89, 148, -7, -282, -84, 81, 35, -7, -211, 175, -54, 157, 56, -40, 265, -99, -106, 69, -179, 94, 232, -159, 14, -122, 35, -74, -3, -2, 214, 10, 28, 300, -56, -40, -57, -214, 63, -131, 18, 78, -57, 36, -96, 93, -65, 68, 15, 89, 99, 124, 192, 242, 53, 50, 84, 82, -179, 120, 280, -18, 115, 116, -150, 237, 47, -33, -31, 193, -20, 68, 119, 189, -28, -6, -120, -205, 267, -13, -3, 260, 163, 13, -138, 65, -110, 50, -75, -62, 72, 77, -16, -262, 207, -147, -266, -138, -2, 36, 190, 18, -72, 80, -123, 261, 80, -260, 21, 90, 103, -33, 108, -124, 24, 221, -57, 93, 219, 185, -70, 141, -91, -155, 86, 18, -138, 232, -105, -117, 157, 217, -168, 122, -53, 50, -117, -230, 213, 67, 207, -159, -126, 128, 70, -19, -115, 141, 10, 104, 84, -130, 25, 53, 121, -3, -69, -113, 104, -319, -85, 79, -135, -135, 19]
1851A9k1M6k20j4LJ8K32k76K03O2n5J09J18j01j36J32k03q1K09Q5m42L26M9k32
1875a70J99j60l6J97R9j55m5J8Q5N7N5l54N2J69N0j30q8L74j81L45l40l1J81j52
1899C9O2J40l58J39J38j29R3J16l18K51J8Mk64L8l9j28mM53j57p1j97P5J88j02
1923a3oK16R2k92Q2K3n4n6K13j9l39K15%Q0o6l7j29J19J66m11K99k4J17k81K02
1948I7j74j34L59k07M5P0l11M99m08L36l10J52j60PL7P1k45K13P7pp1J84l7N3
1972A36j84J12j61R2P1r7O0r1J07K09j17j96Q9n0o2pk13K86k43K78j65K34j33
1995d5K60j77n5K25k47J38k01K54k29K42j48m4J08o8R0k16N2J85k47K81j98K78
2017B38l88K79j80l03M29n5n7J98j1k04J22p9R8o2k03J57Pr4K72j68J00o4j34
$$ y = [19, -2, 44, -176, -190, -187, -169, 63, -213, -10, 52, -3, 106, 224, 123, -13, 119, -84, -165, 44, 129, -313, 13, 62, -170, 29, -131, -167, 30, 129, -26, -71, -53, 32, 89, 144, -210, -158, 11, 61, -69, -157, 217, 36, 381, 41, 10, 191, 39, 101, 241, -117, 22, 160, 31, 124, 240, -78, 173, 191, 195, -69, -31, -70, -198, -202, 251, 94, 23, -174, -99, 89, -13, -19, 197, 289, -3, 79, 102, 48, -8, 205, 186, -153, 62, 62, 142, 76, 39, -90, 29, 195, -216, 83, 59, 176, -105, 97, -77, -211, 148, -59, -14, 56, -255, 244, -164, 172, -138, 14, -146, -139, -102, -31, -276, -63, 14, 7, -64, 120, 83, 136, -48, 64, -97, -5, 66, -31, 29, -62, 45, 254, 137, -59, 30, -20, -82, -89, -302, -16, -259, 19, -146, 88, -45, 215, 38, -17, 208, -39, 99, -102, 152, -77, 165, 17, -27, 81, 13, 103, -113, -61, 124, -123, 158, -40, 238, -150, 129, -51, -354, 75, 20, -37, 161, 150, -54, 68, -11, 87, 25, -178, -21, -14, -108, 164, -4, 96, 32, -102]
2040a02N3R5m03L83k49%L51j1j57n1Q1R6nJ04j80J06j0j09o7K07J33k82J90k46
2064g3O4J48l43J08J76j80j0L44k54k0J0rqn4J24j9j62J11K03q9k31N7M26m84
2088a65K85j86l4k23K42o6O8K81j74m0kJ66k06p2j15J31J27%j58R0P0M8K6jk37
2113a45J13K04k34po3K87M7l54J6J12k5J57j36k36K50j53J05Nj76J95J99j23J01
2136A39l09K30j84o9p1L27l5MJ1j76R3m8R5j7P0J57l9m34J43J40J2j15o3J24j69
2161a84J26m9L58p8j95O4j85N29j9m24j06P8J75P7j65m1p8J31l5N9L6j32j82K61
2185B1L06l60K47k04j11J25Rm16M13RQq9Rl6j25n9K80R1N4j21L5k0J6k65K22m5
2211fN8j6j37nK50j84J04n7J07M4k66J98n4p7J10p2J45lj87L75n08J74N8P3n0
$$ y = [-102, -49, 46, -357, 26, -223, -223, 128, 117, -40, -91, -10, 86, 81, 185, 5, 111, 101, -8, -75, 132, 265, -17, 173, -73, -9, 139, -204, -96, 80, -100, -110, 234, -20, -40, -30, -39, -47, -101, 23, 4, -158, -47, 156, 67, -164, -107, 319, -165, 120, -66, -100, -323, -81, -147, -79, 202, 28, -12, -14, 152, -54, -126, -241, -110, 17, 17, -141, -51, 19, 67, 93, 92, -145, -32, 172, -62, -69, -132, 155, 202, -152, -136, -24, -49, 108, -28, -264, -14, -167, -62, -57, -233, -38, 161, 38, 139, -170, 60, -124, -193, -264, 63, 28, 32, 43, -133, -40, -88, 7, -10, 60, 217, 178, -256, -113, 27, 39, -76, -139, -15, -184, -58, -107, 251, 173, -22, 42, -143, 386, 367, -57, -163, -85, 90, 167, 2, -39, -117, 14, -21, 38, 74, -58, -240, 21, 327, -33, 214, 10, -101, 24, 33, -383, 30, 39, 47, -42, -33, -69, -194, -253, 27, 118, 172, 51, 86, 66, 82, -183, 39, -6, 52, 36, -101, -106, 144, -40, 64, 7, 114, 158, -108, 90, 36, -41, 69, -3, 142, 139, -48, 327, -181, -7, 51, 124, 74]
2236G4k7K35k04j17J76j94K84l39J67j13o4n4J17j44K34j42K39j76N1J1J63k00
2258b3m6J28k07K08KJ34j7p8Lp2j17j12M61k33Q3K0j51j36K67k19J41oj5m0M5
2283B0Jj93K29J29l15K0J80p5m1j64K06m8O4Q3k42J22J52l03qO5M17m41J77K7
2307F2k11J95M9k61J48m4j28L38r8j8O0k67K48J36o9J94m43J63j80L27k2j28K3
2330G4m3J71l84J56r0J51Kk85N5L89j20o8O0J7l21M36l57J50r1p2OJ01l1N1J1
2355c2m1O0R3l40J09n2m4J17KJ91q3q9J99j6o4K4j27K48k28n4J53J97m63O2K50
2380G2q2p7O7K1j92M33Kl32q5K23q7J92k61J47j04J19j15p2J36j04L5J6m3M2n0
2405i9P0nj8J7p5J45L0R2k19L34m01L0J72P7l15J92j64K61n8j8l0Q2j99N9R0R2
$$ y = [74, 47, 282, 78, -39, 137, -57, 227, -112, 55, -58, -122, -176, -59, -203, 31, -111, 128, -48, 3, 14, 177, -23, -69, 59, -148, 60, 62, 196, 179, 101, 104, 32, -85, -197, 264, 31, 114, 134, -17, -153, 114, -105, 36, 30, 15, -25, 20, 21, -172, 57, 186, -129, -109, 71, -4, -45, -209, -3, -51, 13, 96, -146, -24, 128, -175, -183, -118, 299, -142, 35, 62, -149, 46, 95, -166, -18, -62, -190, 148, 50, 32, 92, -175, 73, 209, 140, 334, -109, 54, -126, 201, 179, 51, 74, 31, 202, -182, -26, -116, 35, 37, -248, -193, 196, 76, 8, 68, 85, -236, 200, -157, -7, -98, -170, -164, -63, -94, -43, -32, -73, -13, 80, -260, -151, -203, -247, -130, -128, 63, -20, -109, 90, 74, 10, 34, -93, 155, -73, -127, 26, 223, -240, -178, 72, -10, -87, -20, 1, -191, 242, 244, -88, -173, 50, -37, 155, -106, 41, -63, 56, -59, -131, 5, -99, -64, -48, -91, -49, -99, -29, -34, -52, -35, -110, 35, 65, 157, -62, 272, -129, -99, 73, 150, -165, 27, -137, 124, 66, 48, 18, 100, -99, -40, 50, 142]
2431A42pp8mJ15l9k53PJ09r4jK1n9J77k15J99R7j22j80N6j3J98q4pk26K49k2l3
2458f7R3MR9k05Q6k28J90Q0j12L5j07J97J16kj70l07J35N6j46M20J5q4k05P6O8
2483C7j09J00j43J66O3j56KJ63l6J76k45N6j53j40Q4J17QJ89j47Q3mk24J02J56
2507A45J0L5k19M7N3k26J02n8J05l8k7j8N6j63J7L78j78j02%J96m00M04j62j22
2531a65K00P5L8k35J70j54N7J36k71J96l3j64J56j15L8P1j94K93o6KJ21M6p0k13
2555h1J13o2J00q9k63M11q7R8J86l73J8P9j35K34r1k61L07J10k81P7R7L9k31k7
2579a12J22l3j64P2K34N8k0j12j18L86m61J24L53j54l11J64Qm1m9j62O8kK70j73
2603e3j43Q2J38j45j88M88j53O9Q2m23L76j21k07J32n3L80j85K2j98L51q8k41
$$ y = [142, 135, 57, 53, 168, 129, -124, -117, -8, -102, -103, -82, -141, 36, -179, 20, 117, -5, -185, -129, -142, 56, -28, -35, -261, -12, -34, -67, 26, 30, 129, -76, 10, -218, -28, 52, -60, -25, -132, 65, 181, 179, 9, -298, -163, -107, -253, 167, 182, 98, -107, -31, 37, -72, 28, -115, 51, 114, -42, -40, 123, 87, 263, 18, 74, -79, -219, -135, -18, -10, 179, 32, 115, 111, -113, -11, 145, 155, 190, -29, 18, 71, -155, -53, -111, -6, -44, -71, -89, -33, -196, -179, 199, 21, -81, -81, 115, -285, 119, -43, -165, 35, 110, 148, -87, 83, -71, -14, 122, -149, 47, 14, -150, 6, -109, -71, 0, -194, 99, 33, 35, 156, 202, 132, -81, 32, -30, 70, -19, -282, 129, 42, 140, 326, -47, -29, 50, -85, 149, 58, -203, 104, 214, -67, 10, 107, 146, -85, -112, 10, -23, -187, -115, 119, 177, 157, 45, -73, 313, -148, -24, 329, 175, -136, 28, 36, -5, -54, -216, -148, -150, 120, -53, -196, -114, 24, -121, -309, 179, 26, 95, 177, -246, 130, 9, -198, -66, -119, 261, 76, 98, -100, 251, 163, -78]
2625g8pN1J10j11P8K8q1K19k73l0R3j80Q7J76J2k10M0K4J75L0j77J15P1l16M22
2650B68k42L3J1j83o8K42Ml9j19J19K2l8L1p6R8k82K11j54K94j27j93J60oq2K03
2675H7r3J92j22j66K99jq5k43K48J32k89p3J9p5J70J86l13j3Q4M4l4J13j56k1
2699a10n4R3JL6J94k25O2l9o2K19K1j21j32K53J43k20Jk38M73m79Q5R9J02k21
2723a19K03J74j83OJ09j31K57o26L17r1J2J71j99J69q0M2j32P1L5j74o2L31L0
2746A30l51M04j59J12j34K8K28m40J90j10R0n3J13j38J69l5L8J66k61k5k7Lj36
2769a98L38j42Q7O5l60L38j77k34K37lN7J1j38R4l16M47l3l29M01q7J03j27J6
2792E0q4R8P3j14M5k48L00l24K45k81J20R4J7K88r3j70L8J05l45L15j2q2k1k03
$$ y = [-78, -85, -34, 76, -35, 43, 71, -10, 209, -64, -94, -1, -181, -94, 82, 94, -116, -76, -52, 123, 153, -24, 91, 162, -154, 268, 26, 59, 70, -113, -181, 61, 65, 26, -93, 26, 48, 10, 41, -35, 63, -219, -8, -162, 132, 5, -188, -28, -34, -116, 87, -6, 186, 64, -102, 197, 196, 111, -132, 116, 248, -41, -114, -95, -170, 0, 186, -127, -140, -56, -12, -46, 67, -89, -110, -164, -71, -70, -34, 160, -65, -3, -42, -104, 115, 136, 15, -117, 136, 279, 59, 60, -178, 295, -184, -99, 0, 102, -119, 84, 258, 75, 81, 190, 59, 316, -310, 7, -84, -72, 99, -100, 69, -11, 31, -101, -30, 5, -169, -231, 100, 130, -221, 183, 24, 136, 2, 30, 258, -182, 8, -102, -12, -65, 48, -90, 79, 44, 82, 248, -13, -38, -65, -62, -198, 140, -2, 85, 150, -210, 128, -49, -283, -46, -49, 8, 19, -119, -25, -341, 106, 73, -256, 145, 58, 161, 34, 50, -34, 64, 137, 23, 68, -180, 120, -204, 41, -240, -120, -26, -9, 279, 186, 16, 54, 159, -186, 129, 117, 35, 14, -189]
2816a89J1K33J28r3j33Lm2oJ25j57M7o9Q8J11O5l0j92j56J76J23L6L4k09K14%
2841A18j41p3k21P1K05k04L57p7L8M0o2J81n55L84l68K00J97L3j58j84L79j21
2863C9l65M69j8k18J38j8j44J79o6P9j20J30M8k44J91k15J11J08K0j79P6m7m0
2886h6N9QL27l56j18J86mO2k21K71L8j74j11P1jJ2l2%J44J37K3l81J0M3J07J3
2912B7k48p1M49j06k63K77r4r8K65k49K24m2L4j31O6p6j34J79J07k91R4J58J73
2935B50l01J6j94J69j11O9j65m2J90O6r9M9J19l3r1P9J16k0j89O6r2Q7J00j73
2959a34K99k16K7l5R2l0Nj82K92j63J18k28J12m0J02k00O7o5K28j3OJ30j08J74
2983B38k32q8J0j91J37O5J02q7j90J04j28L80J60k78n6J51q9j91P2m1l8K52m5
$$ y = [-189, -178, 55, 183, 90, -43, -40, -82, -88, 37, -120, -73, -142, -54, 57, 122, 92, -100, -256, -80, 43, 79, 113, -96, 118, 118, -23, -96, -317, -246, -41, -245, 112, 35, 73, 113, 51, 232, -323, 61, -307, -107, 90, 123, -35, -219, 160, 39, -326, 143, 125, -93, 45, 27, -117, 62, -4, 75, -45, 85, 133, -111, 80, -135, -24, 84, 104, -75, 1, -46, -86, -27, -19, 308, -48, -166, 20, 16, 78, -143, 128, 166, -8, -119, -48, -49, -37, -69, -69, 75, 212, 235, -146, -136, -93, 14, 27, -221, -292, 157, 51, -212, 65, -29, -127, 138, -111, 113, 71, 105, -26, 40, -36, -170, 9, 116, -175, -81, 77, 250, -51, -35, -229, -60, -171, -102, -267, -309, -119, -53, -152, -103, 16, -17, -108, -29, 87, 67, -122, -56, -148, -61, 39, -134, 165, -51, -24, -59, 33, 3, 8, -174, 118, -45, 73, -155, -43, -83, 19, -181, -114, -179, 49, 36, 42, 172, 64, 238, 6, -82, -72, -263, -126, -61, 41, -46, -236, -132, -260, 120, 280, 2, -54, 97, 8, -183, -111, -152, -190, 62, 17]
3006A7o0R5j00mk96M48o0k05j27L98k51P4Q1M5O5l05J01Q8J23j94J13j77J58J07
3030A34k23K92r4j97j9K31j45J50j2k15k1m8J76k1J28N0k71J38mp2n3n2K07k75
3054b16K43J5L0K3j54J86j08k79K91L2j57P7J06q3j09J64j48q1O5N03l53o1J10
3077I6K75l30l1l7K11k18k5r4J21Q3Q0k63J35j82L16k64L87k76j8N6o2k88M23
3100I5k0l0j23m9LK30J78k72j17j18K03R6K56l22L1k06J33j5K71k22K8O5j29j8
3124e2K17l1k20P4q7J50o9q0K52j8j42j98j04L27m7O9ll1L0r5L1J38l99L12j05
3149h1l9J7L24m2k03P6m0lK0r5J69LN0j50J94k66j4J82r8J50n5Mj64k06K65m0
3175d2O2M1J25k13P4j56L24k70R8j4k7m9l1j28L24p1j03O6m2O4pl1o6J09J18j01
$$ y = [17, -43, 52, -48, -52, -348, 100, 40, -165, -292, 106, -145, -71, 10, 55, 120, -185, -84, 4, 127, -67, 46, -131, 27, 134, -89, 203, 109, -88, -107, 124, -21, 129, 117, -98, -119, -167, 9, -12, 116, 166, -105, 33, 29, -43, -96, -148, 59, -216, 27, 42, 72, 95, -59, 127, 19, -260, 31, 63, -94, -17, 89, 6, -103, 61, -87, -168, -103, 400, 47, -14, 96, 371, 41, 10, -27, 184, -34, -59, -153, -32, 51, 131, -132, 3, -179, 137, -127, 260, -16, -34, 22, -40, -328, 95, 75, 45, -78, -127, -124, 106, 284, 12, -105, -223, -20, 76, 332, 10, 41, -165, -32, -47, 224, 2, 30, 95, -34, -52, 165, 134, -86, -12, -99, 51, -18, -98, 154, 136, -6, -204, -308, 19, -28, 41, 38, 7, 37, -58, -27, 111, -288, 24, -81, -120, -103, 221, 179, -24, 52, 12, 9, 29, -66, 103, 106, 156, 6, 200, -66, -80, 102, 4, 154, 99, 103, -61, -267, -2, -42, 20, 61, 186, -27, 47, -109, 215, -55, 43, 29, 2, -47, -78, -206, 118, 47, -56, 10, -32, 32, 25, -6, -72, 37, 155, 54]
3201E4j67J55L1K8Jk2j59J77Q9j54J02n2J0j03n4K19k75Q6k47L17Q2mj35J51r7
3226C3j56j08J81J89k37o1jM40n22k4L14j1r1R8j38Q1J98k38J04J3j95NK03m7
3250C0j29j08K55J05j49j84J47k1M9P7k28K08n3k98M04Lo0kj93R7k36L88m4Qj29
3275f3j22L89l61L7j35K32J82l4L3k09Q3J43r5j21J21k44R5J41k61K52O6J52q6
3298A95k84L8P0J48k74N6J51l01L6J71r6j07Q3K40%n7l78K96q9mk5R4n2J42j65
3323a12K0j4p0L79j44j63M9L37l17k15K15O3m9J81k62J57j17j23M36j90K8r8J28
3346A19Q9p4j02l31L67J60k74K30l72J17K1j50O2K36j0j66n0L45m57K52Q0r8J7
3369A1N6Lj82J02K21m02J67K3L4n0k65L82m2q1O6q2p2N6n2J77q5Q6k14J85O6k86
$$ y = [54, -113, 42, 73, 101, 102, 80, -79, 98, 187, 33, 135, 83, 93, -10, -64, 155, -120, -34, -281, 36, 118, 114, -21, 130, 33, -123, -231, -50, 139, -98, -159, -160, 280, -242, -266, 48, 37, -54, 44, -94, -13, 185, -53, 51, 64, -131, -126, 77, 30, -99, -207, 48, 153, 4, -180, -33, -54, -5, 72, -156, 52, -1, -299, 105, 108, 48, 46, -147, -50, -286, 102, 58, 66, -63, -185, 204, -157, -120, -255, -23, 159, 125, 158, -51, 32, 175, 80, -41, 80, -164, -69, 72, -189, 63, 129, 281, 195, -89, -51, 19, 167, -107, -51, 100, -201, -165, 6, -90, -197, -114, 126, 126, 69, -309, -13, -102, -106, -131, -37, -89, 53, -112, -92, -106, -176, 203, 59, -104, -55, 282, -35, -250, -35, 28, -21, 160, -102, 55, -62, -185, 251, 61, 89, -9, 119, 208, 134, 32, -299, 68, 228, -46, 184, -188, -71, -50, -200, -138, 98, 88, -78, -128, 217, -240, 12, 92, -6, 11, 67, 70, -112, -10, 211, -191, -24, -1, 33, -17, -282, 100, 58, -23, 43, -39, -111, -55, -107, 70, -15, 71, -143, 42, 108, -178]
3395a78J97j53K62k04o2P2k2L7q9J10j1r8O3m8L43j40N4m0J83l26j57K77M3j92
3419g9J61KK5j69Q4k20J40J34j12m5j16R5Q4p4Q7p3P6P2m3k5J67j16j32K34l59
3444b02M05q9m9M7j56L36k65j53K87k49R4o0N1J83j84j57K42n4M8j42J19Q3p1
3467F4k28J45N6K5L6j94OR5R5k5L5j13j10P4l4K29j48P5q4l21J79J20l9J93j0
3492A21j95P8O5j74J22M5j42K18N5n16K64J8N2p1q7j61L61L13n05p8J91K8j70
3515a68PL72l59J4J50J17j20j83K7q2M57N8l79K33k59K88P1n02J81RJ27J61l72
3538a52P8K2n5J89k59N5L34m13J70J06J30l17J05k6m8K21k36oJ27L1k13J82J03
3561A28k16J68K12j90k75M6R0o3k5J32k38L56j07k50J38N2J73j95q1K31k23J17
$$ y = [-178, 19, -134, 128, -76, -138, -66, -88, -51, -140, -30, -41, -139, -76, -124, 219, 79, 133, 93, 276, -50, -207, 70, 113, -79, 82, 84, 109, -60, 24, -196, -56, 78, -34, -79, -195, -100, -16, -90, -3, -76, 0, 72, 29, 4, 171, 55, -77, 157, -202, 203, 114, 65, 112, -44, 292, 27, -126, 161, -88, 6, -54, -3, 180, -4, -161, 81, 27, 75, -67, 52, 135, 64, -164, -19, 37, 62, 98, -96, -90, 5, 100, 75, 110, -3, -113, -39, -73, 156, 8, 83, -1, -322, -143, -23, -62, 131, 121, -74, 4, 69, -105, 17, 62, -80, 138, 193, -323, -59, -41, 11, -60, -147, -308, 53, 366, -139, -217, -26, 2, -168, -161, 211, -148, -134, 16, 133, 13, -170, -143, -225, 232, 290, -89, 144, -115, 173, 244, -258, -77, -68, 59, 220, -152, -74, -52, -107, 82, -177, -122, 212, -201, -31, 75, 205, -112, -7, -33, -81, 140, -96, -102, 25, 56, -157, 25, 128, -88, 80, 292, 102, -173, -127, -37, -100, -125, 7, -231, 125, 18, -232, -94, -42, 131, -64, -145, 86, -137, -20]
3583b0l24O60k10j5J07j61J42j80R0J66j92j5j46J63p0O4J8K9m1j18K52k47M9
3606Al0N4m4O4N2P5l21K58l0j85L2R6j0n3J09k0j03J44q4J03k07K5J07j18Mj10
3632a91K62j36l4K5R6n0r6K35j67k2J1J01J21l59P7K14m9P0p7j4O5M7j19j20J95
3657H5J57r5k05M7M0r1J72k60M34k87j77J54k1R8O1j02l27J21K68l10L35M4j86
3680d5j5n8K42Q6j03k19J33j94L38l05J55O3Q9k08k2r3R2L9l82K07J55K55k14
3703dJ49j69j34J39J1k14j25L27J36J16k8j68m8l7P9j94L3Q1o7J9j4K46l0q1L6
3728E9Q2m31M20j41k3J35l6j61L7k0m2J05j11J44q8O4J03l80L81j16m8j6J97j45
3752c1L3J47k68J4L51k38O9L0j24J86j21L2j82m2P0K17Ql08J6K74k09j30K73J52
$$ y = [-20, -344, 316, 106, 91, 198, 37, 179, -1, 89, 255, 63, 48, -98, 65, -5, 59, 77, 106, 65, -53, 199, -48, 1, -29, 25, -19, 45, 97, 172, -149, 109, 79, -106, -74, 22, 12, -41, 68, 48, -55, 89, 5, 108, -99, -74, 33, -85, -81, -191, 71, -65, -99, -74, 22, -28, -124, 111, -56, -78, -67, 34, 155, -204, -127, 87, 38, 108, 31, 17, 82, 129, 10, -110, 85, 242, 147, -58, -11, 29, -62, 110, -150, 284, -3, -180, -26, -47, 51, 112, 10, -317, -196, 72, -238, 97, 141, -45, -60, -118, 124, 210, 107, -112, 21, -173, 165, -140, 15, 78, 167, -41, -63, -156, -64, -25, -407, -200, -45, 210, -4, 145, -24, -158, -19, -8, -222, -347, -20, 116, 232, 204, 36, -12, -49, 30, -164, -131, -50, -117, -98, -112, 134, 104, 23, 59, 141, -290, 130, -11, -34, 101, 65, -96, -59, -79, -121, -16, -127, 17, -71, -7, 96, -284, 97, -19, -67, -83, 114, -31, 2, 149, -119, -105, 246, 8, 77, 107, -17, 169, 48, 80, -102, -144, -74, 143, 151, -157, -141, 133, -76, -206, 67, 219]
3776B19n56K78r5K92l4k71J9K02M4o9J53mk54k60L18o7J33J19j91J6J10r0j2k6
3800b6nKK1N9j98L03o8k7N9n5J6R6l55N0K02m3J01j1k99M03j94omL2J4k94K64
3827C7Rj05qJ23j19K34k77L62l17K44p6m1r8p8K0K34k59J18K03l70J71j14J09
3850Br6O5kO9j32P7J20L3j15R4qQ4j54r7OR4r1l2Rm8J60N7j65K68j87j29k16M70
3878A36k15J56O3r8j20J91R6J3l33J29K21l32%kK9j3J6L14l05Jp8M36j08k44J85
3903A38J6k16k3L8j44M2L34j98MM9M7k15J01k2J53K1r0l6J26J05m39K45N2q1J48
3928A55K3j48r6j31K88K76j02l95J06n2P7K86k31j51K96l10R3k35J42K04j63J94
3950A26k04Q3m2k73L89k15L46j61o9R0l01K44J93q6k20k5J2R0J20p9N1k11J87
$$ y = [219, -337, -59, -154, 138, 104, -167, -148, 54, 98, 29, 182, 178, -76, -336, -18, -85, 48, 167, -24, -8, 102, 12, 0, -26, -31, -29, -8, 51, -147, 156, 88, 61, 120, 65, 81, 177, -178, -128, 74, 31, 132, 121, -178, 225, 31, 25, 21, 53, 67, -227, 37, 46, -59, -67, 56, -63, 171, -106, 256, -61, 183, 107, 66, -32, -110, -90, 144, -115, 3, 206, -164, 7, -107, 2, -94, -29, -31, 38, -94, -17, 103, 136, 21, 115, 107, 191, 37, -60, -54, 40, -51, -83, -74, -122, 38, 95, -70, 198, 11, -118, -334, 136, -79, 77, 140, 42, -78, 113, 209, 222, -111, 18, 239, -93, -93, -95, -66, -79, -63, 251, -54, -53, -131, 305, 197, -47, 138, 154, -62, -85, -47, -191, -149, 185, -13, -9, 40, 87, -128, -27, -49, 104, 125, 35, -1, 125, 230, -209, 36, 88, 7, 155, 178, 30, -66, -197, 91, 367, 265, -130, -24, -76, 1, 287, 56, -95, 201, -109, -16, -251, -109, 95, -68, 126, -78, 5, -37, -310, 79, -136, 210, 49, -20, 70, -231, 13, 206, 120, -100, -125, -113, -23, 97, 18, 69, -142, 45]
3973D5l99L62p4Q5l16L15K81m28J42J86j23K9K9l36K49j41j49K74J7k8k30N03
3995B93k44r5j12K54j54J02k76M69j29Kk42J08Oj03J34J13k19j0J31L4J07m23
4017b54J26J19n5r5K44j16j40K54k12n3L28m5k4k6j42Q2K6K04k76P9m6p4J19k24
$$ y = [45, -354, 8, -66, 19, -297, 18, 299, -129, 13, 199, 76, 105, 134, -202, 47, -94, -243, 31, 48, 20, -210, 293, 49, -46, -158, 96, -58, 44, -232, 237, 108, 110, -132, -24, -18, -121, 13, 126, -93, -103, 28, 62, 169, -254, -128, -9, -64, -159, 85, -31, -171, 83, -129, -182, 146, 101, 77, 51, -91, -9, 17, 221, -55, 24, -22, -96, 23, -201]
$$ [...]
8191B0
##END NTUPLES=NMR FID
##END=
