##TITLE=1H_CA-8768
 CDCl3, 8 sc, 
 28.9.2020
##JCAMPDX= 6.0         $$ Bruker NMR JCAMP-DX V2.0
##DATA TYPE= NMR FID
##DATA CLASS= NTUPLES
##ORIGIN= UXNMR, Bruker Analytische Messtechnik GmbH
##OWNER= root
$$ XWIN-NMR		Version 3.5
$$ Mon Sep 28 11:19:42 2020 Russian Standard Time (UT+4h)  she@DPX200
##.OBSERVE FREQUENCY= 200.1315066352
##.OBSERVE NUCLEUS= ^1H
##.DELAY= (6, 6)
##.ACQUISITION MODE= SIMULTANEOUS
##.ACQUISITION SCHEME= undefined
##.AVERAGES= 8
##.DIGITISER RES= 18
##SPECTROMETER/DATA SYSTEM= spect
##.PULSE SEQUENCE= zg30
##.SOLVENT NAME= CDCl3
##.SHIFT REFERENCE= (INTERNAL, CDCl3, 0, 15.7039)
##AUDIT TRAIL= $$ (NUMBER, WHEN, WHO, WHERE, WHAT)
$$ ##TITLE= Audit trail, XWIN-NMR		Version 3.5
$$ ##JCAMPDX= 5.01
$$ ##ORIGIN= Bruker BioSpin GmbH
$$ ##OWNER= she
$$ F:/spectra/data/she/nmr/H-F/1/audita.txt
$$ ##AUDIT TRAIL=  $$ (NUMBER, WHEN, WHO, WHERE, WHAT)
(   1,<2020-09-28 11:18:48.73 +0400>,<she>,<DPX200>,
      <created by zg, POWCHK disabled, PULCHK disabled
       configuration hash MD5:
       00 E9 B6 7A A2 85 ED C7 34 08 36 98 17 FE 4E 26
       data hash MD5: 16K
       44 8C 8D CE 2F AC 94 89 BA E5 58 4F 1A 31 9D C0>)
$$ ##END=
$$ 
$$ hash MD5
$$ 31 94 E5 07 BE CC A7 5A C2 44 B0 94 71 76 8C 98
##$RELAX= 
##$RELAX= 
##$RELAX= 
##$RELAX= 
##$RELAX= 
##$RELAX= 
$$ Bruker specific parameters
$$ --------------------------
##$DU= <F:/spectra>
##$EXPNO= 1
##$NAME= <H-F>
##$PROCNO= 1
##$TYPE= <nmr>
##$USER= <she>
##$AMP= (0..31)
100 100 100 100 100 100 100 100 100 100 100 100 100 100 100 100 100 100 
100 100 100 100 100 100 100 100 100 100 100 100 100 100 
##$AQSEQ= 0
##$AQ_mod= 1
##$AUNM= <au_zg>
##$AUTOPOS= <>
##$BF1= 200.13
##$BF2= 200.13
##$BF3= 200.13
##$BF4= 200.13
##$BF5= 200.13
##$BF6= 200.13
##$BF7= 200.13
##$BF8= 200.13
##$BYTORDA= 1
##$CFDGTYP= 0
##$CFRGTYP= 5
##$CHEMSTR= <none>
##$CNST= (0..31)
1 1 145 1 1 1 1 1 1 1 1 1 1 1 1 1 1 1 1 1 1 1 1 1 1 1 1 1 1 1 1 1 
##$CPDPRG= <>
##$CPDPRG1= <>
##$CPDPRG2= <>
##$CPDPRG3= <>
##$CPDPRG4= <mlev>
##$CPDPRG5= <mlev>
##$CPDPRG6= <mlev>
##$CPDPRG7= <mlev>
##$CPDPRG8= <mlev>
##$CPDPRGB= <>
##$CPDPRGT= <>
##$D= (0..31)
0 1.2 0 0 0 0 0 0 0 0.06 0 0.03 0 0 0 0 0.0002 0 0 0 0 0 0 0 0 0 0 0 0 
0 0 0 
##$DATE= 1601277528
##$DBL= (0..7)
120 120 120 120 120 120 120 120 
##$DBP= (0..7)
150 150 150 150 150 150 150 150 
##$DBP07= 0
##$DBPNAM0= <>
##$DBPNAM1= <>
##$DBPNAM2= <>
##$DBPNAM3= <>
##$DBPNAM4= <>
##$DBPNAM5= <>
##$DBPNAM6= <>
##$DBPNAM7= <>
##$DBPOAL= (0..7)
0.5 0.5 0.5 0.5 0.5 0.5 0.5 0.5 
##$DBPOFFS= (0..7)
0 0 0 0 0 0 0 0 
##$DE= 6
##$DECBNUC= <off>
##$DECIM= 32
##$DECNUC= <off>
##$DECSTAT= 4
##$DIGMOD= 1
##$DIGTYP= 9
##$DL= (0..7)
0 120 120 120 120 120 120 120 
##$DP= (0..7)
150 150 150 150 150 150 150 150 
##$DP07= 0
##$DPNAME0= <>
##$DPNAME1= <>
##$DPNAME2= <>
##$DPNAME3= <>
##$DPNAME4= <>
##$DPNAME5= <>
##$DPNAME6= <>
##$DPNAME7= <>
##$DPOAL= (0..7)
0.5 0.5 0.5 0.5 0.5 0.5 0.5 0.5 
##$DPOFFS= (0..7)
0 0 0 0 0 0 0 0 
##$DQDMODE= 0
##$DR= 18
##$DS= 0
##$DSLIST= <SSSSSSSSSSSSSSS>
$$ [...]
##$SUBNAM2= <"">
##$SUBNAM3= <"">
##$SUBNAM4= <"">
##$SUBNAM5= <"">
##$SUBNAM6= <"">
##$SUBNAM7= <"">
##$SUBNAM8= <"">
##$SUBNAM9= <"">
##$SW= 16.880792210976
##$SWIBOX= (0..15)
0 0 2 0 0 0 0 0 0 0 0 0 0 0 0 0 
##$SW_h= 3378.37837837838
##$TD= 16384
##$TD0= 1
##$TE= 0
##$TE2= 300
##$TE3= 300
##$TEG= 300
##$TL= (0..7)
0 120 120 120 120 120 120 120 
##$TP= (0..7)
150 150 150 150 150 150 150 150 
##$TP07= 0
##$TPNAME0= <>
##$TPNAME1= <>
##$TPNAME2= <>
##$TPNAME3= <>
##$TPNAME4= <>
##$TPNAME5= <>
##$TPNAME6= <>
##$TPNAME7= <>
##$TPOAL= (0..7)
0.5 0.5 0.5 0.5 0.5 0.5 0.5 0.5 
##$TPOFFS= (0..7)
0 0 0 0 0 0 0 0 
##$TUNHIN= 0
##$TUNHOUT= 0
##$TUNXOUT= 0
##$USERA1= <user>
##$USERA2= <user>
##$USERA3= <user>
##$USERA4= <user>
##$USERA5= <user>
##$V9= 5
##$VALIST= <valist>
##$VCLIST= <CCCCCCCCCCCCCCC>
##$VD= 0
##$VDLIST= <DDDDDDDDDDDDDDD>
##$VPLIST= <PPPPPPPPPPPPPPP>
##$VTLIST= <TTTTTTTTTTTTTTT>
##$WBST= 1024
##$WBSW= 4
##$XGAIN= (0..3)
0 0 0 0 
##$XL= 0
##$YL= 0
##$YMAX_a= 257774
##$YMIN_a= -197136
##$ZGOPTNS= <>
##$ZL1= 120
##$ZL2= 120
##$ZL3= 120
##$ZL4= 120
##$ABSF1= 10
##$ABSF2= 0
##$ABSG= 5
##$ABSL= 3
##$ALPHA= 0
##$AQORDER= 0
##$ASSFAC= 0
##$ASSFACI= 0
##$ASSFACX= 0
##$ASSWID= 0
##$AUNMP= <proc_1d>
##$AZFE= 0.1
##$AZFW= 0.1
##$BCFW= 1
##$BC_mod= 2
##$BYTORDP= 1
##$COROFFS= 0
##$CY= 11.3945322036743
##$DATMOD= 1
##$DC= 2
##$DFILT= <>
##$DTYPP= 0
##$F1P= 16.9975609425685
##$F2P= -3.02152046262296
##$FCOR= 0.5
##$FTSIZE= 0
##$FT_mod= 4
##$GAMMA= 1
##$GB= 0.15
##$INTBC= 1
##$INTSCL= 1
##$ISEN= 128
##$LB= 0.24
##$LEV0= 0
##$LPBIN= 0
##$MAXI= 10000
##$MC2= 0
##$MEAN= 0
##$ME_mod= 0
##$MI= 1.114404
##$NCOEF= 0
##$NC_proc= 0
##$NLEV= 6
##$NOISF1= 3.799351
##$NOISF2= 2.8
##$NSP= 1
##$NTH_PI= 0
##$NZP= 0
##$OFFSET= 15.70392
##$PC= 1
##$PHC0= -9974.831
##$PHC1= 17.6009
##$PH_mod= 1
##$PKNL= yes
##$PPARMOD= 0
##$PSCAL= 0
##$PSIGN= 0
##$REVERSE= no
##$SF= 200.130013532006
##$SI= 16384
##$SIGF1= 3
##$SIGF2= 2
##$SINO= 400
##$SIOLD= 16384
##$SREGLST= <1H.CDCl3>
##$SSB= 0
##$STSI= 0
##$STSR= 0
##$SW_p= 3612.71676300578
##$SYMM= 0
##$S_DEV= 0
##$TDeff= 0
##$TDoff= 0
##$TI= <>
##$TILT= no
##$TM1= 0
##$TM2= 0
##$TOPLEV= 0
##$USERP1= <user>
##$USERP2= <user>
##$USERP3= <user>
##$USERP4= <user>
##$USERP5= <user>
##$WDW= 1
##$XDIM= 8192
##$YMAX_p= 0
##$YMIN_p= 0
$$ End of Bruker specific parameters
$$ ---------------------------------
##NTUPLES= NMR FID
##VAR_NAME=  TIME,          FID/REAL,        FID/IMAG
##SYMBOL=    X,             R,               I
##VAR_TYPE=  INDEPENDENT,   DEPENDENT,       DEPENDENT
##VAR_FORM=  AFFN,          ASDF,            ASDF
##VAR_DIM=   8192,          8192,            8192
##UNITS=     SECONDS,       ARBITRARY UNITS, ARBITRARY UNITS
##FACTOR=    0.000296,      1,               1
##FIRST=     0,             0,               0
##LAST=      2.424536,      0,               0
##MIN=       0,             -197136,         0
##MAX=       2.424536,      257774,          0
$$ Real data points
##PAGE= N=1
##DATA TABLE= (X++(R..R)), XYDATA
0 0 0 0 0 0 0 0 0 0 0 0 0 0 5 -8 8 -8 8 -16 16 -24 24 -32 40 -48 56 -64 77 -89 104 -121 139 -158 181 -206
34 -206 234 -265 301 -337 377 -424 473 -528 589 -653 725 -800 886 -978 1079 -1190 1311
51 1311 -1444 1588 -1750 1927 -2125 2348 -2599 2882 -3207 3586 -4029 4560 -5207 6011 -7041
66 -7041 8407 -10260 12804 -30228 257774 -97604 -68258 111378 -118558 82533 -13740
77 -13740 -1849 90884 -44897 17966 56393 -11858 36667 2534 43236 -28022 14211 49163
89 49163 -23043 20687 -48640 36653 14292 -48982 46007 -32390 704 -14901 -5274 53557
101 53557 -46600 4259 23535 -46930 55747 -33378 -5511 58547 -90414 58051 9127
112 9127 -45378 42012 -28650 29993 -19145 -6748 37823 -25840 6882 -387 2109 14961 -27143
125 -27143 28020 -7053 -25756 53001 -40895 12247 -1586 -20539 54398 -58674 21423 20885
137 20885 -40072 23189 -7852 6738 2654 -11737 11850 -20093 14843 17788 -48423 35258
149 35258 -7527 -18385 32522 -39264 23286 2716 -17375 19377 -471 -6176 1497 11558
161 11558 -14895 22700 8583 -28120 18827 8618 -10575 24999 -19065 1141 27674 -38151
173 -38151 35139 -3845 -15893 28336 -27359 12143 5343 93 -1724 -11748 13433 -526 -8229
186 -8229 5728 -10049 428 8493 -13295 13649 -18568 4477 10547 -16871 14867 -8268 4347
199 4347 -11306 -635 13918 -8156 88 -5800 -2337 404 2348 -3080 -985 -7426 6181 -6457
213 -6457 -3081 8532 -12989 7377 -9005 7354 -1180 -4235 4925 -14785 16674 881 -6772
226 -6772 -3170 -220 6503 -2528 -5639 10630 -824 -15485 11420 76 3765 -5885 5647 -3478
240 -3478 -8784 21136 -10772 4182 -6150 2579 15619 -16233 6143 11385 -9336 3240 8329
253 8329 -5613 11887 -11089 3709 12416 -8869 8472 -4289 556 -4107 9189 -929 -3854
266 -3854 3258 -12358 10531 -5236 -4106 4849 -4191 -6392 -279 1239 3594 -9219 -8492 15115
280 15115 -12084 1029 -2699 71 1116 -10914 17635 -11758 -3152 4807 -2403 2167 -5269 7793
294 7793 949 -13819 3989 10180 -8317 5348 -10553 6315 2870 -11119 15816 -12064 3841
307 3841 910 -2114 5916 -4230 3201 -2067 3658 290 2611 3658 -2505 -4279 11671 297
321 297 -1817 2609 -6407 15847 -12141 5124 9302 -10582 3240 -3960 10501 -4005 -3409 3981
335 3981 -4127 -1407 4352 1936 -4769 -4674 4725 5246 -13230 9937 -4787 -796 2651 -9625 16753
350 16753 -14280 971 4660 -9632 9738 -4006 -5801 146 -4372 2193 2506 -9097 3316
363 3316 -8721 2417 1129 -8076 7906 -9933 5424 -7046 2557 8638 -13068 6072 -180
376 -180 835 2855 -1343 2757 1412 -3286 10200 -962 -3321 7789 -4826 6557 -2917 7606
390 7606 -2073 -5953 8092 -4340 8981 -7654 1263 4052 -7666 8699 -1339 -5685 7372
403 7372 -3459 -2465 7509 -6277 8850 -8441 243 9727 -9403 9302 -6870 2359 1446 -1683
417 -1683 6547 -9306 1715 3014 -2800 1041 223 -3035 2577 -7125 5878 485 -6633 6497
431 6497 -10486 6751 -1558 -1577 1114 -6181 5904 -6373 2066 798 -3616 -868 -826 1160 -864
446 -864 -3393 3039 -3215 -5405 11828 -7940 182 -3027 1559 8758 -12468 10003 -1337 -3246
460 -3246 4306 -642 5860 -2237 363 4968 -2198 1174 7623 -4386 2740 -3724 7367 3991 -9968
475 -9968 9794 -7148 5371 17 -4767 7588 -7448 901 2403 -1113 1262 -1963 -3492 4570
489 4570 -3690 1636 2267 -4274 435 -3426 9620 -7699 -451 4173 -5688 3520 -5897 8142 -2626
504 -2626 -9663 6586 855 -4500 1120 -1915 -232 -995 -2599 7566 -10077 1348 1948 -1891 3045
519 3045 -6627 8712 -6351 -2200 5208 -1895 3735 -4338 -774 4519 -1306 -284 3218 -5000 5108
534 5108 -3021 2125 4675 -7928 6874 -3063 3647 -628 -1019 5358 -5985 2983 3367 1549 -2291
549 -2291 -488 3804 1599 -4380 5667 929 -4736 4603 -2463 6918 -6139 262 4532 -7009
563 -7009 5265 -1138 -375 -3498 -83 2549 -2086 -2199 35 -466 -1384 418 -2612 3041 -5123 1860
579 1860 -2091 -1108 5294 -8819 3675 -2052 -407 1739 -2046 320 -2937 695 1545 83 -3682
594 -3682 2951 -1483 -711 -283 2440 -6 -5921 6165 -2483 2363 -1521 -792 3004 -3764 4436 3
610 3 -848 -74 2704 -1096 1739 1714 -339 511 -1379 4976 -960 2174 -1917 666 1314 367 3492 -4948
628 -4948 3173 -853 568 -7 230 1326 -3286 938 36 1478 -2163 1617 -2504 184 1357 -6
644 -6 -686 -3709 4051 -3074 2077 -949 -1392 -195 -2897 3280 -3253 542 -644 -2074 -1251 2111 -315
661 -315 -3238 399 -805 548 -3574 3573 -1980 -1811 -152 633 1874 -5394 4646 -2387 -1129 2520
677 2520 803 598 -3557 2471 2715 -201 -1468 3933 -1519 1027 896 1643 1798 -3507 4828 -2544
693 -2544 2748 -55 -676 2495 -3967 2972 321 480 -640 -1217 1266 2298 -3062 1005 2087 -3512
709 -3512 2306 -1980 5107 -4530 -1685 5085 -3303 1203 -1743 3152 -3182 -2003 4447 -585 -3506
724 -3506 668 1828 -2317 -713 -265 3763 -6452 319 2861 -2833 842 -4243 3587 -2992 -375
739 -375 2016 -2731 -176 -1949 1889 59 -1745 -596 1548 -2669 1622 -939 1243 1309 -5704 6109
755 6109 -1204 1110 -152 -586 3812 -3229 2963 2077 -812 -1416 2362 2134 -93 -1414 2900 517
771 517 -3445 5183 -1057 1010 -2599 2017 3221 -4847 3937 -1116 -273 -1250 455 1538 -1677 -1070
787 -1070 411 -934 -859 2033 -3161 1002 -2769 1018 616 -2719 1879 -3851 2864 -1439 -419 399
803 399 -1380 948 -2222 1591 361 -1247 -1491 2024 -1740 987 230 -616 771 -3297 4628 -2471
819 -2471 45 284 -1097 1122 -1899 2966 -2425 -877 435 771 -830 720 -552 -431 1110 -920
835 -920 2902 -3145 2369 59 -727 2164 -255 2107 -2511 2393 492 742 831 -90 715 -537 2261
852 2261 324 94 -2030 2817 -830 187 663 -1197 1345 -2600 2791 -1583 136 -225 -1796 1082
868 1082 -1165 1052 -1799 -138 -1202 69 -549 443 -1587 -1849 1946 -1834 1094 -2168 1567 -1920
884 -1920 -1469 2768 -1721 558 -2049 2303 -678 -862 1016 358 -759 -612 2650 -993 580 -990
900 -990 2252 -1150 435 2060 -1230 993 -2211 3373 -834 128 576 -712 1220 -918 1668 -477
916 -477 414 -931 1483 325 172 -592 -449 1748 -2584 3005 -1100 1193 -1167 -436 3660 -2324 632
933 632 -386 944 -1689 781 1659 -901 -1629 430 1990 -2328 845 -1067 960 -2344 310 2110
949 2110 -3255 870 -1678 1335 -1620 -633 885 -1411 -807 -819 1123 -1325 -122 -1844 1271 -858
965 -858 141 328 -1408 1600 -2572 3014 -943 -559 221 18 1595 -2077 1617 437 -14 -859 2154
982 2154 535 -519 -210 923 1363 -2414 3378 -1120 56 -349 598 2362 -2729 1918 -385 348
998 348 -358 984 307 -1447 400 685 752 -1374 977 -1164 1565 -860 -128 1624 -2241 1189 -1766
1015 -1766 1795 -484 -524 306 -488 323 -1284 1131 -1213 -696 -736 1621 -1181 -1138 453 -1046 464
1032 464 -1983 2403 -2042 -856 846 -397 588 -1638 1602 -1671 280 273 987 -472 -292 424 -194
1049 -194 984 -684 1713 -1570 1064 314 -4 1043 -1469 1645 -1414 1596 -69 -295 145 -290
1065 -290 718 -651 1487 -757 268 -665 1327 -344 75 959 -1324 1281 -844 2069 -1340 150
1081 150 256 -774 1531 -1394 980 -1152 515 45 37 -307 66 -186 -970 1371 -1496 640 -1721
1098 -1721 1039 -876 -933 1678 -1926 509 -1534 1312 -558 -1298 491 -1004 -465 -465 1146 -1406 -162
1115 -162 -768 1327 -998 -399 602 -1133 1444 -1436 1980 -880 -508 1065 -627 1386 -551 955
1131 955 77 226 -297 1558 439 131 81 306 2008 -1652 1973 -848 636 80 -365 2022 -2446
1148 -2446 1116 124 44 -753 13 750 -858 -738 637 1002 -2073 1278 -614 660 -998 160 1805
1165 1805 -2973 1438 -185 1005 -521 -575 977 -1215 200 82 290 -1151 -101 -580 1059 -1376
1181 -1376 -13 700 -1337 1149 -1877 1541 -801 -1007 703 -442 1022 -1376 798 168 -902 -191
1197 -191 1502 -600 -654 559 744 696 -1930 2839 -966 -241 1207 134 1432 -2255 1709 433 -149
1214 -149 89 909 331 -496 263 717 454 -1154 1569 -702 840 -63 -304 928 -1975 1938 -816
1231 -816 684 -221 -784 943 -291 63 -918 684 -1114 15 -333 786 -1095 -518 1018 -1266 582
1248 582 -1152 1153 -1421 -493 1303 -765 360 -1041 848 -826 -62 86 373 -933 -70 926 -897
1265 -897 556 -931 854 -1284 612 594 -925 771 -883 1287 -440 696 83 -210 446 151 748
1282 748 -138 847 -538 785 -400 1159 -102 -301 1386 -674 1287 -813 1082 -701 -209 924
1298 924 -662 679 -249 594 -675 533 -220 124 -416 -49 81 -583 1045 -1316 279 -769 760
1315 760 230 -1056 902 -1319 496 -439 652 -659 -685 534 -378 -588 -109 673 -1590 402 -309
1332 -309 523 -736 -528 1033 -1611 906 -804 808 -605 -625 1232 -460 405 -548 510 -321 434
1349 434 -278 817 -480 -212 727 -460 1010 -1268 1388 159 -106 536 -218 1165 -1335 968 608
1366 608 139 -278 326 433 -696 66 690 732 -1463 1410 -377 63 -112 -98 1259 -1940 1147 -41
1384 -41 -375 -301 -219 781 -906 194 178 131 -1057 482 -503 761 -763 -391 790 -1300 1223 -1176
1402 -1176 322 -478 -730 1021 -713 -18 -697 453 -158 -659 -193 666 -803 -534 967 -416 473
1419 473 -1378 1387 -402 -522 1314 -455 524 -861 1331 309 -593 426 444 -13 184 704 -3
1436 -3 419 -812 1200 -699 148 443 -810 950 -1062 1135 -428 -43 29 -225 847 -266 -63 -269
1454 -269 460 -691 841 -382 264 -662 -323 1325 -1368 672 -648 415 -226 -315 1230 -976 -5
1471 -5 -51 370 -577 19 -416 28 -566 -134 466 -1301 454 -1020 444 -608 110 566 -1014 818 -269
1490 -269 446 -442 173 -230 -4 398 -3 290 -287 612 -707 888 -265 443 101 -238 1237 -761
1508 -761 1033 -156 136 -82 -120 688 -475 10 -103 478 -302 883 -368 309 122 60 624 -731 1012
1527 1012 -929 612 -19 -207 371 -474 741 -1013 130 50 -88 -593 -111 335 -136 -125 -488 397 -965
1546 -965 439 28 -240 -56 -458 1024 -956 667 -248 -166 -114 -332 468 -569 4 -62 95 -612 -17
1565 -17 -398 174 -85 -348 752 -668 569 -726 655 344 -381 457 -164 583 -256 593 521 -54 179
1584 179 679 -137 -252 585 33 544 -965 1216 100 -355 495 -726 521 -1118 556 -61 -442 -258
1602 -258 306 190 -486 76 -263 53 -646 696 -458 38 -175 -400 999 -1108 625 -579 -14 54
1620 54 -47 713 -571 39 -86 254 -298 122 -346 257 -403 -225 767 -1049 187 -571 804 -189 -582
1639 -582 672 -615 -67 -66 703 -383 -164 -29 580 -157 114 782 -482 340 -736 909 -187 -103 521
1658 521 -505 567 -578 837 -143 21 295 -242 232 -129 58 -57 512 -686 735 -213 309 -102
1676 -102 -141 909 -646 434 -173 80 -88 -173 542 -869 -103 56 291 -535 151 -9 -71 -484 -256 428
1696 428 -897 634 -513 345 -166 -525 484 -769 254 -433 -58 -504 78 -74 60 62 -295 607 -345
1715 -345 759 -398 606 -193 -96 111 -462 744 -802 397 -228 -36 118 374 520 -474 299 -65
1733 -65 363 -422 314 -6 215 247 -289 513 -610 707 -232 294 348 -16 42 -383 531 -365 -56 -318 83
1754 83 -128 8 116 -238 219 -294 409 -629 396 -31 -437 -180 -565 653 -558 386 -396 -78 110
1773 110 159 288 -754 13 -111 387 -412 298 -273 256 6 -250 379 -614 565 -507 429 61 -219
1792 -219 496 -273 299 -363 324 -62 83 -43 196 135 -344 603 -370 559 -337 464 -206 -439 740 -37
1812 -37 568 -764 519 144 -59 175 316 190 -349 380 -50 123 -631 583 -287 -20 238 -506 485
1831 485 -974 192 -380 -120 164 -570 338 -669 -11 -178 218 -620 13 -61 137 -142 -454 786 -809
1850 -809 239 -184 255 -263 -455 484 -697 208 169 364 -379 26 15 185 -409 -76 324 -639 534 -385
1870 -385 347 -323 -284 485 -394 589 -189 269 49 -74 172 7 96 -153 506 -65 318 -412 690 -251
1890 -251 -253 443 -117 633 -723 560 242 -135 160 -88 243 -148 289 139 222 -362 205 11 -198 183
1910 183 -288 383 -945 305 -183 88 148 -287 263 -627 210 -405 -126 -473 52 -13 66 114 -139 264 -261
1931 -261 471 -323 429 182 -250 247 -379 392 -606 232 -20 96 230 -4 178 -115 539 -116 491 -480
1951 -480 116 72 -49 299 -556 651 -251 485 -137 255 312 21 375 -166 327 -323 77 -320 17 -29 177
1972 177 334 -417 444 -233 404 -408 189 132 -432 111 -402 281 -614 453 -70 -262 34 -50 212 -490
1992 -490 248 -174 -144 -465 318 -293 -151 358 -487 265 -601 483 117 47 184 -281 150 -140 107 -202
2012 -202 291 -338 323 68 12 57 -157 584 -547 319 -99 603 -31 -282 700 -302 353 -164 410 -154
2032 -154 75 394 161 238 -70 500 -162 299 -379 388 -115 -282 509 -193 266 -474 447 144 -355 -138
2052 -138 -189 83 -162 -76 -127 134 -600 283 -33 22 294 -267 107 -562 317 -28 -93 -246 -373 321 -418 -10
2074 -10 -118 301 -328 123 -86 -156 -70 -378 286 -824 293 20 41 95 -10 556 -422 54 -132 7 -239
2095 -239 304 46 -56 71 -111 388 -297 537 -536 463 -15 -201 391 -326 426 -347 390 -88 13 14
2115 14 -66 302 -105 259 -282 298 -340 387 14 36 -49 -378 228 -699 368 -128 50 199 -118 14 -385
2136 -385 0 39 188 -201 188 128 -139 94 -324 399 -144 318 -548 254 -119 -275 234 -262 99 -383 292
2157 292 -137 -55 -245 -105 245 -265 160 -27 231 -171 274 132 -199 243 173 175 -174 483 -163 -51 5 -68
2179 -68 228 26 289 -238 79 -119 188 62 -113 26 -133 441 -84 125 -243 190 -68 -310 177 -169
2199 -169 226 -220 229 12 -192 -78 -64 191 13 334 -299 259 -432 106 41 -150 120 -297 299 -240 132
2220 132 127 105 -154 -157 225 -347 51 -192 172 -250 -40 -74 -46 20 -401 394 -283 260 -175 98 -9 -263 528
2243 528 -173 132 -215 378 -46 -118 74 128 -110 -478 481 -267 336 -150 207 124 -130 173 -368 100 -455
2264 -455 418 43 44 2 -44 219 -372 198 -384 132 -99 151 -114 -312 119 -402 304 -355 391 -172 -135 160
2286 160 87 292 -159 70 -222 121 -282 167 116 -242 183 -204 490 -454 147 -160 140 214 163 331 -344
2307 -344 205 -219 409 -40 -229 271 -401 147 -64 7 -135 335 -67 50 98 29 163 -119 283 -127 -68
2328 -68 140 -157 102 -87 32 -97 408 -241 20 -194 330 -31 -129 231 -318 282 -172 195 -101 -107 303
2349 303 83 280 -68 139 -35 -77 -383 44 83 -131 164 -109 203 -294 26 -25 34 -36 -252 321 -266 306
2371 306 -303 272 -100 -66 -111 -78 89 -18 382 -269 71 -156 23 229 -262 134 -198 235 -355 162 -206
2392 -206 170 183 43 37 -89 317 -370 107 -276 -142 -160 -120 215 -188 229 -94 10 -28 -54 140 -361 209
2414 209 -168 285 -177 134 -140 -14 256 -167 106 -35 161 -153 266 -68 226 0 -64 -17 -123 297 -122
2435 -122 143 -255 -200 110 -148 216 -170 3 -107 66 -295 89 181 -113 107 -37 304 -524 185 91 -198
2456 -198 -46 -200 404 -266 37 -193 58 118 204 77 53 67 -2 118 -356 103 -9 -17 366 -19 187 -397
2478 -397 129 -23 182 154 -55 324 -222 310 -13 132 -67 -72 -358 -88 64 -100 147 -335 402 -205 210
2499 210 -139 -8 -28 -142 81 -268 -76 -276 256 -229 61 68 -254 84 -54 101 -53 45 39 -31 -102 -365 259
2522 259 -12 223 -76 238 -394 178 259 -100 200 -144 295 -199 273 -344 83 270 -246 423 -370 276
2542 276 -133 66 251 33 152 -16 381 6 86 206 334 -74 -4 -77 -98 3 -284 -59 -4 -138 255 1
2564 1 146 -152 4 -209 -181 -166 -29 -150 9 -206 -133 436 -206 320 -66 291 -60 -111 29 -97 276 -275
2586 -275 172 -276 107 -66 -95 23 73 -43 -261 297 -72 206 81 6 167 -276 437 -236 193 31 69
2607 69 27 -196 205 -108 182 -166 99 -262 133 -101 132 115 -252 227 -89 289 75 100 59 -278 -79 -84
2629 -84 268 237 41 -116 45 -150 -7 -44 36 99 -39 251 -14 21 -36 182 -122 -239 351 -315 -13 -458
2651 -458 141 20 40 174 -98 69 -128 163 -295 -101 -89 126 -36 -33 238 -76 165 -106 -404 -79 -114 238
2673 238 210 26 -160 138 -290 -163 110 95 54 126 141 68 311 -107 188 88 -266 105 -171 530 -221 134
2695 134 35 157 -54 -103 15 245 282 -114 155 -144 324 -46 179 13 -106 174 -183 172 -96 -221 -19
2716 -19 -152 92 -308 -96 -130 -16 -296 190 -72 41 -131 -166 365 -156 -54 -175 425 289 -125 -13 -144
2737 -144 27 -275 -91 -156 30 22 226 -205 -291 -49 -113 -52 -169 -15 -149 -65 120 -237 251 11 -53 -57 183
2760 183 38 -82 -69 49 180 -190 319 -55 99 153 160 -11 -39 222 -50 88 14 23 -177 29 -83 21 -99
2783 -99 -104 107 119 94 73 57 163 -193 305 -118 304 -122 -149 -1 -125 145 -94 -2 -299 -138 4 59 65 93
2807 93 -179 50 225 -196 380 -306 7 120 327 58 -23 130 -324 -66 -154 -51 -77 -78 218 -130 88 -187
2829 -187 -79 -77 -12 -62 -153 57 -165 -67 -350 71 -186 -33 53 -22 -42 -178 19 -233 81 83 -63 -95 160 408
2853 408 -74 251 -71 67 -128 -117 -13 -198 97 130 79 -384 159 -133 93 -131 -26 -18 -274 -62 -114 -300
2875 -300 -133 117 -448 -92 224 -68 202 -265 -8 -93 80 25 -65 222 37 -85 198 213 -62 98 -228
2896 -228 31 -128 -90 92 -349 301 -181 52 59 6 134 84 130 34 -168 -109 26 -178 225 44 -184 247 -185
2919 -185 248 -208 -248 301 -201 516 106 114 -83 11 -83 91 21 -129 -143 45 93 -64 306 -194 -5 99 -81
2942 -81 76 -229 -6 -76 88 -127 -66 -14 -249 156 -206 142 -333 102 -125 -373 74 -67 -74 -242 47 -69
2964 -69 159 -56 -118 -10 -70 -12 -166 78 165 124 -145 -12 114 -21 -113 8 269 293 214 -75 85 130 -70
2987 -70 292 -124 127 -56 -167 82 179 -164 77 166 -121 -77 -187 -10 19 196 -34 95 -41 -94 1 -151
3009 -151 206 -88 -95 -220 167 320 -235 57 -162 85 -32 18 -70 -152 36 -162 -243 -235 346 -94 -207 -94 -24
3032 -24 257 -29 428 158 229 -58 201 -241 -74 47 -126 -43 -91 23 -16 97 -115 -53 211 -142 294 -132
3054 -132 85 126 115 37 186 100 99 46 123 202 -16 231 84 -40 282 44 195 234 68 -274 188 -354 -198
3077 -198 272 -15 104 -213 218 21 12 104 -75 35 118 131 -84 105 -12 119 107 -133 241 -189 34 19
3099 19 -93 -62 117 177 -162 7 -10 154 -248 143 102 -7 75 100 28 -109 102 -75 -192 -49 99 59 5
3122 5 42 -176 82 -83 -6 256 -74 231 -186 8 -127 58 -94 -3 33 84 179 132 148 -72 125 -4 78 257
3146 257 -49 175 -280 116 -58 -246 -338 101 -84 101 -2 -220 -39 -191 207 -158 -190 9 285 67 -83
3167 -83 147 -44 228 95 -21 63 -381 104 11 165 -290 -123 0 63 -93 -46 -15 -116 248 22 204 177
3189 177 -65 -83 -87 17 13 44 5 -153 -83 198 -25 -182 31 -11 86 -40 -67 -248 124 -232 -71 -125 67 62 30
3214 30 122 112 72 -88 265 -54 -17 0 -142 -28 -148 145 -121 -94 116 0 -7 158 218 -48 -246 -234 -170 42
3238 42 90 316 -308 -120 85 -120 -55 -40 17 -83 191 -363 133 71 99 37 15 -190 -110 11 -149 54 -115
3261 -115 35 105 -116 3 -143 -124 -260 102 -37 128 416 -66 74 54 45 -291 204 -322 310 6 -116 130
3283 130 -163 -111 -254 40 -105 -24 -193 -97 101 -5 267 4 154 276 42 113 3 -184 277 428 43
3304 43 -53 -44 3 49 198 -217 86 244 -159 96 18 124 79 3 -150 -141 168 -64 132 -121 268 -11 40 -13
3328 -13 -5 -47 -44 231 -67 58 67 -201 155 -280 -68 154 -324 -153 -15 258 78 113 -169 -13 -64 86 31 63
3352 63 -28 -77 -171 -5 63 -155 186 74 -39 108 28 52 61 209 -239 280 62 160 138 140 -16 -213 200 -150
3376 -150 -53 181 169 -47 -117 21 -164 -2 81 -95 25 208 124 -110 -80 -28 26 1 119 -23 112 238 48
3399 48 -15 -56 -128 -137 -106 50 -107 -245 -70 101 4 -49 -43 223 -143 53 -11 7 253 -110 132 -51 123 127 154
3424 154 121 -51 -15 -140 -114 -23 -27 50 -26 -138 17 -3 -23 48 166 -41 -6 110 -319 -60 -130 -64 171 70 -9
3449 -9 53 -80 -89 99 -252 153 -40 21 248 209 -63 111 -182 -167 -113 238 127 268 -288 218 -77 -17 163
3472 163 25 47 12 -18 -52 20 -105 4 244 -77 -47 -219 -170 -146 -122 -102 -2 322 187 16 -25 -97 -27 -114 4
3497 4 -90 5 -112 -185 -159 99 -377 347 40 362 151 53 75 134 -18 -192 77 4 -82 -11 66 -122 -166 -191 111
3522 111 40 -16 -50 -26 -166 69 199 -26 104 295 67 -89 9 14 118 36 18 -188 9 -7 69 283 158 155
3546 155 4 -182 75 -132 116 136 -160 77 -125 80 154 -94 -104 -11 62 67 -140 65 -187 -84 -180 -81 77
3569 77 -178 -87 -130 -189 40 31 24 -44 -107 153 28 109 113 177 47 -84 -7 -32 -161 83 -104 69 119 -57 -142 44
3595 44 -15 -287 15 177 158 146 145 149 -126 1 -12 11 -216 95 -240 54 -28 -100 97 -65 -244 -148 -23 29 59
3620 59 -99 -43 -115 83 250 21 -171 -143 -242 164 -44 -17 177 -23 -107 -49 327 13 -120 -93 -26 -74 53 -20
3644 -20 237 -182 -2 82 165 41 75 -62 -23 -161 -82 9 93 319 49 138 -26 206 -196 18 171 -67 66
3667 66 128 -92 68 -23 44 87 -251 -21 60 -154 281 -114 -192 -99 9 38 224 164 -126 -187 88 357 143 109
3691 109 -48 -114 163 35 -13 -118 73 -63 -47 42 43 208 -45 123 68 82 84 -117 -40 46 -146 -17 -91 63
3715 63 162 -10 -145 274 35 -57 -132 -58 -2 -89 -56 -12 94 210 60 -95 204 -196 6 1 -101 48 -121 -123
3739 -123 176 -10 98 2 38 2 109 -101 108 178 26 56 22 112 -136 72 39 48 75 -11 60 -23 173 -112 -301
3764 -301 38 199 -143 -100 -3 26 163 -140 -52 140 104 -106 19 106 -71 21 -88 -140 75 145 -76 -27 231
3787 231 -155 -35 -7 449 214 164 -32 -203 88 48 -36 -89 -12 -62 87 90 54 116 49 52 -177 -221 -58 1 -84 -93
3813 -93 21 109 164 28 -173 -205 68 -90 56 91 -193 277 -126 -14 149 3 244 -65 60 -131 139 -140
3835 -140 66 81 -364 19 -84 114 -48 42 -89 -72 80 -122 237 181 -113 99 -102 49 -41 -60 204 -20
3857 -20 -57 -91 47 -28 11 21 160 -48 161 128 -136 -64 -105 -156 -32 183 -125 196 -122 155 36 68 -96 29
3881 29 118 21 7 -301 -78 -33 136 67 36 -287 33 106 -2 168 -262 -97 -145 103 186 45 131 -159 11 -149
3905 -149 3 41 142 -57 -95 -20 -84 -117 -228 8 30 133 62 -62 -186 161 57 -34 -153 122 -30 -79 46
3928 46 71 -129 -91 -264 -222 -138 -32 -122 144 -260 -62 -237 136 75 44 -46 56 -278 90 151 -328 -196 -60
3951 -60 -2 72 11 66 104 21 57 -56 -68 1 -27 46 -74 -211 6 345 -3 105 -99 150 41 -52 43 -220 154
3976 154 -104 -48 116 -112 90 246 219 -121 -40 7 127 -41 164 -78 16 161 30 -187 -92 60 64 -39 181
3999 181 113 55 -36 -125 -57 223 -113 -37 -143 -57 169 72 -56 160 94 57 114 -59 77 -132 94 84 3 -106
4023 -106 -154 -101 -33 29 138 2 130 186 -3 14 32 -100 115 -191 -119 -147 -120 -70 -227 -224 4 50 -96 -62 65
4048 65 46 34 314 165 -8 57 136 -15 50 6 52 37 -45 78 31 180 -5 -79 -79 -27 74 18 9 41 -34 -24 -57
4075 -57 -5 179 -94 18 243 -103 75 79 220 165 68 -167 -176 -69 204 135 34 173 134 78 249 63 -147 -52
4099 -52 70 86 38 -202 172 -14 57 26 148 -87 -52 6 -159 -287 -109 6 -145 147 -97 28 65 164 33
4122 33 84 1 -305 81 3 177 -222 -64 206 -45 -140 34 -5 270 -94 75 120 217 45 109 80 56 243 40
4146 40 92 -90 23 34 87 -188 -75 -187 223 43 -122 -200 194 -16 143 76 -147 -211 -95 -195 14 123
4168 123 141 15 -78 66 -227 -71 -285 -52 55 -209 199 -8 -311 -187 25 114 176 -115 -318 220 64
4189 64 134 -64 -157 56 81 166 -140 10 -209 175 -83 1 -202 -150 -101 -119 228 99 -140 26 96 81 193 -299
4213 -299 89 -65 31 219 -8 5 -126 101 231 -17 41 -100 44 -276 -83 197 -45 -280 63 -67 -118
4234 -118 48 232 143 -214 -38 -55 -176 98 -23 128 113 -27 103 40 -39 103 296 -66 54 122 -92 -139
4256 -139 125 -55 24 -49 -178 69 40 297 -62 -144 16 96 -184 201 142 -124 -9 -7 114 166 286 47 -210
4279 -210 19 69 -333 70 59 -30 34 143 89 57 -192 57 16 -28 50 -85 -98 -235 -53 -95 30 92 142 92 53
4304 53 76 75 -146 143 72 9 4 248 5 53 -167 100 64 -212 59 -107 207 -125 -240 -167 -43 -118 -184 141
4328 141 -310 -114 56 -110 48 -6 -125 120 81 -66 -135 -342 -9 -36 15 119 31 117 -218 -3 -28 77 -54
4351 -54 180 -267 51 227 52 -78 129 -105 79 38 -379 81 7 149 8 124 -143 -10 -23 -177 16
4372 16 -29 -94 44 -317 -232 -205 -46 -206 -76 172 -11 44 -235 242 78 -49 -184 180 134 54 -119 36 -106
4395 -106 -53 25 0 -50 -43 121 250 -101 138 85 -55 5 125 -80 -156 121 -130 99 -147 192 -20 75 266
4418 266 166 43 -63 -35 -255 -114 -208 206 5 -111 226 -139 165 -52 265 -130 -2 -153 -223 173 -57
4439 -57 -27 120 -12 324 -77 -164 8 134 -26 -169 -104 145 29 -66 66 -19 191 128 53 -281 -65 135 -55
4462 -55 22 -173 1 -122 70 49 -149 -131 -43 -39 33 -163 -34 -244 4 -184 -116 -162 -96 238 17 28 -148 8
4486 8 -194 -31 37 -30 323 97 21 -269 63 87 -185 71 -105 31 177 62 -17 -32 98 35 -4 -72 95 -159
4510 -159 117 241 -127 348 -63 -8 73 -203 47 141 136 -96 71 -178 -135 -42 -178 217 -125 32 160 -27
4532 -27 182 -58 -68 -279 -12 -263 -25 21 -113 -86 48 259 -152 137 -182 -97 -164 180 -56 15 110 -108 46
4555 46 -73 -98 190 208 81 36 187 128 203 20 -155 49 3 164 161 -10 -90 155 -94 -80 -162 166 -49 49
4579 49 222 270 -132 69 -24 16 26 -26 -32 94 79 -113 190 51 -72 85 -60 83 -209 -24 104 8 84 -48
4603 -48 -155 1 147 -143 127 -175 28 316 23 172 143 98 120 -142 192 66 13 -53 130 -42 83 -174
4625 -174 165 -57 -143 -18 174 -144 81 -61 -23 321 -6 109 88 165 -127 166 -42 34 111 -119 1 -23
4647 -23 -136 127 17 -52 -124 -185 -276 62 -13 -279 22 -183 130 63 192 -34 -269 -183 45 43 -30 97 -113 243
4671 243 44 -249 -115 88 -46 32 -98 24 -27 -36 -117 337 -58 108 -219 -141 21 0 75 -204 243 9 85
4694 85 108 -28 -75 -32 237 -10 -81 -149 18 19 88 42 235 -103 -62 -101 208 50 30 -16 75 -238 -117 56 126
4719 126 -135 220 -127 -42 22 120 64 85 170 22 103 -268 49 -124 45 302 116 79 -462 -41 -120 87 102
4742 102 51 87 21 66 -92 82 -90 -144 -93 -89 116 -147 -55 29 -228 66 44 -274 138 124 -86 211 -83 -145
4766 -145 17 27 -151 36 -54 220 25 -164 -183 -289 -143 -187 82 65 -220 -71 143 -47 142 56 -104 157
4788 157 93 108 42 -52 -91 -138 150 15 -82 -114 46 -142 -76 -209 -27 -29 129 118 -65 -85 -14 -90 -26 252 9
4813 9 161 -108 50 104 16 103 131 95 -16 -270 -106 -102 -128 165 -38 77 -100 -175 8 -123 -24 -29 -166 -239 -4
4838 -4 -52 120 59 -41 -109 -5 -60 -53 -109 329 -103 -27 152 -125 96 -43 137 -199 90 -86 -190 -145 -138 1
4862 1 -42 -328 -168 78 16 -221 152 79 -261 -23 22 85 -325 116 220 83 -6 -87 -161 156 -124 7 -140
4885 -140 -7 -74 107 -159 -233 -88 -152 -96 -3 29 84 9 61 -348 -17 364 17 115 115 89 17 90 -37 49 355
4910 355 -292 132 259 11 182 -132 85 -77 -163 -71 54 -83 -40 -44 -189 34 -21 27 48 154 13 19 -83
4933 -83 -141 99 -4 9 -198 -121 -145 240 111 227 -249 113 155 -19 107 -10 -200 69 49 44 -5 169 -19
4956 -19 -62 -138 -65 305 51 -155 -13 82 -277 -41 5 98 146 -92 226 40 46 182 164 -173 7 19 83 -233
4980 -233 18 60 19 52 -6 77 38 -123 386 16 -47 66 -109 -13 230 -34 123 -131 -12 -37 -112 -61 -236 -196
5004 -196 -56 24 24 -159 -2 -79 163 146 2 124 -94 -33 -154 -117 215 179 -26 42 88 -110 169 126 -142 -16
5028 -16 -174 -32 59 34 -76 -36 -70 149 34 -98 312 86 -290 -137 -75 87 -78 -18 -81 -65 -110 -192 103 21
5052 21 -210 -15 -80 -102 85 -15 -83 -134 72 91 63 -14 1 9 70 -80 4 112 -54 -70 27 141 -80 63 -87
5077 -87 44 -23 56 -187 79 15 -80 28 -194 -178 159 71 64 154 -82 64 -113 141 -262 -71 5 31 48 92 -5
5102 -5 -155 111 -45 -22 24 177 42 152 -92 -45 259 89 332 -260 53 -166 -78 -18 321 125 46 149 -98
5125 -98 -16 -163 55 107 -61 -47 31 -9 -2 87 95 -101 -80 -3 228 -127 -133 138 -105 -72 -115 -61 6 -12 145 139 -252
5152 -252 0 -140 -456 -305 -92 192 -13 75 113 135 128 -143 21 42 114 199 128 -291 152 -115 -165 -43 131
5175 131 -113 33 76 -136 7 -97 80 -120 -10 33 148 57 -107 -229 -161 115 274 -160 -188 232 -67 51
5197 51 -121 46 154 50 -67 43 216 -179 -4 47 178 156 127 189 -75 -51 235 10 83 149 -45 -121 -179
5220 -179 -357 -94 -40 -133 -93 37 122 38 -35 103 -34 -12 -71 45 -119 -198 29 -86 -101 31 105 -387 -261 129
5244 129 -45 -55 -70 -126 -20 -117 -103 3 167 4 216 117 11 162 212 -87 -99 57 165 -14 -261 127 -22
5267 -22 2 62 -160 -91 -204 63 163 119 65 31 -29 204 -16 -15 114 -68 -51 -72 30 -157 -19 -32 22 27 -81
5292 -81 -71 37 -35 83 -242 -92 90 -248 0 111 -13 -96 -24 27 198 86 -32 -124 -181 -57 -40 142 -204
5315 -204 28 -169 235 -108 -88 118 100 -52 233 -108 50 -45 -100 -15 -7 -69 -49 16 224 31 29 20 27 63 27 -184
5341 -184 -115 65 179 127 -113 71 -165 -81 36 -59 -1 -103 -64 -50 -44 -49 364 42 53 230 31 0 -220 130
5365 130 102 -26 -134 -1 -141 -103 136 -95 -60 74 446 -253 147 -6 -111 99 -6 -16 56 -136 -328 10
5387 10 40 -107 12 -80 -80 121 95 31 91 -54 -130 -36 -170 265 -41 -65 -26 32 -96 -233 -30 125 116 -199 -203 13
5413 13 -83 -67 -36 -8 -159 202 41 124 -34 44 -125 147 128 48 177 -24 131 -297 -11 84 -33 185 51
5436 51 -113 105 260 -12 63 58 -85 111 -14 193 -37 -101 -237 86 -134 -194 107 6 16 21 88 -238 127
5459 127 -176 117 216 -2 97 -236 71 23 268 25 -64 -69 -145 31 44 202 -172 -45 -53 96 -90 -227 -244 -99
5483 -99 0 -55 -5 139 -54 -203 -323 10 109 -60 -116 -177 73 -18 184 -53 45 -349 40 45 175 -210 -19 35
5507 35 -153 -153 -57 314 -23 -94 -110 97 -119 90 161 72 211 87 -112 84 153 11 -36 72 94 158 -51 -145
5531 -145 6 76 -26 -78 -30 115 -234 86 127 107 -213 -176 59 -53 -210 -213 36 40 235 130 -94 176 72
5554 72 56 -17 88 -63 -113 -76 -74 -26 187 37 210 -7 -63 -134 21 -99 -145 30 -104 71 -50 93 -118 131
5578 131 -235 -149 10 33 -41 -22 102 -72 -15 65 45 143 47 -158 -62 -132 52 -131 82 89 2 178 37 29 50 146
5604 146 53 -61 70 -108 -283 -82 37 70 47 240 45 -242 -117 35 130 -40 74 123 80 77 96 -48 -61
5627 -61 412 -142 -106 -141 193 155 71 -46 -3 123 -64 170 -120 102 -86 -57 -177 -57 -192 244 1 -21 -291
5650 -291 133 -40 -94 131 -139 98 -78 327 14 -4 101 28 -165 -109 151 -11 -163 4 8 126 46 -116
5672 -116 -126 93 -216 307 -156 206 -201 106 -107 136 -88 -11 73 -147 216 43 62 -3 53 5 -52 -181 89
5695 89 -88 -165 208 -299 -185 -21 -104 -96 127 -129 56 172 -91 -37 177 87 43 -68 62 -25 -97 5 63 -134
5719 -134 -66 236 43 -62 -322 41 -75 -14 254 150 102 129 47 130 304 -65 131 89 -54 143 37 48 198
5742 198 53 60 122 -65 -151 -115 19 152 -200 368 2 140 -213 -56 -164 -155 107 145 -16 58 -16 120 97 -143
5766 -143 67 -69 -264 -8 -160 62 62 -19 -94 154 106 -181 27 -17 30 -12 128 75 -212 12 224 81 118
5789 118 203 27 56 271 -12 192 -189 -56 78 16 -352 189 7 -90 8 64 -208 -287 57 116 -155 -107 -29
5812 -29 -99 -162 46 171 3 66 16 120 -137 71 22 -55 13 13 32 22 377 43 61 59 -123 -125 82 131 -103 -108 -5
5839 -5 363 24 83 -182 -188 234 -23 106 114 11 -320 -203 180 -18 65 -106 -40 -109 -22 -164 -43 -122 -115 -65 23
5864 23 -212 -8 192 -145 178 -98 174 53 -16 53 -114 -112 -167 -125 61 -44 21 -70 -146 -77 -87 266 -224 76
5888 76 5 91 -171 -146 173 -39 -58 195 -193 38 132 -155 65 -9 -52 53 -102 -174 105 -183 279 120 30
5911 30 -179 36 114 -86 -32 179 -34 99 -86 46 52 131 253 -80 120 -199 -38 96 -144 -76 161 -154
5933 -154 18 -1 134 345 -304 -80 -67 41 -116 32 -226 -149 93 -19 78 -107 -12 -84 176 20 -147 -55
5955 -55 253 -1 107 27 64 166 -177 25 73 40 36 36 45 -158 -24 -26 144 132 -48 137 133 -84 17 109 -111 14
5981 14 -59 -94 189 -185 94 -77 66 130 103 -4 -175 -16 -143 26 265 79 -127 -19 -171 -164 -21 -125
6003 -125 54 91 -251 -149 -73 -28 18 2 -54 0 12 10 -82 -194 -9 149 156 21 8 73 -40 -10 52 186 46 162
6029 162 78 81 124 -45 165 -409 290 112 13 44 64 27 -262 -112 -350 -7 140 17 157 129 156 25 15 -142
6053 -142 -31 207 -33 75 -106 78 -182 44 140 27 -25 9 29 -83 -54 155 -45 -186 32 -2 -128 -65
6075 -65 -80 -129 115 121 49 52 98 222 93 14 -33 89 -25 -1 20 234 -39 -149 94 11 -307 204 14 -99 -151
6100 -151 25 -262 59 127 100 -176 13 48 -68 184 -96 -59 -114 275 14 -99 -189 117 -154 -54 -172 -72
6122 -72 -75 -33 116 -170 -117 74 -280 -58 -102 -155 -36 156 -122 55 -79 -99 -120 -216 -39 -6 -36 -55 153 -18
6146 -18 -28 -92 92 -179 -53 38 -33 126 159 -205 -227 -64 322 -105 -107 2 146 -186 -104 100 -100 258 -102
6169 -102 -139 194 -166 60 10 171 -7 117 -161 -249 155 -16 115 -215 -26 -19 171 109 -39 197 -29 188
6191 188 -12 -185 -97 -108 -7 -108 56 -92 99 78 126 224 -117 202 -170 -24 151 28 47 88 47 145 -142
6214 -142 -20 18 5 -197 29 174 74 -126 -2 135 -229 36 274 -26 163 -101 -8 -7 26 -74 107 77
6236 77 168 -25 79 -37 68 214 -182 176 -80 -227 -177 -49 -168 -28 61 -7 54 8 17 -160 174 52 -15
6259 -15 -201 36 150 0 -52 -22 -176 -90 94 16 85 -174 -83 -145 -74 87 -116 171 -83 129 98 177 181 -80
6283 -80 -75 119 235 101 198 36 -23 -78 -108 49 -118 222 -217 2 124 6 -340 -216 213 -20 -60 -13 -109
6306 -109 -188 17 170 -170 -192 61 114 -236 210 8 98 18 82 23 65 129 -330 -205 19 128 -60 -126 -55 111
6330 111 188 -49 21 45 -51 31 42 -92 124 -69 -13 133 -100 -82 4 -170 168 -16 -220 95 -44 0 -100
6353 -100 -179 -85 166 251 -206 -31 92 -83 106 -11 -93 -105 -135 59 -63 167 -257 166 45 58 -133 -58 -84
6376 -84 53 71 -83 225 -61 110 -89 156 12 92 148 -190 -153 -190 11 -34 17 -13 -154 -100 0 -235 0
6399 0 164 21 233 -40 109 183 76 -32 171 26 -6 -99 -33 -19 -28 102 -21 41 -249 102 -158 -221 -2 119
6423 119 -131 60 35 57 279 106 -101 16 -83 -275 332 -2 -11 -52 -38 44 55 93 -278 -226 99 -124 -31 78
6447 78 198 100 27 78 -4 -150 -223 -154 -220 4 -37 -81 -102 175 256 1 -119 40 -61 -19 35 7 119 90 16 280
6473 280 -132 84 -119 123 -51 240 147 137 28 102 -54 338 59 -56 -30 13 193 -146 74 84 44 -142
6495 -142 232 -52 -123 -62 -71 64 -20 76 163 -115 194 -322 -43 -56 -120 -63 -26 -204 -2 80 45 -142 35 -50 -93
6520 -93 -81 193 134 75 -162 104 146 -283 223 23 59 16 -12 -122 -164 65 160 -90 47 263 47 95 -53 125
6544 125 -37 183 -100 -31 46 -46 -110 -84 22 -118 106 107 198 39 -160 -122 -95 28 14 13 -14 -200 64 209 209
6569 209 -1 109 -7 -106 -111 178 172 158 -79 -208 257 -341 197 158 -37 98 -27 -49 247 167 -140 -214 277
6592 277 19 -44 -133 78 159 -85 193 -2 -60 -62 -141 -192 82 42 86 -156 2 -101 -182 115 62 -83 -110 -240
6616 -240 18 39 -38 -7 -15 -10 -25 -34 53 -142 -29 -138 -122 200 -31 50 118 9 -77 91 -30 143 70 -240 278
6641 278 -198 -38 25 -107 29 -156 142 -107 45 228 -68 -127 -25 -191 52 -102 297 68 -202 -102 46
6662 46 27 178 -87 -59 -21 126 -115 -122 277 188 121 81 -29 -61 117 -176 233 -161 49 46 -17 155 -106 -75 -12
6687 -12 -92 -54 4 142 -129 151 61 -44 -250 -132 -60 121 -114 101 8 -95 37 -138 10 -95 -25 195 126
6710 126 -95 89 123 -63 -206 203 251 61 -21 -4 239 62 -301 -56 -148 18 89 -181 83 -108 260 52
6732 52 -62 -108 -62 -202 -184 39 -53 117 122 100 71 9 -13 259 -203 -234 -43 141 204 131 -39 30 19 -204 154
6757 154 -115 -70 67 -137 48 -89 -301 0 -66 105 29 -94 70 -88 -117 -57 -213 -67 -80 24 -91 -190
6779 -190 -62 -91 -94 51 53 -76 -131 -76 272 -7 -30 -61 -99 124 -125 124 91 30 -58 -161 156 44 -5 -44 -273
6804 -273 -21 -62 317 236 -205 -12 -127 110 190 -62 3 -3 -134 -20 218 -16 137 40 -23 10 114 136 220 177
6828 177 8 13 -13 -163 -9 13 -19 314 101 -59 -17 40 120 33 103 60 139 -98 -1 -12 52 297 -71 -32 -15 -84
6854 -84 -125 132 290 108 173 20 133 80 -17 -212 153 -73 -13 122 56 111 -57 5 68 131 110 68 -2 -68 -95
6879 -95 -287 -102 70 133 167 113 24 -185 -127 244 -32 113 -57 -20 39 -17 -9 -122 310 -96 42 -151 95 -187
6903 -187 -5 186 18 298 -178 -58 5 171 -290 87 -30 -20 -213 233 -57 -79 36 -24 -15 -121 87 145
6925 145 -187 -75 91 -67 -14 48 -126 78 74 -118 193 -281 -64 -221 37 -157 51 -33 -211 -4 50 50 18
6948 18 -152 39 -235 -51 -117 52 -118 -51 205 55 107 -82 160 280 -93 -191 178 137 139 -60 -155 18 15 4
6972 4 11 132 178 36 -211 -622 210 -122 76 -89 329 -201 -8 43 14 -168 -197 12 154 -39 -45 -70 -16 9
6996 9 147 -56 -116 169 -382 57 158 87 82 34 12 288 41 -224 30 -50 -101 -48 37 -134 276 11 173 163
7020 163 126 82 -61 206 78 -113 -128 200 -79 -68 143 -81 -177 86 34 224 -5 -30 42 109 156 -63 -144 192
7044 192 195 -377 28 199 -23 -242 -11 -137 92 -73 195 -60 -103 -189 -11 129 28 122 -410 36 258 151
7066 151 -45 -241 170 64 -1 -264 -250 30 188 277 -304 74 122 596 17 682 50 -466 329 430 393 -9
7088 -9 104 -89 121 -95 268 144 39 -84 79 -115 -66 132 -78 30 32 -371 207 393 18 114 108 174 -136
7111 -136 -155 -185 280 -78 -72 92 147 -27 92 -255 324 119 50 186 42 99 -243 254 -147 -91 91 -63 -4
7134 -4 -9 -175 71 34 -38 131 33 240 -52 -216 164 95 -21 -20 -115 122 74 245 -38 -61 -70 -88 126 -49 -52 -41
7160 -41 66 241 32 71 208 -22 -102 -42 -32 338 -3 66 -29 -123 -101 252 -141 -51 -77 -76 -24 226 -56 77 -47
7185 -47 -89 -105 -159 68 -21 -36 102 -112 -42 -203 -117 15 33 183 -41 123 319 81 61 -40 -12 119 -17 25
7209 25 -3 165 69 -136 119 -71 127 -38 -6 76 41 -216 -6 -12 195 -124 234 87 40 392 47 124 -120
7232 -120 -73 -174 -204 -31 -104 55 -279 -31 -66 15 -171 -125 -56 230 163 1 180 -132 -179 -46 -123 -117 12 -24
7256 -24 79 -16 -225 -265 -85 47 39 143 -123 -114 21 -81 79 -119 -112 6 -181 -117 -159 -80 -165 32 254 -128
7280 -128 159 359 154 62 -23 152 -113 7 16 -161 -131 -61 -14 -152 62 -101 233 174 93 204 105 -279 -6
7303 -6 49 -10 -239 -141 -70 33 -75 -20 -8 -14 110 29 85 -126 -87 62 -120 182 -87 54 -87 21 74 59 -99
7328 -99 -126 32 -63 -35 -39 -9 -111 -122 -278 -157 -252 -24 50 79 246 -394 -109 -96 -97 148 69 -49 19 149 -43
7353 -43 -57 180 -273 -162 56 -201 91 -146 209 83 185 -11 62 -21 -9 -98 54 63 38 -83 325 -54 78
7376 78 149 -104 75 -27 -158 142 226 -27 173 -30 199 104 -10 -112 167 -140 86 172 -17 199 -95 2
7398 2 42 122 -170 -91 296 11 106 125 -190 53 -90 137 254 -48 -134 -85 279 -90 164 164 98 -36 -120 44
7422 44 -102 52 163 146 107 -81 73 -18 192 37 -93 96 -50 -31 272 -16 130 -86 -7 -5 72 200 -7
7445 -7 -147 4 202 -55 8 5 -119 48 169 88 35 184 -132 -328 102 -152 -165 -146 151 193 -65 201 101
7468 101 67 -124 -106 56 8 57 -48 -279 -77 45 -89 93 48 173 132 -260 -191 -39 -186 31 132 24
7490 24 -39 251 -2 74 -64 -218 -68 -53 249 -96 171 289 214 -101 6 -76 138 -183 -123 89 133 92 -194
7513 -194 82 76 -66 211 32 48 68 31 -21 164 272 69 -67 -33 10 67 62 -124 -47 21 -26 -119 289 -222 155
7538 155 -26 -100 -121 33 25 -94 -13 -251 -213 -49 -12 79 -172 43 225 -161 462 61 -39 -217 116 -112 -8
7561 -8 -90 112 49 59 175 68 42 -105 98 183 117 211 -56 -10 -42 56 -42 175 17 -129 115 24 -74 -36 -57 84
7587 84 -185 192 -68 195 -117 -83 45 266 71 -24 96 -249 142 -92 57 -69 67 52 74 -198 90 4
7609 4 30 71 50 57 -279 26 54 55 -2 14 146 -82 25 -248 41 56 -28 -90 -151 -7 2 212 -57 -32 -17 -256 73
7636 73 -63 -144 -168 -25 -326 127 214 21 111 -19 -167 101 -6 37 220 -17 146 -212 -207 128 -375 -71 -46
7659 -46 116 84 105 -175 -164 -90 83 77 -77 74 121 -64 -68 -66 100 -60 276 116 165 25 -21 -128 -110 7 -6
7684 -6 -165 -91 26 45 -39 268 -35 201 -118 -326 49 -37 -27 -137 156 -205 3 -189 139 191 -218 409 210
7707 210 18 -4 160 195 144 66 -25 -84 142 19 13 29 27 -55 -14 5 -58 -98 35 -90 237 -157 -135 176 109 -14
7733 -14 -121 125 -9 -177 -178 94 69 50 81 -97 -32 31 70 -208 20 -155 -59 -6 175 17 -3 -58 -137 -36 77
7758 77 -40 235 -84 -16 -22 -10 13 77 70 223 -25 -60 122 -116 95 -6 53 -52 -97 -50 -160 102 -285 -124
7782 -124 -2 2 118 99 -243 82 -172 54 -181 -79 -332 -102 -254 -51 -143 -70 -10 67 125 123 83 -171 17 -166
7806 -166 46 108 279 185 87 -320 -197 -71 -154 81 39 138 -147 -143 -123 -11 -233 -127 175 -61 -109 -41 -83 -107
7830 -107 52 105 -18 24 65 208 82 -134 26 44 -172 -80 137 45 -218 -161 172 49 -69 -23 -16 -4 123 -198
7854 -198 75 191 96 -88 -210 -204 138 -110 -83 -23 489 -206 87 109 -107 31 120 119 130 179 -119 -44 -36 3 92
7879 92 -188 149 104 1 7 -137 -22 38 62 -79 -288 -55 50 -97 -77 -159 -63 52 -88 26 -87 -131 -50 -124
7903 -124 52 79 -26 9 -12 -1 21 -93 -36 -50 103 -2 -47 79 236 77 -33 201 -43 -8 71 41 -132 -35
7927 -35 56 -190 66 15 -100 -140 -73 -18 85 -11 -193 -47 -17 111 -11 -4 164 313 35 65 -24 -58 71 125 -26
7952 -26 -52 320 -149 -126 242 24 -172 37 -54 151 -239 -123 -12 37 245 104 -22 47 198 27 39 -39 200
7975 200 -33 44 149 130 80 126 62 -58 72 -25 79 -101 -165 128 -27 -180 -21 41 16 -75 29 -267 127
7998 127 -99 271 236 124 146 208 -94 -130 215 56 188 -148 55 -121 -118 -65 25 -152 -69 -131 10 -107 -125 36
8022 36 -87 93 -8 -125 85 73 -16 -59 -46 87 32 -197 138 -23 -78 -9 -77 -49 80 259 207 -39 65 153
8046 153 -209 5 44 -59 52 75 163 -28 -105 125 249 31 141 -38 -237 -128 -53 -18 88 -137 221 59
8068 59 -189 315 -33 -82 14 247 -30 -52 -2 -149 110 -108 161 130 57 -54 -51 48 33 -24 134 -178 -46 -304
8092 -304 -36 114 -99 -37 -59 -28 -32 185 -124 231 -259 125 -16 65 -248 162 -48 172 10 155 145 -38
8114 -38 -119 -141 145 115 -115 198 -240 -192 -207 -160 123 39 148 -208 -115 132 81 -157 260 156 319 105 94 -75
8138 -75 -135 -41 2 172 45 162 -43 8 19 -75 -13 -123 -45 -75 -68 110 -285 -81 12 -20 78 0 -102 -176 143 -65
8164 -65 -38 -47 37 171 -92 -288 182 -1 -52 176 128 119 -10 139 -58 -130 134 131 -246 217 -247 1 73 -332
8188 -332 119 -10 -93
8191i3
$$ Imaginary data points
##PAGE= N=2
##DATA TABLE= (X++(I..I)), XYDATA
0 0 0 0 0 0 0 0 0 0 0 8 -8 8 -8 16 -16 24 -24 32 -40 48 -56 72 -82 96 -113 136 -155 180 -208 240 -272 309
32 309 -351 396 -447 504 -564 632 -705 786 -874 971 -1075 1189 -1314 1452 -1600 1765 -1945
49 -1945 2139 -2358 2597 -2862 3157 -3488 3863 -4290 4779 -5350 6026 -6837 7835 -9094
63 -9094 10736 -12974 16213 -21322 30578 -52514 207189 109202 -197136 206359 -63275 37386
75 37386 75214 -41596 82254 -16123 -41297 75244 -32754 7842 -373 2145 -9764 -29420
87 -29420 50692 -38376 -14401 -15971 -11448 48676 -69610 27942 -2249 -29865 20793 -15716
99 -15716 47072 -20221 -30817 53184 -35159 24725 21075 -49883 72208 -54664 -1272 68759
111 68759 -78528 37560 -7382 -8842 10587 -36049 38803 -21657 -17083 14294 -11438 13997
123 13997 -17610 3736 22161 -38061 42704 -8128 -28230 39000 -35335 45302 -23199 -23346
135 -23346 55348 -47202 12782 13269 -11336 11475 -16161 8103 -2742 -4460 27342 -39629
147 -39629 7609 28730 -42165 34151 -19047 -5623 29045 -30644 17567 3507 -9299 974
159 974 13238 -5588 5851 19385 -28407 10207 23569 -16280 11992 -139 -20550 33732
171 33732 -27855 1810 23838 -42382 25986 -16704 -10190 16894 -16310 -1299 -14170 6577
183 6577 2700 -15178 1256 -2256 -7663 13025 -12333 3063 -936 -11194 23252 -17957 8261
196 8261 2871 -7011 3623 -7059 19918 -6819 -4304 876 -1360 3885 2159 -1883 -2462 -3069 1045
211 1045 2798 -10778 11431 -10195 176 2519 -3618 8926 -12169 9425 -8409 8378 10396
224 10396 -13450 2786 2130 8635 621 -3288 7027 6551 -14368 10804 9117 -3308 1214 -2201
238 -2201 7703 -11957 17997 -2551 -9625 7045 -6955 16156 -13492 -5423 14115 -9874 -5407
251 -5407 9528 -8525 1347 -2298 -9993 16231 -12405 265 242 -4948 1324 1321 4703 -11687 5647
266 5647 -8711 4224 4263 -10708 6781 -3280 -5705 708 3756 -487 -3422 -10402 13832 -3726
280 -3726 -9371 7995 -6374 7519 -10272 11112 253 -12946 13227 -2816 3174 -1731 4085
293 4085 4836 -9848 2441 16325 -6634 372 1610 -2058 14651 -12877 11821 -1016 -7038
306 -7038 10928 -7175 7080 -3767 468 220 -565 1733 -2144 1708 -3332 -4376 5809 4102
320 4102 -10572 4850 -6400 8190 -1585 -9417 16141 -13916 647 1387 3468 2033 -9669
333 -9669 5996 -2732 -1671 3283 1580 -6364 -3071 2052 6095 -11753 844 5152 -11935 8397
347 8397 -11370 8878 -3509 -12844 13731 -11125 5031 961 -9214 3026 414 850 5365
360 5365 -6546 1899 2784 -1674 11213 -8177 8651 -896 12 6298 -4061 14835 -10353 1952
374 1952 7758 -2947 4322 -1926 754 2261 -2748 3983 3056 -10142 7166 -3606 354 1559
388 1559 -2484 3468 -11014 9273 -1532 1818 -547 -6731 9692 -7158 4447 3507 -8133 5244
402 5244 1894 -6890 7646 -4113 -76 870 -9576 13332 -10223 215 458 -7215 6967 -7096
416 -7096 4510 -6707 -3526 6334 -3675 -1138 1086 -3448 1935 -1495 107 7502 -10040 6133
430 6133 -3321 125 7332 -7601 5468 -5744 4290 -709 -2650 5062 -4882 701 474 1349 -317
445 -317 -2089 1001 2353 -6070 9858 -1079 -6748 7072 -2738 11791 -8503 2526 8859 -8456
459 -8456 7628 584 3455 -58 -2232 4783 -447 -2306 6362 -4197 -3156 1486 -1251 6898 -13485
474 -13485 4232 -376 -5760 5802 -10408 5756 -4414 -4297 4696 -2965 -484 -1158 -3535 3481
488 3481 380 -3459 5142 -5588 1052 -936 5117 -725 -8085 9973 -6248 2142 -1109 1124
502 1124 3655 -11794 6196 4192 -6281 148 1199 -2334 2353 -3224 5483 -3651 -4640 9449
516 9449 -4695 4628 -4087 4064 1827 -7174 9670 -1483 1711 -672 -1724 5934 904 -2233
530 -2233 4133 -2526 1497 3022 -3944 7553 -7539 2840 2400 -3072 3654 -5346 5715 -4623
544 -4623 -915 4574 -1992 -2457 -2044 2770 639 -4143 793 3815 -8030 3331 -544 798 -1112
559 -1112 -6581 7955 -6671 1941 2520 -4043 -655 -1808 3791 -2526 -2274 -79 1055 -2095 873
574 873 -2173 1284 -1496 -2001 3641 -4614 6177 -5984 -465 4641 -3756 4326 -2769 582 -599
589 -599 1104 2826 729 -2356 2501 2486 -2017 2707 477 2498 -5043 4933 2348 -2382 3090 -3441
605 -3441 4838 -2783 1720 2044 -2936 296 1404 82 -1046 2698 -2819 524 -1360 2927 -13
620 -13 -1841 500 -2352 3182 -2287 2670 -4258 -58 2438 -2644 1623 -1889 1655 -2940 249 815
636 815 109 -1775 -742 71 -2348 2501 -1809 -410 -4119 2731 -131 -2310 1894 -4192 1791 -2608
652 -2608 2755 -492 -2052 1975 -1696 648 1445 1834 -3118 1673 809 1662 -1370 1605 2054 -3532
668 -3532 3046 44 3442 -3779 2363 2641 -3855 4866 -126 697 -2637 1690 3423 -944 -1791 2241
684 2241 668 -1954 2923 -1470 2110 -3973 2394 578 -2115 3015 -4047 2798 -3016 726 2082
699 2082 -2493 -191 -1513 641 1042 -2393 -2182 3519 -3901 983 98 602 -646 -5643 6715 -2946
715 -2946 -1178 207 -98 -109 -4001 4773 -248 -3564 67 3177 -2247 -784 461 2313 -2789 -3048
731 -3048 6599 -3689 585 -1716 1589 1855 -3222 4376 -2830 229 -175 1483 1353 -1346 63 2185
747 2185 -89 -142 2427 -1410 3447 -4414 3743 3197 -2976 2957 -2441 4329 -1944 224 3121 -1971
763 -1971 -1085 1516 2211 -1901 -1173 279 1524 -4684 3097 306 -3081 -182 -2044 4254 -5548 483
779 483 855 -3031 394 -1165 1674 -2626 -1214 367 329 -1396 1631 -1818 -813 969 -1363 3284
795 3284 -3535 2001 -1349 517 2083 -2810 2301 -1789 1463 -888 680 1212 -1179 -935 1397 126
811 126 -1132 2178 -2228 1764 -2423 2537 778 -3488 3006 -2307 2141 -1189 1455 214 -1753
826 -1753 2402 717 311 -156 1174 -1136 2336 -751 1687 -795 -850 2966 -2870 2592 -929 714
842 714 -1711 -345 1914 -2006 1007 -1444 446 -1359 1072 -48 -958 -1661 620 824 -2789 1709
858 1709 -2593 947 -1749 453 439 -2932 1841 -2697 1253 -1185 64 -748 -1082 330 -734 935
874 935 -603 673 -2411 2471 -432 -22 242 -311 1642 -2128 3923 -981 -96 19 1286 2386 -1819
891 -1819 2064 300 224 -736 2839 -151 -709 325 632 741 -1730 2894 -1683 60 -990 1047 1095
908 1095 -2967 1590 -1513 1293 -567 542 12 -936 55 15 1276 -1420 493 -1012 2028 -1900
924 -1900 680 941 -1575 1200 -2489 3417 -1798 -1271 1000 -616 -575 -1014 1713 -1782 -1201 -638 2213
941 2213 -2364 -800 262 -1024 -53 -1610 3482 -3200 97 458 -318 867 -1821 2284 -1088 69
957 69 630 1510 -433 -359 17 648 1690 -1273 1997 -1507 2073 -594 1236 1685 -2489 1875 -357
974 -357 2278 -1420 302 1494 -1141 -219 1012 1265 -1771 291 29 1807 -2341 1370 1124 -2429
990 -2429 1318 -960 2735 -2632 126 1075 -1235 721 -636 832 -1806 362 169 664 -1837 44
1006 44 -50 -845 903 -2043 2091 -2548 464 -97 -324 927 -2317 902 -1336 553 -758 530 -412
1023 -412 -1044 301 810 337 -2183 1829 -524 914 -583 1030 602 -2275 3051 -580 1173 -978
1039 -978 1299 214 -648 1537 160 708 -818 1465 -412 1074 -315 726 -43 -933 2112 -1140
1055 -1140 1334 -1491 1065 -87 -220 1120 -1618 909 -621 833 -940 638 -241 -669 193 -251
1071 -251 624 -1663 1366 -1560 511 -191 97 137 -1947 1820 -1749 1193 -753 -500 -78 -1003 886
1088 886 -802 -200 -789 625 -1509 942 -844 -315 -225 -614 1131 -2423 2197 -1446 -408 -98 68
1105 68 1180 -2127 1558 -355 125 110 1320 -764 -539 537 860 801 -1598 2164 -912 1256 186
1122 186 719 1447 -1715 2387 -602 795 113 342 606 -434 563 361 623 -1239 626 -665 1449
1139 1449 -1508 -248 373 -1835 1194 -1621 1429 -2004 -820 1378 -638 -81 -938 914 -872 -519
1155 -519 429 1478 -2054 157 1035 -715 602 -1399 2388 -2444 38 1496 -1151 326 -1878 1290
1171 1290 -877 -339 72 -17 -828 -76 342 205 -226 -1300 1796 -1406 1265 -173 156 1402 -2168
1188 -2168 1982 -139 983 -344 148 1277 -790 485 851 305 -1446 1565 375 681 -1369 1058
1204 1058 1000 -2189 1922 -793 847 -1415 484 1324 -1707 638 -126 396 -1226 338 171 123 -1297
1221 -1297 532 131 -1001 918 -1582 1163 -1633 651 540 -1317 610 -1677 931 -247 -387 -546
1237 -546 198 -169 -670 138 -8 328 -1446 1733 -1059 514 103 -59 652 -1489 2159 -744 54 -403
1255 -403 581 436 -476 857 -264 -142 -509 1292 -829 479 -309 267 333 -678 1740 -1241 1102
1272 1102 -93 469 654 -519 1077 -986 1154 -11 449 -173 380 -48 114 871 -162 341 -1380
1289 -1380 1258 -632 204 68 -588 483 -1413 1008 -1193 -68 -357 -383 -131 -293 745 -816 -14
1306 -14 -673 518 -867 699 -714 -699 567 -607 908 -1659 1129 -484 -341 629 -435 113 -1042
1323 -1042 995 -111 -122 -73 574 -604 11 881 53 371 -1025 1702 -905 360 855 -161 826 -1192
1341 -1192 1634 -242 -31 21 13 498 -10 296 -92 184 -736 923 -449 559 -599 -116 1103 -1006
1359 -1006 1452 -657 630 -822 -356 1239 -694 -286 -174 459 -967 -120 -122 483 -1390 167 944
1376 944 -1349 511 -992 1175 -1307 -57 1054 -1291 89 -390 703 -808 -370 109 -156 -906
1392 -906 354 479 -499 289 -1207 941 -1006 334 198 -692 949 -1084 1463 68 -249 -59 533
1409 533 794 -517 195 495 244 -917 1708 -518 436 -471 676 1043 -1345 1306 -451 179 -142
1426 -142 302 785 -1253 116 112 18 -402 471 -381 1 -372 557 226 -1505 942 -1196 882 -556 -44
1445 -44 544 -1353 573 -648 582 -248 -254 35 319 -553 71 198 -549 308 -956 1363 -737 -485 429
1464 429 -325 576 -1005 975 -751 -354 296 84 -145 -322 423 -324 -75 -589 1074 -910 86 256
1482 256 76 703 -824 1141 -718 577 443 120 606 -524 649 -194 809 -141 201 -149 451 -303
1500 -303 154 616 -655 588 -774 860 -488 -72 359 -742 326 -563 924 -507 -22 -64 225
1517 225 -109 -163 11 -686 542 -338 536 -808 116 -127 -728 750 -1009 408 -716 201 -146 -12
1535 -12 498 -349 -127 -549 709 -208 69 -310 262 -447 -221 569 -556 485 -544 1170 -402 22
1553 22 706 -664 325 -149 669 -553 -219 262 169 -106 36 101 -42 592 -247 1201 -197 237 111 -96
1573 -96 1104 -828 1066 -183 23 209 -188 675 -498 -57 318 376 -912 614 -395 217 -563 -191
1591 -191 710 -1408 751 -487 359 -563 -47 358 -975 -243 24 374 -537 2 42 408 -404 137 281
1610 281 -897 789 -491 996 -708 -435 619 -876 730 -801 394 -117 -325 -27 461 158 -398
1627 -398 191 -48 380 -683 1101 -412 -384 422 -70 595 -1120 1052 -5 -189 227 -4 291 -541
1645 -541 599 34 -54 -313 941 -378 -1 45 25 657 -869 1002 -636 219 -252 -247 816 -856 274
1664 274 18 361 -411 123 -178 182 -494 -158 169 -625 435 -580 615 -587 -415 328 -677 470
1682 470 -675 774 -404 -334 277 180 -376 -324 484 -438 206 -116 962 -482 119 394 -223 770 -531
1701 -531 886 -454 108 281 -199 -18 -209 319 -244 197 -291 266 -206 342 218 28 398 -512 718
1720 718 -424 316 -202 -76 614 -212 259 -309 405 -341 372 108 46 43 -2 349 -760 637 -353 442
1740 442 -345 -26 285 -207 200 -799 12 -530 266 -29 -198 108 -178 174 -238 433 -565 152 -302 2
1760 2 -321 -337 477 -773 382 -198 625 -90 23 514 -339 272 -329 337 -323 163 162 61 31 12 221 -289
1782 -289 662 -481 319 -238 57 313 -150 602 -324 549 -123 24 29 75 305 -360 330 149 178 -747 487
1803 487 -178 302 142 -36 333 -1040 600 -48 370 -279 44 583 -440 285 89 -256 -460 75 -194
1822 -194 -47 -329 -80 83 -1013 539 -624 314 -411 -322 589 -500 562 -340 346 -305 -156 264 213
1841 213 -105 -148 296 -282 280 -612 811 -325 -260 600 -145 293 -532 789 -160 -210 125 -94 -204 -364
1861 -364 404 -103 127 -468 640 -434 231 170 -294 566 -666 963 -362 77 221 -168 293 -381 249
1880 249 -78 33 -569 57 -276 -15 -245 -196 415 -699 778 -634 194 -356 -285 522 -595 65 -426
1899 -426 301 -206 75 -112 -179 -217 69 351 -730 44 -350 176 -497 109 377 -371 298 -436 436 -37
1919 -37 121 -226 -172 118 -7 489 -422 464 -310 435 -63 -155 210 -77 570 -631 471 -317 160 -95
1939 -95 242 688 -240 414 21 182 -306 98 126 1 75 -58 290 -547 570 -332 474 -62 87 220 -416
1960 -416 400 -430 242 -34 91 -103 -113 -58 -382 244 -180 421 -577 -12 -149 4 -4 -466 154 -701 177
1981 177 -253 -46 -391 56 351 -585 237 -290 235 -414 95 -300 -177 -54 32 439 -163 578 -207 377
2001 377 -44 -96 373 -260 347 -500 350 24 72 127 107 10 -348 223 -165 155 -315 571 109 -281 311 -334
2023 -334 221 -682 610 123 -283 108 11 451 -329 226 -77 90 -323 284 -211 -117 -60 -250 217 -652 356
2044 356 -497 164 -161 -204 196 -501 148 -290 92 -219 56 -62 -57 -253 -147 384 -327 188 -489 419 -47
2065 -47 -449 423 -412 251 -396 333 -301 -229 169 -46 -48 1 468 -49 46 -363 409 -161 5 22 -113 317
2087 317 -475 468 -200 -24 165 -68 250 -395 117 -300 471 -104 469 72 113 4 77 584 -522 473
2107 473 -328 -13 -144 -231 509 -590 194 -77 -137 -378 204 83 -217 -88 -32 369 -661 419 -424 -69
2127 -69 -104 -136 65 -261 456 -441 45 -197 94 236 -397 -216 -336 221 -253 147 -245 111 74 -228 -16
2148 -16 -278 582 50 379 -318 66 238 68 374 -512 223 202 175 -520 188 33 -105 193 -95 398 -277
2169 -277 510 144 -66 -54 21 266 -339 163 -55 106 -5 203 -342 -76 50 -246 93 -338 449 -366 18
2190 18 -248 -168 -36 -394 273 -384 292 -148 -60 -246 -249 221 -375 430 -352 49 -174 426 -22 -108 14 -133
2212 -133 252 -327 334 -197 -53 -69 -90 214 -45 305 -218 134 -204 39 -7 -86 -3 -60 537 -300 245 -25
2234 -25 140 15 -435 356 -63 304 -229 289 -180 29 338 205 125 -76 276 225 -91 -486 291 -170 -337
2255 -337 57 -416 163 -643 76 -52 -251 27 -231 290 -330 96 -97 60 -372 158 7 83 -140 -145 279
2276 279 -452 93 -208 265 -70 -313 378 -267 90 -233 365 -269 -80 111 28 0 43 93 -405 341 -22
2297 -22 305 -42 -134 385 -217 506 -108 237 -475 -133 216 -65 360 -162 257 -305 183 -3 164 -57 -62
2318 -62 105 -98 655 -346 43 -38 76 133 -202 144 -310 282 221 346 -384 37 -78 -71 -181 -188 278 -460
2340 -460 40 -118 -50 27 -341 159 -275 173 -151 -76 -205 339 32 27 7 -241 -2 -419 219 -274 66 38
2362 38 118 441 -350 302 -302 170 422 -139 165 -53 307 -119 21 -231 39 -147 66 118 -350 39 140
2383 140 337 -362 234 154 85 261 -116 90 24 309 -78 232 -28 136 0 -18 107 -102 261 -98 19
2404 19 -159 202 -79 99 136 -358 44 -297 204 5 77 91 -13 112 -366 242 -117 85 -53 211 116 -310
2426 -310 251 -181 18 -289 235 -400 -62 160 -98 299 -194 332 -126 -107 -340 -88 -116 -98 64 -52 200
2447 200 -116 272 -216 318 -39 54 456 -488 154 -38 116 -92 -144 197 23 36 -126 190 -199 207 -35
2468 -35 41 -311 -92 295 -9 262 -358 102 -316 71 104 -249 122 -110 117 -258 171 -267 -100 -197 -9
2489 -9 -43 -202 137 -136 -104 4 -58 -138 -194 97 -271 47 -332 173 38 10 225 26 -52 -298 197 -219 161
2512 161 85 108 5 -123 124 -356 168 -129 65 52 67 78 -107 70 -213 259 -93 123 -371 132 -181 -10
2534 -10 258 -265 390 -91 369 118 18 217 -232 132 -166 198 72 15 -140 198 92 -185 -101 -16 97
2555 97 -402 272 30 -13 -429 -87 189 -176 35 258 248 -125 35 -80 -163 -71 -241 396 -58 420 -64 -18
2577 -18 -148 -220 182 -245 346 -347 202 114 -18 -40 -201 -138 -118 218 -116 329 -214 -107 213 -232 120 -31
2599 -31 63 56 235 -74 -253 342 40 98 -219 141 77 -1 -103 184 32 -74 -52 -283 143 -71 60 -39 -68
2622 -68 220 7 13 18 -25 -390 86 -286 -184 -58 -199 -83 -117 213 -86 -25 -58 248 151 -252 30 -131 121
2645 121 -262 285 -210 -62 14 -104 73 -24 -83 -103 -27 -7 -182 191 41 144 -83 317 -55 118 24 -241
2667 -241 68 -166 308 -121 198 13 145 22 -28 321 -98 67 -36 400 -142 -27 -43 171 -108 -130 287
2688 287 -232 477 -96 59 146 262 242 -243 -136 -71 -91 -106 -39 -135 -21 42 86 201 -225 260 -201 187 234
2711 234 -112 114 17 260 -147 -6 0 -77 101 41 -15 -109 65 -58 150 -306 169 35 -137 170 -225 370
2733 370 -266 163 49 4 -170 182 -123 -52 31 -50 45 117 211 32 310 145 32 146 -163 156 -285 91
2755 91 104 -243 73 -102 357 30 34 -260 172 8 83 69 -92 21 -110 -28 -260 53 305 7 27 -63 97
2778 97 -242 -13 -11 -147 -118 123 -89 -174 234 -291 188 -198 95 -226 -99 219 -142 254 -178 75 -13 18
2800 18 -2 114 -7 -408 38 -85 -194 -269 119 -23 7 71 -271 141 -47 254 -115 44 238 -27 344 -52
2822 -52 59 -168 -111 111 -203 -59 131 243 -119 221 -42 131 30 221 -26 -92 35 -146 234 -1 76
2843 76 -212 96 -93 -109 191 137 28 -204 55 -46 13 107 -136 -63 -39 -45 50 83 -122 165 -59 -108 182 -140
2867 -140 32 -239 -233 -94 -96 -38 -106 86 113 297 -131 1 -223 -36 15 -292 200 -304 -22 -163 -91 30 -42
2890 -42 -102 -59 96 -157 170 -50 47 63 184 -35 147 127 -147 305 -394 76 -128 -71 -15 -79 128 -183 136
2913 136 -285 44 -204 245 112 -452 100 -3 117 -301 112 128 19 19 138 283 -334 80 -306 134 85
2934 85 283 -60 -341 -63 17 138 -10 114 -155 0 -140 -208 22 -155 2 3 118 185 67 -41 -21 -15 82
2957 82 176 -183 -66 -317 -27 -42 -163 -28 50 122 -150 193 165 -190 47 126 294 -219 1 165 252 -118 289
2980 289 -34 -38 91 40 81 -346 155 -47 -2 62 -43 173 -225 263 -140 196 105 -139 142 35 142 -71
3002 -71 228 -252 -38 -113 113 -347 23 -20 -132 231 -151 96 -43 100 -42 -395 24 -80 244 28 191
3023 191 -7 -25 -28 -115 33 28 111 -76 89 -160 -94 -181 -251 71 -75 54 96 220 26 183 -94 -141 85 63
3047 63 414 -44 122 0 -66 -210 22 139 9 122 -191 -37 -169 -109 101 -217 -55 55 138 -159 201
3068 201 6 -74 -266 -125 242 -209 52 -220 128 -143 -124 224 234 346 -123 -22 -223 35 -58 -16 137 197
3090 197 84 -549 -13 176 -91 47 38 136 -56 42 -26 135 288 185 101 -34 -83 -54 37 -99 -3 60 212 -70
3114 -70 -9 210 -241 45 -113 214 -124 70 -212 56 -70 63 119 302 -23 -69 3 285 83 -70 -292 33
3136 33 219 199 -78 171 4 26 54 -106 43 -122 150 -122 5 85 96 45 -76 51 -67 130 -41 15 -135
3159 -135 69 135 -184 -59 -105 63 -200 84 -62 -145 -280 54 80 -145 -135 -328 90 -196 76 -277 -52 251
3181 251 -112 0 -159 143 -102 30 -1 -121 -80 128 9 -146 64 -150 -194 -99 163 139 61 148 -145 163
3203 163 -353 -103 -38 -163 -165 -74 202 -1 92 -242 -80 134 16 -94 -4 172 51 104 -99 -147 103 -12 174
3226 174 -350 246 -110 -97 -29 -14 96 -37 -208 -113 57 -79 -28 -163 -23 92 -55 -39 87 75 19 -185 168
3249 168 -29 135 94 61 85 122 -189 -113 -83 -87 66 -53 25 118 -296 -29 197 94 20 -108 -28 -15 -338 20
3273 20 -68 -187 2 136 -63 -49 -22 -121 -128 -292 38 -144 262 245 15 -59 -58 81 -273 28 -148 79 -130 -26
3297 -26 11 -151 -93 -203 18 61 69 34 -70 64 32 -200 95 -41 -90 -178 -336 -90 -48 70 144 -284 175 -280
3321 -280 30 245 76 93 -372 175 -29 104 -255 59 -34 24 94 -126 105 -223 80 59 139 190 -87 74
3343 74 91 -47 -165 28 113 71 132 -3 -67 -195 166 -316 -268 -156 98 58 64 -76 19 19 80 -126 -42 -7 -152
3368 -152 28 -145 -77 133 -387 -182 -19 -20 69 -47 47 58 -30 70 30 16 -116 113 -40 -92 58 -25 -252 -170
3392 -170 11 -102 -231 -48 154 -40 75 -266 81 -7 -50 -158 13 263 -87 108 -40 54 48 35 -67 -125
3414 -125 60 -105 156 -252 -140 108 -182 150 -71 53 -333 207 156 147 3 50 -65 -157 -112 -6 -62 -113 -166
3437 -166 -147 -283 -36 -124 -161 5 166 8 189 200 -163 -136 -77 131 -136 43 -160 -22 -269 228 33 -195
3459 -195 155 -169 242 -220 45 79 200 136 -101 41 -189 72 -61 -41 130 8 50 -91 -78 -271 -73 -151
3481 -151 -6 -18 -28 202 155 -48 -22 -41 -47 161 -120 -93 -152 -179 243 -213 -8 325 193 52 -62 59 27 211
3505 211 80 -10 145 189 -25 -213 -34 -106 170 -164 192 139 -91 17 99 -174 151 31 -247 -92 110 28
3527 28 139 -6 206 207 216 -29 -2 120 92 159 -22 104 8 46 137 -38 275 193 91 -146 26 -111 141 -107
3551 -107 -1 82 98 49 -245 125 18 92 -184 189 34 -10 153 -304 26 -68 152 -128 65 -67 34 114
3573 114 280 267 -131 152 125 109 106 -26 -119 49 -50 -47 120 -16 15 -25 51 2 175 114 -44 126 52 48 217 51
3599 51 135 14 138 75 176 -8 1 80 120 16 -238 11 69 134 -154 4 -284 -21 77 148 -284 112 153 -121
3623 -121 -171 20 30 59 115 -108 84 71 40 84 -41 -66 -21 40 -99 35 87 -32 178 -104 -44 40 304 88
3647 88 -55 29 -137 199 -161 218 -253 57 -52 31 186 46 27 121 139 195 -244 -31 -82 29 -136 -74 -42
3670 -42 171 133 205 57 -94 59 21 106 -112 -277 -79 38 -170 16 27 -61 86 141 48 -194 51 -218 29
3693 29 -14 37 148 -139 -80 -16 128 -176 131 255 -10 99 37 18 -164 -116 -44 -12 -216 240 -149 -22 8 50
3717 50 -57 -171 138 142 173 164 -239 -61 -7 -39 9 -80 73 -72 116 -110 -157 -168 -79 82 -89 -86 108 84 -123
3742 -123 152 112 -221 -13 15 56 -265 192 32 -97 -186 317 -18 -372 -112 24 150 -92 -99 -56 66 119 -248
3765 -248 2 77 93 22 -50 199 -65 23 -10 236 137 106 49 -103 -36 72 -9 -54 -236 182 238 -11 194 128 82
3790 82 58 -116 120 44 283 -312 -150 -51 -127 73 186 221 34 106 -181 133 67 30 -41 -10 47 -27 -58 -7 73
3815 73 -92 108 79 -218 89 16 28 -220 -67 -119 -46 58 40 133 46 218 -148 -90 -141 -30 -100 81 -27 -369
3839 -369 -164 102 57 141 -20 -89 -154 -11 -44 158 -159 92 163 -139 107 -154 22 -106 -58 4 105 -20 -13
3862 -13 -96 -148 -26 162 -157 -334 316 15 228 191 -177 88 -138 -137 20 38 -19 -36 3 -25 -115 108 10 -26 -147
3887 -147 -35 109 -2 27 94 128 228 -105 17 -111 4 198 81 142 -109 -19 178 49 279 -65 18 -100
3909 -100 -69 -28 -270 57 -58 -222 -53 330 115 2 -31 -43 -174 125 -349 58 46 13 22 23 167 233 -135 127
3933 127 76 119 33 -157 -162 73 112 309 131 249 -50 -78 -188 20 36 -204 5 79 71 -213 29 187 -125 -75
3957 -75 47 146 34 -118 -98 -192 -71 112 -82 -218 -8 126 -33 298 238 -185 -38 -34 -62 -62 215 -53 206
3980 206 58 68 -189 231 -142 -155 -46 15 -23 20 42 -30 -82 -43 33 307 10 61 66 103 119 -174 52 79 110 -3
4006 -3 35 -84 -39 34 97 -73 -268 93 -184 -21 -26 23 45 -41 140 129 288 -123 41 56 -119 -121 101 84 71 82
4032 82 -92 -134 -125 -140 -34 -183 122 -56 -28 20 185 58 -75 160 10 253 -42 9 18 -120 -223 -17 -8 46
4056 46 103 334 -18 -21 71 25 32 89 -13 -72 63 34 35 111 24 -50 71 214 -20 147 168 205 221 136 41 -212 207
4083 207 -155 151 -32 229 -30 -29 30 32 -55 156 -166 99 104 -6 -109 36 17 -41 30 -58 165 -164 55 -38
4107 -38 -140 195 -86 -22 -26 85 -4 99 27 -6 -130 -6 -177 -69 171 -277 38 -110 -49 48 188 -39 -93
4130 -93 -120 -121 240 20 66 45 191 153 173 -65 -126 55 17 -14 -84 234 -24 22 185 76 -106 -105 20 58 1 20
4156 20 -105 -129 165 15 58 77 -146 85 -155 -75 130 -42 128 103 152 169 -32 9 -134 63 -41 96 -358
4179 -358 93 37 24 278 108 133 114 -265 192 -56 -48 31 -146 41 91 28 10 102 5 49 27 13 -41 -200 -62
4204 -62 -57 -3 179 31 50 126 8 -38 9 64 39 112 16 34 -69 57 43 7 -93 -152 -21 30 -16 48 126 -250 105
4231 105 96 -98 -163 256 156 74 -308 -30 112 276 75 -46 188 -108 257 -63 2 111 -135 45 182 -250
4253 -250 157 -114 148 -27 -196 74 -168 26 -62 9 -30 -9 213 150 167 -77 -80 -21 -102 35 -273 -133 -165 -99
4277 -99 123 7 75 216 129 -4 -217 -94 47 140 127 -132 -5 -161 -79 137 124 246 -99 -75 -184 44 74
4300 74 51 80 -117 186 -89 95 -11 67 72 29 65 -97 -58 57 -163 -26 -23 -33 -174 33 238 -14 163 127
4324 127 -85 39 210 69 -125 101 16 261 163 -167 252 64 104 22 -123 255 72 -146 -105 -50 43 -157
4346 -157 18 50 -51 241 -54 -138 88 -18 60 -127 97 119 95 213 -166 318 -118 32 144 3 116 149
4368 149 94 2 157 25 -90 -40 178 -2 175 -51 390 -10 170 60 87 27 9 71 37 104 -150 87 42
4391 42 92 -15 53 -29 -129 -81 31 -35 -18 75 16 48 -117 -106 45 -122 29 -29 120 127 -162 -99 84 -111 -216
4416 -216 163 -147 -115 79 -28 43 -162 130 -63 -24 206 -135 -73 18 -4 20 76 -103 -73 -157 254 114 297
4439 297 21 147 134 -80 143 -21 59 -267 135 -20 -88 233 -18 161 -129 154 166 -150 257 -4 67 66
4461 66 -95 -110 -169 8 123 117 -20 -72 75 40 145 197 135 139 58 106 -33 225 77 -199 73 109 -17 229 45
4486 45 -105 -15 80 39 -1 25 50 -60 102 73 199 -29 3 179 270 -20 79 -115 166 -53 243 -115 -202 150
4510 150 -113 -147 -107 39 207 133 -79 -68 70 119 -19 -17 134 -106 -56 -19 9 18 161 56 -224 -227 -110 117 182
4535 182 235 -168 -60 -195 -110 -160 -165 272 122 -113 97 -95 250 -102 -43 -13 -57 9 100 -150 -40 46 -3 244
4559 244 -9 37 -260 120 103 75 -85 -40 -49 121 185 93 152 104 -129 66 30 -48 -90 125 115 73 124 36 37 17 -44
4586 -44 -250 -80 111 26 -2 62 -119 40 -155 -42 -91 -147 -128 -165 -123 165 3 292 -110 109 -93 76 -364
4609 -364 151 -124 -167 -69 48 53 -140 200 -34 -94 -375 -142 -34 -92 22 38 20 -79 -149 160 -152 -190 -429 303
4633 303 -38 2 139 -117 -108 -10 -13 -149 11 1 -41 -189 -1 156 -64 -118 -129 127 -140 -175 -17 -213 -171 460
4657 460 105 -19 -163 -20 137 102 95 53 -90 165 -146 163 -135 -143 -84 16 -145 -77 -151 -178 -179 3 223 -162
4681 -162 152 120 -31 214 1 125 151 23 200 21 -256 50 152 -60 -137 97 39 -37 201 -81 -77 59
4703 59 -21 -78 -163 -104 224 -133 33 -94 -125 188 64 -88 108 137 -152 -164 74 160 177 -265 -105 -20 79 48
4727 48 68 76 19 -17 76 -166 174 239 -28 217 122 -142 -41 40 -113 105 -248 66 87 -100 132 41 39 44 16 42
4753 42 93 -9 136 -117 201 -65 -22 8 -313 85 219 16 -6 -119 -64 198 -295 -143 -11 -142 -105 85
4775 85 86 97 80 -3 -288 8 -167 124 282 -260 40 -95 -43 160 33 -30 -32 -56 132 344 53 175 -68 -131
4799 -131 -7 -211 -12 169 -67 -194 7 29 236 -55 -134 -131 -3 140 -269 224 -98 -187 186 4 174 15
4821 15 200 -36 135 -53 214 -77 186 50 12 -11 -188 33 5 3 -8 257 -185 -179 224 33 4 -174 -160 122
4845 122 7 -14 122 88 -61 86 -152 154 -29 -40 -61 -61 8 154 76 -80 -115 87 60 43 65 257 18 -6
4869 -6 -114 90 -111 112 0 -83 -22 10 -133 -18 -6 140 94 -114 9 -206 -2 108 43 300 127 154 74
4892 74 7 132 -163 -92 182 -80 65 -165 117 -189 -183 8 -58 -9 240 145 34 -34 244 -148 -425 184 -44
4915 -44 20 -122 -50 42 -129 60 131 109 -27 -234 72 56 -54 5 -191 -101 -223 -17 4 -116 105 39 -192 17
4939 17 -255 16 50 31 -102 -46 -32 -187 -14 -11 108 344 14 -84 -124 50 -93 -233 -126 -48 159 243 -62 201
4963 201 52 117 87 -15 -60 -87 81 23 -12 -4 103 53 -33 181 -302 -45 -293 -193 454 -106 8 -39 224 -32
4987 -32 152 -135 -138 64 -147 281 198 44 215 195 -3 147 113 69 -12 70 -50 -145 -79 -165 -176 -31 -61 208 143
5012 143 -184 168 4 189 29 61 78 -197 -63 75 -141 140 -54 -23 -278 -1 -164 -29 159 50 -220
5033 -220 63 135 -215 -94 133 186 -14 -87 260 33 -73 -79 17 -7 76 345 -302 -102 2 48 84 -165 105
5056 105 296 -129 273 46 3 -84 118 -195 75 -46 63 121 2 85 -115 361 10 -63 252 289 -308 -172
5078 -172 11 -131 -106 154 80 -41 112 -141 41 78 78 -142 -84 -313 97 117 -40 -23 249 -190 30 -12 -18 33
5102 33 -11 -30 0 49 37 -110 -163 56 -154 17 64 39 -73 -49 132 -155 73 -113 -393 -22 -63 -277 -36 -29
5126 -29 148 -84 -227 145 30 60 22 190 -70 -91 53 -148 -220 -150 76 -3 -332 308 -154 -81 55 21 158
5149 158 -224 13 113 254 -171 -89 -71 -96 29 102 -34 40 35 96 -112 -66 -71 -204 325 -83 -68 -48 -85 77 -95
5174 -95 -112 69 1 19 29 -31 -133 -132 -101 85 141 -309 -51 -254 90 -411 -76 25 -27 51 -208 -218 -85 -224
5198 -224 -266 -58 -114 -147 150 146 30 10 -110 -37 -164 70 -79 -44 -9 173 -44 -135 167 -21 -10 -47 50 -176
5222 -176 117 -36 64 -67 117 215 117 257 -138 29 -26 -160 82 -78 -271 38 28 -215 56 -102 84
5243 84 231 -170 -18 -25 -58 -110 28 163 -26 -187 -65 64 -143 -243 26 13 13 206 6 245 -101 11 -239
5266 -239 -151 -169 14 144 -125 11 24 -109 -208 5 132 12 -96 -288 75 -160 -2 -86 181 156 -154 70
5288 70 -93 94 -7 276 51 -210 -141 -108 77 122 134 -64 3 75 -103 107 125 180 -86 -196 -146 64 -86
5311 -86 -252 176 -82 -119 46 89 -64 -201 168 65 15 -73 32 216 -2 -226 38 44 -51 -153 41 141 41
5334 41 78 -241 13 -123 -20 17 -42 -67 -74 19 -19 -217 -75 -89 177 19 -100 -196 32 144 18 -51 38 102 -115
5359 -115 40 195 -49 -96 144 -98 -119 -16 8 117 -109 142 -179 6 220 -185 91 -131 -127 -176 49 -152
5381 -152 14 -119 74 -134 -7 12 164 23 75 65 -3 -169 3 -19 89 35 46 -1 -140 71 -70 -98 290
5404 290 -89 -58 93 -151 53 225 -63 -3 272 80 -109 214 61 -214 87 81 217 91 -189 -210 104 219
5426 219 -5 71 -38 -18 235 -145 111 114 35 78 38 -211 62 147 -55 -16 269 -191 125 274 -209 51 166
5449 166 135 -68 142 63 -87 200 99 29 -195 8 171 229 134 -135 76 63 -126 35 44 68 52 55 -80 -175
5473 -175 -115 84 -26 201 80 -5 -53 -129 148 32 -39 -213 -46 -51 -132 77 -12 91 114 147 -251 61 18 127
5497 127 -166 -81 -52 -51 -35 47 90 -45 51 29 -60 -56 155 -63 -50 238 -104 74 -16 85 46 -173 285 181 51
5522 51 -106 56 121 -7 58 -83 22 -256 42 -60 133 48 -46 69 -153 177 -43 31 265 46 50 50 4 -257
5546 -257 -40 -61 -77 -191 22 291 -36 -55 -87 -214 80 59 -195 52 -153 217 100 83 36 -112 20 -27 46
5569 46 -266 -186 74 -52 112 -40 -139 -156 44 53 -49 -144 124 -294 10 143 -137 -21 -234 -26 -47 71 59
5592 59 177 40 -34 -150 -137 19 -157 -227 138 93 53 -119 87 -44 23 236 -136 212 -86 -30 -27 5 44 -124
5616 -124 -53 57 -22 -235 180 -221 -14 -155 164 62 -43 -22 -130 70 238 46 -46 -195 125 -11 15 182
5638 182 -107 -227 -80 -162 -159 37 -195 -247 -107 67 -93 212 50 -259 -188 154 -98 -7 -112 143 -15 -30
5660 -30 101 39 -60 149 96 -80 63 -57 161 -101 -319 -38 98 -8 144 -160 18 71 278 -88 -21 -127
5682 -127 -22 -71 39 15 163 230 -58 93 153 93 -27 -215 112 -251 113 67 23 -16 -54 179 64 6 -103
5705 -103 23 272 76 252 56 261 -61 127 48 203 -200 0 12 -62 58 -66 -31 33 -244 -21 -128 -14
5727 -14 119 99 -67 -102 -147 -217 -157 -24 52 70 120 -248 -190 -265 -234 -109 -103 41 190 -148 -140 -68 67 1 81 101 238
5754 238 -105 -26 300 13 42 0 104 88 -204 12 -187 0 -169 148 49 -5 -70 -55 -53 45 -38 -85 58 -2 226
5779 226 -198 -139 -118 188 -17 155 165 81 161 -196 78 139 -154 -207 66 -110 212 343 69 -132 -179 51 171
5802 171 306 -148 -138 -169 -245 168 -142 164 -27 21 -68 -38 -332 -15 -1 -47 -151 -57 41 -108 158 85 -123 -140
5826 -140 22 -186 -223 -8 101 -42 33 -10 -52 -78 105 46 -3 239 -142 37 -28 -128 -96 202 22 -73 -86 -84
5850 -84 -177 -44 79 -29 -54 115 15 40 -69 11 -125 -60 -439 16 44 91 198 122 70 138 -164 -115 182 -3
5874 -3 192 -10 172 -3 39 234 -194 73 109 42 -250 -88 154 257 194 -190 94 72 -16 -90 57 106 -58
5897 -58 147 -179 -169 -191 -6 -56 60 290 -14 187 -240 89 -50 65 24 -66 218 -108 107 191 323 118
5919 118 -104 40 49 -176 9 -321 -150 276 -215 173 -236 94 207 -57 140 -111 58 99 52 235 63
5940 63 57 -134 3 -7 127 84 -161 2 232 156 29 -98 -35 -76 113 24 -11 19 206 177 81 -67 -50 -72 -69 439
5966 439 5 106 -188 -39 119 110 58 312 273 -126 -62 -7 35 37 150 -295 109 -23 -201 -99 -109 73 17 -16
5990 -16 -147 100 23 62 108 -195 -9 151 237 -84 -36 51 92 -12 -93 25 -141 -61 -56 54 -61 -180 -203 80
6014 80 -118 41 152 -225 -25 -5 14 -176 186 15 -183 18 -155 -250 75 117 11 -9 -20 -128 -29 -290 -29
6037 -29 -89 114 135 -77 153 137 57 -38 256 -128 -102 26 21 89 -170 -140 67 -52 -47 -1 55 46 34 220 46 -213
6063 -213 -26 8 -58 -97 122 62 -258 204 -198 -135 46 -57 -168 63 129 -151 168 -51 -38 -117 136 -71 -299
6086 -299 -113 82 88 -38 -148 -22 143 -122 -80 -76 -153 63 10 -100 -233 63 24 -146 -78 103 6 -215 -16
6109 -16 72 87 -77 166 -9 -238 -157 51 -220 -50 -10 -85 -126 -91 57 223 -42 55 -132 -105 206 49 271
6132 271 -79 154 -166 204 124 199 136 -60 -51 53 131 -72 -284 -38 -64 -36 149 -76 3 79 -337 191 -15
6155 -15 -392 221 95 20 -175 -16 -269 79 -41 36 61 7 -32 -107 -54 116 96 -118 186 92 170 -119 -216 255
6179 255 -99 61 -132 -47 104 -36 91 -82 104 -239 38 0 34 108 103 69 -85 18 -154 -18 -6 -83 115
6202 115 25 -52 -132 142 102 3 -1 111 -51 171 47 7 200 177 32 -15 74 108 -210 53 -124 -37 45 20 -21
6227 -21 -8 84 -94 56 82 -123 52 133 103 23 49 -19 -117 226 239 -26 86 302 109 333 87 61 -51 175
6251 175 416 -79 -37 -199 -63 -61 -53 -299 218 174 -143 -170 -126 -168 -202 -81 -276 -28 -97 -7 90 -19 23 -60 -122
6276 -122 -136 219 -28 129 63 -70 -5 132 188 96 15 103 211 170 -75 166 61 -194 -50 13 37 -192 199
6299 199 -116 42 -180 41 185 81 -17 8 -222 -48 93 -161 279 -17 35 19 90 37 -85 -50 1 216 78
6322 78 195 211 -70 -136 118 -126 275 133 -185 143 -71 80 -49 46 -105 87 270 9 215 85 59 -116
6344 -116 105 -78 -311 -144 -12 175 -39 136 -7 -128 123 -19 -21 50 98 131 138 113 -131 -91 -241 26 69
6367 69 71 32 78 -114 -210 -81 -131 90 -1 -127 7 -73 14 -258 25 39 -213 -212 148 -190 -79 30 80 154 -92
6392 -92 21 -85 38 -101 -78 106 -12 -93 144 81 -72 -68 112 -91 6 207 35 74 18 61 -161 -49 -151
6415 -151 -142 9 27 -92 -102 -154 124 -35 -40 79 21 -25 -117 350 -254 34 -229 212 -27 -202 -124 -86 -48 -24 155
6440 155 -21 -23 23 -79 -31 -119 28 -19 -105 -20 -91 152 202 -102 -12 -119 -273 -73 -224 72 -145 309 212 8
6464 8 61 6 9 -87 -155 139 -16 68 -75 200 -169 5 191 255 -50 158 401 64 -36 10 128 -282 229 114
6488 114 -146 -34 91 41 166 -23 157 73 123 -80 143 -96 116 68 93 -63 -147 151 -92 -68 73 139 -110
6511 -110 -59 -89 -111 225 108 43 237 -84 -60 -70 51 22 4 6 -36 115 28 -24 -30 182 97 95 -259 -360 78 -118
6537 -118 74 -163 -251 -170 -30 43 134 98 -46 100 57 -9 176 71 -304 214 29 -117 -55 126 -166 -41 19
6560 19 144 123 -33 118 17 -108 -151 -82 -75 166 55 -87 -87 134 -180 183 -209 -127 -5 182 -119 31 161
6583 161 179 97 -148 -94 -247 186 21 68 13 31 -64 -9 -13 -118 146 88 38 126 2 -173 -40 -31 149 -272 -408
6608 -408 198 -195 -71 -73 -240 37 -100 269 -114 167 -148 131 -17 -28 295 -90 213 -52 -80 27 31 212
6630 212 -113 25 -79 -62 180 -18 236 155 -100 -276 -207 148 103 68 107 -87 -71 -126 -50 190 -29 175 28
6653 28 -27 30 32 -20 28 14 -200 108 -105 -6 -41 176 -14 -96 -35 -46 -130 -80 174 -217 158 -12 -45 -154 1
6678 1 251 -39 159 132 20 239 -163 -34 -125 152 103 121 194 35 -44 -251 14 -51 69 -173 359 113 -33
6701 -33 49 -43 191 -137 392 -163 -133 38 7 -229 -13 -53 107 -85 -25 80 198 249 -224 -82 166 -197 -78
6724 -78 88 -22 -35 -52 99 -49 152 142 87 -12 -195 1 -270 14 -108 271 96 19 29 103 109 -126 8 -72
6748 -72 -65 -81 161 42 -128 -2 61 -13 95 -9 -5 14 -41 -139 314 -2 23 -19 -29 -137 -16 127 -134 19 259
6773 259 67 -33 42 -99 219 85 -42 -63 166 -95 134 -273 -137 112 22 -143 167 236 -110 -62 -143 -194
6795 -194 124 -101 -59 96 -80 -43 -73 -58 -153 144 168 175 -129 121 -73 118 -46 110 42 -54 82 -70 122
6818 122 -167 -27 143 -228 10 3 43 -43 129 -54 56 11 172 43 -242 -61 -385 16 -153 80 -50 1
6840 1 -25 -93 -13 250 198 20 -43 37 -109 -50 29 -55 9 -33 27 72 8 104 -20 66 131 -78 -34 210 74 218 25
6867 25 19 -57 -77 -16 24 156 79 -107 -18 107 -83 83 108 78 -172 140 235 108 65 173 179 67 -232 49 317
6892 317 -198 -208 -165 -323 -63 -224 121 -214 18 -108 84 114 -103 -10 -79 45 -138 128 14 -171 13 -47
6914 -47 -148 38 143 8 49 47 150 70 -208 -4 -299 38 183 40 -254 104 -4 -33 126 150 7 -37 197
6937 197 267 185 59 -10 78 -16 145 148 307 -88 -164 74 31 192 -122 315 -70 -42 -54 184 -76 55 81 90 46
6962 46 163 31 -10 140 -31 237 -127 -1 -61 -61 -24 -35 -164 -14 34 163 -173 60 323 -100 138 -97 77
6985 77 -25 89 -96 -78 91 -93 128 88 61 -114 68 -249 50 -118 163 200 -61 -43 -160 -185 -188 -156 20
7008 20 -72 -17 -6 -143 -28 -2 -101 -170 95 146 134 155 -38 -54 -58 -52 278 -108 -43 -25 53 79 -64 -63 439 81 32
7035 32 159 74 -128 165 -57 -217 55 -24 29 50 116 37 5 -203 -27 -110 -122 1 -63 31 96 64 65 -110 105
7060 105 -139 -120 -82 135 -16 -53 59 251 210 -211 137 -14 -52 -86 -203 -405 459 31 150 -297 167 -231
7082 -231 -170 126 -141 -228 281 -32 -183 141 -63 106 -106 -188 97 121 -57 25 -119 73 -415 -162 2 12
7104 12 -50 87 44 150 -37 61 -247 -129 144 -203 -14 -186 91 113 -182 158 -88 -115 25 176 -2 71
7126 71 148 -101 22 91 104 257 -110 -331 -20 66 -164 84 20 3 -1 131 105 113 215 19 -50 18 6 89 128 -142
7152 -142 54 88 -4 100 -33 64 70 158 -138 -15 29 33 73 -5 -76 -124 172 104 -63 9 -40 77 116 -5 23 65
7178 65 -79 -149 225 104 -85 -140 -107 33 -24 63 -145 88 -80 -64 88 189 -123 19 -94 148 42 -146
7200 -146 160 -32 160 -49 88 165 -101 176 50 17 -2 -115 -171 -118 168 -103 251 49 49 134 -84 1 -76
7223 -76 -56 4 18 -48 -282 78 -244 32 -57 57 98 -36 93 69 -26 196 -17 42 144 136 -104 -10 143 21
7247 21 15 35 150 -151 31 159 -9 1 78 -14 93 55 105 105 1 4 101 121 -19 54 62 -81 -132 -21 -145 -95 -97
7274 -97 91 87 42 -67 66 52 -7 159 -64 -9 -59 149 -173 26 -39 -74 217 201 32 3 -29 -42 12 -166 38
7299 38 36 -126 91 -155 95 266 -73 3 14 126 205 47 132 -144 -94 -270 -20 89 -94 -77 -121 -37 6 -62
7323 -62 104 8 -15 139 -162 14 -93 352 -172 157 -71 143 0 -53 -51 -43 212 205 -18 -36 136 -126 113 -48
7347 -48 -149 63 -231 -199 71 -199 283 166 13 -250 241 -145 -63 -184 78 -18 -14 228 -20 285 -104 324
7369 324 -71 -52 79 -46 -1 -20 -47 -112 -41 17 236 -6 103 216 -169 156 135 -173 47 -7 114 66 111 -135
7393 -135 -131 183 373 140 -109 -25 -426 -44 -138 73 -18 -76 54 -115 96 116 54 -151 -25 163 269 -11 -68
7416 -68 -24 75 187 2 133 26 90 -64 21 -189 -125 -159 -121 -40 156 -231 0 55 57 -5 74 4 31 -187 61
7441 61 -52 -37 12 148 131 80 43 6 -67 77 -82 66 27 29 213 -152 -66 1 -180 -38 -50 -172 93 83 31
7466 31 -318 107 24 -16 -54 51 202 -183 -140 80 -9 36 -252 148 -319 68 -133 -64 249 -76 -268 -89 105
7489 105 169 218 -69 -73 37 209 -101 132 11 -18 45 -37 146 56 -73 -197 121 -140 -90 64 -180 -83 -48 104
7513 104 -80 -183 82 177 -76 59 -188 -250 -197 126 -189 2 24 56 -1 -106 -246 45 44 189 -103 -124 88
7536 88 -92 -41 -6 84 -17 -188 -241 -125 -88 -167 -96 -134 13 -23 -8 -21 -138 -82 147 39 36 11 130 -94 -4 73
7562 73 -130 -17 -131 -188 275 32 -109 -17 175 120 84 24 -158 -52 -28 130 88 177 -127 229 -66 -31 -121 -44
7586 -44 -306 -65 164 52 -43 112 -82 21 -76 196 49 -34 55 -204 -51 110 -203 -54 -120 53 -260 -33
7608 -33 -16 -264 -15 125 81 196 -61 342 -110 -18 -150 -106 -76 41 92 64 -154 73 15 -52 -241 125 79 -59
7632 -59 95 -252 29 107 235 64 1 169 5 243 113 -27 62 -209 -13 -168 -48 30 59 15 -115 -24 -99
7655 -99 43 -119 27 6 -55 3 96 51 -74 3 -27 -174 -22 63 194 -14 -87 -282 34 66 -110 26 -148 -49
7679 -49 -102 -93 -67 10 266 -58 -81 4 65 125 -249 177 25 -44 154 -193 56 125 127 100 -94 180 -208 -198 -69
7704 -69 107 -1 -8 -112 129 -179 67 178 -16 9 -153 -203 -59 -44 126 197 -155 -268 -168 312 62 -39
7726 -39 -97 -47 -210 157 -17 -117 59 224 -4 51 61 -192 113 1 75 44 -223 -45 26 -98 42 57 -16
7749 -16 -197 -12 -64 -156 47 -123 194 128 277 -226 -12 218 -194 -21 -13 203 -16 -256 -90 -79 244 89
7771 89 -83 297 98 -87 186 239 -25 -142 -135 -132 -209 -279 -174 46 231 -43 -153 110 -192 -144 -83 96 -5
7794 -5 -201 -187 -32 -55 -334 -130 -6 -157 -67 171 84 232 -4 5 58 128 132 -210 -135 238 34 -91 178 31
7818 31 -78 -41 20 -10 50 184 -226 -175 65 251 76 246 -52 126 68 64 -60 -36 51 45 77 203 58 45 46 10
7844 10 89 -122 73 -135 51 53 -143 -99 -28 -267 53 22 -162 67 192 145 -112 160 145 -41 -42 -63 217 -39
7868 -39 -198 350 48 -108 -25 -97 -5 -46 -147 43 -30 -203 35 -37 -122 -123 -63 -77 -64 83 -189 -29 19 47 23
7893 23 184 107 -31 68 111 143 -45 84 5 157 183 38 125 137 55 -268 -65 86 -26 135 5 -123 78
7916 78 163 -33 145 -138 -96 102 -370 83 34 -35 98 46 -25 55 -61 -130 -76 102 73 228 90 -138 -16 -33
7940 -33 28 176 0 150 -88 47 -7 -90 189 -1 178 261 126 57 438 114 -27 -15 200 -114 -132 49 -70
7963 -70 -113 73 -133 -98 -189 -227 -23 215 -51 17 9 224 163 12 175 -96 129 123 -166 -95 202 114 -33 -30 -106
7988 -106 -9 47 -41 -155 -47 158 -12 24 77 -139 -116 60 -48 71 -18 -234 -3 -259 -49 225 176 -51 225
8011 225 290 91 47 -31 116 -61 -137 16 -70 -21 34 6 -68 63 155 124 62 -196 -62 -86 -212 -81 233 145 -84
8036 -84 -238 -92 -178 -41 120 -236 -116 -70 146 95 191 -70 -118 -151 -15 -130 173 -46 25 211 -187 4 -90
8059 -90 -4 -165 -43 27 201 -175 141 -59 49 58 20 -35 -233 -76 -67 -95 82 100 -74 -162 134 16 -17 -21 -54
8084 -54 68 118 159 -62 50 240 81 185 -221 -31 158 94 166 -245 93 -44 -158 188 -85 29 -169 29
8106 29 59 133 199 69 7 -183 -81 -164 -181 -24 39 -188 135 -63 67 -26 -113 31 -79 152 -142 74 3 117
8130 117 -41 15 58 -38 -7 157 57 -36 102 364 -33 129 243 -45 -222 15 -1 207 -89 49 155 -65
8152 -65 20 -152 214 258 -61 -12 7 -4 -12 47 146 139 2 61 196 76 -31 -101 81 155 253 -8 -38 -36 -52 -89 74
8179 74 83 63 8 -199 2 -120 25 175 -343 -104 89 37
8191C7
##END NTUPLES=NMR FID
##END=
