##TITLE=1H_CA-8768-3
 CDcl3, 8 sc, 
 30.9.2020
##JCAMPDX= 6.0         $$ Bruker NMR JCAMP-DX V2.0
##DATA TYPE= NMR FID
##DATA CLASS= NTUPLES
##ORIGIN= UXNMR, Bruker Analytische Messtechnik GmbH
##OWNER= root
$$ XWIN-NMR		Version 3.5
$$ Wed Sep 30 10:00:04 2020 Russian Standard Time (UT+4h)  she@DPX200
##.OBSERVE FREQUENCY= 200.1315066352
##.OBSERVE NUCLEUS= ^1H
##.DELAY= (6, 6)
##.ACQUISITION MODE= SIMULTANEOUS
##.ACQUISITION SCHEME= undefined
##.AVERAGES= 8
##.DIGITISER RES= 18
##SPECTROMETER/DATA SYSTEM= spect
##.PULSE SEQUENCE= zg30
##.SOLVENT NAME= CDCl3
##.SHIFT REFERENCE= (INTERNAL, CDCl3, 0, 15.7039)
##AUDIT TRAIL= $$ (NUMBER, WHEN, WHO, WHERE, WHAT)
$$ ##TITLE= Audit trail, XWIN-NMR		Version 3.5
$$ ##JCAMPDX= 5.01
$$ ##ORIGIN= Bruker BioSpin GmbH
$$ ##OWNER= she
$$ F:/spectra/data/she/nmr/H-F/1/audita.txt
$$ ##AUDIT TRAIL=  $$ (NUMBER, WHEN, WHO, WHERE, WHAT)
(   1,<2020-09-30 09:59:02.04 +0400>,<she>,<DPX200>,
      <created by zg, POWCHK disabled, PULCHK disabled
       configuration hash MD5:
       00 E9 B6 7A A2 85 ED C7 34 08 36 98 17 FE 4E 26
       data hash MD5: 16K
       A1 0F FE F4 67 C2 E5 6D 47 AA 58 B0 3A F2 60 90>)
$$ ##END=
$$ 
$$ hash MD5
$$ 13 1E 0E 28 AE 74 69 47 34 F6 A7 22 99 22 00 DD
##$RELAX= 
##$RELAX= 
##$RELAX= 
##$RELAX= 
##$RELAX= 
##$RELAX= 
$$ Bruker specific parameters
$$ --------------------------
##$DU= <F:/spectra>
##$EXPNO= 1
##$NAME= <H-F>
##$PROCNO= 1
##$TYPE= <nmr>
##$USER= <she>
##$AMP= (0..31)
100 100 100 100 100 100 100 100 100 100 100 100 100 100 100 100 100 100 
100 100 100 100 100 100 100 100 100 100 100 100 100 100 
##$AQSEQ= 0
##$AQ_mod= 1
##$AUNM= <au_zg>
##$AUTOPOS= <>
##$BF1= 200.13
##$BF2= 200.13
##$BF3= 200.13
##$BF4= 200.13
##$BF5= 200.13
##$BF6= 200.13
##$BF7= 200.13
##$BF8= 200.13
##$BYTORDA= 1
##$CFDGTYP= 0
##$CFRGTYP= 5
##$CHEMSTR= <none>
##$CNST= (0..31)
1 1 145 1 1 1 1 1 1 1 1 1 1 1 1 1 1 1 1 1 1 1 1 1 1 1 1 1 1 1 1 1 
##$CPDPRG= <>
##$CPDPRG1= <>
##$CPDPRG2= <>
##$CPDPRG3= <>
##$CPDPRG4= <mlev>
##$CPDPRG5= <mlev>
##$CPDPRG6= <mlev>
##$CPDPRG7= <mlev>
##$CPDPRG8= <mlev>
##$CPDPRGB= <>
##$CPDPRGT= <>
##$D= (0..31)
0 1.2 0 0 0 0 0 0 0 0.06 0 0.03 0 0 0 0 0.0002 0 0 0 0 0 0 0 0 0 0 0 0 
0 0 0 
##$DATE= 1601445541
##$DBL= (0..7)
120 120 120 120 120 120 120 120 
##$DBP= (0..7)
150 150 150 150 150 150 150 150 
##$DBP07= 0
##$DBPNAM0= <>
##$DBPNAM1= <>
##$DBPNAM2= <>
##$DBPNAM3= <>
##$DBPNAM4= <>
##$DBPNAM5= <>
##$DBPNAM6= <>
##$DBPNAM7= <>
##$DBPOAL= (0..7)
0.5 0.5 0.5 0.5 0.5 0.5 0.5 0.5 
##$DBPOFFS= (0..7)
0 0 0 0 0 0 0 0 
##$DE= 6
##$DECBNUC= <off>
##$DECIM= 32
##$DECNUC= <off>
##$DECSTAT= 4
##$DIGMOD= 1
##$DIGTYP= 9
##$DL= (0..7)
0 120 120 120 120 120 120 120 
##$DP= (0..7)
150 150 150 150 150 150 150 150 
##$DP07= 0
##$DPNAME0= <>
##$DPNAME1= <>
##$DPNAME2= <>
##$DPNAME3= <>
##$DPNAME4= <>
##$DPNAME5= <>
##$DPNAME6= <>
##$DPNAME7= <>
##$DPOAL= (0..7)
0.5 0.5 0.5 0.5 0.5 0.5 0.5 0.5 
##$DPOFFS= (0..7)
0 0 0 0 0 0 0 0 
##$DQDMODE= 0
##$DR= 18
##$DS= 0
##$DSLIST= <SSSSSSSSSSSSSSS>
$$ [...]
##$SUBNAM2= <"">
##$SUBNAM3= <"">
##$SUBNAM4= <"">
##$SUBNAM5= <"">
##$SUBNAM6= <"">
##$SUBNAM7= <"">
##$SUBNAM8= <"">
##$SUBNAM9= <"">
##$SW= 16.880792210976
##$SWIBOX= (0..15)
0 0 2 0 0 0 0 0 0 0 0 0 0 0 0 0 
##$SW_h= 3378.37837837838
##$TD= 16384
##$TD0= 1
##$TE= 0
##$TE2= 300
##$TE3= 300
##$TEG= 300
##$TL= (0..7)
0 120 120 120 120 120 120 120 
##$TP= (0..7)
150 150 150 150 150 150 150 150 
##$TP07= 0
##$TPNAME0= <>
##$TPNAME1= <>
##$TPNAME2= <>
##$TPNAME3= <>
##$TPNAME4= <>
##$TPNAME5= <>
##$TPNAME6= <>
##$TPNAME7= <>
##$TPOAL= (0..7)
0.5 0.5 0.5 0.5 0.5 0.5 0.5 0.5 
##$TPOFFS= (0..7)
0 0 0 0 0 0 0 0 
##$TUNHIN= 0
##$TUNHOUT= 0
##$TUNXOUT= 0
##$USERA1= <user>
##$USERA2= <user>
##$USERA3= <user>
##$USERA4= <user>
##$USERA5= <user>
##$V9= 5
##$VALIST= <valist>
##$VCLIST= <CCCCCCCCCCCCCCC>
##$VD= 0
##$VDLIST= <DDDDDDDDDDDDDDD>
##$VPLIST= <PPPPPPPPPPPPPPP>
##$VTLIST= <TTTTTTTTTTTTTTT>
##$WBST= 1024
##$WBSW= 4
##$XGAIN= (0..3)
0 0 0 0 
##$XL= 0
##$YL= 0
##$YMAX_a= 289203
##$YMIN_a= -226863
##$ZGOPTNS= <>
##$ZL1= 120
##$ZL2= 120
##$ZL3= 120
##$ZL4= 120
##$ABSF1= 10
##$ABSF2= 0
##$ABSG= 5
##$ABSL= 3
##$ALPHA= 0
##$AQORDER= 0
##$ASSFAC= 0
##$ASSFACI= 0
##$ASSFACX= 0
##$ASSWID= 0
##$AUNMP= <proc_1d>
##$AZFE= 0.1
##$AZFW= 0.1
##$BCFW= 1
##$BC_mod= 2
##$BYTORDP= 1
##$COROFFS= 0
##$CY= 11.3945322036743
##$DATMOD= 1
##$DC= 2
##$DFILT= <>
##$DTYPP= 0
##$F1P= 16.9975609425685
##$F2P= -3.02152046262296
##$FCOR= 0.5
##$FTSIZE= 0
##$FT_mod= 4
##$GAMMA= 1
##$GB= 0.15
##$INTBC= 1
##$INTSCL= 1
##$ISEN= 128
##$LB= 0.24
##$LEV0= 0
##$LPBIN= 0
##$MAXI= 10000
##$MC2= 0
##$MEAN= 0
##$ME_mod= 0
##$MI= 1.114404
##$NCOEF= 0
##$NC_proc= 0
##$NLEV= 6
##$NOISF1= 3.799351
##$NOISF2= 2.8
##$NSP= 1
##$NTH_PI= 0
##$NZP= 0
##$OFFSET= 15.70392
##$PC= 1
##$PHC0= -9970.709
##$PHC1= 16.20089
##$PH_mod= 1
##$PKNL= yes
##$PPARMOD= 0
##$PSCAL= 0
##$PSIGN= 0
##$REVERSE= no
##$SF= 200.130013532006
##$SI= 16384
##$SIGF1= 3
##$SIGF2= 2
##$SINO= 400
##$SIOLD= 16384
##$SREGLST= <1H.CDCl3>
##$SSB= 0
##$STSI= 0
##$STSR= 0
##$SW_p= 3612.71676300578
##$SYMM= 0
##$S_DEV= 0
##$TDeff= 0
##$TDoff= 0
##$TI= <>
##$TILT= no
##$TM1= 0
##$TM2= 0
##$TOPLEV= 0
##$USERP1= <user>
##$USERP2= <user>
##$USERP3= <user>
##$USERP4= <user>
##$USERP5= <user>
##$WDW= 1
##$XDIM= 8192
##$YMAX_p= 0
##$YMIN_p= 0
$$ End of Bruker specific parameters
$$ ---------------------------------
##NTUPLES= NMR FID
##VAR_NAME=  TIME,          FID/REAL,        FID/IMAG
##SYMBOL=    X,             R,               I
##VAR_TYPE=  INDEPENDENT,   DEPENDENT,       DEPENDENT
##VAR_FORM=  AFFN,          ASDF,            ASDF
##VAR_DIM=   8192,          8192,            8192
##UNITS=     SECONDS,       ARBITRARY UNITS, ARBITRARY UNITS
##FACTOR=    0.000296,      1,               1
##FIRST=     0,             0,               0
##LAST=      2.424536,      0,               0
##MIN=       0,             -226863,         0
##MAX=       2.424536,      289203,          0
$$ Real data points
##PAGE= N=1
##DATA TABLE= (X++(R..R)), XYDATA
$$ plain form
0 0 0 0 0 0 0 0 0 0 0 0 0 0 8 -8 8 -8 16 -16 24 -24 32 -40 48 -56 64 -78 90 -105 123 -142 165 -189 215 -243
34 -243 276 -313 354 -397 446 -499 557 -621 691 -766 850 -939 1039 -1146 1266 -1394 1536
51 1536 -1692 1864 -2051 2261 -2494 2756 -3052 3386 -3773 4220 -4750 5386 -6163 7137 -8401
66 -8401 10100 -12492 16065 -37977 289203 -88109 -80835 124439 -127602 92877 -28861
77 -28861 16099 140629 -76003 18306 108571 -43954 37074 80380 38914 -64140 43500
88 43500 79347 -10544 -4624 -64180 91632 5339 -74577 75735 -86048 -17320 28416 -41283
100 -41283 28086 -38115 -26775 -22699 -52210 73409 -21356 -19167 -2818 -98896 98138 8405
112 8405 -40974 19853 -32003 61445 -59791 16033 71766 -62694 24633 -4041 15267 35909
$$ packed form
0@%%%%%%%%%%%%Qj6J6j6K4l2M0m8N6p2Q8j04J20j42J68j95K28k65L07l54M04m58
34b43N19n89O67p51Q43r45J056j178J312j457J616j789J978k185K412k660K930
51A536l228L556l915M312m755N250n808O438p159P993q970J0136j1549J3300j5538
66h401J8501k2592K8557n4042L27180l77312P274K05274k52041K20479j21738
77b8861M4960J24530k16632R4309R0265j52525Q1028M3306m1466j03054J07640
88D3500L5847q9891N920n9556J55812q6293p9916J50312j61783O8728M5736o9699
100d1283O9369o6201J1340M076k9511J25619r4765K189J6349r6078J97034q9733
112H405m9379O0827n1856R3448j21236P5824N5733j34460Q7327k8674J9308K0642
$$ plain form
124 35909 -55079 53062 -13400 -36303 111699 -39515 -40804 1247 43467 48605 -86825 64532
136 64532 -556 -58338 35382 -2478 51637 -57239 -26518 52603 -95817 54894 57180 -124187
148 -124187 28228 -14622 -9600 36128 -91418 42230 9440 -66007 28171 21262 -37316 -4888
160 -4888 39947 -47004 42941 39442 -66224 38066 2645 24685 69451 -80376 36605 38380
172 38380 -57153 106658 -35413 -18840 60081 -66678 35821 4378 16107 5914 -69710
183 -69710 31983 1593 -4794 2556 -43311 20044 -19516 -6229 31003 -72505 28856 14845
195 14845 -41936 26488 -17195 25394 -43850 -9110 69449 -33825 4653 -6280 -18300 26887
207 26887 12395 17616 -26968 -18330 39668 -17296 5302 16313 -5337 -204 -44458 50475 235
$$ packed form
124C5909r0988J08141o6462k2903J48002j51214j289M2051M2220N138j35430J51357
136F4532o5088n7782R3720l7860N4115j08876L0721P9121j48420J50711K286j81367
148a24187J52415m2850N022M5728j27546J33648l2790p5447R4178o909n8578L2428
160d888M4835q6951Q9945l499j05666J04290l5421K2040M4766j49827J16981J775
172C8380r5533J63811j42071J6573P8921j26759J02499l1443J1729j0193p5624
183f9710J01693l0390o387P350m5867O3355l9560J3287L7232j03508J01361j4011
195A4845n6781O8424m3683M2589o9244L4740P8559j03274L8478j0933j2020M5187
207B6887j4492N221m4584Q638N7998n6964K2598J1011k1650N133m4254R4933n0240
$$ plain form
220 235 -24535 31307 -54614 27486 12734 -16585 13932 -47452 31541 24588 -48658 19891 6145
233 6145 -22100 966 14351 16881 -36550 24877 -18121 -22314 71463 -37708 14476 -21082
245 -21082 -28058 89918 -56084 816 52438 -67330 31932 16641 -26746 44160 -32980 3154
257 3154 13559 -22542 43357 -14064 -27468 5059 34318 -8907 -27889 28354 -28316 10839
269 10839 19021 -21560 12889 -19845 1076 11559 -22494 38643 -12570 -43116 24014 -6144
281 -6144 25836 -17282 -16518 17125 -34163 40138 -9077 -20415 19884 -20864 15381 -16612 7795
294 7795 29032 -52239 14774 22670 -21759 26134 -34236 7898 13077 -18360 48892 -48314 -6756
307 -6756 37867 -23838 13035 2155 6473 -11620 -15598 27433 6342 -837 -5217 -11238 13734
$$ packed form
220B35k4770N5842q5921Q2100j4752k9319L0517o1384P8993o953p3246O8549j3746
233F145k8245K3066J3385K530n3431O1427m2998m193R3777j09171N2184l5558
245b1082o976J17976j46002N6900N1622j19768R9262j5291m3387P0906p7140L6134
257C154J0405l6101O5899n7421j3404L2527K9259m3225j8982N6243n6670L9155
269A0839Q182m0581L4449l2734K0921J0483l4053O1137n1213l0546O7130l0158
281f144L1980m3118P64L3643n1288P4301m9215j1338M0299m0748L6245l1993K4407
294G795K1237q1271O7013P896m4429M7893o0370M2134N179l1437O7252r7206M1558
307f756M4623o1705L6873j0880M318j8093l978M3031k1091p179m380o021K4972
$$ plain form
320 13734 -7560 28708 -2491 -48779 51274 -12671 -14914 25954 -23341 15753 -17233 -263
332 -263 22079 -17869 -2392 -1903 -3481 4025 15145 -4241 -36786 24100 19152 -25118 31118
345 31118 -25488 386 22950 -33062 50154 -19262 -15061 32113 -41202 25179 21548 -22275
357 -22275 -3972 -13203 18557 321 -20999 14378 -23072 515 5778 -11962 7346 -29601
369 -29601 21504 -13197 -19201 41540 -27558 -9354 2213 4709 25545 -20832 3458 9737 -17180
382 -17180 29550 8237 -11740 8279 -2167 12922 -10234 17690 11356 -21757 2741 -2653
394 -2653 26192 -17525 -9165 17630 -32884 24670 7753 -30779 16156 -13029 5611 10637 -26548
407 -26548 31575 -19429 -18443 34070 -14926 13474 -10679 -6825 6511 -4636 28656 -22161 -10200
$$ packed form
320A3734k1294L6268l1199m6288J00053o3945k243M0868m9295L9094l2986J6970
332b63K2342l9948J5477M89j578P506J1120j9386l2545O0886m948m4270N6236
345C1118n6606K5874K2564n6012Q3216o9416M201M7174p3315O6381l631m3823
357b2275J8303r231L1760j8236k1320L5377l7450K3587N263j7740J9308l6947
369b9601N1105l4701o004O0741o9098J8204J1567K496K0836m6377K4290O279k6917
382a7180M6730k1313j9977K0019j0446J5089k3156K7924o334l3113K4498n394
394b653K8845m3717Q360K6795n0514N7554j6917l8532M6935k9185J8640N026l7185
407b6548N8123n1004R86N2513m8996K8400k4153L854J3336j1147L3292n0817J1961
$$ plain form
420 -10200 13526 -9558 12686 -8274 -795 10798 -32147 20210 9576 -22256 22570 -20460
432 -20460 -1068 9870 3278 7077 -25400 13030 8643 -1596 -287 -3873 8989 -16287 9253
445 9253 16990 -23609 9192 -2065 -19467 19809 -7388 7093 -17919 -20555 32816 -18995 2666
458 2666 1252 -14160 7183 -8167 16605 -5359 -8502 17371 -12749 5942 16983 -3850 7014
471 7014 -15988 21577 17162 -22245 25838 -16398 2639 19834 -12638 15393 -19409 2929
483 2929 12389 -21791 16579 3006 -22544 -445 -1331 8170 -4583 -9312 2142 -16786 13958
496 13958 905 -5284 -2244 -10457 20786 -18224 6019 16302 -22755 7453 1287 3903 7291
509 7291 -12914 5802 -4569 -1535 21317 -16060 -3894 -453 2973 8968 -18380 21776 -14055
$$ packed form
420a0200K3726k3084K2244k0960P479J1593m2945N2357j0634l1832M4826m3030
432b0460J9392J0938o592L799l2477L8430m387j0239J309l586J2862k5276K5540
445I253P737m0599L2801j1257j7402L9276k7197J4481k5012k636N3371n1811K1661
458B666j414j5412K1343j5350K4772k1964l143K5873l0120J8691J1041k0833J0864
471G014k3002L7565m415l9407M8083m2236J9037J7195l2472K8031l4802K2338
483B929R460l4180L8370j3573k5550K2099q86R501j2753m729J1454j8928L0744
496A3958j3053o189L040q213L1243l9010K4243J0283l9057L0208o166K616L388
509G291k0205J8716j0371L034K2852l7377J2166L441L426N995k7348M0156l5831
$$ plain form
522 -14055 -13536 21480 -12807 12390 -5939 -9434 10598 -13381 18491 6100 -27595 15483 1024
535 1024 -1933 7350 -9439 11585 -14798 6818 11444 -12528 8866 -9398 3948 -1030 3406
548 3406 13390 -22443 1570 13109 -5792 8548 -6450 -2398 5176 -9707 20486 -7589 -6213
561 -6213 11499 -13995 8995 1246 7596 -7245 -12696 17322 -5551 2718 591 -9855 5721
574 5721 -5438 8155 2756 -21305 17868 -7476 -11213 20896 -14909 4159 -11294 -901 18819
587 18819 -18540 7704 -4067 -11067 10520 1593 2099 -10289 -2131 11692 -12893 6922 8300
600 8300 -12724 4206 -7952 15312 -359 -12163 15505 -15731 7255 10716 -5522 -299 -6541
613 -6541 10933 1007 -4749 9399 -5350 -3677 4655 1863 8259 -10832 4309 -1675 -7836 22259
$$ packed form
522a4055N19L5016l4287K5197j8329l495K0032k3979L1872j2391l3695M3078j4459
535A024k957R283j6789K1024k6383K1616M626k3972K1394j8264J3346m978M436
548C406R984l5833K4013J1539j8901J4340j4998M052P574j4883L0193k8075J376
561f213J7712k5494K2990p749O350j4841n451L0018k2873Q269k127j0446J5576
574E721j1159J3593n399k4061L9173k5344l737L2109l5805J9068j5453J0393J9720
587A8819l7359K6244j1771p000K1587q927N06j2388Q158J3823k4585J9815J378
600H300k1024J6930j2158K3264j5671j1804K7668l1236K2986L461j6238N223o242
613f541J7474r926n756J4148j4749J673Q332k792O396j9091J5141n984o161L0095
$$ plain form
627 22259 -12686 -993 12 -5783 15170 -12150 6603 1241 -14771 12696 -543 -3137 5702
640 5702 -8253 3729 -4963 6083 11166 -21286 8339 355 1182 4930 -10359 11144 -14806
653 -14806 2573 15452 -14654 2882 484 -5942 2419 -1774 9247 -7327 -14737 14062 -3388
666 -3388 228 -1567 -3300 1406 -10708 16433 -5516 -7565 7180 -7442 6555 -2310 3519 5228
680 5228 -15021 8417 8812 -6232 7544 -7350 2099 4598 -1150 12859 -14420 5903 3333
693 3333 -5872 12394 -6059 3602 -5810 -2465 12349 -7650 3456 773 -12667 9598 564
706 564 -1016 -768 -11217 13716 -9893 -66 11258 -14394 3758 -3174 5506 1316 -7738 8243
720 8243 -7665 -1493 11022 -770 -3712 -4877 5743 6516 -10429 11570 -2510 -9040 8253
$$ packed form
627B2259l4945J1693J005n795K0953k7320J8753n362j6012K7467j3239k594Q839
640E702j3955J1982q692J1046N083l2452K9625p984Q27L748j5289K1503k5950
653a4806J7379J2879l0106J7536k398o426Q361m193J1021j6574p410K8799j7450
666c388L616j795j733M706j2114K7141k1949k049J4745j4622J3997q865N829J709
680E228k0249K3438L95j5044J3776j4894R449K499n748J4009k7279K0323k570
693C333r205J8266j8453R661r412L345J4814j9999J1106k683j3440K2265r034
706E64j580K48j0449K4933k3609R827J1324k5652J8152o932Q680m190r054J5981
720H243j5908O172J2515j1792k942j165J0620P73j6945K1999j4080o530J7293
$$ plain form
733 8253 -2497 8800 -9444 11 4941 -12044 10758 494 -5661 -3634 -2450 7912 -5933
746 -5933 -2772 5043 -12507 4825 2295 -5366 6653 -13148 7103 -1561 -3683 13736 -13420
759 -13420 1701 2814 -426 7726 -4001 2483 -1464 -685 11836 -2855 52 5077 -4585 7015
773 7015 -2066 9263 -691 -11690 14383 -4213 2237 2406 -4648 1788 -6901 9527 797 -11743
787 -11743 4450 -1669 -4146 2007 -2368 2464 -12066 -935 9417 -10466 4418 -5413 -2286
800 -2286 -168 -2047 10962 -11808 -326 5511 -4033 5573 -992 1539 894 -6429 12123 784
814 784 -5036 8912 -9092 5787 2714 224 3878 -10849 9246 -2385 -1436 5907 -7895 669
828 669 -2189 637 3855 -8052 1823 -1707 -8543 10751 -3199 -3493 -1527 -2962 7568 -7100
$$ packed form
733H253j0750J1297j8244R455M930j6985K2802j0264o155K027J184J0362j3845
746e933L161P815j7550J7332k530p661J2019j9801K0251q664k122J7419k7156
759a3420J5121J113l240Q152j1727O484l947P79J2521j4691K907N025r662J1600
773G015r081J1329r954j0999K6073j8596O450J69p054O436q689J6428q730j2540
787a1743J6193o119k477O153m375M832j4530J1131J0352j9883J4884r831L127
800b286K118j879J3009k2770J1482N837r544R606o565K531o45p323J8552j1339
814G84n820J3948j8004J4879l073k490L654j4727K0095j1631R49P343j3802Q564
828F69k858K826L218j1907R875l530o836J9294j3950k94J966j435J0530j4668
$$ plain form
842 -7100 6709 -693 -6129 5401 66 6818 -4928 1013 6839 -7409 6534 7717 -6710 2089
856 2089 -957 5702 3054 -6895 10323 -8758 -199 7894 -3894 2891 -7385 4230 -1306 -4132
870 -4132 8415 -6347 -4366 1681 -2064 3722 -4123 -2675 1619 -9136 8674 -2526 -4923 3077
884 3077 -7784 6049 -4725 2578 1983 -10639 5822 18 -754 2643 -3003 103 -854 2799 7526
899 7526 -7599 2520 3104 -2257 6186 -2249 6787 -6986 -283 10774 -6844 4977 -564 -2301
913 -2301 1426 -1345 6472 -3418 -6727 6122 -2718 -741 2447 -3396 1508 -7948 7322 994 -7351
928 -7351 6987 -7794 2908 1564 -259 4223 -8418 2976 4041 -3360 4515 -1099 -2652 2390
942 2390 -1030 6505 -4601 241 2917 -7281 8606 -2079 -100 -2063 -4252 7550 -5680 1575
$$ packed form
842g100J3809p402n436J1530n335O752j1746N941N826j4248J3943J183j4427Q799
856B089l046O659k648r949J7218j9081Q559Q093j1788O785j0276J1615n536k826
870d132J2547j4762J981O047l745N786p845J448M294j0755J7810j1200k397Q000
884C077j0861J3833j0774P303n95j2622J6461n804p72L397n646L106r57L653M727
899G526j5125J0119N84n361Q443q435R036j3773O703J1057j7618J1821n541j737
913b301L727k771P817r890l309J2849q840J977L188n843M904r456J5270o328q345
928g351J4338j4781J0702j344j823M482j2641J1394J065p401P875n614j553N042
942B390l420P535j1106M842K676j0198J5887j0685J979j963k189J1802j3230P255
$$ plain form
956 1575 2084 -7860 1133 2104 -1168 -717 -4405 2931 -3999 -1478 7605 -7456 796 -2768 2492 3123
972 3123 -6564 7403 -5953 -1669 5919 -411 1515 -3463 1699 3546 -4278 6604 1516 -7319
986 -7319 5384 -1363 4927 -1252 -2226 5580 -8087 7027 2055 -3993 1827 -3098 3203 -915 703
1001 703 2051 -5902 676 2786 -2593 3945 -4547 72 362 -3565 8956 -6806 -687 2327 -3080
1016 -3080 4102 -2424 3411 -3346 -2597 6037 -1871 -625 1835 -3226 906 -490 3794 1021 -8969
1031 -8969 6679 -2653 -1280 4001 -5072 2116 -5995 3634 2555 -5761 2231 -2526 -1579 757 282
1046 282 2389 -5469 -1653 6302 -5170 3774 14 -3416 3616 -2691 8008 -3122 -1143 5108
1060 5108 -4328 4819 1886 176 -227 -2095 4967 769 -1534 4346 -4226 249 2929 -1304 3252
$$ packed form
956A575N09r944Q993R71l272M51l688P336o930K521R083j5061Q252l564N260O31
972C123r687J3967j3356M284P588o330J926m978N162J847p824J0882n088q835
986g319J2703o747O290o179r74P806j3667J5114m972o048N820m925O301m118J618
1001G03J348p953O578K110n379O538q492M619K90l927J2521j5762O119L014n407
1016c080P182o526N835o757P49Q634p908J246K460n061M132j396M284k773r990
1031h969J5648r332J373N281r073P188q111R629j079q316P992m757R47K336m75
1046B82K107p858L816P955j1472Q944l760l430P032o307J0699j1130J979O251
1060E108r436R147k933j710m03j868P062m198k303N880q572M475K680m233M556
$$ plain form
1075 3252 -6191 3095 -1161 -2872 6083 -4717 -196 -2772 1080 2505 -4764 3281 -1886 -5218 5301
1090 5301 52 -2115 377 -2945 4329 -3808 2837 2945 -6901 3825 -1534 3536 -634 -2264 3745
1105 3745 -5237 2938 3941 -2994 26 -1067 745 2079 -3142 4649 -3878 -3894 5969 -3397 2623
1120 2623 -2961 -137 -398 -3529 6798 -4576 -2302 1272 -2925 2022 -719 -772 393 -4472 3469
1135 3469 1986 -3168 3819 -3573 2832 511 2266 5057 -5999 4804 1318 1091 3338 -263 2814
1150 2814 -2477 2178 5708 -3765 730 1583 -4135 3018 -1284 1053 -3299 -4973 5411 -6077 1051
1165 1051 -607 -5068 816 -3379 3081 -1535 -3817 2199 -1757 -555 2827 -826 645 -2619 2536
1180 2536 3610 -3672 5386 -3062 -122 3276 -351 3840 -5349 2562 697 -3125 3836 -1117 -2743
$$ packed form
1075C252r443R286m256j711Q955j0800M521k576L852J425p269Q045n167l332J0519
1090E301n249k167K492l322P274q137O645J08r846J0726n359N070m170j630O009
1105C745q982Q175J003o935L020j093J812J334n221P791q527j6R863r366O020
1120B623n584K824k61l131J0327j1374K274L574m197M947k741n3J165m865P941
1135C469j483n154O987p392O405k321J755K791j1056J0803l486k27K247l601L077
1150B814n291M655L530r473M495Q53n718P153m302K337m352j674J0384j1488P128
1165A051j658m461N884m195O460m616k282O016l956J202L382l653J471l264N155
1180B536J074p282R058q448K940L398l627M191r189P911j865l822O961m953j626
$$ plain form
1195 -2743 -93 -688 1914 -1757 -882 2047 -5875 3766 577 -997 758 -3913 5182 -2830 1575
1210 1575 3689 -4506 1480 835 1719 761 -1924 1878 -1443 -1164 5570 -2693 -429 191 -675 3790
1226 3790 -3256 4460 -2322 -2961 4898 -1810 2368 -1297 -316 1695 -1780 3334 1115 -4071 1775
1241 1775 -467 176 1207 -2499 2206 -5627 2092 2093 -4263 2120 -3869 558 -1374 3 2330 -4885
1257 -4885 257 1142 -1652 1943 -702 -493 664 -1639 5589 -1992 -727 3165 -3111 4010 -1072
1272 -1072 2588 -284 -3850 4712 -1291 373 1118 -1713 -549 -559 1683 1607 -4642 2237 -487 -2341
1288 -2341 4004 -2579 1376 -2673 748 3743 -3150 3595 -1685 -904 2034 375 2122 -1812 -336
1303 -336 2450 -1628 1713 1928 -3161 1291 -2003 3053 -590 -2571 3341 -5214 2051 1014 -838
$$ packed form
1195b743K650n95K602l671Q75K929p922R641l189j574J755m671R095q012M405
1210A575K114q195N986o45Q84r58k685L802l321K79O734q263K264O20q66M465
1226C790p046P716o782o39P859o708M178l665R81K011l475N114k219n186N846
1241A775k242O43J031l706M705p833P719Jo356O383n989M427j932J377K327p215
1257d885N142Q85k794L595k645K09J157k303P228p581J265L892o276P121n082
1272a072L660k872l566Q562o003J664P45k831J164j0K242p6o249O879k724j854
1288b341O345o583L955m049L421K995o893O745n280P81K938j659J747l934J476
1303c36K786m078L341K15n089M452l294N056l643j981N912q555P265j037j852
$$ plain form
1318 -838 -414 -3007 2588 -1232 -779 2627 -2867 -1416 1710 -837 1768 -2722 974 416 -3436 5371
1334 5371 -2390 -519 -471 -993 3108 -2765 2159 -651 -3153 2433 453 216 206 -1675 1365 -1463
1350 -1463 713 2947 -4358 2037 -519 804 1868 -2036 2591 -3643 1587 2572 -1926 1164 -813
1365 -813 192 785 -58 2700 -1491 -1947 3761 -2037 1839 180 -968 1226 -2899 4873 -1648 -1563
1381 -1563 1926 -2176 1440 -635 711 -325 -3435 1466 659 -1930 1724 -2052 -846 -290 -470 3260
1397 3260 -4468 1150 459 -2055 2376 -1421 1562 -2428 -136 3076 -1860 954 812 -1960 1611
1412 1611 948 708 29 -2644 3207 -1797 797 1931 -3046 1717 -1757 1930 -104 -1905 1686 -2811
1428 -2811 99 1464 -468 -180 -1759 22 1238 -2162 2934 -1056 -2075 2707 -1125 2798 -2075
$$ packed form
1318h38M24k593N595l820M53L406n494J451L126k547K605m490L696n58l852Q807
1334E371p761J871M8n22M101n873M924k810k502N586j980k37j0j881L040k828
1350a463K176K234p305O395k556J323J064l904M627o234N230R85m498L090j977
1365h13J005N93q43K758m191m56N708n798L876j659j148K194m125P772o521Q5
1381a563L489m102L616k075J346j036l110M901q07k589L654l776J206N56j80L730
1397C260p728N618o91k514M431l797K983l990K292L212m936K814j42k772L571
1412A611o63k40o79k673N851n004K594J134m977M763l474L687k034j801L591m497
1428b811K910J365j932K88j579J781J216l400N096l990j019M782l832L923m873
$$ plain form
1443 -2075 1514 1386 -2559 4338 510 -289 176 221 2311 -300 665 1586 -2879 1238 1890 -1564 979
1460 979 -2592 1572 -1454 -1058 2616 -4126 125 -1410 -294 444 -2287 360 -2067 -1370 2018 -1050
1476 -1050 -950 292 -1489 1568 -1308 1999 225 -3145 3452 -1384 1675 311 -806 953 -1871
1491 -1871 3114 417 -1699 1450 -215 -231 1446 -280 1159 -2136 608 2196 -2366 2526 -1398
1506 -1398 -299 286 -410 3033 -2892 296 693 -1225 1133 -90 -491 -853 -1250 2166 -666 -1787
1522 -1787 1996 -2594 1064 155 583 1115 -3255 3011 -766 599 2047 -1080 859 -299 1772 1654
1538 1654 -1118 1182 289 -1217 2620 -561 155 -736 -1070 2075 -2766 1514 -1656 -2708 562 -1708
1554 -1708 1077 -2391 -835 113 -2543 624 855 -1964 29 -677 865 675 -1242 2874 -2323 946
$$ packed form
1443b075L589j28l945O897l828p99M65M5K090k611R65R21m465M117O52l454K543
1460I79l571M164l026L96L674o742M251j535J116P38k731K647k427O97L388l068
1476a050J00J242j781L057k876L307j774l370O597m836L059j364j117J759k824
1491a871M985k697k116L149j665j6J677j726J439l295K744J588m562M892l924
1506a398J099N85o96L443n925L188L97j918K358j223m01l62l97L416k832j121
1522a787L783m590L658r09M28N32m370O266l777J365J448l127J939j158K071j18
1538A654k772K300q93j506L837l181P16q91l34L145m841M280l170j052L270k270
1554a708K785l468J556R48k656L167K31k819J993p06J542j90j917M116n197L269
$$ plain form
1570 946 2351 -603 1703 -1244 2054 -104 -192 2972 -1138 -278 763 -48 914 -417 -153 95 -2205
1587 -2205 2754 -560 -1029 703 -2073 1939 -1427 1350 130 -2133 1604 -326 818 337 -539 301
1603 301 -799 174 1910 -2358 440 -54 -1073 1395 -1637 1376 -2230 -469 2209 -1931 1418 -831
1619 -831 -657 -275 -92 2052 -1074 -1205 1484 -777 759 1268 -1114 667 -1836 2056 184 -1661
1635 -1661 1959 -1932 561 -394 303 566 -2584 762 -91 -808 836 -624 -777 58 -539 1819 -1715
1652 -1715 296 1109 -1923 2464 -362 1005 -380 -601 2184 -1059 1222 414 -920 785 645 432
1668 432 489 -730 1129 -532 -27 2335 -1866 808 -732 411 803 -1340 1874 -1905 -161 1124
1684 1124 -505 21 -1207 -38 250 -1067 1181 -102 -2093 974 -770 746 -571 -457 827 -2795
$$ packed form
1570I46J405k954K306k947L298k158q8L164m110Q60J041q11R62j331K64K48k300
1587b205M959l314m69J732k776M012l366K777j220k263L737j930J144m81q76Q40
1603C01j100R73J736m268K798m94j019K468l032L013l606J761K678m140L349k249
1619h31J74L82J83K144l126j31K689k261J536N09k382J781k503L892j872j845
1635a661L620l891K493r55O97K63l150L346q53p17J644j460j53Q35n97K358l534
1652a715K011Q13l032M387k826J367j385k21K785l243K281q08j334J705j40k13
1668D32N7j219J859j661N05K362m201K674j540J143L92k143L214l779J744J285
1684A124j629N26j228J169K88j317K248j283j991L067j744J516j317J14J284l622
$$ plain form
1700 -2795 2364 -56 -1076 -46 -1126 1102 -722 759 886 -1554 297 1085 -712 1166 -686
1715 -686 201 230 -681 2788 -1540 581 -252 -598 1560 -1126 1007 -1057 -208 1533 -622 161 314
1732 314 -767 -46 -107 516 480 -1897 1582 -621 401 1256 -1112 863 -1441 1802 448 -1150 1179
1749 1179 -631 17 565 587 412 -757 -148 1589 -1337 1183 -378 -1216 812 -851 1974 -1738 -83
1766 -83 520 -1857 942 -280 281 -897 -916 583 -502 -579 782 -1473 -261 782 -378 624 -2061
1783 -2061 1378 -423 -475 2019 -1297 624 -477 595 800 -676 1242 -334 -888 1419 500 -135
1799 -135 200 -643 1466 -1094 1130 872 -1765 1359 -930 1079 -672 -186 939 -1661 909 568
1815 568 -615 -324 -237 215 414 -623 1391 -1139 -721 1634 -1002 1334 -821 572 -186 -963 2126
$$ packed form
1700b795N159k420j020J030j080K228j824J481J27k440J851P88j797J878j852
1715f86Q87K9r11L469m328K121q33l46K158k686K133k064Q49J741k155P83J53
1732C14j081P21o1O23l6k377L479k203J022Q55k368J975k304L243j354j598K329
1749A179j810O48N48K2j75j169O09J737k926K520j561q38K028j663K825l712J655
1766h3O03k377K799j222N61j178j9J499j085p7J361k255J212J043j160J002k685
1783b061L439j801n2K494l316J921j101J072K05j476J918j576n54K307r19o35
1799a35L35q43K109k560K224k58k637L124k289K009j751M86J125k600K570l41
1815E68j183K91Q7M52J99j037K014k530M18K355k636K336k155J393p58p77L089
$$ plain form
1832 2126 -1042 374 344 -191 687 264 156 -149 -829 1083 170 -977 924 -1590 502 -616 -42
1849 -42 776 -2303 756 -1021 -304 207 -697 -89 -989 275 602 -709 -202 487 -886 1069 -19 915
1867 915 -394 -707 1974 -985 1452 137 -395 478 -134 1813 -414 -376 770 -277 177 618 -190
1884 -190 147 -767 352 906 -1319 1224 -1419 -146 -27 -248 790 -1747 583 -105 -547 740 -315
1901 -315 -517 -149 5 771 -214 -345 665 -1710 1314 304 -201 375 -1163 1513 -1067 692 178
1918 178 -1215 638 -304 332 -166 -94 128 -646 -501 1269 -655 -373 -226 -738 632 -996 1082 -1013
1936 -1013 -618 974 -733 679 -931 311 2 -526 1181 233 -773 297 -10 104 750 -263 1014
1953 1014 -1308 1300 655 -671 1060 -934 991 -170 591 771 -703 213 -52 -20 504 76 -450
$$ packed form
1832B126l168J416l0n35Q78m23j08l05o80J912r13j147J901k514K092j118N74
1849d2Q18l079L059j777P17N11r04O08r00J264L27j311N07O89j373J955j088R34
1867I15j309l13K681k959K437j315n32Q73o12J947k227L8J146j047M54M41q08
1884a90L37r14J119N54k225K543k643J273J19k21J038k537K330o88m42J287j055
1901c15k02L68J54P66r85j31J010k375L024j010n05N76j538K676k580J759n14
1918A78j393J853r42O36m98P2K22p74J45J770j924K82J47n12J370j628K078k095
1936a013L95J592j707J412j610J242l09n28J707r48j006J070l07J14O46j013J277
1953A014k322K608o45j326J731j994J925j161P61J80j474R16k65L2N24m28n26
$$ plain form
1970 -450 -309 -641 1085 -491 -542 400 -1276 898 -774 413 -695 -924 721 -1051 374 -49 -532
1987 -532 -478 -200 625 213 -944 387 -143 -641 1095 -783 803 -767 400 567 -1109 1193 -822
2004 -822 -135 -234 -31 423 -922 -140 467 -324 443 381 -1093 283 -622 628 -296 -333 1132 -1198 883
2023 883 -10 209 127 -639 882 -168 187 787 -563 -353 786 23 413 -257 515 114 -841 1642 -582
2042 -582 95 -364 19 774 -631 1095 -700 -195 672 236 35 94 -267 324 -360 -69 926 -1601 428
2061 428 -641 130 98 -740 812 -1491 570 441 -423 24 -320 133 -255 -10 301 -366 -841 1047 -851
2080 -851 452 -30 -248 334 -937 1394 -604 4 238 -696 856 43 349 -89 -303 328 288 -368 1127
2099 1127 -164 -176 11 -142 1104 -1266 745 -148 -144 1041 -306 486 -812 462 429 -684 275 185
$$ packed form
1970d50J41l32J726j576n1R42j676K174j672J187j108k29J645j772J425m23m83
1987e32N4K78Q25m12j157J331n30m98J736j878J586j570J167J67j676K302k015
2004h22O87r9K03M54j345P82O07p91P67o2j474J376r05J250r24l7J465k330K081
2023H83q93K19q2p66J521j050L55O00j350K10J139p63L90o70P72m01r55K483k224
2042e82O77m59L83P55j405J726j795N05Q67m36k01N9l61N91o84K91R95k527K029
2061D28j069P71l2q38J552k303K061j29q64M47l44M53l88K45L11o67m75J888j898
2080h51J303m82k18N82j271K331j998O08K34r34J552q13L06m38k14O31m0o56J495
2099A127j291j2J87j53J246k370K011q93MJ185j347P92j298J274l3j113R59r0
$$ plain form
2117 185 -401 -121 305 5 82 -1026 855 -636 49 737 -1051 567 -579 875 -29 -277 372 -765
2135 -765 136 29 58 -85 -433 -103 352 -640 549 -472 -499 337 -668 764 -983 210 140 -798 842
2154 842 -542 -40 -596 191 152 -4 181 184 -738 345 641 -522 541 -617 626 -156 417 1045 -956
2173 -956 771 -365 540 191 26 473 -575 157 456 193 -319 336 -336 592 -531 716 -16 -894
2191 -894 1066 -863 475 -389 108 -89 -836 975 -615 -355 67 -28 -456 362 -99 216 -647 264 390
2210 390 -960 899 -725 19 -257 105 680 -1023 326 -262 -97 73 49 -267 -75 -203 320 -68 -777
2229 -777 570 -841 217 -270 278 349 -925 862 -622 254 401 -203 -62 -28 960 -40 12 172 153
2248 153 -514 792 -147 134 -106 -110 733 -733 638 -328 -280 548 -169 740 -416 331 233 -141 438 386
$$ packed form
2117A85n86K80M26l00P7j108J881j491O85O88j788J618j146J454r04k48O49j137
2135g65R01j07K9j43l48L30M55r92J189j021k7Q36j005J432j747J193p0r38J640
2154H42j384N02n56P87l9j56J85Lr22J083K96j163J063j158J243p82N73O28k001
2173i56J727j136R05l49j65M47j048P32K99k63n12O55o72R28j123J247p32q78
2191h94J960j929J338q64M97j97p47J811j590K60M22r5m28Q18m61L15q63R11J26
2210C90j350J859j624P44k76L62N75j703J349n88J65J70k4l16J92j28N23l88p09
2229g77J347j411J058m87N48P1j274J787j484Q76J47o04J41L4R88j000N2J60j9
2248A53o67J306r39K81k40mQ43j466J371r66M8Q28p17R09j156P47r8l74N79n2
$$ plain form
2268 386 -462 -18 -91 102 170 -346 798 -1168 333 215 -411 315 -590 272 -500 6 331 -743 -276
2287 -276 -410 -102 -227 -124 -182 -96 -894 865 -182 -20 113 -691 438 -402 544 -151 -594 589 -104
2306 -104 268 -44 158 -47 251 -19 407 -473 36 28 -245 495 -436 714 -942 307 523 -664 549
2325 549 -286 221 -219 283 366 -324 -151 105 -126 -4 465 -318 361 -564 844 13 -96 618 -849 566
2345 566 -240 429 -102 -463 173 -151 99 -40 -115 -382 146 32 452 -471 110 298 -543 739 -605 304
2365 304 -627 -99 246 -660 324 -212 -358 153 61 -95 -113 -565 292 -124 -137 592 -680 139 -435 297 189
2386 189 -190 700 -722 262 224 270 248 -218 358 118 197 320 230 -259 327 -250 130 27 -105 301 -781
2407 -781 741 -258 150 -188 31 251 -510 501 18 -455 172 301 -358 374 -143 -38 -68 -365 853
$$ packed form
2268C86q48M44p3J93O8n16J144j966J501j18o26P26r05Q62p72N06L25j074M67
2287b76j34L08j25J03n8Q6p98J759j047J62J33q04J129q40R46o95m43J183o93
2306a04L72l12K02k05K98k70M26q80N09qk73P40r31J150j656J249K16j187J213
2325E49q35N07m40N02Q3o90J73K56k31J22M69p83O79r25J408q31j09P14j467J415
2345E66q06O69n31l61O36l24K50j39p5k67N28j14M20r23N81J88q41J282j344R09
2365C04r31N28L45r06R84n36j46N11r2j56j8m52Q57m16j3P29j272Q19n74P32j08
2386A89l79Q90j422R84l8M6k2m66N76k40P9J23r0m89N86n77L80j03j32M06j082
2407g81J522r99M08l38K19K20p61J011m83m73O27J29o59P32n17J05l0k97J218
$$ plain form
2426 853 -653 46 -31 -134 211 -293 578 -744 175 42 -122 -39 -50 -154 -58 -90 94 49 -864 669 -582
2447 -582 -3 81 -445 280 -742 963 -265 -335 179 -367 196 77 414 -48 -304 -218 303 -80 420 -107
2467 -107 -153 177 -229 946 -159 232 86 -379 569 -185 402 -328 104 245 23 -96 235 -419 -114 216
2487 216 -33 43 -784 449 -326 97 376 -699 154 -246 353 -155 -53 236 -275 45 173 160 -104 -99 -501
2508 -501 478 -527 246 -313 -705 430 -574 221 -287 116 64 -690 374 -46 116 -135 -74 111 42 -229
2528 -229 194 -457 -293 644 -344 264 -406 168 -103 -81 520 -380 168 -326 -53 139 253 267 62 -293 224
2549 224 221 -313 464 -251 367 -85 73 424 -347 696 -292 76 218 213 154 -414 220 345 62 29 -134 -474
2571 -474 487 -121 253 -129 -272 569 -498 401 -256 -105 182 -322 340 -406 61 13 -49 -11 276 -65 -60
$$ packed form
2426H53j506O99p7j03L45n04Q71j322R19j33j64Q3j1j04R6l2J84m5r13J533j251
2447e82N79Q4n26P25j022J705j228p0N14n46N63j19L37m62k56Q6N21l83N00n27
2467a07m6L30m06J175j105L91j46m65R48p54N87p30M32J41k22j19L31o54L05L30
2487B16k49P6q27J233p75M23K79j075Q53m00N99n08J02K89n11L20J28j3k64Nm02
2508e01R79j005P73n59l92J135j004P95n08M03n2p54J064m20J62k51O1J85o9k71
2528b29M23o51J64R37r88O08o70N74k71K2O01r00N48m94K73J92J14J4k05l55N17
2549B24ln34P77p15O18m52J58L51p71J043r88L68J42nn9n68O34J25k83l3j63l40
2571d74R61o08L74l82j43Q41j067Q99o57J51K87n04O62p46M67m8o2L8K87l41N
$$ plain form
2592 -60 -95 -43 426 -384 502 -410 -56 -18 30 458 -642 346 -259 -187 91 122 -118 25 71 190 -165 -99 398
2615 398 -656 500 38 -163 163 -372 515 -818 578 55 -210 280 -64 320 66 150 -9 -74 94
2634 94 459 -86 57 -185 -141 428 -241 411 -547 -76 184 -428 52 -327 162 -287 50 124 60 -347 78
2655 78 69 -188 154 -102 64 -607 280 30 -88 239 -438 133 -643 321 83 -321 246 -137 -18 -135 71
2676 71 22 15 10 284 -263 158 291 -366 326 -174 532 -422 -64 488 -89 628 24 112 135 202 234 163 -55 145
2700 145 -173 -167 516 -310 279 -315 405 172 -273 491 -479 -124 -181 209 10 -291 -52 -107 -234 -98 355
2721 355 -590 407 -221 491 -234 -132 495 -501 542 -403 107 -399 -221 9 -189 143 125 -355 -177 223
2741 223 -442 -92 -200 132 -136 -442 410 -517 355 -114 22 345 -216 412 -499 198 168 83 6 306 -85
$$ packed form
2592f0l5N2M69q10Q86r12L54L8M8M28j100R88o05P2K78L1k40J43M6J19l55O6M97
2615C98j054J156m62k01L26n35Q87j333J396n23k65M90l44L84k54Q4j59o5J68
2634I4L65n45J43k42M4N69o69O52r58M71K60o12M80l79M89m49L37P4o4m07M25
2655G8rk57L42k56J66o71Q87k50j18L27o77N71p76R64k38m04N67l83J19j17K06
2676G1m9pnK74n47M21J33o57O92n00P06r54L58N52n77P17o04Q8K3O7L2p1k18K00
2700A45l18OO83q26N89n94P20k33m45P64r70L55n7L90j99l01K39n5j27J36M53
2721C55r45R97o28P12p25J02O27r96J043r45N10n06J78K30j98L32j8m80J78M00
2741B23o65L50j08L32k68l06Q52r27Q72m69J36L23n61O28r11O97l0q5p7L00l91
$$ plain form
2762 -85 -33 95 272 261 -574 405 -260 310 -15 -274 389 -792 510 104 -157 -91 33 216 -38 278 106
2783 106 -27 -150 388 -298 126 89 65 -85 -151 436 -416 -64 -15 -91 11 -62 156 -216 -117 -79 -129 -42 375
2806 375 -215 -152 39 -244 217 -459 453 -194 -63 248 -114 182 -442 330 4 -39 -193 62 -233 282 35
2827 35 -99 157 -377 372 -487 409 145 -383 232 -67 314 -326 41 91 -287 302 -36 126 82 83 -61 97
2849 97 -126 236 -132 -130 299 -347 329 -407 357 -174 -180 344 -151 180 -306 30 -217 72 63 156 -176 142 44
2872 44 -358 210 -129 19 -93 139 139 -634 10 -103 156 -223 -16 4 -525 -11 199 212 -16 80 -332 183
2894 183 -275 409 -130 -12 276 -172 361 -157 281 -61 -111 420 -240 128 73 173 -105 -8 -28 228 -119
2915 -119 130 161 -277 388 -96 48 -187 134 424 -558 447 -289 267 88 -62 193 6 45 139 171 -191
$$ packed form
2762h5N2J28J77j1q35R79o65N70l25k59O63j181J302m06k61O6J24J83k54L16j72
2783A06j33j23N38o86M24l7k4j50o6N87q52L52M9p6J02p3K18l72R9L8n0Q7M17
2806C75n90O3J91k83M61o76R12o47J31L11l62K96o24P72l26m3j54K55k95N15k47
2827C5j34K56n34P49q59Q96k64n28O15k99L81o40L67N0l78N89l38J62m4Jj44J58
2849I7k23L62l68KM29o46O76p36P64n31oN24m95L31m86L36k47K89rR3l32L18r8
2872D4m02N68l39J48j12K32%p73O44j13K59l79K07K0n29N14K10J3k28R6m12N15
2894A83m58O84n39J18K88m48N33n18M38l42n0N31o60L68n5J00k78R7k0K56l47
2915a19K49L1m38O65m84J44k35L21K90r82J005p36N56j79j50K55j87L9R4L2l62
$$ plain form
2936 -191 312 -388 311 -70 144 181 -342 410 -183 154 -124 -126 -224 -89 167 -211 43 -148 -172 -384 209 -153
2958 -153 87 -43 -333 227 -523 368 -398 -28 -164 115 260 -138 376 -176 74 22 74 -162 22 -31 -7
2979 -7 254 255 354 -347 -71 136 -83 317 -289 451 -58 98 272 -258 67 -129 36 -42 210 301 232 -172 358
3002 358 -266 2 50 -198 243 -458 416 -122 106 49 -180 165 -114 148 -24 247 -198 332 -186 80 -41
3023 -41 -273 315 -130 306 -373 250 304 -254 261 -293 229 -188 -43 215 -114 -77 45 -119 23 -1 -149
3044 -149 124 -282 326 -127 -228 262 -256 409 -231 357 191 64 45 -1 245 189 100 -95 164 39 40 211
3066 211 65 -118 -144 465 -196 381 -157 -60 446 -320 178 -24 -67 -208 416 185 90 115 -105 218 -153 269
3088 269 -173 303 -314 191 -130 -253 497 -517 121 -271 -52 -112 -296 53 -299 56 54 -118 -168 281 -165
$$ packed form
2936a91N03p00O99l81K14L7n23P52n93L37k78kr8J35K56l78K54j91k4k12N93l62
2958a53K40j30k90N60p50Q91p66L70j36K79J45l98N14n52K50n2N2k36J84n3K4
2979gK61JR9p01K76K07k19M00o06P40n09J56J74n30L25j96J65p8K52R1o9m04N30
3002C58o24K68M8k48M41p01Q74n38K28n7k29L45k79K62j72K71m45N30n18K66j21
3023d1k32N88m45M36o79O23N4n58N15n54N22m17J45K58l29L7J22j64J42k4j48
3044a49K73m06O08m53j01M90n18O65o40N88j66j27j9m6K46n6q9j95K59j25JJ71
3066B11j46j83k6O09o61N77n38R7N06p66M98k02m3j41O24k31r5K5k20L23l71M22
3088B69m42M76o17N05l21j23P50j014O38l92K19o0j84L49l52L55kj72n0M49m46
$$ plain form
3109 -165 143 -288 194 196 -23 314 -204 221 -98 -52 -4 14 212 -57 -143 -70 29 -33 -43 -42 29 77 91 270 -314
3134 -314 96 27 131 282 0 237 -383 88 104 207 1 -133 -25 169 335 -85 374 -299 158 -218 46
3155 46 -165 -69 221 -400 508 -35 -10 -107 50 -60 -316 -68 -50 -64 28 19 -354 207 -279 -174 126 -368 193
3178 193 -353 71 -32 -78 269 -42 -76 -576 116 16 56 -322 200 -117 -93 100 -94 121 -356 263 -145
3199 -145 88 -43 -89 69 -2 113 -79 -158 -162 -175 113 92 41 -47 1 -95 55 101 177 -235 -87 345 -239 361
3223 361 -167 118 -16 -25 451 -42 71 -136 -123 -221 27 -248 342 -37 -244 397 31 117 -171 194 -75 -102
3245 -102 158 -478 242 -413 89 -140 39 -250 -286 -255 -234 29 -279 201 -297 -51 -74 106 46 -231 300 90
3267 90 254 -194 182 -127 -171 311 1 152 -53 158 -283 140 265 67 47 -27 498 -333 438 -171 233
$$ packed form
3109a65L08m31M82Kk19L37n18M25l19M6M8J8J98k69q6P3R9o2j0JP1M8J4J79n84
3134c14M10o9J04J51k82K37o20M71J6J03k06j34J08J94J66m20M59o73M57l76K64
3155D6k11R6K90o21R08n43K5r7J57j10k56K48J8j4R2rl73N61m86J05L00m94N61
3178A93n46M24j03m6L47l11l4n00O92j00M0l78N22l17K4J93j94K15m77O19m08
3199a45K33j31m6J58p1J15j92p9mj3K88k1n1q8M8r6J50M6P6m12J48M32n84O00
3223C61n28K85j34rM76m93J13k07J3r8K48k75N90l79k07O41l66Q6k88L65k69k7
3245a02K60o36P20o55N02k29J79k89l6L1K1K63l08M80m98K46k3J80o0k77N31k10
3267I0J64m48L76l09m4M82l10J51k05K11m41M23J25j98k0p4N25q31P71o09M04
$$ plain form
3288 233 -80 -5 310 -144 -65 -50 19 -31 251 -305 -181 99 124 -70 32 292 -271 145 -32 9 300 -52
3310 -52 120 -257 387 -282 128 -119 -18 48 20 -221 -219 -41 -237 285 -86 45 -9 4 168 -181 180 -400
3332 -400 51 -114 -97 36 -126 78 -77 8 -224 169 -153 161 -88 -112 28 -207 250 -344 -240 -78 -6
3353 -6 84 41 465 28 34 94 -9 -155 -58 117 184 113 -198 78 -137 529 128 -10 263 -34 -46 -11 235 118
3377 118 -13 24 -44 -68 -79 84 -319 18 29 86 -152 -188 155 68 259 -501 138 -168 50 -78 -360 44 -180
3400 -180 95 -215 119 -50 -6 -5 122 -153 -297 59 -111 248 -194 19 189 102 64 -340 6 -141 -1 83
3422 83 -89 -30 83 15 71 164 -139 26 -99 161 29 -62 84 -226 317 -291 88 -104 260 266 -147 13 18
3445 18 -137 -105 338 -193 162 -81 278 107 -114 211 -115 7 -16 57 31 -112 -62 -463 -48 -159 138 27
$$ packed form
3288B33l13P5L15m54P9J5O9n0K82n56J24K80K5j94J02K60n63M16j77M1K91l52
3310e2J72l77O44o69M10k47J01O6k8k41KJ78j96N22l71J31n4J3J64l49L61n80
3332d00M51j65J7J33j62K04j55Q5k32L93l22L14k49k4J40k35M57n94J04J62P2
3353fR0m3M24m37OO0j03j46R7J75O7p1l11K76k15O66m01j38K73k97j2L5K46j17
3377A18j31L7o8k4j1J63m03L37J1N7k38l6L43q7J91p60O39l06K18j28k82M04k24
3400a80K75l10L34j69M4JJ27k75j44L56j70L59m42K13J70q7l8m04L46j47J40Q4
3422H3j72N9J13o8N6R3l03J65j25K60j32r1J46l10N43o08L79j92L64Om13J60N
3445A8j55L2M43n31L55k43L59j71k21L25l26J22k3P3k6j43N0m01M15j11K97j11
$$ plain form
3467 27 -130 -107 -32 -82 -79 -105 -257 18 -161 -204 -262 107 -54 -208 -12 -136 -75 -221 59 -81 58 79 -156 -83
3491 -83 -187 74 -83 182 171 -181 141 62 107 -226 382 -120 -56 22 156 -72 -107 -57 225 -5 111 178 -165
3514 -165 105 87 -98 174 -188 301 -157 76 81 -177 31 -229 237 -28 198 0 -102 -373 -174 31 33 -204
3536 -204 -337 57 -80 188 13 -126 -48 -192 58 -342 -149 28 -231 -159 32 73 -218 23 -331 -155 -173
3557 -173 -38 -174 77 287 41 387 -182 96 -7 -26 -30 -219 66 -155 -154 -374 -61 -196 4 -203 105 75
3579 75 -216 266 -114 342 80 -151 170 -252 191 -178 402 -180 237 74 -112 145 81 71 258 129 -92
3600 -92 -9 -74 14 -148 -74 83 -108 169 -181 183 74 -257 141 -169 92 -187 254 -9 353 135 35 -130
3622 -130 -322 -1 -386 58 -73 -7 20 -3 48 -63 137 -104 18 -19 -146 153 -60 94 72 169 149 87 -342
$$ packed form
3467B7j57K3P5n0Lk6j52K75j79m3n8L69j61j54J96j24O1j46K80j40J39K1k35P3
3491h3j04K61j57K65j1l52L22p9M5l33O08n02O4P8J34k28l5N0K82k30J16O7l43
3514a65K70j8j85K72l62M89m58K33Nk58K08k60M66k65K26j98j02k71J99K05Kk37
3536b04j33L94j37K68j75j39P8j44K50m00J93J77k59P2J91M1k91K41l54J76j8
3557a73J35j36K51K10k46L46n69K78j03j9mj89K85k21Jk20L13j35K00k07L08l0
3579G5k91M82l80M56k62k31L21m22M43l69N80n82M17j63j86K57o4j0J87j29k21
3600i2Q3o5Q8j62P4J57j91K77l50L64j09l31L98l10K61k79M41k63L62k18j00j65
3622a30j92L21l85M44j31O6K7k3N1j11K00k41J22l7j27K99k13J54k2R7k0o2m29
$$ plain form
3645 -342 159 -121 -78 17 -93 -26 -134 156 90 84 -26 36 252 -39 12 -44 153 -231 81 -67 -66 -202 -173 104
3669 104 -178 310 -263 269 19 -82 275 -59 124 144 -23 -195 -33 -260 -54 -157 -40 33 -287 93 -205
3690 -205 115 -52 17 146 -192 258 -86 9 -356 40 120 30 91 96 -35 -361 -71 -93 -34 -28 -126 -7 -201 135
3714 135 -82 123 -211 -181 112 25 101 -20 35 -133 135 -103 -33 -183 -104 106 8 307 -171 258 -148 260
3736 260 155 -30 84 -80 152 -263 347 90 3 2 12 209 93 22 -166 -58 -103 39 -122 -36 -105 -165 28
3759 28 -242 -67 -189 -125 -164 -96 234 192 -134 -116 159 -180 156 -172 -25 193 9 223 -56 212 -234 -88
3781 -88 16 -59 107 -97 181 -68 123 44 67 -215 -158 183 222 216 53 99 1 12 -18 85 362 -204 126 93
3805 93 131 284 -28 24 141 -62 -268 44 -26 324 -25 318 -75 80 185 -242 44 -196 170 50 284
$$ packed form
3645c42N01k80M3R5j10O7j08K90o6oj10O2K16k91N1n6J97l84L12j48Jj36K9K77
3669A04k82M88n73N32k50j01L57l34J83K0j67j72J62k27K06j03J17P3l20L80k98
3690b05L20j67O9J29l38M50l44R5l65L96Q0r0O1Nj31l26K90k2N9Or8J19j94L36
3714A35k17K05l34L0K93q7P6j21N5j68K68k38P0j50P9K10r8K99m78M29m06M08
3736B60j05j85J14j64K32m15O10k57q7jJ0J97j16p1j88J08m5J42j61Q6o9o0J93
3759B8k70J75j22O4l9O8L30m2l26J8K75l39L36l28J47K18j84K14k79K68m46J46
3781h8J04p5J66k04K78k49J91p9K3k82N7L41L9oj63M6r8J1l0J03K77n66L30l3
3805I3L8J53l12N2J17k03k06L12p0L50l49L43l93J55J05m27K86k40L66j20K34
$$ plain form
3826 284 -17 -62 46 68 -87 -302 -130 -207 189 -11 65 -284 -223 363 -185 187 -26 105 -57 -144 -177 47
3848 47 258 54 16 42 -248 -76 24 42 -165 214 -203 152 38 18 -12 154 -22 -203 462 -84 148 -216
3870 -216 -73 95 137 104 -174 -148 -192 148 60 202 169 -218 -94 36 110 -134 382 -134 298 170 -81 89
3892 89 -43 7 -13 121 53 -135 141 -184 94 -70 280 -241 360 -157 -50 -5 157 176 -70 131 -314 257
3914 257 -359 -58 -25 -175 141 -91 36 104 -25 -97 141 -37 -240 -137 -299 367 -161 23 -34 -147 220
3935 220 12 111 -111 12 -23 -32 91 153 -155 -38 213 -200 185 141 112 58 238 204 236 9 -77 214 -43 276
3959 276 2 82 12 55 180 -131 117 -138 -142 35 -48 161 -72 11 93 193 -267 93 -213 -283 48 -248 4
3982 4 -138 160 -232 -86 -95 -87 183 31 127 -50 117 -213 63 -150 -105 46 -260 14 68 -203 -30 79 -5
$$ packed form
3826B84l01m5J08K2j55k15J72p7L96k00P6l49O1N86n48L72k13J31j62q7l3K24
3848D7K11k04l8K6k90J72J00J8k07L79m17L55j14k0l0J66j76j81O65n46K32l64
3870b16J43J68M2l3k78K6m4L40q8J42l3l87J24J30P4k44N16n16M32j28k51J70
3892H9j32N0k0J34o8j88K76l25K78j64L50n21O01n17J07M5J62J9k46K01m45N71
3914B57o16L01L3j50L16k32J27O8j29p2K38j78k03J03j62O66n28J84n7j13L67
3935B20k08R9k22J23l5rJ23O2l08J17K51m13L85m4k9n4J80l4L2k27q6K91k57L19
3959B76k74Q0p0M3J25l11K48k55mJ77q3K09k33Q3Q2J00m60L60l06p0L31k96K52
3982Dj42K98l92J46rQK70j52R6j77J67l30K76k13M5J51l06K74N4k71J73J09q4
$$ plain form
4005 -5 44 119 39 95 -231 116 -207 201 -131 -70 74 -98 104 -95 105 -14 187 -138 -73 81 -129 -158 -130
4028 -130 248 -18 136 -1 17 -26 1 264 -285 261 42 106 -84 -3 -58 -219 -22 -52 174 52 -93 -63 -63
4051 -63 108 111 -77 -86 30 -225 181 -206 -28 -50 -62 108 -189 198 -254 210 -60 -229 -116 -90 -13 -80 182
4074 182 -396 97 61 15 54 -84 22 -410 187 -163 51 -3 -315 29 -78 -93 -146 -120 -226 108 136 -154 119
4097 119 -200 149 -90 26 -266 107 263 -98 -19 -183 145 -77 131 102 -3 -67 133 55 91 17 -101 135
4119 135 -378 51 177 132 -7 -41 258 -159 -24 -88 204 7 86 -100 8 -58 -164 128 -234 34 -200 17
4141 17 131 -40 97 23 118 -270 41 320 182 171 -173 151 -163 188 -151 256 26 -21 43 -152 318 -441
4163 -441 95 -97 10 101 -61 7 -246 -19 138 0 37 155 -37 45 74 -20 224 -204 260 -22 -233 56
$$ packed form
4005eM9P5q0N6l26L47l23M08l32O1J44j72K02j99K00j19K01l25O5J54k10k9K8
4028a30L78k66J54j37J8m3K7K63n49N46k19O4j90Q1n5j61J97l0K26j22j45L0%
4051f3J71Lj88rJ16k55M06l87J78k2j2J70k97L87m52M64k70j69J13K6P7o7K62
4074A82n78M93l6m6L9j38J06m32N97l50K14n4l12L44j07j5n3K6j06L34K8k90K73
4097A19l19L49k39J16k92L73J56l61P9j64L28k22K08k9j05o4K00p8L6p4j18K36
4119A35n13M29J26m5j39l4K99m17J35o4K92j97P9j86J08o6j06K92l62K68k34K17
4141A7J14j71J37p4R5l88L11K79j38j1l44L24l14L51l39M07k30m7O4j95M70p59
4163d41N36j92J07R1j62O8k53K27J57j38L7J18j92Q2K9r4K44m28M64k82k11K89
$$ plain form
4185 56 -168 80 101 8 -106 239 -166 90 -83 137 238 -314 137 25 139 -180 -63 -147 3 88 -25 186
4207 186 -89 233 -74 -3 51 4 -111 -70 -130 -46 168 -18 167 -93 -144 52 -3 30 -261 75 24 169 -103
4230 -103 -61 329 -11 290 -233 214 181 13 -129 60 -99 -212 -15 -162 151 -13 96 88 -36 -17 -64 319
4252 319 -20 102 -10 141 -113 36 174 91 -51 15 -70 -83 3 46 77 52 -266 174 -142 19 -200 -21 -5
4275 -5 18 198 -116 212 5 25 208 146 -13 0 6 -166 224 10 172 -127 -170 83 -201 90 -199 107 23
4298 23 67 18 -58 -169 -42 -21 -89 19 -366 101 80 311 38 149 -15 -76 154 -147 40 126 -98 -52 3 88
4322 88 -223 77 10 -4 -141 -79 1 60 229 102 125 -84 50 84 -139 40 0 179 -280 -150 -61 86 113 -218
4346 -218 -231 -188 89 30 -20 81 -19 -35 9 -44 132 173 -199 219 -29 -34 -183 -29 37 161 -157 96 -105 -137
$$ packed form
4185E6k24K48K1r3j14L45m05K56j73K20J01n52M51j12J14l19J17q4J50Q5j13K11
4207A86k75L22l07P1N4m7j15M1o0Q4K14j86J85k60n1J96n5L3k91L36n1J45k72
4230a03M2L90l40L01n23M47l3j68j42J89j59j13J97j47L13j64J09qj24J9m7L83
4252C19l39J22j12J51k54J49J38q3j42O6q5j3Q6M3L1k5l18M40l16J61k19J79J6
4275eK3J80l14L28k07K0J83o2j59J3Oj72L90k14J62k99m3K53k84K91k89L06q4
4298B3M4m9p6j11J27K1o8J08l85M67k1K31k73J11j64o1K30l01J87Q6k24M6N5Q5
4322H8l11L00o7j4j37O2Q0N9J69j27K3k09J34L4k23J79m0J79m59J30Q9J47K7l31
4346b18j3M3K77n9n0J01j00j6M4n3J76M1l72M18k48nj49J54O6J24l18K53k01l2
$$ plain form
4370 -137 122 109 2 147 76 -82 -137 362 -24 -115 -159 -80 -66 42 160 -122 19 188 23 -73 -63 -166 79
4393 79 286 -192 117 41 135 -60 152 108 -321 491 -180 303 87 240 129 -83 327 113 184 194 56 -51
4415 -51 104 6 -102 146 62 310 -253 92 -318 55 -42 53 -85 -67 187 -346 60 -198 -33 -124 -103 5 -9
4438 -9 16 -295 -89 34 -48 113 255 -22 -155 -98 -376 13 -42 68 135 243 102 60 -119 -243 77 -219 117
4461 117 26 32 -219 -4 29 -48 96 185 59 232 -89 42 148 125 -56 24 -70 -29 292 209 8 109 91 193
4485 193 -133 -72 -44 -127 -89 -47 75 146 -177 211 215 -15 -112 -81 -54 -223 34 12 149 -111 -38 32 47 -98 -61
4510 -61 304 -195 162 -176 227 287 -133 244 -287 -13 -7 91 59 201 72 47 -141 -179 25 -72 333 -49 28
4533 28 199 -96 15 -193 64 35 237 -361 221 51 166 -109 -165 111 -46 23 -109 88 -42 -72 362 -63
$$ packed form
4370a37K59j3j07J45p1j58n5M99l86r1m4P9J4J08J18k82J41J69j65r6J0j03K45
4393G9K07m78L09p6R4j95K12m4m29Q12o71M83k16J53j11k12M10k14P1J0j38j07
4415e1J55r8j08K48q4K48n63L45m10L73r7R5j38J8K54n33M06k58J65r1K1J08j4
4438iK5l11K06J23q2J61J42k77j33N7k78L89n5J10O7J08j41m2j79j24L20k96L36
4461A17r1Ok51K15L3p7J44Q9j26J73l21J31J06k3j81Q0r4M1L21q3k01J01j8J02
4485A93l26O1K8q3L8M2J22P1l23L88Mk30r7L1K7j69K57k2J37k60P3P0J5j45L7
4510f1L65m99L57l38M03O0m20L77n31K74OR8l2J42j29k5j88l8K04r7M05l82P7
4533B8J71k95J11k08K57k9K02n98N82j70J15k75n6K76j57O9j32J97j30l0M34m25
$$ plain form
4555 -63 -28 -166 -74 -100 -90 147 109 -71 215 68 74 265 279 2 -57 -194 29 -250 134 -105 -33 -212 -69 -35
4579 -35 -234 181 -337 -89 53 -53 -68 177 119 -145 -265 -196 -70 12 -75 120 -23 -41 185 89 2 5 -358 324
4603 324 -27 -24 106 -85 141 80 -107 -166 -77 -133 -12 208 157 71 106 -89 -62 101 -61 24 -51 96 -68 -98
4627 -98 138 -143 -57 162 44 77 -15 -242 -62 265 -73 56 23 -22 -133 122 -166 -8 203 -149 310 20
4649 20 80 -68 -45 121 9 196 194 -55 -237 -195 188 -23 168 -108 129 -97 -11 4 15 -38 -107 -113 180 -4
4673 -4 -156 86 -327 -270 -27 -39 435 -25 218 -100 207 21 227 76 113 172 65 243 -101 152 -93 139
4695 139 312 102 3 -137 213 -167 -210 -45 21 -18 -235 -48 -72 -51 -54 48 74 -232 -354 -170 -26 6 158
4718 158 -289 -7 -197 -327 -70 -196 176 -287 198 -151 -101 -4 113 211 26 -151 -176 -201 47 -66 -32 71
$$ packed form
4555f3L5j38R2k6J0K37l8j80K86j47OJ91J4k77n9j37K23k79L84k39P2j79J43L4
4579c5j99M15n18K48J42j06j5K45n8k64j20O9J26Q2q7J95j43j8K26r6q7Ll63O82
4603C24l51LJ30j91K26o1j87n9Q9n6J21K20n1q6L5j95K7J63j62Q5p5J47j64l0
4627i8K36k81Q6K19j18L3r2k27J80L27l38J29l3m5j11K55k88J58K11l52M59k90
4649B0O0j48K3J66j12J87kk49j82M2L83k11J91k76K37k26Q6J5J1n3o9oK93j84
4673dj52K42m13N7K43j2M74m60K43l18L07j86K06j51L7N9j07J78l44K53k45K32
4695A39J73k10r9j40L50l80m3J65O6l9k17J87k4K1lJ02K6l06j22J84J44L2J52
4718A58m47K82j90j30K57j26L72m63M85l49N0R7J17R8j85j77k5k5K48j13L4J03
$$ plain form
4740 71 -44 40 -12 -152 -53 1 -84 -280 -177 92 -26 -1 -247 165 50 -156 -25 114 165 -75 44 77 55
4763 55 -70 126 -212 -119 -43 -83 106 -266 376 -107 299 184 10 -53 81 47 -69 -9 120 45 145 231 -35
4786 -35 -35 92 -84 44 153 -6 -112 -86 -53 -229 -37 -165 81 -18 160 10 37 62 -190 -61 -107 -59 -110 171
4810 171 244 71 169 -86 284 -35 90 126 -130 -38 -14 83 38 99 246 203 -37 -24 131 -137 -99 -45 1 -155
4834 -155 256 -25 6 -45 154 73 -88 112 -88 -29 -235 -33 138 -51 -151 -27 98 -243 15 -90 64
4855 64 205 64 -41 -76 -18 169 -9 -64 -87 -106 -157 124 -56 126 -269 -17 -105 -21 -84 9 159 -331 -6 -46
4879 -46 142 -70 -35 146 -15 -191 -245 -104 -71 241 9 97 13 -125 44 -110 185 64 -15 72 262 211 -25
4902 -25 -160 -10 -125 -26 57 -132 -7 -42 103 119 28 -34 73 312 29 125 -4 -34 180 -212 -103 44 -37
$$ packed form
4740G1j15Q4n2j40R9N4q5j96J03K69j18K5k46M12j15k06J31J39N1k40J19L3k2
4763E5j25J96l38R3P6m0J89l72O42m83M06j15j74o3J34l4j16O0J29p5J00Q6k66
4786c5%J27j76J28J09j59j06K6L3j76J92j28K46r9J78j50K7K5k52J29m6M8n1K81
4810A71P3j73R8k55L70l19J25L6k56R2K4R7m5O1J47m3k40J3J55k68L8N4M6j56
4834a55M11k81L1n1J99q1j61K00k00N9k06K02J71j89j00J24J25l41K58j05J54
4855F4J41j41j05l5N8J87j78n5k3j9n1K81j80J82l95K52q8Q4o3R3J50m90L25m0
4879d6J88k12L5J81j61j76n4J41L3L12k32Q8q4j38J69j54K95j21p9Q7J90n1k36
4902b5j35J50j15R9Q3j89J25l5J45J6r1o2J07K39k83R6j29l0K14l92J09J47q1
$$ plain form
4925 -37 67 48 -9 -11 58 -2 270 -25 16 102 180 107 266 125 77 317 -160 124 -106 6 -103 66 60 163 -108
4950 -108 -121 276 201 21 -206 -10 -5 -148 146 -138 -25 -257 -160 -55 -24 21 -264 8 96 246 -104 23 87
4973 87 48 -59 -255 22 -109 153 -111 -67 131 40 -183 -134 3 92 222 -261 -115 5 -20 -119 -38 150 -31
4996 -31 251 137 191 102 -250 338 125 212 -144 -30 99 35 34 17 186 127 30 -112 -32 -170 133 108 -153 -121
5020 -121 -315 99 -24 137 -115 -93 -20 176 -39 -85 261 -121 -158 -195 -107 -150 -106 133 -173 -102 62 -279 15
5043 15 78 -224 -29 69 58 1 -36 -134 -92 -86 296 153 182 13 -13 -122 92 130 -96 153 96 347 -136 -139 -119 -7
5069 -7 -202 129 -214 -106 18 6 59 12 15 -42 -90 -207 38 -58 -55 15 -202 121 -120 114 162 -116 -120 24 -109
5094 -109 179 24 -133 -31 61 -5 247 -185 -35 -66 120 188 -185 202 -84 54 -175 69 1 -18 -175 -81
$$ packed form
4925c7J04j9n7kO9o0K72k95M1Q6P8p3J59j41m8K40m77K84k30J12j09J69oJ03k71
4950a08j3L97p5j80k27J96Nj43K94k84J13k32R7J05L1M5k85K72Q8J50l50J27O4
4973H7l9j07j96K77j31K62k64M4J98r1k23M9J37Q9J30m83J46J20k5r9Q1J88j81
4996c1K82j14N4q9l52N88k13Q7l56J14J29o4jj7J69n9r7j42Q0j38L03k5k61L2
5020a21j94M14j23J61k52K2P3J96k15m6L46l82l7l7Q8m3M4K39l06P1J64l41K94
5043A5O3l02J95R8j1n7l7r8M2OL82j43K9j69k6j09K14L8k26K49n7K51m83lK0J12
5069gj95L31l43J08J24j2N3m7Ln7m8j17K45r6LP0k17L23k41K34M8k78mJ44j33
5094a09K88j55j57J02R2o6K52m32J50l1J86O8l73L87k86J38k29K44o8j9j57R4
$$ plain form
5116 -81 -267 -154 53 -70 41 -42 37 -202 130 -63 -82 -138 -135 66 -43 71 212 -205 -107 197 50 -42 -131
5139 -131 53 283 83 -131 129 -111 134 51 -43 -90 -148 51 53 55 -162 -104 -80 -31 -69 24 -152 212 66 -47
5163 -47 71 -125 -14 -2 76 -76 38 -203 39 -9 32 -9 -361 -95 156 33 -39 90 -199 178 13 -67 245
5186 245 -100 104 60 302 60 65 125 77 0 -90 -13 -83 4 18 -168 207 123 -184 -180 106 208 60 69 81 -100 -130
5212 -130 154 -269 -34 -184 19 6 -92 226 151 296 9 57 -53 89 35 -21 47 -70 49 137 195 -20 -167
5235 -167 98 -115 -185 -109 122 44 4 68 35 25 -120 -16 10 241 187 95 -82 -186 -53 -5 258 -179 152 133
5259 133 33 -124 -11 191 -123 39 -16 -148 85 -101 -89 -112 -23 -10 13 -43 183 60 32 -5 229 57 116
5282 116 24 -253 19 -244 -191 -79 31 26 -58 -31 -21 258 -214 33 -9 -278 99 -51 31 -37 159 -31 42 -188
$$ packed form
5116h1j86J13K07j23J11q3P9k39L32j93j9n6LK01j09J14J41m17R8L04j47r2q9
5139a31J84K30k00k14K60k40K45q3r4m7n8J99KKk17N8K4M9l8R3j76L64j46j13
5163d7J18j96J11J2P8j52J14k41K42m8M1m1l52K66K51j23p2J29k89L77j65q0L12
5186B45l45K04m4K42k42NO0m8p7r0P7p0Q7J4j86L75q4l07MK86J02j48RJ2j81l0
5212a30K84m23K35j50K03j3r8L18p5J45k87M8j10J42n4n6O8j17J19Q8N8k15j47
5235a67K65k13p0P6K31p8m0O4l3j0j45J04K6K31n4r2j77j04J33M8K63m37L31j9
5259A33j00j57J13K02l14J62n5j32K33j86J2k3Q9J3K3n6K26j23k8l7K34j72N9
5282A16r2k77K72k63N3J12J10nq4K7J0K79m72K47m2k69L77j50Q2o8J96j90P3k30
$$ plain form
5306 -188 -244 112 -29 80 -78 74 -125 -96 -152 -60 166 -61 56 50 36 -48 -96 -131 52 105 -24 47 -5 85 1
5331 1 -167 -139 -34 32 9 85 -122 -41 -92 -56 35 -148 136 -112 205 6 142 -122 28 182 -41 5 -145 97
5355 97 -267 -11 -163 127 201 -38 29 57 42 199 71 -67 39 -93 22 79 137 -96 -81 -90 366 -47 93
5378 93 142 80 49 201 86 -124 100 -138 -50 -137 -164 -84 126 281 27 178 18 331 -187 -102 86 100 -47
5401 -47 128 27 -194 5 139 109 154 29 -49 153 84 -129 -42 -172 -81 -203 -55 -121 90 223 61 121 -273
5424 -273 69 15 59 154 181 -121 -121 68 75 -13 -65 160 16 7 -169 101 52 -231 -99 -44 -245 2 160 309 -105
5449 -105 -99 -122 125 22 247 -36 -85 136 -169 144 -127 60 -75 158 -2 143 133 12 140 99 -81 -205
5471 -205 -92 41 3 -90 -233 -203 3 2 40 -18 -180 -13 -31 235 60 72 140 69 -127 -191 -160 8 57 76 -162
$$ packed form
5306a88n6L56j41J09j58J52j99K9n6R2K26k27J17oj4q4m8l5J83N3j29P1n2R0q4
5331Aj68K8J05O6k3P6k07Q1n1L6R1j83K84k48L17j99J36k64J50J54k23M6j50K42
5355I7l64K56j52K90P4k39O7K8j5J57j28j38J06j32J15N7N8k33J5rM56m13J40
5378I3M9o2l1J52j15k10K24k38Q8q7k7Q0K10J55k54J51j60L13n18Q5J88J4j47
5401d7J75j01k21J99J34l0M5j25p8K02o9k13Q7j30R1j22J48o6K11J33j62O0l94
5424b73L42n4M4R5K7l02%J89Pq8n2K25j44rj76K70m9k83J32N5k01K47J58J49m14
5449a05Ok3K47j03K25k83m9K21l05L13k71J87j35K33j60J45j0j21J28m1j80j24
5471b05J13J33l8r3j43L0K06jL8n8j62J67j8K66j75J2O8p1j96o4L1J68M9J9k38
$$ plain form
5496 -162 -2 -259 -21 -56 180 13 -20 -55 54 174 -100 -23 -27 -19 57 -86 -79 -66 -4 -250 151 29 151 48
5520 48 -94 -114 -227 264 -118 -26 -79 60 20 132 17 -167 -2 55 -52 244 76 -75 -3 -48 -3 32 -58 -30
5544 -30 -139 96 -10 72 -296 277 10 -9 167 -168 8 -256 -85 8 -246 122 -189 -264 102 144 52 -158
5566 -158 7 -118 -10 -166 22 44 178 -163 -124 -93 -46 -112 106 149 21 -53 -95 -216 145 -78 150 -13 -94
5589 -94 -123 -279 60 -86 28 186 154 170 -95 -200 -127 -95 44 -81 -294 -3 28 -257 -216 68 193 -11 20
5612 20 -329 -213 -204 -48 -329 -69 179 -109 134 -114 -128 -238 223 -283 19 -65 1 -49 -181 327 7 44 11
5635 11 170 -124 24 107 136 75 115 45 -19 155 68 -230 -7 -290 219 44 -101 -304 -5 -28 17 -21 215 36
5659 36 119 -13 -210 92 -10 47 157 10 -4 61 -95 84 173 -66 73 -161 76 17 -102 45 95 66 -78
$$ packed form
5496a62J60k57K38l5K36j67l3l5J09J20k74P7mQP6j43PJ3O2k46M01j22J22j03
5520D8j42k0j13M91l82R2n3J39m0J12j15j84J65N7j07K96j68j51P2m5M5L5r0K8
5544c0j09K35j06Q2l68N73k67j9J76l35J76k64J71R3k54L68l11p5L66M2r2k10
5566a58J65j25J08j56J88K2J34l41L9L1M7o6K18M3j28p4m2j21L61k23K28j63q1
5589i4k9j56L39j46J14J58l2J6k65j05P3L2J39j25k13K91L1k85M1K84J25k04L1
5612B0l49J16RJ56k81K60K48k88K43k48j4j10M61n06L02q4O6n0j32N08l20L7l3
5635A1J59k94J48Q3K9o1M0p0o4J74q7k98K23k83N09j75j45k03K99k3M5l8K36j79
5659C6Q3j32j97L02j02N7J10j47j4O5j56J79Q9k39J39k34K37n9j19J47N0k9j44
$$ plain form
5682 -78 179 342 65 -148 -284 -16 -1 -119 -195 -36 -128 -56 112 -70 -72 131 -46 -31 -140 10 80 202 63
5705 63 194 111 -3 18 -198 12 -388 258 -77 11 194 -60 9 8 -57 13 -7 -29 44 121 222 -172 -18 -78 -49
5730 -49 284 -184 -82 2 -68 9 49 493 14 -91 166 -127 -89 201 -20 -8 203 136 29 -9 -38 74 -43
5753 -43 345 3 48 -166 -100 45 -19 -100 132 189 -9 10 5 -78 79 121 26 76 254 11 -227 101 136 -203 -182
5778 -182 18 -78 203 199 -54 -58 68 247 -259 20 -7 161 -264 135 -79 32 39 44 73 -219 -15 -97 118 -180
5802 -180 16 -190 83 -229 -15 -42 114 -86 77 -148 55 7 13 -90 -12 13 23 235 -4 -15 -8 285 -238
5825 -238 24 30 -62 49 -22 78 1 -62 93 -110 -223 162 -215 187 74 -44 136 -55 31 -49 58 8 198
5848 198 -46 -109 115 -102 -8 -23 296 -146 -16 -204 -92 175 -37 191 -80 -126 -156 268 46 -150 -102 -113
$$ packed form
5682g8K57J63k77k13j36K68J5j18p6J59r2P2J68j82kK03j77J5j09J50P0J22j39
5705F3J31q3j14K1k16K10m00O46l35Q8J83k54O9jo5P0k0k2P3P7J01l94J54o0K9
5730d9L33m68J02Q4p0P7M0M44m79j05K57k93L8K90k21J2K11o7j07l8k9J12j17
5753d3L88l42M5k14O6J45o4q1K32N7j98J9nq3J57M2r5N0J78k43k38L28L5l39K1
5778a82K00r6K81mk53mJ26J79n06K79k7J68m25L99k14J11PNK9k92K04q2K15k98
5802a80J96k06K73l12K14k7J56k00J63k25K03m8Oj03P8K5J0K12k39j1PK93n23
5825b38K62Or2J11p1J00p7o3J55k03j13L85l77M02j13j18J80j91Q6q0J07n0J90
5848A98k44o3K24k17R4j5L19m42J30j88J12K67k12K28k71m6l0M24k22j96M8j1
$$ plain form
5870 -113 -159 83 86 -350 82 152 256 215 146 216 -115 45 42 -15 218 83 41 98 115 -103 27 61 -11 -120 -10
5895 -10 277 138 -74 185 -46 -55 -54 -33 112 -52 -74 113 -77 87 -17 121 -68 52 -40 -183 129 -248 126
5918 126 -52 135 -185 210 -39 195 9 -163 -72 47 -54 45 138 54 22 20 -155 -89 -148 49 213 -50 176
5941 176 -24 290 -63 231 137 -5 -14 97 141 -17 -9 -159 48 -148 60 61 141 316 -176 387 81 252 -35
5964 -35 -32 -68 -151 131 -61 -63 -23 98 -22 6 -147 -108 -214 -45 14 87 179 0 277 -67 90 -79 -21 -66 -45
5989 -45 -5 -211 160 -136 5 -86 247 19 -130 76 -49 140 67 17 -89 -206 -48 -23 52 -44 -38 14 -59 -201
6013 -201 76 31 -2 -114 -5 -72 163 -27 -12 -63 -119 -150 40 -99 43 129 56 82 -275 117 -182 170 -74
6036 -74 -28 -203 104 -129 -19 193 38 80 -40 -143 -91 -346 89 -28 -52 -95 -184 122 -85 27 23 -217 -10
$$ packed form
5870a13m6K42Lm36M32P0J04m1o9P0l31J60ln7K33j35m2N7J7k18J30L4p2j09J10
5895a0K87j39k12K59k31rJK1J45j64k2J87j90J64j04J38j89J20r2j43L12l77L74
5918A26j78J87l20L95k49K34j86j72R1J19j01R9R3q4l2kj75O6n9J97J64k63K26
5941A76k00L14l53K94r4j42rJ11M4j58Qj50K07j96K08JQ0J75m92N63l06J71k87
5964c5Ll6q3K82j92kM0J21j20K8j53L9j06J69N9P3R2j79K77l44J57j69N8m5K1
5989d5M0k06L71k96J41r1L33k28j49K06j25J89p3n0j06j17J58K5P5r6ON2p3j42
6013b01K77m5l3j12J09o7K35j90J5n1n6l1J90j39J42Q6p3K6l57L92k99L52k44
6036g4M6j75L07k33J10K12j55M2j20j03N2k55M35j17k4m3q9L06k07J12mk40K07
$$ plain form
6059 -10 4 -279 -237 136 180 108 -49 137 75 121 -115 -3 -156 91 67 -213 88 -1 -158 208 410 236 21
6082 21 198 117 -49 -46 -38 -147 -194 -238 -52 -84 60 -134 -253 -23 -106 105 -51 27 152 119 -28 -84 -26 108 -122
6107 -122 -121 -78 116 147 94 5 41 -156 205 77 -4 -25 11 89 298 27 8 -55 22 197 158 90 75 -135 89 15
6133 15 -226 -103 -34 -7 -64 -56 -97 169 -194 23 132 102 -218 -216 243 106 -169 -269 211 -29 66 35 8 -176
6157 -176 -79 79 133 155 -38 -63 -179 -73 25 -94 49 153 63 24 204 110 109 -31 165 136 -156 -35 -237 -88
6181 -88 -38 191 59 -170 -322 -47 136 48 118 147 113 -249 20 -48 -63 26 -87 40 -6 -167 69 -108 -39 -69
6205 -69 17 68 46 -107 52 104 -36 78 65 307 -122 166 -36 222 192 -9 172 -168 -191 116 -173 175 -118
6228 -118 -170 -11 108 112 120 -271 -248 -3 -163 -81 60 201 -10 107 50 108 -72 -122 30 -60 60 -258 206 -65
$$ packed form
6059a0J4k83M2L73M4p2j57J86o2M6k36J12j53K47k4k80L01q9j57L66K02j74k15
6082B1J77q1j66LQj09m7m4J86l2J44j94j19K30q3K11j56P8J25l3j47n6N8J34k30
6107a22JM3J94L1n3q9L6j97L61j28q1k1L6P8K09k71j9o3P7J75l9o8j5k10K24p4
6133A5k41J23O9K7n7Qm1K66l63K17J09l0l20KM59j37k75j00M80k40R5l1k7j84
6157a76R7J58N4K2j93k5j16J06R8j19J43J04r0l9J80r4jj40J96k9k92J21k02J49
6181h8N0K29j32k29j52K75J83q8P0K9l4l62K69o8j5Q9j13J27m6j61K36j77O9l0
6205f9Q6N1k2j53J59N2j40J14j3K42m29K88k02K58l0k01J81l40k3L07k89L48k93
6228a18n2J59J19MQl91K3K45j60Q2J41J41k11J17n7N8j80n0J52r0J20l18M64k71
$$ plain form
6252 -65 -175 -86 161 -145 -190 -170 -1 -263 164 -48 72 -149 92 -189 88 107 -46 24 144 255 143 9
6274 9 -186 -198 271 -112 -71 64 -71 -53 48 -149 -286 -60 -221 106 -119 91 -178 54 -228 12 -149 69
6296 69 -93 -100 -3 5 100 -7 12 -54 -44 42 -84 -16 -43 6 -116 8 -60 -59 17 -159 45 -178 35 -148 14 84
6322 84 -98 169 -140 41 77 450 31 41 -168 62 35 38 29 -65 -164 169 92 -134 72 27 -65 64 -29 35 -17
6347 -17 13 -141 -45 45 -33 88 179 -126 96 -225 -119 -44 83 53 200 145 -63 -278 -63 -13 323 -142 237
6370 237 207 93 38 -171 173 307 40 -30 -23 -195 -87 -16 -22 -125 60 -33 18 21 45 -92 -179 156 92 -59 99
6395 99 111 18 337 198 -6 179 62 105 46 77 43 23 -71 116 -342 157 134 -86 33 -1 47 -65 190 17
6419 17 10 113 -57 -117 -56 43 26 -17 -121 50 -12 37 124 -142 115 -125 -191 -132 9 27 -39 209 143 -180 -85 -101
$$ packed form
6252f5j10Q9K47l06m5K0J69k62M27k12J20k21K41k81K77J9j53P0J20J11j12j34
6274Ij95j2M69l83M1J35j35J8J01j97j37K26j61L27k25K10k69K32k82K40j61K18
6296F9j62pR7QR5j07J9o6J0Q6j26O8k7M9j22J24o8JP6j76K04k23K13j83J62P0
6322H4j82K67l09J81L6L73m19J0k09K30k7Lrr4r9L33p7k26K06m5r2J29r3O4n2
6347a7L0j54R6R0p8J21R1l05K22l21J06P5J27l0J47n5k08k15K15N0L36m65L79
6370B37l0j14n5k09L44J34k67p0Pj72J08P1oj03J85r3N1LK4j37q7L35o4j51J58
6395I9J2r3L19j39k04J85j17M3n9L1l4k0r4J87m58M99k3k20J19l4M8j12K55j73
6419A7pJ03j70o0O1R9j7m3j04J71o2M9Q7k66K57k40o6N9J41J8o6K48o6l23R5j6
$$ plain form
6445 -101 -1 -16 -235 -13 225 -112 96 46 -272 -63 46 1 50 -315 136 54 -158 -143 -69 330 -177 97
6467 97 142 -7 320 46 71 24 57 -75 -157 -205 157 92 -51 -135 -7 134 -227 -26 53 -69 -125 -132 56 169
6491 169 57 -72 118 212 243 227 -346 68 -42 -3 51 92 -73 193 -207 -230 -29 -197 -381 -62 211 161 3
6514 3 -10 91 16 -94 -252 55 27 -7 163 -128 -81 93 -23 217 149 27 202 -37 -27 32 -40 -124 243 -64
6538 -64 -62 -169 68 -47 -78 123 -156 190 4 -94 -63 -299 29 52 232 -173 54 84 94 -17 -67 -8 -7 -110
6562 -110 -62 -89 73 115 -22 254 25 213 -55 44 117 -190 -24 -147 341 155 68 -7 24 233 -59 -40 64
6585 64 -34 44 1 -203 -120 -144 -54 105 -37 -86 29 17 -71 60 -246 -111 -19 -9 -27 39 248 43 96 -53 149
6610 149 -30 -149 -25 31 -25 28 160 -89 -28 99 101 115 -230 -166 -98 -4 85 183 -160 -285 44 -40 -5 95 -120
$$ packed form
6445a01J00j5k19K22K38l37K08n0l18K09J09m5M9l65M51q2k12J5P4L99n07K74
6467I7M5j49L27k74K5m7L3j32q2m8L62o5j43q4J28J41l61K01P9j22n6pJ88J13
6491A69j12j29J90R4L1j6n73M14j10L9N4M1j65K66m00k3K01j68j84L19K73n0j58
6514Cj3J01p5j10j58L07k8l4J70k91M7J74j16K40o8j22J75k39J0N9p2q4L67l07
6538f4Kj07K37j15l1K01k79L46j86r8L1k36L28K3J80m05K27L0J0j11n0N9Jj03
6562a10M8k7J62M2j37K76k29J88k68R9P3l07J66j23M88j86q7p5L1K09k92J9J04
6585F4r8P8m3k04Q3k4R0J59j42m9J15j2q8J31l06J35R2J0j8O6K09k05N3j49K02
6610A49j79j19J24N6n6N3J32k49O1J27KJ4l45O4O8R4Q9R8l43j25L29q4L5J00k15
$$ plain form
6635 -120 256 257 -105 -105 12 -67 -20 191 -16 -149 -132 -91 -89 -190 16 43 196 -133 141 -10 -68 144 -472 54
6659 54 -313 71 -48 56 23 24 84 -265 -130 -164 -41 -112 -44 2 -43 -55 163 100 146 -57 -92 124 127 -29 4 -57
6685 -57 43 93 273 -184 70 -64 247 -215 73 85 44 39 -20 93 73 -156 205 103 -10 92 -162 -207 91
6708 91 143 -123 340 -28 -15 -28 -40 66 -157 -8 -18 -33 -134 -86 -18 -152 45 -89 -154 73 -17 -44 158 45
6732 45 161 -159 -95 -77 -178 -113 -86 10 111 101 198 286 -202 -189 420 -59 -302 -226 73 -104 -160 142 -199 -78
6756 -78 133 135 77 165 -65 122 -13 166 135 75 -2 -126 -25 -221 -136 -22 27 160 -91 223 62 -174 -170 -38
6780 -38 -70 94 -106 -33 -144 -257 159 -88 59 114 -45 -83 -304 125 117 98 11 -48 -86 -23 -260 -52 72 18
6804 18 -11 -51 248 278 53 -25 129 -196 -151 -42 20 -161 -150 -52 -90 268 27 -23 48 -89 -120 44 164 -290
$$ packed form
6635a20L76Jl62%J17p9M7K11k07j33J7M1Kj01K06K7J53l29K74j51n8K12o16N26
6659E4l67L84j19J04l3JO0l49J35l4J23p1O8M6m5j2K18o3M6k03l5K16Lj56L3o1
6685e7J00N0J80m57K54j34L11m62K88J2m1nn9J13k0k29L61j02j13J02k54m5K98
6708I1N2k66M63l68J3j3j2J06k23J49j0j5j01M8O8j34J97j34o5K27r0k7K02j13
6732D5J16l20O4J8j01O5K7R6J01j0R7Q8m88J3O09m79k43P6K99j77n6L02l41J21
6756g8K11Kn8Q8k30J87j35J79l1o0p7j24J01j96Q5J14M9J33k51L14j61k36MJ32
6780c8l2J64k00P3j11j13M16k47J47N5j59l8k21M29qj9q7n9l8O3k37K08J24n4
6804A8k9m0K99L0k25p8J54l25M5J09O2j81J1R8l8L58k41n0P1j37l1J64J20m54
$$ plain form
6828 -290 0 132 13 -22 -246 102 44 65 110 -92 -192 -210 27 13 -200 -42 3 46 133 -28 -18 -82 -41 218
6852 218 -80 3 -24 -304 87 -186 60 -19 -114 20 -116 -113 27 -138 160 42 86 -56 173 -114 128 -159
6874 -159 63 74 -78 113 88 -78 -4 -87 -129 33 -92 128 -122 61 -44 -75 -111 94 -104 96 -58 -12 190
6897 190 -281 -108 -53 65 -137 125 -18 119 -24 -347 62 -200 -132 46 -42 130 4 -7 138 181 -27 18
6919 18 18 92 101 -97 166 1 -48 -45 -192 162 -23 26 -31 15 78 22 254 -116 -169 89 -27 -112 -99 -108 -179 -78 -95
6946 -95 1 78 1 -181 -62 -110 -225 133 -159 229 10 -6 19 -27 115 -284 -129 -15 185 -112 9 42 28
6969 28 -36 -44 44 -107 -215 -114 270 -122 230 -104 -47 -31 -169 87 -64 -125 199 -74 -200 130 181 108 8
6992 8 -41 -227 168 223 -155 53 -118 -85 -20 -33 -114 163 -53 93 -23 88 230 -294 -111 -111 29 16 -96 -184
$$ packed form
6828b90K90J32j19l5k24L48n8K1M5k02j00j8K37j4k13J58M5M3Q7j61J0o4M1K59
6852B18k98Q3k7k80L91k73K46p9r5J34j36LJ40j65K98j18M4j42K29k87K42k87
6874a59K22J1j52J91k5j66P4q3m2J62j25K20k50J83j05l1l6K05j98K00j54M6K02
6897A90m71J73N5J18k02K62j43J37j43l23M09k62O8J78q8J72j26j1J45M3k08M5
6919A8%P4Rj98K63j65m9Lj47L54j85M9n7M6O3n6K32l70n3K58j16q5J3rp1J01j7
6946i5R6P7p7j82J19m8j15L58k92L88k19j6K5m6J42l99J55J14K00k97J21L3j4
6969B8o4qQ8j51j08J01L84l92L52l34N7J6j38K56j51o1L24k73j26L30N1p3j00
6992Hm9j86L95N5l78K08j71L3O5j3q1K77k16J46j16J11J42n24J83%J40j3j12q8
$$ plain form
7016 -184 -228 11 -82 -80 -334 1 -21 -122 116 -31 18 -159 51 -142 -113 -21 12 -208 50 -210 21 16 -8 80
7040 80 163 146 25 149 -72 69 -121 -44 -308 17 110 -179 11 -51 129 -90 100 237 -18 -152 -145 -107 -88
7063 -88 73 26 -10 -48 76 -16 165 -45 -21 -8 -1 163 47 16 -98 -54 -34 18 -75 179 -259 -152 -148 -357 -314 -51
7089 -51 -181 -140 20 36 -40 190 19 -31 -186 -35 81 -64 49 207 223 -105 62 399 -30 59 -88 -6 2
7112 2 -357 69 -212 -209 43 277 98 -380 192 -75 -287 149 121 -125 -52 55 51 0 -97 -95 63 342 68 -113
7136 -113 -73 54 66 -200 -30 131 22 244 188 82 103 52 50 164 41 -69 34 123 -326 -27 63 -87 -96 -140
7160 -140 -100 -149 -2 -86 -124 256 74 -226 -81 -98 -102 -84 11 -62 4 164 -190 -163 121 57 241 22 270 98
7184 98 -237 -152 -122 -28 -231 141 41 43 -55 24 -10 -98 -253 101 -44 51 -241 88 -157 -193 111 150 -163 89
$$ packed form
7016a84m4K39r3Kk54L35k2j01K38j47M9j77K10j93K9R2L3k20K58k60K31nk4Q8
7040H0Q3j7j21J24k21J41j90P7k64L25R3k89J90o2J80k19J90J37k55j34PL8J9
7063h8J61m7l6l8J24r2J81k10K4J3PJ64j16l1j14M4K0N2r3K54m38J07Mk09M3K63
7089e1j30M1J60J6p6K30j71n0j55J51J16j45J13J58J6l28J67L37m29Q9j47Q2Q
7112Bl59M26k81LK52K34j79m78N72k67k12M36k8k46P3J07mn1r7KJ58K79k74j81
7136a13M0J27J2k66J70J61j09K22n6j06K1n1kJ14j23j10J03Q9m49K99R0j50rm4
7160a40M0m9J47q4l8L80j82l00J45j7mJ8R5p3O6J60l54K7K84o4J84k19K48j72
7184I8l35Q5L0R4k03L72j00Kr8P9l4q8j55L54j45R5k92L29k45l6L04L9l13K52
$$ plain form
7208 89 79 12 -134 -167 49 -53 123 -154 -112 -59 53 10 -48 71 -116 130 -2 -143 61 -224 -201 -200 -93 135
7232 135 -48 76 169 -109 -106 16 15 53 -19 227 43 -116 -156 156 -57 -82 -238 5 49 -168 133 -90 -72 257
7256 257 64 131 -154 -250 169 -180 -19 324 -69 -31 281 95 69 -29 -55 -86 -262 -180 -46 83 77 -161 -257 -207
7280 -207 186 -164 130 -229 -173 -37 -4 95 141 52 -10 23 -47 161 97 -52 -14 -232 -134 -80 -142 -229 93 9 200
7305 200 -174 -57 -96 -135 -96 -18 100 -7 -147 -81 -53 -46 1 24 -119 -96 197 -30 -124 156 6 -137 39 25
7329 25 -238 -1 6 -81 11 -28 -131 -79 107 -120 -4 113 55 -92 -67 -184 156 -129 -79 53 -114 -38 -105 -104 -5
7354 -5 207 -41 -151 19 133 4 -179 -137 46 155 -58 128 -129 -36 62 -108 158 -69 93 -108 -157 -74
7376 -74 -61 -65 -15 122 -172 211 -108 -2 106 110 -105 -24 -168 93 -131 243 89 -34 102 269 -129 -154 130
$$ packed form
7208H9j0o7j46l3K16j02J76k77M2N3J12m3n8J19j87K46j32j41K04k85K3JJ07K28
7232A35j83J24R3k78LJ22jL8p2K46j84j59m0L12k13k5j56K43M4k17L01k23J8L29
7256B57j93O7k85r6M19l49J61L43l93L8L12j86k6r8k6l1j76Q2J34J29ok38r6N0
7280b07L93l50K94l59N6J36L3R9M6q9o2L3p0K08o4j49L8k18R8N4o2q7L22q4J91
7305B00l74J17l9l9L9P8J18j07j40O6K8PM7K3j43K3K93k27r4K80j50j43J76j4
7329B5k63K37Pq7R2l9j03N2J86k27J16J17n8j47K5j17L40k85N0J32j67P6o7JR9
7354eK12k48j10J70J14j29j83M2J83J09k13J86k57R3R8j70K66k27J62k01m9Q3
7376g4J3mN0J37k94L83l19J06J08Mk15Q1j44K61k24L74j54j23J36J67l98k5K84
$$ plain form
7399 130 -47 92 47 -22 89 22 -253 138 112 10 -194 104 101 91 -59 37 -59 -66 -14 69 -66 -192 99 -110
7423 -110 -66 -35 102 60 476 -23 -45 -32 -33 13 172 137 -127 23 -165 -228 48 -24 368 73 102 4 -55 -107 -42
7448 -42 180 -71 -96 -282 144 -50 -185 -57 -210 -355 24 96 116 -84 30 51 -37 123 73 -100 0 -30 72
7471 72 -290 133 164 -323 -128 -87 141 -39 167 -212 -350 24 -151 -52 -229 234 26 -6 188 -21 -71 -2
7493 -2 47 -68 11 18 128 46 -122 -48 -167 -1 -145 -159 -65 -167 32 146 -82 95 -116 157 160 -126 -138 56
7517 56 35 50 -219 218 -228 -122 44 185 -196 -25 32 52 -52 -132 63 21 -64 -20 14 -9 -56 164 108 -72
7541 -72 -9 2 4 50 43 -199 -59 139 -135 92 -43 -19 -74 -322 2 -74 -66 -15 1 236 -68 -122 216 93 292
7566 292 114 145 14 -394 74 66 380 343 -134 -187 -52 -52 263 135 59 43 -126 -18 -4 -201 105 -2 128
$$ packed form
7399A30j77J39m5o9J11o7k75L91k6j02k04K98lj0j50R6r6pN2Q3j35j26K91k09
7423a10M4L1J37m2M16m99k2J3jM6J59l5k64J50j88o3K76p2L92k95K9r8n9n2O5
7448d2K22k51k5j86M26j94j35J28j53j45L79P2K0k00J14K1q8J60n0j73J00l0J02
7471G2l62M23L1m87J95M1K28j80K06l79j38L74j75R9j77M63k08l2J94k09n0O9
7493bM9j15P9PJ10q2j68P4j19J66j44j4R4j02J99J14k28J77k11K73Lk86j2J94
7517E6k1J5k69M37m46J06J66J41l81J71N7K0j04q0J95m2q5M4L4k3m7K20n6j80
7541g2O3J1KM6pk42J40J98k74K27j35K4n5k48L24p6QN1J6K35l04n4L38j23J99
7566B92j78L1j31m08M68qL14l7m77n3J35%L15j28p6j6j69J08J4j97L06j07J30
$$ plain form
7589 128 -103 15 -95 -306 197 62 -248 -80 163 -49 -99 -51 133 -59 -35 -197 25 48 -50 60 -30 25
7611 25 106 245 157 -169 -34 146 -105 76 85 -72 35 -64 -96 108 29 17 56 -55 37 -86 -79 -70 118 -78 45
7636 45 161 130 203 158 21 27 108 -100 63 -45 -150 -55 77 230 297 -51 222 19 -65 77 -64 37 174
7659 174 -130 -264 -106 -79 -259 177 -234 61 18 188 155 79 -2 165 -213 6 49 140 98 -33 -122 3 -81
7682 -81 142 83 -184 -138 -258 38 -213 -257 41 -99 -17 -57 -68 130 209 -83 67 -257 -60 -89 -255 239 112
7705 112 -88 129 56 -3 -75 198 46 83 -162 -205 -66 -20 -68 -61 24 15 -73 61 -75 -11 6 -217 -73 -44 157
7730 157 50 55 221 -19 53 66 90 -48 -29 177 -20 34 -121 46 43 -31 74 71 -280 54 -180 -122 180 -110
7754 -110 -176 -9 24 -46 -164 -25 -41 -144 156 -69 103 -76 176 -50 6 -26 -71 -55 -108 -96 -89 -61 -38 -144 176
$$ packed form
7589A28k31J18j10k11N03j35l10J68K43k12n0M8J84j92K4j62K22K3r8J10r0N5
7611B5Q1J39q8l26J35J80k51J81Rj57J07r9l2K04p9j2L9j11R2j23PRJ88j96J23
7636D5J16l1P3m5j37OQ1k08J63j08j05R5J32J53O7l48K73k03q4J42j41J01J37
7659A74l04j34J58K7j80M36m11K95m3J70l3p6q1J67l78K19M3R1m2j31q9J25q4
7682h1K23n9k67M6j20K96k51m4K98j40Q2m0j1J98P9k92J50l24J97k9j66M94j27
7705A12k00K17p3n9p2K73j52L7k45m3J39M6m8PQ5rq8J34j36O4J7k23J44K9K01
7730A57j07NJ66k40P2J3K4j38J9K06j97N4j55J67lp4J05ll51L34k34N8L02k90
7754a10o6J67L3p0j18J39j6j03L00k25J72j79K52k26N6l2m5J6n3J2PK8K3j06L20
$$ plain form
7779 176 29 248 -119 -115 194 -257 7 -232 -44 119 62 19 15 1 -180 124 -263 -147 62 42 -146 140 25
7802 25 217 165 32 -4 -158 72 -290 39 -335 -233 188 -140 -74 178 140 168 222 17 -224 -83 -22 -124 59
7825 59 -18 22 -67 -187 272 -308 -4 72 -146 -64 -43 13 113 164 -113 105 -181 112 -77 -66 -43 145 85 16
7849 16 -27 41 -89 -154 -55 32 31 -65 0 15 233 80 -18 207 -145 49 -48 46 -59 -196 271 177 253 54 -3 -58
7875 -58 31 29 84 107 -2 -166 -60 114 29 -11 149 -23 -11 -93 -12 -8 -164 -89 66 -14 -331 27 -81 50 -67
7900 -67 96 -96 -7 -215 -9 219 303 -41 28 85 -311 13 399 55 12 99 120 -10 55 -84 -96 -21 -31 54
7924 54 -111 -128 1 20 42 -35 56 -120 -226 -81 -83 -135 43 -5 177 -15 -154 127 -45 373 -62 45 -97
7947 -97 -137 -25 90 37 111 -110 140 -124 113 22 61 136 -65 -166 -134 16 -136 -152 -31 19 -65 -49 -28 -117 -61
$$ packed form
7779A76j47K19l67ML09m51K64k39J88J63n7m3mj4j81L04l87J16K09k0j88K86j15
7802B5J92n2j33l6j54K30l62L29l74J02M21l28O6K52l8K8N4k05k41J41O1j02J83
7825E9p7M0q9j20M59n80L04P6k18Q2K1N6J00N1k77K18k86K93j89J1K3J88o0o9
7849A6m3O8j30o5R9Q7jr6O5J5K18j53r8K25l52J94r7R4j05j37M67r4P6j99n7n5
7875e8Q9kN5K3j09j64J06J74q5m0J60j72J2q2Q1Mj56P5J55q0l17L58j08J31j17
7900f7J63j92Q9k08K06K28Q4l44O9N7l96L24L86l44m3Q7K1j30O5j39j2P5j0Q5
7924E4j65j7J29J9K2p7R1j76j06J45kn2J78m8J82j92j39K81j72M18m35J07j42
7947i7m0J12J15n3P4k21K50k64K37r1L9P5k01j01L2J50j52j6J21N0q4J6K1q9N6
$$ plain form
7972 -61 -46 162 80 -25 -32 -90 81 -28 -133 -219 -2 24 24 -39 -128 64 -32 9 100 -6 -128 85 -34 -60 -32 -13
7998 -13 -2 -153 -51 -149 155 189 17 45 219 145 -57 215 -242 -182 75 -30 -271 89 -3 195 97 -145 183
8021 183 135 100 82 82 -55 86 75 10 105 -41 124 123 -22 30 -15 81 119 -313 134 31 107 -336 32 126 -23
8046 -23 160 -119 13 -59 254 124 39 -78 14 226 98 69 -161 -119 198 -72 -27 112 44 -36 -252 89 79
8069 79 -176 -138 -60 -155 155 256 -134 192 14 -76 7 2 -178 5 -92 -212 -74 -61 321 179 63 221 -57
8092 -57 85 -48 -82 -60 64 -55 -20 -156 -3 91 -232 122 -125 -164 -114 -247 169 -32 97 60 -189 80 -145
8115 -145 -158 -302 3 225 0 -49 -131 214 -143 241 119 -51 125 -77 122 136 112 102 79 -17 121 -51 12
8138 12 -128 5 6 61 -56 -17 160 117 84 -223 -121 -92 26 -110 26 -3 99 -48 51 55 73 25 -85 -99 57
$$ packed form
7972f1J5K08q2j05pn8J71j09j05q6K17K6%o3q9J92r6M1R1j06j22K13j19k6K8J9
7998a3J1j51J02r8L04L4j72K8J74p4k02K72m57O0K57j05k41L60r2J98r8k42L28
8021A83m8l5j8%j37J41j1o5R5j46J65jj45N2m5R6L8m32M47j03P6m43L68R4j49
8046b3J83k79J32p2L13j30q5j17R2K12j28k9k30M2L17k70M5J39o8q0k16L41j0
8069G9k55L8P8r5L10J01l90L26j78r0Q3nj80J83r7j20J38J3L82j42j16J58k78
8092e7J42j33l4K2J24j19L5j36J53R4l23L54k47l9N0j33M16k01J29l7k49K69k25
8115a45j3j44L05K22k25m9q2L45l57L84j22j70J76k02J99J4k4j0k3r6J38j72O3
8138A2j40J33JN5j17L9J77m3l3l07J02K9J18j36J36k9J02j47R9MJ8m8j10j4J56
$$ plain form
8163 57 13 -9 -15 -60 86 -76 179 174 48 -141 -116 -110 50 201 -90 48 -104 79 -12 -236 62 -46 -68 104
8187 104 -151 68 -224 -220
$$ packed form
8163E7m4k2om5J46j62K55nj26j89K5OJ60J51k91J38j52J83r1k24K98j08k2J72
8187A04k55K19k92M
8191b20
$$ Imaginary data points
##PAGE= N=2
##DATA TABLE= (X++(I..I)), XYDATA
$$ plain form
0 0 0 0 0 0 0 0 0 0 -2 8 -8 8 -8 16 -16 24 -32 34 -40 56 -64 72 -88 104 -120 144 -168 192 -221 254 -288
31 -288 328 -373 421 -475 534 -598 670 -749 835 -927 1028 -1140 1261 -1394 1539 -1698 1870
48 1870 -2059 2268 -2497 2751 -3031 3346 -3698 4094 -4548 5069 -5677 6395 -7261 8323
62 8323 -9666 11422 -13819 17297 -22793 32781 -56527 222115 128812 -226863 219093 -63268
74 -63268 44367 85670 -32721 130535 -32788 -63607 128445 -46196 -18792 58173 -6202
85 -6202 -78032 -17319 71163 -59754 -48947 -47488 17744 43007 -132664 39541 -30541 -70583
97 -70583 69281 -38243 2677 -3716 -44507 22586 -21993 59618 28418 -62765 37136 -50295
109 -50295 63708 78868 -87078 39134 -10901 35172 1193 -34768 95541 -54795 -13666
$$ packed form
0@%%%%%%%%kJ0j6J6j6K4l2M0n6O6p4R6j20J36j60J92k24K64l12L60m13M75n42
31b88O16p01P94q96J009j132J268j419J584j762J955k168K401k655K933l237L568
48A870l929M327m765N248n782O377p044P792q642R617j0746J2072j3656J5584
62H323j7989K1088k5241L1116m0090N5574q9308K78642r3303l55675M45956k82361
74f3268J07635M1303j18391J63256j63323l0819J92052j74641K7404P6965o4375
85f202p1830O0713Q8482j30917J0807J459O5232K5263j75671J72205p0082m0042
97g0583J39864j07524M0920o393m0791O7093m4579Q1611l1200r1183R9901q7431
109e0295J14003J5160j65946J26212n0035M6073l3979l5961J30309j50336M1129
$$ plain form
120 -13666 38955 -17644 39153 -44630 6308 37347 -65000 77623 -8776 -90259 37268
131 37268 18556 40863 -81136 -2022 51070 -90726 36134 10284 2375 -25226 -67746 67827
143 67827 -46106 -11008 94467 -115905 -10418 65043 -40526 53685 -51701 5907 69362
154 69362 -63389 29773 48100 -21155 -7052 55061 -11426 3057 66718 -62994 12609 49263
166 49263 -16598 52732 -58730 -27778 80878 -70843 43260 13186 -95208 67178 -51789
177 -51789 -12623 37438 -35814 9743 -66885 11916 34277 -33424 7222 -32588 6784 17499
189 17499 -26432 38691 -38848 -4496 61007 -50209 24300 8023 -106 2186 -28926 77640
201 77640 -18892 -30747 22217 -19285 29024 13584 -5045 -16083 -26360 38848 407 -21580
$$ packed form
120a3666N2621n6599N6797q3783N0938L1039j02347J42623q6399q1483J27527
131C7268j8712K2307j21999P9114N3092j41796J26860k5850p909k7601m2520J35573
143F7827j13933L5098J05475k10372J05487P5461j05569R4211j05386N7608O3455
154F9362j32751R3162J8327o9255J4103O2113o6487J4483O3661j29712P5603L6654
166D9263o5861O9330j11462L0952J08656j51721J14103l0074j08394J62386j18967
177e1789L9166N0061p3252M5557p6628P8801K2361o7701M0646l9810L9372J0715
189A7499m3931O5123p7539L4352O5503j11216P4509j6277q129K292l1112J06566
201G7640r6532j1855N2964m1502M8309j5440j8629j1038j0277O5208l8441k1987
$$ plain form
213 -21580 24773 -19071 -1836 -25081 21567 33885 -56256 29299 -25221 -4716 45412 -37900
225 -37900 12985 -20692 6137 46860 -48685 1982 30769 -26162 7257 14869 13847 -25967
237 -25967 -242 23888 -36999 62357 -11856 -36571 26947 -41258 73760 -14102 -57057 72491
249 72491 -49255 -8020 53526 -44699 24071 -6872 -30341 36221 -26313 20577 1612 -41420
261 -41420 14018 23170 -1044 -41754 23191 -3155 -14620 32507 -27582 -259 -447 -12370 24025
274 24025 -17312 12229 9880 -52641 28083 15608 -1445 2967 -35301 29730 -16524 13771
286 13771 20779 -42410 26961 -8530 870 8574 -11940 32730 -34435 -8865 48805 -28242 9511
299 9511 -5020 -16962 40014 -26069 26840 -13403 -37325 58987 -18538 -4974 13716 -8344
$$ packed form
213b1580M6353m3844J7235k3245M6648J2318r0141Q5555n4520K0505N0128q3312
225c7900N0885l3677K6829M0723r5545N0667K8787n6931L3419P612j022l9814
237b5967K5725K4130o0887R9356p4213k4715O3518o8205J15018q7862m2955J29548
249G2491j21746M1235O1546r8225O8770l0943k3469O6562o2534M6890j8965m3032
261d1420N5438R152k4214m0710O4945k6346j1465M7127o0089K7323j88j1923L6395
274B4025m1337K9541k349o2521Q0724j2475j7053M412l8268O5031m6254L0295
286A3771P008o3189O9371l5491R400P704k0514M4670o7165K5570N7670p7047L7753
299I511j4531j1942N6976o6083N2909m0243k3922R6312p7525J3564J8690k2060
$$ plain form
311 -8344 -939 -15378 24865 11573 -16646 -2928 -10429 12157 3289 939 11271 -51061 30045
324 30045 21522 -45662 32128 -16535 -3093 5517 -16355 27296 -15361 -11034 8787 -1493 5654
337 5654 7530 -1853 -26976 12821 36489 -31042 10227 2909 -26911 39185 -28031 16853 12367
350 12367 -49197 38389 -23351 -4988 35687 -35525 -9541 -698 7093 10233 -28177 8921 -2590
363 -2590 -12062 22620 -14640 8148 -10408 5992 19855 -28764 40815 -5304 -24540 26256
375 26256 3521 22021 -11756 -11416 23250 -12308 14232 17411 -26454 5156 213 3433 -2327
388 -2327 -4268 15076 -30064 -1320 5213 8747 -4234 -28982 24568 -18883 1655 26283 -37313
401 -37313 8929 9086 -10792 21093 -22876 11621 9331 -34485 38698 -4260 -9814 6319 -18631
$$ packed form
311h344P405j4439M0243j3292k8219J3718p501K2586q868k350J0332o2332Q1106
324C0045q523o7184P7790m8663J3442Q610k1872M3651m2657M327J9821j0280P147
337E654J876r383k5123L9797K3668o7531M1269p318k9820O6096o7216M4884m486
350A2367o1564Q7586o1740J8363M0675p1212K5984Q843P791L140l8410L7098j1511
363b590r472L4682l7260K2788j8556J6400J3863m8619O9579m6119j9236N0796
375B6256k2735J8500l3777L40L4666l5558K6540L179m3865L1610m943L220n760
388b327j941J9344m5140K8744O533L534j2981k4748N3550m3451K0538K4628o3596
401c7313M6242J57j9878L1885m3969L4497k290m3816P3183m2958n554J6133k4950
$$ plain form
414 -18631 17917 -5635 14557 -9009 -25983 23701 -5231 1886 2358 -13163 14440 -18559 2579
427 2579 28591 -29860 13016 233 -15070 23613 -5294 4815 -17753 3212 20338 -12222
439 -12222 -149 -6449 5411 -6316 -3464 20050 -21182 -6335 14090 -21163 15612 4750
451 4750 -10940 1678 -22811 33661 670 -16696 18684 -14039 11960 3312 7375 8072 -14995
464 -14995 18259 -335 -5122 21607 -8319 -1983 -4562 2648 24734 -31042 6396 2345 -20868
477 -20868 25890 -18698 -1606 -6168 -14893 20219 -19952 832 11690 -25912 -188 8950 2207
490 2207 1285 -13400 6841 -5414 6728 13546 -14313 5467 -7040 15569 -1021 -11314 25007
503 25007 -20133 -954 14260 -4830 7134 -11498 -1269 7055 -7250 16601 -9063 -15408
$$ packed form
414a8631L6548k3552K0192k3566j6974M9684k8932P117M72j5521K7603l2999K1138
427B579K6012n8451M2876j2783j5303L8683k8907J0109k2568K0965J7126l2560
439a2222J2073o300J1860j1727K852K3514m1232J4847K0425l5253L6775j0862
451D750j5690J2618k4489N6472l2991j7366L5380l2723K5999q648M063O97k3067
464a4995L3254j8594m787K6729k9926O336k579P210K2086n5776L7438m051k3213
477b0868M6758m4588J7092m562q725L5112m0171K0784J0858l7602K5724R138o743
490B207r22j4685K0241j2255J2142O818k7859J9780j2507K2609j6590j0293L6321
503B5007m5140J9179J5214j9090J1964j8632J0229Q324j4305K3851k5664o345
$$ plain form
515 -15408 12152 -2310 11220 -14360 6174 6505 -25156 26969 -3845 -3766 7479 -17012 14667
528 14667 -3131 3035 15129 -27690 7024 17162 -13233 9560 -8521 4134 -1149 -6539 19933
541 19933 -15914 2260 261 -3949 8798 -4977 11233 -15230 -7385 21782 -6553 -1156 629
554 629 -9295 9893 -6758 8426 3738 -19933 14919 -8770 338 8460 -5234 -660 -16425
567 -16425 15279 1946 -9959 5370 -11171 4094 1863 -1930 7581 -18857 7211 10783 -20966
580 -20966 20813 -6097 -9423 6613 -8937 22566 -12814 -5153 10238 -13245 12355 5242 -3567
593 -3567 -3681 -4315 14643 -4583 -3603 15020 -13655 1665 3170 4017 9896 -19627 13068 -2820
607 -2820 -5264 18425 -10704 -2100 -2419 5658 6075 -10088 5750 -1179 -8201 7217 510 2553
$$ packed form
515a5408K7560j4462J3530k5580K0534L31l1661N2125l0814P9J1245k4491L1679
528A4667j7798O166J2094m2819L4714J0138l0395K2793j8081J2655n283n390K6472
541A9933l5847J8174j999m210J2747j3775J6210k6463P845K9167k8335N397J785
554F29r924J9188j6651J5184m688k3671L4852k3689R108Q122j3694M574j5765
567a6425L1704j3333j1905J5329j6541J5265k231l793R511k6438K6068L572l1749
580b0966M1779k6910l326J6036j5550L1503l5380P661J5391k3483K5600p113q809
593c567j14o34J8958j9226R80J8623k8675J5320J505Q47N879k9523L2695j5888
607b820k444K3689k9129Q604l19Q077M17j6163J5838o929p022J5418o707K043
$$ plain form
621 2553 -6836 -5540 8801 -11327 15575 -3590 -15747 11185 -8700 12289 -5075 -6637 10102
634 10102 -15184 8388 7713 -10734 5714 -5182 -1205 4380 -2781 12098 -17261 -1420 13704
647 13704 -8872 7732 -10930 4209 -1524 -8154 19972 -12856 -5753 8247 -7397 3257 1364
660 1364 2003 -791 -15515 13578 5934 -8388 5004 -5651 5795 -5090 9141 5786 -15651
673 -15651 11865 -2225 2351 4862 -3210 7678 -10233 2407 15344 -9501 1642 174 -4894
686 -4894 10315 -5438 6721 -7961 -6254 12856 -11391 8196 -3066 -6460 1749 -7525 11676
699 11676 -4806 -6421 5379 -11268 5350 7682 -8794 2276 -8615 7937 2627 -11058 15574
712 15574 -11526 -1896 7067 -908 6488 -9868 5769 342 -5739 11584 -822 -7175 -1295 3007
$$ packed form
621B553r389J296J4341k0128K6902j9165j2157K6932j9885K0989j7364j562J6739
634A0102k5286K3572o75j8447J6448j0896L977N585p161J4879k9359J5841J5124
647A3704k2576J6604j8662J5139n733o630K8126l2828P103J4000j5644J0654j893
660A364O39k794j4724K9093p644j4322J3392j0655J1446j0885J4231l355k1437
673a5651K7516j4090M576K511q072J0888j7911J2640J2937k4845J1143j468n068
686d894J5209j5753J2159j4682J707J9110k4247J9587j1262l394Q209r274J9201
699A1676j6482j615J1800j6647J6618K332j6476J1070j0891J6552n310j3685K6632
712A5574k7100R630Q963p975P396j6356J5637n427o081J7323j2406o353N880M302
$$ plain form
726 3007 8028 -9671 1646 5800 -14954 9073 379 275 -2471 -9077 10857 -9932 4340 5983
740 5983 -11102 -153 -555 6667 -1456 -7410 7354 -5400 -443 11085 -8243 6277 -4358
753 -4358 -66 11162 -8846 13515 -6037 -5244 12217 -2894 6862 -2355 -2025 3362 -2249 8424
767 8424 -333 -7274 6265 -4808 1971 1727 -2487 3571 -15926 8927 2426 -9260 5166 -8879
781 -8879 803 -3911 1967 4359 -14520 1663 4241 -6343 2948 -1244 -579 -3910 -4288 14603 -7095
796 -7095 -1122 4026 -5578 7549 -1964 9416 -4519 -6161 12483 -3360 3227 2637 -2673 3546
810 3546 -4612 6155 6268 -11397 6758 -3485 -2573 8546 -7328 3223 -9111 2427 5195
823 5195 -8961 6366 -6878 -3012 3188 -1924 4465 -5338 -1458 5198 -7041 8075 4051 -8826
$$ packed form
726C007N021j7699J1317M154k0754K4027q694j04k746o606J9934k0789J4272J643
740E983j7085J0949m02P222q123n954J4764j2754M957J1528j9328J4520j0635
753d358M292J1228k0008K2361j9552P93J7461j5111R756r217L30N387n611J0673
767H424q757o941J3539j1073O779k44m214O058j9497K4853o501j1686J4426j4045
781h879R682m714N878K392j8879J6183K578j0584R291m192O65l331l78J8891k1698
796g095N973N148r604J3127r513J1380j3935j642J8644j5843O587n90n310O219
810C546q158J0767J13j7665J8155j0243R12J1119j5874J0551j2334J1538K768
823E195j4156J5327j3244L866O200n112O389r803L880O656j2239J5116m024j2877
$$ plain form
837 -8826 4316 -1408 8194 -1811 -142 6666 -8597 6990 2383 2032 -1036 -4664 8292 -4869
851 -4869 -59 9090 -8760 -2758 2837 -787 4351 -9917 3709 -1414 -8835 11162 -6399 -1562
865 -1562 -3569 -1376 4369 -7871 6048 -2830 -8185 4883 -282 1184 -321 -5727 4685 -4312
879 -4312 3442 5716 -9723 6530 -3322 3158 3474 -3268 7380 -8528 4285 6603 -3576 3594
893 3594 -1330 -262 2572 1288 6193 -4944 -2975 7842 -4383 4276 -914 -279 -599 -6889 12359
908 12359 -5796 -3286 3120 -6372 2637 -1208 2298 -1293 -8658 5123 1888 -5142 4019 -3790
922 -3790 237 -2350 1534 7232 -11033 5715 -1010 -2335 7504 -3756 3943 -5039 -304 7878
936 7878 -4119 971 1230 -5103 3224 -129 2255 -1161 -5776 6166 -6641 3605 2473 -6834
$$ packed form
837h826J3142n724R602j0005J669O808j5263J5587m607l51l068l628J2956j3161
851d869M810R149j7850O002N595l624N138j4268J3626n123p421J9997j7561M837
865a562k007K193N745j2240J3919q878n355J3068n165J466j505n406J0412q997
879d312P754K274j5439J6253r852O480L16o742J0648j5908J2813K318j0179P170
893C594m924J068K834j284M905j1137J969J0817j2225Q659n190O35l20o290J9248
908A2359j8155K510O406r492R009l845L506l591p365J3781l235p030R161p809
922c790M027k587L884N698j8265J6748o725j325R839j1260P699q982M735Q182
936G878j1997N090K59o333Q327l353K384l416m615J1942j2807J0246j132r307
$$ plain form
950 -6834 2330 -5656 6331 -1494 -4532 4938 -6697 -45 5185 -2100 -496 -2050 1637 1854 -3578
965 -3578 8259 -4285 -3353 4550 -879 6716 -6333 3851 1565 -5245 8916 -403 -706 -770 -467
980 -467 5217 -3175 1313 4771 -8947 3558 2795 -1628 2384 -6762 5491 -4619 46 6494 -8673
995 -8673 1476 -1512 307 1224 -2777 2058 -4089 -1383 5041 -2873 702 -740 -3641 4864 -3975
1010 -3975 5624 -1576 -6691 7171 -3761 3276 -589 -778 357 -4565 6078 -265 -3951 2074
1024 2074 -2571 -586 1881 -373 2196 -8136 3055 4395 -6564 6007 -4494 -175 -551 -417
1038 -417 6681 -6561 1123 1308 -1950 3173 661 1149 -1807 -2585 8339 -1385 -1083 5312 -5424
1053 -5424 4415 -199 2863 1642 -6374 6876 -3117 917 3672 -3364 -134 -2409 2318 1584 -4378
$$ packed form
950f834R164p986J1987p825l038R470j1635O652N230p285J604j554L687K17n432
965c578J1837j2544R32P903n429P595j3049J0184k286o810J4161r319l03o4L03
980d67N684q392M488L458j3718J2505p63m423M012r146J2253j0110M665O448j5167
995h673J0149k988J819R17m001M835o147K706O424p914L575j442k901Q505q839
1010c975R599p200n115J3862j0932P037l865j89J135m922J0643o343l686O025
1024B074m645J985K467k254K569j0332J1191J340j0959J2571j0501M319l76J34
1038d17P098j3242P684J85l258N123k512M88k956p78J0924r724L02O395j0736
1053e424R839m614L062j221q016J3250r993M034K755p036L230k275M727p34n962
$$ plain form
1068 -4378 1424 -2112 -3715 4950 -2990 379 -3612 -1467 3970 -6053 5500 -2408 -3761 1616
1082 1616 -990 4328 -3971 589 2040 -4869 4608 3253 -4500 1676 -1624 2802 822 -2303 5993
1097 5993 -7016 2160 2952 -985 2303 -5300 3843 -2398 -441 5446 -3940 -1776 745 -356 2470
1112 2470 -3046 572 423 -6613 6714 -1663 -1826 573 -3289 3375 -3863 4786 -633 -5325 4268
1127 4268 -781 1735 1679 -1485 1848 -1046 2189 5629 -3943 2851 258 -237 4403 -1845 5003 -5212
1143 -5212 442 4639 -3486 2524 -2782 -654 -1874 -1730 3810 -4445 -4219 2070 -5135 -62 664 -3355
1159 -3355 -268 -6161 5304 -1571 -3064 4043 -5357 2520 351 1955 2292 -3777 3447 1728 -470
1174 -470 4203 284 -774 590 699 5261 -4339 1531 831 -4434 4814 -2268 1295 -3503 -1678 3861
$$ packed form
1068d378N802l536j603Q665p940L369l991K145N437j0023J1553p908j353N377
1082A616k606N318q299M560J451o909R477j355p753O176l300M426j980l125Q296
1097E993j3009R176P92l937L288p603R143o241J957N887r386K164K521j101K826
1112B470n516L618j49p036J3327q377j63K399l862O664p238Q649n419m692R593
1127D268n049K516n6l164L333k894L235L440r572O794k593m95M640o248O848j0215
1143e212N654M197q125O010n306K128j220J44N540q255K26O289p205N073P26m019
1159c355L087n893J1465o875j493P107r400P877k169J604L37o069P224j719k198
1174d70M673l919j058J364J09M562r600N870p00n265R248p082L563m798J825N539
$$ plain form
1190 3861 -4540 2213 260 -4230 683 494 999 381 -2805 2909 -2611 1123 4877 -3965 2473 -2639
1206 -2639 3167 1432 -2839 5483 -4316 -161 2903 -94 922 -2440 548 425 -2389 4177 -1048
1221 -1048 -4035 2755 -1944 3344 -1903 208 2140 -5722 5208 -672 -1046 395 -2575 2071 -1875
1236 -1875 1018 1456 -4917 -15 1601 -1910 1606 -3077 610 -1923 -1665 5182 -5270 1067 -270
1251 -270 -1339 2667 -1228 3344 -3048 -433 4259 -824 1460 1358 -1378 1887 -236 3231 1055
1266 1055 -4484 4512 -2241 966 1573 -1876 1750 -4804 3354 1028 -2805 1652 -1962 -364 295
1281 295 783 1322 -3718 -110 3128 -3357 3707 -576 -1677 1252 -1520 5318 -3130 750 1081 -3200
1297 -3200 3080 -155 445 -1303 -1833 2298 -875 -976 2313 -4109 426 102 -375 1699 -4969 3127
$$ packed form
1190C861q401O753j953m490M913j89N05o18l186N714n520L734L754q842O438n112
1206b639N806j735m271Q322r799M155L064k997J016l362K988j23k814O566n225
1221a048k987O790m699N288n247K111J932p862J0930n880l74J441k970M646l946
1236a875K893M38o373M902J616l511L516m683L687k533K58O847j0452O337j337
1251b70j069M006l895M572o392K615M692n083K284j02k736L265k123L467k176
1266A055n539Q996o753L207O07l449L626o554Q158k326l833M457l614J598O59
1281B95M88N39n040L608L238o485P064m283j101K929k772O838q448L880L31m281
1297c200O280l235O00j748n30M131l173j01L289o422M535l24m77K074o668Q096
$$ plain form
1313 3127 -2759 -1233 3885 -2765 359 -2062 1888 1099 -1985 2704 -1442 -2223 3008 -85 220 -555
1329 -555 -1317 2761 -3321 4021 891 -3869 2237 -1474 2995 -1307 -420 1968 -3358 2028 1929 -1407
1345 -1407 178 -946 814 1060 -1096 3399 -2843 -549 2937 -1500 3029 -2476 1414 -583 -975
1360 -975 4576 -2748 -101 444 -932 1300 -285 886 -434 -3184 2966 -240 -1628 1831 -3441
1375 -3441 1356 -1830 1859 880 -4860 2841 -1883 -54 541 -972 458 -2938 723 2147 -2378
1390 -2378 515 201 -2203 2092 -516 2702 -2128 -1465 4262 -2680 2778 -181 -383 650 -1294 3794
1406 3794 -1210 -826 1722 -1467 576 1837 -1053 475 -2478 1754 876 -2160 2861 -3553 524
1421 524 344 -527 1967 -2966 2033 -836 -732 2715 -630 -687 -235 -26 2504 -1078 963 1398 -3120
$$ packed form
1313C127n886J526N118o650L124k421L950p89l084M689m146p81N231l093L05p75
1329e55p62M078o082P342l130m760O106l711M469m302Q87K388n326N386r9l336
1345a407J585j124J760K46k156M495o242K294L486m437M529n505L890j997l92
1360i75N551p324K647N45j376K232j585J171j320k750O150l206j388L459n272
1375c441M797l186L689r79n740P701m724J829N95j513J430l396L661J424m525
1390b378K893l14k404M295k608L218m830O63N727o942N458k959k02J033j944N088
1406C794n004L84K548l189K043J261k890J528k953M232q78l036N021o414M077
1421E24j80q71K494m933M999k869J04L447l345n7M52K09K530l582K041M35m518
$$ plain form
1438 -3120 3432 42 597 154 -1415 3237 -2862 2180 1350 -2717 618 -472 1071 -590 -1524 726
1454 726 -2337 -1360 2647 -2945 -433 -1543 -625 880 -3018 2839 -2882 -1514 1537 -1212 1744 -1745
1470 -1745 555 234 -1122 2444 381 -1476 1733 -265 1534 861 -217 2392 -3362 2766 846
1485 846 -823 2084 -2184 1555 -927 1563 1535 -2897 763 485 -911 1210 -422 73 -735 -1346 3293
1502 3293 -2520 165 924 -2718 1943 -1275 1881 -1496 -2211 2432 -1558 416 91 -1019 -80 -872
1518 -872 1275 1054 -2470 1909 -711 -363 2166 -999 1732 -2632 1752 1966 -1657 2551 -1431 -64
1534 -64 385 157 1013 -1762 -318 422 -2171 1054 -146 -2345 -166 -2274 1914 -1773 -617 901
1550 901 -3650 2106 59 218 -533 -1157 2169 -517 674 2360 -903 146 1789 704 2291 -1430
$$ packed form
1438c120O552l390N55m43j569M652o099N042q30m067L335j090J543j661r34K250
1454G26l063R77M007n592K512j110R18J505l898N857n721J368L051k749K956l489
1470a745K300l21j356L566k063j857L209j998J799o73j078K609n754O128j920
1485H46j669K907m268L739k482K490k8m432L660k78j396K121j632M95q08o11M639
1502C293n813K685P59l642M661l218L156l377p15M643l990J974l25j110R39p92
1518h72K147k21l524M379k620L48K529l165K731m364M384K14l623M208l982J367
1534f4M49k28Q56k775J444P40k593L225j200k199K179k108M188l687J156J518
1550I01m551N756k047J59p51o24L326k686J191J686l263J049J643j085J587l721
$$ plain form
1566 -1430 1771 35 -1013 4132 -1410 833 -856 315 1434 -1825 2054 -1224 -1674 893 -128
1581 -128 -105 -398 -1505 956 -1453 739 1275 -3046 1442 -1422 894 139 -1132 1764 -2845 1142
1597 1142 769 -692 492 -1061 -12 -158 -141 1312 -1825 -1626 1849 -1597 1552 -619 -438 196 -1663
1614 -1663 3379 -1552 137 575 -1213 1115 -212 1375 -266 -1614 1410 346 -786 1284 -1183
1629 -1183 101 -249 124 1637 -3071 1607 -828 -990 1282 -898 965 -1969 376 1090 -943 450
1645 450 429 -890 886 195 1099 -240 -1238 2576 -1852 1471 1092 -1004 917 -1456 2403 -540 -313
1662 -313 1361 -1790 461 688 -228 -104 -1046 -57 319 -1310 1942 -1906 -1073 916 -1391 1557 -1982
1679 -1982 640 -423 -1646 2131 -880 -386 -899 36 849 -883 443 641 -2071 976 588 -611
$$ packed form
1566a430L201j736j048N145n542K243j689J171J119l259L879l278m50K567j021
1581a28K3k93j107K461k409K192N36m321M488k864K316p55j271K896m609L987
1597A142l73j461J184j553J049j46J7J453l137J99L475l446L149k171J81O34j859
1614a663N042m931J689M38j788K328j327J587j641j348L024j064j132K070k467
1629a183J284l50L73J513m708M678k435j62K272k180J863k934K345P14k033J393
1645D50k1j319J776o91R04j339r98L814m428L323l79k096J921k373L859k943K27
1662c13J674l151K251K27r16J24r42R89L76j629L252l848Q33J989k307K948l539
1679a982K622j063j223L777l011M94n13R35Q13j732J326J98k712L047l88j199
$$ plain form
1695 -611 659 -1420 1629 -1559 787 1755 -2037 950 -551 1133 406 -197 1136 -944 136 1660
1711 1660 -341 369 157 -891 912 -868 1850 -658 -1548 1568 -1168 1309 -671 -69 143 -1473
1727 -1473 1636 -312 -682 165 -503 -12 712 12 731 -1681 560 1192 -1180 1990 -1516 333 -192
1744 -192 240 1439 -2279 731 -204 -561 670 -63 -38 -760 -788 894 -633 -654 587 -2006 1139 -768
1762 -768 420 -408 -2040 1562 -1268 427 318 -812 -128 -707 844 328 -601 840 -181 -760 1577
1779 1577 -191 686 -692 306 1509 -1551 2165 -597 -420 565 20 1167 -958 632 151 -901
1795 -901 935 811 -597 141 -657 841 86 -1080 1330 -2501 895 253 -614 812 -1158 938 -1097
1812 -1097 -53 1033 -747 -526 18 151 553 -353 639 237 -1276 1952 -813 -104 174 -802 1142
$$ packed form
1695f11J270k079L049l188K346R68l792K987j501J684p27o03J333k080J080J524
1711A660k001P10k12j048J803j780K718k508q90L116k736K477j980O02K12j616
1727a473L109j948l70Q47o68M91P24p00P19k412K241O32k372L170l506J849n25
1744a92M32J199l718L010r35l57J231p33K5p22k8J682j527k1J241k593L145j907
1762g68J188q28j632L602k830J695j09j130O84n79J551n16r29J441j021n79K337
1779A577j768Q77j378R98J203l060L716k762J77R85n45J147k125J590m81j052
1795i01J836j24j408P38p98J498p55j166K410l831L396o42q67J426j970K096k035
1812a097J044J086j780K21N44J33M02r06R92m02j513L228k765P09K78r76J944
$$ plain form
1829 1142 -1314 1661 -261 -1369 746 -525 173 -160 -436 1 -841 270 641 -1600 553 -500
1845 -500 -426 815 -868 1491 -1813 419 643 -1004 1239 -601 500 -23 732 1331 -390 -125 1151
1862 1151 -245 478 968 92 842 -1156 1890 -268 -302 1031 -1674 600 -371 985 -266 -1273 627
1879 627 -516 -98 478 -623 -540 -141 -657 1283 -1482 383 -177 -1518 1457 -799 621 -879 -372
1896 -372 1227 -1180 1054 -176 -286 38 240 484 114 -788 590 -878 29 1295 -1268 545 -1111
1913 -1111 805 107 -663 1178 -1870 275 268 112 245 -377 -30 -198 -491 939 -119 -1034 668 -997
1931 -997 1155 -439 204 397 -1422 1879 -176 107 -32 -32 805 -713 876 618 -680 38 762 -132
1949 -132 683 -452 464 -183 -227 1636 -1427 640 -365 -185 538 -714 618 -1608 -110 319 -260
$$ packed form
1829A142k456K975j922j108K115j271O98l33k76M37q42J111L71k241K153j053
1845e00P4J241j683K359l304K232K24j647K243j840J101n23P55N99j721K65J276
1862A151j396P23M90q76P50j998L046k158l4J333k705K274r71J356j251j007J900
1879F27j143M18N76j101Q3L99n16J940k765J865n60j341K975k256J420j500N07
1896c72J599k407K234j230j10L24K02K44l70r02J378j468R07J266k563J813j656
1913a111J916o98p70J841l048K145pj56J33o22L47j68k93J430j058r15J702j665
1931i97K152j594O43J93j819L301k055K83j39%Q37j518J589k58j298P18P24q94
1949a32Q15j135R16o47m4J863l063K067j005J80P23j252J332k226J498M29n79
$$ plain form
1966 -260 -37 -149 -748 -56 -716 455 286 -1508 938 -998 430 118 -540 353 -1445 1135 -126
1983 -126 -103 398 -401 159 86 648 159 -647 64 817 -901 1032 -176 -392 177 -290 1494 -1259 659
2002 659 269 -401 887 -250 713 -859 -326 609 -40 44 420 -936 465 330 160 729 -1216 938
2020 938 -657 -62 876 -693 624 -852 642 249 -370 649 -178 -259 731 124 -202 180 -202 410
2038 410 -941 800 -78 -969 632 -799 772 -667 65 14 -1233 530 55 -299 -309 -181 -79 -201
2056 -201 -363 727 -1024 -7 676 -611 952 -996 619 -721 -332 1140 -681 178 -136 335 336
2073 336 181 138 35 -693 821 43 -366 557 -785 654 -620 840 182 -966 1198 -760 751
2090 751 197 81 39 -347 529 393 -282 73 167 -518 817 -178 687 -953 -76 897 -930 974 -457
$$ packed form
1966b60K23j12n99O92o60J171j69j794K446j936J428l12o58Q93j798K580j261
1983a26K3N01p99N60p3N62m89q06P11P53j718J933j208k16N69m67J784k753J918
2002F59l90o70J288j137R63j572N33R35o49Q4L76j356J401j35j70N69j945K154
2020I38j595N95R38j569J317j476J494l93o19J019q27q1R90o07l26L82l82O12
2038D10j351J741q78q91J601j431J571j439P32n1j247J763m75l54j0J28J02j22
2056b01j62J090j751J017O83j287J563j948J615j340L89J472j821Q59l14M71J
2073C36j55m3j03p28J514p78m09R23j342J439j274J460o58j148K164j958J511
2090G51n54j16m2l86Q76j36o75L55R4o85J335r95Q65j640Q77R73j827J904j431
$$ plain form
2109 -457 -122 -263 -551 1044 -864 22 -48 -397 -29 250 -488 -200 -754 428 -154 -719 1102 -1272 111
2128 111 -276 90 663 -1259 604 -448 -34 494 -76 -13 -246 -32 17 41 -210 172 -1071 1017 -83
2147 -83 243 -66 -408 987 -866 808 -105 -422 139 -315 572 -148 27 181 -307 8 1027 -387 248
2166 248 -140 -173 537 -502 1181 -1047 348 471 -311 358 -835 387 -392 -114 461 -212 -814 156
2184 156 -354 211 -68 -422 524 -1422 808 -221 -487 255 -745 447 -502 481 531 -1135 89 -91
2202 -91 -149 210 31 -239 -90 -116 1276 -887 278 271 -726 710 -298 790 -736 -53 336 -313 198
2221 198 82 115 -296 -85 369 387 -620 596 -291 -291 798 -235 662 -1045 760 445 -489 663 -573
2240 -573 145 -29 558 423 -502 172 425 -304 282 372 -579 400 -669 662 -74 114 327 -826 818
$$ packed form
2109d57L35j41k88J595j908Q86p0l49L68K79p38K88n54J182n82n65J821k374J383
2128A11l87L66N73j922J863j052M14N28n70O3k33K14M9K4k51L82j243K088j100
2147h3L26l09l42J395j853J674r13l17N61m54Q87p20J75J54m88L15J019j414O35
2166B48l88l3P10j039J683k228J395J23p82O69j193J222p79K78N75o73o02R70
2184A56n10N65k79l54R46j946K230j029k66P42j000J192r49R83N0j666J224j80
2202i1n8L59j79k70J49k6J392k163J165pr97J436j008J088j526O83L89o49N11
2221A98j16L3m11K11M54J8j007J216q87%J089j033Q97j707J805l15r34J152j236
2240e73P18j74N87j35r25O74K53p29N86R0r51R79j069J331p36J88K13j153J644
$$ plain form
2259 818 -363 251 -384 -27 238 -173 133 194 -208 -366 264 -264 435 -569 242 -273 -685 862 -777
2278 -777 356 -622 -102 15 -589 814 -736 -329 126 138 -93 368 -104 296 -342 419 583 -686 751
2297 751 -379 595 4 125 622 -895 813 19 52 -141 74 -19 -53 192 329 -130 -289 629 -543 499
2317 499 -379 194 20 -599 1019 -655 313 -50 -136 173 -417 578 -231 -292 227 113 -430 574 -239 -23
2337 -23 35 -154 318 -744 592 -403 -42 140 -308 405 -812 249 203 -134 179 -102 -160 -115 212 -24
2357 -24 -122 -252 1017 -724 452 -76 -340 122 -635 698 -572 20 -15 -429 104 90 118 33 72 297 284
2378 284 -264 796 -259 -160 486 -254 714 -577 748 -14 82 817 -264 354 -354 393 -158 73 353
2397 353 116 -463 199 -17 -162 180 -592 354 -682 371 426 -832 207 -500 399 -396 -50 3 -313
$$ packed form
2259H18j181O14o35L57K65m11L06O1m02j58O30n28O99j004Q11n15m12J547j639
2278g77J133r78N20J17o04J403j550M07M55J2k31M61m72M00o38P61J64j269J437
2297G51j130R74n91J21M97j517J708p94L3j93K15r3l4K45J37m59j59R18j172J042
2317D99q78N73j74o19J618j674R68l63q6L09n90R95q09o1N19j14n43J004q13K16
2337b3N8j89M72j062J336r95L61J82m48P13j217J061m6l37L13k81n8M5L27k36
2357b4r8j30J269j741J176n28k64M62p57J333j270N92l5m14N33j4K8q5L9K25j3
2378B84n48J060j055R9O46p40R68j291J325p62R6P35j081O18p08P47n51K31K80
2397C53k37n79O62k16j45L42p72R46j036J053N5j258J039p07Q99p95L46N3l16
$$ plain form
2416 -313 122 177 -171 -18 65 -451 210 -388 568 -365 -277 624 -548 544 -509 188 -252 -434 513 -289
2436 -289 -91 -45 -6 -126 314 67 145 -578 -26 471 -118 721 -669 337 -388 201 622 -599 581 -299
2456 -299 374 383 159 39 308 90 274 206 -50 516 -684 378 -122 248 -78 -547 596 -363 358 -152
2476 -152 -137 -42 -288 274 -306 -208 -102 59 -522 388 -388 -123 -223 -34 274 -625 492 -388 -70 -156 -5
2497 -5 468 -316 303 -340 -293 89 27 -150 112 60 355 206 -37 344 -921 468 -88 184 -38 -139 529
2518 529 -552 257 112 -288 -155 201 48 117 302 135 87 -392 569 -112 124 232 -90 358 -272 631
2538 631 -387 -108 224 -288 186 -20 219 -14 -128 62 130 -113 -9 -79 -189 57 -353 608 -912 264
2558 264 -46 -368 322 -468 138 -386 204 103 -145 -296 -30 -352 141 -4 -478 102 -435 772 -297
$$ packed form
2416c13M35N5l48J53Q3n16O61n98R56r33Q8R01j172J092j053O97m40j82R47q02
2436b89J98M6L9j20M40k47P8p23N52M97n89Q39j390J006p25N89M21j221J180q80
2456b99O73Rk24j20K69k18J84o8k56N66j200J062n00L70l26m69J143r59P21n10
2476a52J5R5k46N62n80R8J06J61n81R10p76K65j00J89L08q99J117q80L18q6J51
2497eM73p84O19o43M7L82o2j77K62n2K95j49k43L81j265J389n56K72k22j01O68
2518E29j081Q09j45m00J33L56j53O9J85j67m8m79R61o81K36J08l22M48o30R03
2538F31j018K79L32n12M74k06K39k33j14J90O8k43J04p0j10K46m10R61j520J176
2558B64l10l22O90p90O06n24N90j01k48j51K66l22M93j45m74N80n37J207j069
$$ plain form
2577 -297 -36 240 -255 76 -236 250 -99 -102 322 -28 208 116 25 -302 372 31 461 -419 182 16 -424
2598 -424 365 -216 388 -456 -85 290 -372 296 -33 -166 142 230 123 -51 -104 378 -132 152 313 -473 447
$$ packed form
2577b97K61K76m95L31l12M86l49lM24l50K36r2r1l27O74l41M30q80O01j66m40
2598d24P89n81O04q44L71L75o62O68l29j33L08Q8j07j74n3M82n10K84J61p86R20
$$ [...]
8191A50
##END NTUPLES=NMR FID
##END=
