##TITLE=1H_CA-8768-1
 CDCl3, 8 sc, 
 29.9.2020
##JCAMPDX= 6.0         $$ Bruker NMR JCAMP-DX V2.0
##DATA TYPE= NMR FID
##DATA CLASS= NTUPLES
##ORIGIN= UXNMR, Bruker Analytische Messtechnik GmbH
##OWNER= root
$$ XWIN-NMR		Version 3.5
$$ Tue Sep 29 10:33:00 2020 Russian Standard Time (UT+4h)  she@DPX200
##.OBSERVE FREQUENCY= 200.1315066352
##.OBSERVE NUCLEUS= ^1H
##.DELAY= (6, 6)
##.ACQUISITION MODE= SIMULTANEOUS
##.ACQUISITION SCHEME= undefined
##.AVERAGES= 8
##.DIGITISER RES= 18
##SPECTROMETER/DATA SYSTEM= spect
##.PULSE SEQUENCE= zg30
##.SOLVENT NAME= CDCl3
##.SHIFT REFERENCE= (INTERNAL, CDCl3, 0, 15.7039)
##AUDIT TRAIL= $$ (NUMBER, WHEN, WHO, WHERE, WHAT)
$$ ##TITLE= Audit trail, XWIN-NMR		Version 3.5
$$ ##JCAMPDX= 5.01
$$ ##ORIGIN= Bruker BioSpin GmbH
$$ ##OWNER= she
$$ F:/spectra/data/she/nmr/H-F/1/audita.txt
$$ ##AUDIT TRAIL=  $$ (NUMBER, WHEN, WHO, WHERE, WHAT)
(   1,<2020-09-29 10:32:01.59 +0400>,<she>,<DPX200>,
      <created by zg, POWCHK disabled, PULCHK disabled
       configuration hash MD5:
       00 E9 B6 7A A2 85 ED C7 34 08 36 98 17 FE 4E 26
       data hash MD5: 16K
       D2 6D C2 3B A5 8C 3B 1B 2B 4D 07 E1 B5 EC BD 66>)
$$ ##END=
$$ 
$$ hash MD5
$$ E5 01 58 B3 39 25 87 FF 59 20 FE A6 A7 1B 62 E1
##$RELAX= 
##$RELAX= 
##$RELAX= 
##$RELAX= 
##$RELAX= 
##$RELAX= 
$$ Bruker specific parameters
$$ --------------------------
##$DU= <F:/spectra>
##$EXPNO= 1
##$NAME= <H-F>
##$PROCNO= 1
##$TYPE= <nmr>
##$USER= <she>
##$AMP= (0..31)
100 100 100 100 100 100 100 100 100 100 100 100 100 100 100 100 100 100 
100 100 100 100 100 100 100 100 100 100 100 100 100 100 
##$AQSEQ= 0
##$AQ_mod= 1
##$AUNM= <au_zg>
##$AUTOPOS= <>
##$BF1= 200.13
##$BF2= 200.13
##$BF3= 200.13
##$BF4= 200.13
##$BF5= 200.13
##$BF6= 200.13
##$BF7= 200.13
##$BF8= 200.13
##$BYTORDA= 1
##$CFDGTYP= 0
##$CFRGTYP= 5
##$CHEMSTR= <none>
##$CNST= (0..31)
1 1 145 1 1 1 1 1 1 1 1 1 1 1 1 1 1 1 1 1 1 1 1 1 1 1 1 1 1 1 1 1 
##$CPDPRG= <>
##$CPDPRG1= <>
##$CPDPRG2= <>
##$CPDPRG3= <>
##$CPDPRG4= <mlev>
##$CPDPRG5= <mlev>
##$CPDPRG6= <mlev>
##$CPDPRG7= <mlev>
##$CPDPRG8= <mlev>
##$CPDPRGB= <>
##$CPDPRGT= <>
##$D= (0..31)
0 1.2 0 0 0 0 0 0 0 0.06 0 0.03 0 0 0 0 0.0002 0 0 0 0 0 0 0 0 0 0 0 0 
0 0 0 
##$DATE= 1601361121
##$DBL= (0..7)
120 120 120 120 120 120 120 120 
##$DBP= (0..7)
150 150 150 150 150 150 150 150 
##$DBP07= 0
##$DBPNAM0= <>
##$DBPNAM1= <>
##$DBPNAM2= <>
##$DBPNAM3= <>
##$DBPNAM4= <>
##$DBPNAM5= <>
##$DBPNAM6= <>
##$DBPNAM7= <>
##$DBPOAL= (0..7)
0.5 0.5 0.5 0.5 0.5 0.5 0.5 0.5 
##$DBPOFFS= (0..7)
0 0 0 0 0 0 0 0 
##$DE= 6
##$DECBNUC= <off>
##$DECIM= 32
##$DECNUC= <off>
##$DECSTAT= 4
##$DIGMOD= 1
##$DIGTYP= 9
##$DL= (0..7)
0 120 120 120 120 120 120 120 
##$DP= (0..7)
150 150 150 150 150 150 150 150 
##$DP07= 0
##$DPNAME0= <>
##$DPNAME1= <>
##$DPNAME2= <>
##$DPNAME3= <>
##$DPNAME4= <>
##$DPNAME5= <>
##$DPNAME6= <>
##$DPNAME7= <>
##$DPOAL= (0..7)
0.5 0.5 0.5 0.5 0.5 0.5 0.5 0.5 
##$DPOFFS= (0..7)
0 0 0 0 0 0 0 0 
##$DQDMODE= 0
##$DR= 18
##$DS= 0
##$DSLIST= <SSSSSSSSSSSSSSS>
$$ [...]
##$SUBNAM2= <"">
##$SUBNAM3= <"">
##$SUBNAM4= <"">
##$SUBNAM5= <"">
##$SUBNAM6= <"">
##$SUBNAM7= <"">
##$SUBNAM8= <"">
##$SUBNAM9= <"">
##$SW= 16.880792210976
##$SWIBOX= (0..15)
0 0 2 0 0 0 0 0 0 0 0 0 0 0 0 0 
##$SW_h= 3378.37837837838
##$TD= 16384
##$TD0= 1
##$TE= 0
##$TE2= 300
##$TE3= 300
##$TEG= 300
##$TL= (0..7)
0 120 120 120 120 120 120 120 
##$TP= (0..7)
150 150 150 150 150 150 150 150 
##$TP07= 0
##$TPNAME0= <>
##$TPNAME1= <>
##$TPNAME2= <>
##$TPNAME3= <>
##$TPNAME4= <>
##$TPNAME5= <>
##$TPNAME6= <>
##$TPNAME7= <>
##$TPOAL= (0..7)
0.5 0.5 0.5 0.5 0.5 0.5 0.5 0.5 
##$TPOFFS= (0..7)
0 0 0 0 0 0 0 0 
##$TUNHIN= 0
##$TUNHOUT= 0
##$TUNXOUT= 0
##$USERA1= <user>
##$USERA2= <user>
##$USERA3= <user>
##$USERA4= <user>
##$USERA5= <user>
##$V9= 5
##$VALIST= <valist>
##$VCLIST= <CCCCCCCCCCCCCCC>
##$VD= 0
##$VDLIST= <DDDDDDDDDDDDDDD>
##$VPLIST= <PPPPPPPPPPPPPPP>
##$VTLIST= <TTTTTTTTTTTTTTT>
##$WBST= 1024
##$WBSW= 4
##$XGAIN= (0..3)
0 0 0 0 
##$XL= 0
##$YL= 0
##$YMAX_a= 273562
##$YMIN_a= -206030
##$ZGOPTNS= <>
##$ZL1= 120
##$ZL2= 120
##$ZL3= 120
##$ZL4= 120
##$ABSF1= 10
##$ABSF2= 0
##$ABSG= 5
##$ABSL= 3
##$ALPHA= 0
##$AQORDER= 0
##$ASSFAC= 0
##$ASSFACI= 0
##$ASSFACX= 0
##$ASSWID= 0
##$AUNMP= <proc_1d>
##$AZFE= 0.1
##$AZFW= 0.1
##$BCFW= 1
##$BC_mod= 2
##$BYTORDP= 1
##$COROFFS= 0
##$CY= 11.3945322036743
##$DATMOD= 1
##$DC= 2
##$DFILT= <>
##$DTYPP= 0
##$F1P= 16.9975609425685
##$F2P= -3.02152046262296
##$FCOR= 0.5
##$FTSIZE= 0
##$FT_mod= 4
##$GAMMA= 1
##$GB= 0.15
##$INTBC= 1
##$INTSCL= 1
##$ISEN= 128
##$LB= 0.24
##$LEV0= 0
##$LPBIN= 0
##$MAXI= 10000
##$MC2= 0
##$MEAN= 0
##$ME_mod= 0
##$MI= 1.114404
##$NCOEF= 0
##$NC_proc= 0
##$NLEV= 6
##$NOISF1= 3.799351
##$NOISF2= 2.8
##$NSP= 1
##$NTH_PI= 0
##$NZP= 0
##$OFFSET= 15.70392
##$PC= 1
##$PHC0= -9976.84
##$PHC1= 17.40089
##$PH_mod= 1
##$PKNL= yes
##$PPARMOD= 0
##$PSCAL= 0
##$PSIGN= 0
##$REVERSE= no
##$SF= 200.130013532006
##$SI= 16384
##$SIGF1= 3
##$SIGF2= 2
##$SINO= 400
##$SIOLD= 16384
##$SREGLST= <1H.CDCl3>
##$SSB= 0
##$STSI= 0
##$STSR= 0
##$SW_p= 3612.71676300578
##$SYMM= 0
##$S_DEV= 0
##$TDeff= 0
##$TDoff= 0
##$TI= <>
##$TILT= no
##$TM1= 0
##$TM2= 0
##$TOPLEV= 0
##$USERP1= <user>
##$USERP2= <user>
##$USERP3= <user>
##$USERP4= <user>
##$USERP5= <user>
##$WDW= 1
##$XDIM= 8192
##$YMAX_p= 0
##$YMIN_p= 0
$$ End of Bruker specific parameters
$$ ---------------------------------
##NTUPLES= NMR FID
##VAR_NAME=  TIME,          FID/REAL,        FID/IMAG
##SYMBOL=    X,             R,               I
##VAR_TYPE=  INDEPENDENT,   DEPENDENT,       DEPENDENT
##VAR_FORM=  AFFN,          ASDF,            ASDF
##VAR_DIM=   8192,          8192,            8192
##UNITS=     SECONDS,       ARBITRARY UNITS, ARBITRARY UNITS
##FACTOR=    0.000296,      1,               1
##FIRST=     0,             0,               0
##LAST=      2.424536,      0,               0
##MIN=       0,             -206030,         0
##MAX=       2.424536,      273562,          0
$$ Real data points
##PAGE= N=1
##DATA TABLE= (X++(R..R)), XYDATA
0 0 0 0 0 0 0 0 0 0 0 0 0 0 7 -8 8 -8 8 -16 16 -24 25 -32 40 -48 56 -66 79 -92 106 -124 140 -164 187 -212
34 -212 239 -271 307 -345 387 -433 487 -540 601 -667 740 -820 906 -1000 1104 -1215 1339
51 1339 -1474 1623 -1788 1970 -2172 2399 -2654 2945 -3277 3661 -4112 4651 -5309 6122 -7161
66 -7161 8526 -10353 12734 -28573 273562 -96558 -63084 117582 -119040 91853 -23610
77 -23610 13991 120641 -63460 25308 86443 -35744 38448 50721 33119 -51722 35872 65178
89 65178 -17515 -1099 -58367 72488 725 -59224 65262 -73344 -8640 13540 -29252 36900
101 36900 -39606 -14417 -7023 -49236 67951 -24737 -16064 16658 -87631 84563 6432 -38526
113 -38526 25057 -27355 49662 -46020 12391 53408 -47847 23023 -3630 11656 26948 -45855
125 -45855 44730 -10390 -28612 91503 -42938 -25872 2641 21465 43047 -70321 48937
136 48937 -432 -47529 25869 -6551 36063 -38561 -16792 35489 -73385 40404 40417 -95741
148 -95741 34980 -8853 -14916 31013 -69338 33173 9446 -40861 21520 10587 -26928 -2723
160 -2723 30455 -32866 35549 26599 -49878 25680 5502 16340 45555 -52868 25140 26110 -42656
173 -42656 74192 -27954 -9330 43295 -49555 25132 -1379 13118 2352 -45798 25522 1013
185 1013 -7473 -2323 -26281 14807 -8677 -5242 17354 -51160 21083 9947 -26192 21583 -13839
198 -13839 15491 -33293 -2066 45291 -20518 5240 -9229 -11220 13851 8452 10132 -16979 -8972
211 -8972 23649 -14218 2055 9507 -3906 3027 -27932 33417 -6503 -14504 20281 -36942 24685
224 24685 7092 -10915 1462 -27863 24451 13351 -26639 11852 2834 -16699 1634 13610
236 13610 10624 -22378 20463 -18914 -13360 49021 -26149 14465 -18770 -11346 55429 -43160 7647
249 7647 30617 -38328 22915 5778 -15910 26500 -21993 8435 7964 -13876 27517 -14655 -16233
262 -16233 4194 26029 -7700 -16582 15281 -22714 12653 8007 -10698 9544 -15526 417
274 417 2611 -12741 25345 -9924 -24767 15002 -7488 15654 -14812 -5094 10458 -21024 28659
287 28659 -15232 -10515 12022 -10318 12722 -14400 8011 12975 -34847 13747 14984 -12304 16007
300 16007 -24390 6849 6425 -8542 33078 -33881 825 19914 -14022 7879 1095 8361 -10426
313 -10426 -6147 14218 1078 1884 -3903 -5376 10367 -6767 16495 -4534 -29875 36780 -9563
326 -9563 -6666 12501 -16575 10256 -11042 6293 11474 -9987 -1949 -3072 -496 3857 12921 -3846
340 -3846 -23431 15793 10371 -15927 20640 -15732 3245 10789 -21387 31413 -17383 -3548 17933
353 17933 -26334 16786 7539 -14366 -4909 -6126 12589 -2645 -14466 6145 -15940 2180 4039
366 4039 -7064 3622 -19642 15276 -11171 -7019 26730 -17444 -2759 -1122 5581 14624 -10778
379 -10778 5278 5352 -9728 17826 4019 -7382 6899 282 8058 -8085 10339 3633 -11993
392 -11993 3377 -2037 16439 -14850 -4104 8390 -18917 18399 2100 -17602 7911 -7186
404 -7186 4014 6311 -13011 19152 -12942 -9323 18421 -8752 9637 -6902 -688 377 -1963
417 -1963 16782 -16300 -2713 7928 -3925 5206 -6678 369 5258 -16759 13817 3312 -14061
430 -14061 13161 -12558 1006 5716 3766 1411 -15708 8360 2456 1668 -1743 -1413 3341 -10958
444 -10958 6189 6934 -12761 5866 -2090 -11185 10418 -5322 4541 -10790 -7968 18958 -12603
457 -12603 2640 -1171 -4389 4694 -2516 10624 -6112 -2236 9204 -5627 5546 9459 -1592
470 -1592 2251 -9219 14522 8150 -11725 14652 -12498 3293 8265 -6639 8336 -12333 4203
483 4203 3613 -11369 7758 171 -10965 -22 -65 3532 -3453 -4304 961 -8123 10329 -787 -2694
498 -2694 -2542 -4073 12919 -11203 6599 6429 -12938 4306 758 3234 2453 -4954 1794 -3891 122
513 122 10387 -8963 -2067 -1185 2833 2127 -10646 13434 -10192 -3850 10010 -7916 7431 -5877
527 -5877 -2448 5204 -6097 10214 1505 -14099 8433 1402 622 3243 -4610 6042 -8316 6232
541 6232 3696 -4910 5495 -6254 3588 -2157 4015 6106 -11519 2898 5406 -2751 3937 -2930
555 -2930 -770 2214 -3760 10189 -6218 -2116 5207 -6651 4763 -577 4683 -6625 -4511 8760
569 8760 -3951 2708 -2139 -3745 1771 -2786 5536 -341 -10097 9554 -5508 -4105 9767 -7801
583 -7801 3353 -7510 2167 7066 -9230 5111 -4101 -3015 3795 1412 69 -6581 1496 5131
597 5131 -5952 4300 1902 -5919 2794 -3984 9015 -2133 -4789 6861 -8349 5567 4016
610 4016 -1162 -1435 -2583 5902 -990 -444 3118 -2091 -767 1124 1914 3285 -5823 3936 -2349 -2578
626 -2578 10873 -8106 1357 -1734 -356 7047 -6916 4665 -2086 -5056 5861 -754 -582 1117
640 1117 -3034 1419 -3471 5295 3559 -10671 5358 -1463 2495 777 -4262 5900 -9288 3708
654 3708 5001 -6866 1791 -549 -1487 42 -712 4090 -4696 -5808 6112 -1962 990 -2485 -513
669 -513 -319 -4902 9317 -5148 -1499 2233 -3533 4289 -2471 3180 876 -6275 4899 2330 -1650
684 -1650 3475 -3622 2408 1145 742 5389 -7662 5373 -167 -993 5117 -3828 3016 -4599 985
699 985 5085 -4291 2831 -824 -5164 4650 -158 469 -1828 -4645 7238 -5912 1517 3567 -6543
714 -6543 2301 -2526 4271 -1506 -2660 3940 -4726 473 3837 -148 -2053 -2621 3684 2150 -5065
729 -5065 5504 -2402 -2841 3531 -1281 4592 -5619 1477 1204 -4705 5167 -1451 -1297 -3136 -326
744 -326 3792 -3551 -420 1635 -5263 2687 -144 -1997 2853 -6514 4283 -1888 -607 5048 -6921
759 -6921 2041 2 924 2486 -1412 1115 -1832 1037 4771 -2103 490 1875 -1496 3213 -1180
774 -1180 4889 -1251 -4329 6795 -2253 2287 -6 -632 669 -3289 5408 -565 -4275 1554 -293
789 -293 -1223 28 -960 1195 -5740 378 3349 -4532 1789 -3646 341 -1164 -310 4372 -5975 902
805 902 803 -1146 2153 -1300 802 -556 -2322 4755 -387 -1143 3027 -4299 3168 462 1115 853 -4215
822 -4215 4658 -2050 1058 1881 -3031 709 -1081 1200 876 -2812 1355 -753 -3123 4270 -1079 -958
838 -958 -1348 41 2835 -3498 3449 -1187 -1719 1256 102 2997 -3334 1057 1960 -2869 2512 2254
854 2254 -2514 684 -743 2643 789 -2361 4005 -3848 1505 2219 -965 1328 -3287 3051 -1218
869 -1218 -491 3050 -2497 -970 196 -379 1305 -1667 -668 69 -3270 3623 -2186 -1416 525 -2772
885 -2772 2238 -2856 1887 -790 -3884 2669 -779 43 122 -814 -214 -916 1515 2457 -3071 1448 931
902 931 -226 1924 -1032 3505 -3420 923 3717 -2367 2347 -778 207 -131 -149 2815 -1678 -1965 2101
919 2101 -879 254 435 -1107 682 -3344 3473 -424 -2108 2371 -3480 1854 -22 531 857 -3157
935 -3157 1537 594 -413 1077 -930 -946 735 -23 2233 -2111 908 594 -2522 3641 -1538 905
951 905 -1442 -930 2706 -2659 1209 194 -2557 170 756 269 -743 -1424 1445 -2014 -321 2659
967 2659 -2907 662 -1714 1521 478 -2483 2844 -2529 114 1394 115 446 -1708 1189 717 -1332
983 -1332 2249 251 -1991 2103 -727 2094 -779 -758 1648 -2792 3229 -153 -796 276 -829 1651
999 1651 -800 744 513 -1990 692 893 -893 1191 -1525 323 -227 -1001 3550 -2955 212 371
1015 371 -666 1061 -969 1463 -2084 -425 1906 -923 -521 357 -959 431 -509 1170 140 -3194
1031 -3194 2718 -1338 289 899 -1514 831 -2410 1879 101 -1504 336 -1039 -237 35 277 705
1047 705 -1815 -346 2409 -1899 1512 -195 -936 1095 -992 2820 -1963 308 1260 -1222 2063 310
1063 310 567 -551 -483 1608 203 -310 1266 -1701 120 481 -396 1008 -2300 1607 -763 -749 1812
1080 1812 -1839 169 -1242 1136 385 -1280 1210 -712 -1500 1442 45 -419 -40 -802 1401 -1309
1096 -1309 1317 529 -2122 1268 -1004 1724 -987 -107 1015 -1831 1028 845 -431 -247 -312 216 262
1113 262 -892 1360 -1508 -900 1588 -1159 903 -1368 398 -492 -989 2137 -2001 -243 224 -322
1129 -322 416 -254 276 -22 -1329 1662 518 -732 1280 -826 1230 -397 928 1305 -2182 1748
1145 1748 -152 647 581 -185 790 -1333 871 1014 -1232 274 -31 -1189 790 -728 581 -1290 -1291
1162 -1291 1698 -2074 1077 -499 -1071 260 -755 1690 -892 -678 801 -418 174 939 -113 184
1178 184 -858 1077 577 -1448 1664 -1497 -126 436 -129 935 -2113 821 -217 -630 809 -379
1194 -379 -611 -405 -400 747 -430 -124 741 -1510 1257 -97 206 350 -1252 2108 -1189 778 1017 -1155
1212 -1155 480 -45 769 -316 -281 781 -393 -58 1622 -697 50 -117 -255 965 -1278 1760 -1059
1229 -1059 -587 1046 -535 992 -958 364 76 -427 1049 84 -965 180 -364 318 120 -591 575
1246 575 -1752 884 421 -933 554 -1143 540 -747 273 487 -1433 192 -15 -100 381 -142 -209
1263 -209 116 -360 1547 -563 -120 872 -871 1149 -950 927 -841 -1137 1182 -509 391 -32 -242
1280 -242 -169 -268 810 518 -1449 582 -140 -61 1097 -602 733 -840 418 1013 -1022 1118 -482
1297 -482 33 388 574 578 -688 88 545 -389 712 464 -820 602 -512 837 -546 -674 962 -1426
1315 -1426 751 -69 256 -249 -981 968 -578 -91 459 -704 -242 316 -363 236 -849 242 138 -1115
1333 -1115 1380 -872 -87 -542 -324 750 -784 772 -493 -632 338 -110 141 -43 -532 228 -405 304
1351 304 956 -929 780 -46 487 179 -468 787 -958 892 392 -251 186 -75 356 -272 101 700
1369 700 -435 -466 1007 -553 565 -82 -19 217 -689 1343 -555 -350 297 -775 412 -444 596 -139
1387 -139 -806 359 190 -648 491 -308 -268 -131 -331 946 -1073 566 -73 -404 750 -843 452 -796
1405 -796 312 590 -553 298 201 -124 50 -15 229 -147 -894 537 -563 379 510 -688 320 -720
1423 -720 819 -282 -314 573 -866 322 186 183 -111 -330 420 613 -729 804 -304 -448 774 -210
1441 -210 558 -598 556 284 -611 1158 244 108 -359 -40 611 -200 281 317 -769 44 454 -192 286
1460 286 -898 391 -573 -109 529 -867 159 -264 78 10 -278 202 -680 -122 453 -135 -152 113 -364
1479 -364 546 -386 678 -103 -1010 815 -395 504 -138 -40 249 -273 961 -218 -558 -132 -235 -68 145
1498 145 109 347 -627 110 729 -471 653 -507 75 1 -121 1089 -597 207 134 53 301 100 -56 -155
1518 -155 -270 307 -138 -236 414 -660 202 -99 130 211 -1150 741 -606 52 190 -399 59 -362 448
1537 448 143 -289 397 53 -315 352 53 -18 -88 -157 620 -816 707 -92 -494 225 -132 432 -540 309
1557 309 248 -531 267 384 -313 16 -221 154 151 -328 589 -668 278 359 -177 310 -626 401 -77 -20 323
1578 323 -524 -358 -18 89 84 126 -10 7 -610 524 -141 -29 435 -185 756 -221 658 143 -322 408 -189
1599 -189 248 92 118 135 -127 329 311 -527 384 -31 -225 602 -343 201 -619 -200 254 -679 373 -354 35
1620 35 -263 -25 577 -206 -194 -68 -108 120 261 -105 256 -531 591 7 -542 495 -322 376 53 305
1640 305 244 -610 335 136 -39 250 143 -185 -27 -213 262 -500 159 200 -483 665 -445 125 67 -16 553
1661 553 -403 362 -105 -184 190 83 293 -167 -482 303 -221 86 716 27 236 -475 145 404 -368 515
1681 515 -419 107 137 -80 146 -394 45 -45 -276 86 219 -588 203 -160 298 -253 -259 79 -459 488 -104
1702 -104 -54 -68 -375 77 -379 -65 -28 -409 -57 -15 -352 47 -181 -33 -172 -256 367 -113 331 78 66 288
1724 288 -157 368 -165 -47 141 -136 13 233 0 -53 18 311 278 -483 151 -104 150 -25 -201 158 -558
1745 -558 375 225 -236 91 -276 -13 89 210 94 -47 -265 173 -357 131 54 -273 100 -178 565 -181
1765 -181 49 68 -201 140 -342 46 -418 -219 -75 83 110 200 -35 -234 284 -32 117 -678 318 -145 -25
1786 -25 516 -393 186 -241 208 -31 106 133 -109 77 142 -74 -63 -6 14 712 -219 250 118 -252 433 -182
1808 -182 169 -81 -64 401 -158 161 133 22 -98 55 83 99 -20 203 -52 -112 192 -91 464 -205 45 157
1830 157 -11 402 -42 -131 -125 -194 171 167 97 -152 61 289 -167 -273 206 -239 -8 -140 -45 252 -441 182 -90
1853 -90 60 -64 -24 206 -193 218 132 -2 137 197 56 61 264 110 -371 -296 250 -251 208 39 -259 -19
1875 -19 -332 440 -278 -70 28 56 -52 189 157 -140 -184 474 3 -94 343 -387 179 -34 67 429 25 122
1897 122 111 -243 127 -166 17 -192 -34 -6 -97 -21 147 -255 195 113 -124 70 -416 209 -233 -17 42 -230
1919 -230 107 -10 -143 95 -55 138 7 -201 203 -465 -191 -61 -202 -19 -349 198 -189 69 25 -240
1939 -240 317 -234 108 -134 -68 10 65 29 96 -87 4 -139 42 133 -271 383 19 -157 -21 -155 135 -287
1961 -287 -29 -53 -256 117 -26 74 160 -25 83 54 -204 146 -37 65 207 -240 171 -208 106 141 -101
1982 -101 56 -215 333 95 54 -11 -174 45 226 -82 68 154 -42 227 9 -102 -136 56 -32 -114 300 -45
2004 -45 -115 -200 282 387 -83 -188 61 -86 -30 257 -210 18 -157 98 252 -66 292 -266 138 -21 -182
2025 -182 -42 -81 59 -10 -24 49 64 -15 183 -234 101 -293 -6 264 -198 110 176 -7 -366 -26 112 -29
2047 -29 -5 -231 46 -94 16 129 -193 162 -79 -222 58 328 88 111 79 157 53 -150 300 -377 105 -18
2069 -18 1 121 -205 164 85 50 -131 -203 -240 -51 -39 138 102 7 117 -96 247 -330 248 5 -158 86 -99
2092 -99 31 -128 -117 223 24 -74 154 110 -163 21 125 73 -279 83 -238 22 45 87 79 -103 62 284 -93
2115 -93 32 84 -99 250 189 163 79 -195 240 122 83 104 -176 104 -222 315 -116 -136 -249 42 245 -104 20
2138 20 -30 -435 -88 77 5 122 -276 -145 193 -80 70 72 -17 -118 119 125 -279 136 -77 92 -80 -86 -188
2161 -188 133 -94 -115 29 -177 43 -25 -141 31 199 13 -14 75 -218 69 221 -52 104 -136 37 273
2182 273 134 297 89 -135 58 110 78 32 -162 220 -180 283 158 172 48 53 199 63 110 -5 69 293 88
2205 88 10 -88 -250 -76 288 9 40 1 -79 -228 -37 13 -142 50 50 -144 -54 64 -55 10 -59 52 -34 150
2229 150 228 -124 209 -76 227 -68 124 -78 -47 8 -75 178 -173 17 164 65 26 -45 4 -219 54 86 110
2252 110 161 25 120 -226 107 115 79 37 49 157 -131 175 188 -58 -18 89 -109 -24 -75 194 17 -55 88 -303
2276 -303 -215 -112 -110 -119 -67 5 -218 -167 60 -18 181 -71 64 83 55 190 9 8 45 -45 -8 -302 -158 153 -193
2301 -193 117 -120 -112 -126 83 194 -10 219 -105 -68 -96 129 70 -23 98 124 -159 -15 224 -77 -68 192 93 63
2325 63 -104 -95 -53 -51 -39 -70 -144 -16 68 -164 14 189 -66 -17 69 -26 -3 24 -135 -86 -194 -33 -255 -1 181
2350 181 29 -241 79 63 -117 -212 -20 208 -257 -79 -18 -114 382 -113 -77 -243 32 75 -69 1 -131 117
2372 117 -84 21 -122 -38 -96 258 21 -69 94 30 118 -120 24 -81 181 79 16 62 29 -91 -44 -64 169
2395 169 -141 221 155 -5 -228 154 -185 -7 80 156 -21 -43 -2 -155 135 97 -26 -313 -68 122 132 8
2417 8 209 36 -78 -90 -57 10 44 -300 64 32 75 -85 -6 125 -53 103 -43 -118 -119 -180 8 -96 106 299
2441 299 31 -136 27 -29 -74 -205 -105 69 -141 77 -63 105 -2 -68 74 -160 142 -30 233 -21 250
2462 250 82 100 64 256 41 -228 74 -79 -152 -3 -14 249 187 47 211 -213 198 -122 -18 -42 -208 -26
2484 -26 -100 48 62 114 15 -61 198 -85 33 -32 -62 39 260 279 -233 -301 182 -35 -78 12 -11 -163 13 -279
2508 -279 24 -31 -452 -129 -293 144 -22 246 61 48 -31 -326 173 -105 58 -105 -114 97 269 113 99 61
2530 61 -63 -14 -150 35 -182 -5 163 13 -107 -211 -273 5 -165 36 -248 11 9 -17 -131 39 -29 -1 -136
2553 -136 -97 -80 35 -94 -52 -198 29 75 148 -54 169 -30 -56 -6 117 -136 79 -50 -187 96 273 166
2575 166 133 -9 65 198 -69 149 174 -201 32 -98 54 86 -81 254 238 54 -115 72 -105 -53 -74 230
2597 230 -67 35 -67 -35 -111 193 188 105 53 97 -53 -33 8 -102 150 114 277 0 -30 -48 278 64 -278 84
2621 84 -91 51 43 -66 -48 79 302 98 -93 7 192 187 -37 -110 -21 169 -19 169 -93 11 13 -153 -2
2644 -2 -147 76 53 155 -6 -78 68 -107 -11 111 85 -181 83 -82 39 234 -165 201 -42 47 -65 -162 47
2667 47 -20 -24 -60 -203 -30 71 194 -200 -18 -183 -18 26 13 140 102 137 -162 197 -5 209 -109 29 255
2690 255 -150 -89 7 -88 51 33 124 -34 28 290 -90 154 263 145 -15 -281 -33 -168 -213 154 -95 155
2712 155 16 -109 107 -67 -115 11 -45 22 213 154 -46 -226 375 -118 -21 17 116 -24 84 -105 -69 -43 99
2735 99 -186 -152 84 -94 62 221 96 -259 100 -158 12 -12 63 0 136 -153 75 -156 86 -270 21 -175
2757 -175 -120 -19 133 -141 -6 -295 -139 50 -86 -35 -69 -37 137 -169 -232 -17 -108 0 -499 76 -142 -177
2779 -177 -248 -227 -133 -15 -85 -240 -42 -78 368 65 -41 -63 8 -66 -138 119 -171 -8 163 -13 -73 128 133 95
2803 95 103 66 117 -133 14 99 -134 -9 141 55 -113 7 52 10 184 112 279 37 105 23 122 74 -56 145 -83
2828 -83 95 -135 133 198 384 278 -100 19 -100 184 3 -85 -82 -16 23 135 8 -82 -6 -340 254 -13 382
2851 382 -173 53 -107 -304 305 -104 80 -14 -59 42 89 119 91 74 73 -10 67 179 -28 -235 158 33 143
2874 143 -19 205 -80 206 -165 -178 -64 -117 -140 12 -68 151 -34 -63 -47 -356 115 78 -323 -181 -114 -68 -224
2897 -224 -156 -194 62 -109 -16 -98 78 -135 -140 54 186 -219 31 -17 115 21 35 113 -82 -85 -74 180 70 81 -85
2922 -85 45 22 4 70 -99 24 -75 77 251 -69 42 -26 16 177 31 -1 223 -91 -137 -55 -151 -1 -249 -38
2946 -38 -79 220 2 176 217 -196 -36 227 93 -160 239 66 -76 40 27 -209 -59 -127 83 139 -170 -147
2968 -147 34 -189 -111 -150 166 92 62 -58 45 -220 75 181 35 67 -124 85 93 -47 -149 -20 136 115 47
2991 47 -100 248 -93 83 -37 30 117 22 -14 72 -127 22 -58 93 -94 127 -33 -61 -155 35 -52 -166 93
3014 93 -315 -44 -123 -26 -12 310 -81 192 149 4 -21 122 140 22 -33 136 40 89 -109 -82 -53 7 -132 -66 -46
3039 -46 -3 -25 140 24 1 52 148 -60 187 156 -294 88 89 159 239 -86 271 -124 -115 -290 162 -51 -55 -152 55
3064 55 -106 0 193 -252 -117 -116 -110 65 -245 -99 -175 7 208 42 93 -139 -146 -39 -197 175 14 -65 320
3087 320 -67 -172 44 -218 -81 186 -260 -37 -148 245 27 97 -217 -152 93 134 -67 -148 171 -76 -46 -134
3109 -134 -39 -15 56 -4 47 142 128 26 317 -86 -115 -36 -152 104 27 -159 284 -33 -271 -86 65 -225 3
3132 3 189 -180 -54 18 86 22 -21 68 -45 173 153 -71 -50 -120 19 82 240 -63 191 -8 38 -87 4 -114
3156 -114 76 10 -61 188 23 75 -146 173 164 -17 -124 76 -144 -30 -32 180 233 243 -95 205 283 23 -69 86
3180 86 -3 -97 -30 -36 -175 203 67 50 -61 -16 131 -128 86 286 -104 -313 -4 46 120 125 -207 3 -98 -141
3204 -141 -45 36 -103 115 84 95 -28 -3 -111 137 -31 -110 -35 157 -37 -79 -20 -119 -103 -84 -193 26 -56 23 -36
3229 -36 34 -169 50 -87 25 46 70 -4 -74 168 -183 53 -173 47 29 3 24 -35 276 -55 -83 -294 81 98
3253 98 75 -92 -61 -40 10 60 93 54 -57 50 9 -156 -20 90 -112 74 -20 -262 73 37 -83 -159 -35 -179
3277 -179 -316 144 30 89 17 7 1 -27 193 -11 107 -13 -142 -96 3 206 229 -43 76 92 115 275 -157 -33
3301 -33 115 141 67 -204 49 247 63 192 -142 -90 190 46 -243 68 109 -47 66 247 190 -101 84 -95
3323 -95 -427 -148 166 215 -135 -40 26 115 -278 52 -256 140 252 -207 -59 -243 131 30 -11 -91 -124 -71 114
3346 114 -58 -16 323 -39 69 -29 51 269 70 -38 -146 10 145 9 -13 19 44 52 92 57 282 -42 -43 -4
3370 -4 -79 105 -45 31 151 40 -66 220 -147 84 29 157 -68 -63 186 79 197 -12 -253 -193 -163 -12 298
3393 298 -114 -125 80 -122 -163 172 4 111 184 89 8 -208 -167 -86 -77 275 25 -56 118 106 73 151 87 173 -197
3418 -197 -221 -45 -127 193 -208 27 -68 39 85 78 175 -95 -98 83 51 -31 162 -18 0 -220 65 -146 85 64
3442 64 64 99 -234 188 72 -55 109 18 130 54 219 -76 44 67 -176 -84 41 -175 -239 -10 -96 -8 -30 133
3466 133 99 66 -177 72 -42 11 -69 -1 -122 223 -148 -62 -219 37 3 -18 -60 -31 138 75 -10 20 68 -126 -56
3491 -56 -331 10 74 13 -52 221 -171 71 65 -107 -61 -106 160 61 76 181 -308 -55 99 167 -176 -40 -132 31
3515 31 -75 -248 -18 26 55 -83 58 144 105 -65 -117 -49 -158 -303 -112 -48 43 52 265 -26 -138 138 80 -91
3539 -91 -208 -78 16 11 45 191 -212 -3 -75 120 208 71 27 -152 65 253 73 -7 107 55 113 -176 -169 -37
3563 -37 6 -24 97 -94 327 -56 148 -70 -68 -399 -126 70 84 -45 -11 162 -159 69 -51 34 -81 41 117
3586 117 -189 -71 -52 43 -110 -68 54 -12 -1 -72 32 -158 264 127 177 107 221 90 128 -306 32 114 71 79
3610 79 -145 4 73 -299 102 -56 44 101 211 -109 -277 69 300 -43 83 194 -28 167 -36 33 36 -6
3632 -6 65 78 34 -152 102 141 -96 -144 -20 -3 25 7 25 310 -119 -47 -113 75 23 -139 -26 -108 70 -151 3
3657 3 92 -199 -125 148 -6 131 143 87 10 -43 99 88 201 -76 -226 31 -111 -4 131 17 -106 -191 -155 -273
3681 -273 237 -141 -113 -101 -226 75 -32 -1 -160 55 -228 86 167 -48 232 167 -4 -147 -162 -247 4 119
3703 119 -121 60 210 -7 -16 -99 -84 -56 284 308 161 -89 244 -15 104 126 -21 -64 -209 -135 67 -27 18 -64
3727 -64 67 59 -55 27 2 -303 -66 97 248 -82 26 20 -179 -76 -134 245 -38 -166 187 13 -188 41 262
3750 262 -4 77 -170 10 -32 -157 54 81 -202 -35 -105 -39 -86 73 108 107 114 232 -61 -32 -1 64 123 -119 -68
3775 -68 -83 230 -110 17 13 -50 0 20 -177 25 -136 -38 284 -136 49 82 71 134 -196 116 -85 -243 -76 -135
3799 -135 -129 -74 10 -178 -28 -27 -110 84 30 58 -18 -274 70 -127 -260 25 -359 93 93 -15 -83 -137 152 84 -89
3824 -89 -29 74 36 122 -90 -42 -17 -136 -150 -125 -118 24 -54 -112 -48 192 -123 -18 -154 101 -15 46 40 -44 232 127
3850 127 -378 83 -31 136 -111 -18 37 119 -12 154 152 86 -5 -218 -96 -77 345 267 -48 -8 -132 -14 41 -166
3874 -166 134 -66 -70 37 42 -24 92 -132 -10 3 -5 170 -16 5 63 -112 177 196 -240 55 35 -60 -113 -105 -88 159
3900 159 60 93 180 -32 -72 181 -41 59 1 210 -74 173 30 -347 259 -13 -59 -100 31 60 31 -24 5 -117
3924 -117 -62 -28 0 136 8 60 -25 62 36 82 75 -165 35 -101 115 95 -113 -133 -40 76 233 93 -26 56 2
3949 2 -155 -46 2 -144 -86 216 49 142 -160 -67 13 -192 65 159 201 185 -9 131 31 37 -26 -160 -137 -60 -53 -8
3975 -8 161 -131 -67 -78 -99 -80 -233 -207 -83 -117 -115 6 38 -44 -296 -50 48 40 235 -9 79 186 73 -124 -77 -119
4001 -119 4 -6 128 -134 70 369 -90 -50 9 53 99 173 51 78 -173 169 40 -170 117 -52 139 -13
4023 -13 89 43 141 -98 80 47 -209 13 -111 -8 -212 26 -156 -27 262 -73 -123 242 -143 -54 25 -115
4045 -115 -85 31 97 -201 -97 111 32 -120 102 78 46 9 -44 -51 97 -139 -102 101 -153 -21 -147 -88 -257 -348
4069 -348 87 184 6 -164 -17 9 77 -61 87 38 -153 -57 -264 108 -248 31 4 -182 87 207 -63 -55 -74
4092 -74 -88 -82 -181 78 -11 22 -64 -312 120 -54 -39 -11 -169 46 -63 -120 32 -31 -155 -26 -109 -72 -120 47 233
4117 233 155 16 -39 -154 6 76 106 64 99 73 59 -155 12 9 -53 -94 -87 248 94 324 -309 38 -80 92 -106
4142 -106 40 101 -196 81 -65 -55 -145 -205 125 63 10 194 13 -64 73 18 -100 -34 -37 99 -130 159 -47 -94
4166 -94 329 128 -58 142 -240 -184 40 -21 21 82 132 155 -98 -17 -161 85 271 -112 9 -14 -92 135 9
4189 9 -182 -102 -1 112 -103 186 55 15 -86 200 -113 -129 -130 -17 -125 -18 21 -5 -193 -122 263 -255 129
4212 129 -167 239 -161 35 -255 -178 -76 -65 101 247 -131 36 226 71 256 35 -75 12 36 10 -77 119
4234 119 -230 58 -107 -157 -157 -82 116 -368 -25 -184 -56 -25 206 -164 -146 72 90 160 -63 366 -10 81 -109
4257 -109 52 333 -81 15 158 400 118 -277 -202 -61 -69 179 -148 -51 100 -42 -141 123 -9 57 44 139 -49
4280 -49 252 107 -186 -323 -467 -62 223 168 -151 13 16 -6 -2 94 11 33 94 -5 41 121 149 113 -42 86 -113
4305 -113 24 69 194 -22 76 -80 -44 -25 -2 57 -7 -161 65 -150 205 -320 97 112 122 72 -190 -108 -270 -57
4329 -57 -64 -21 -131 26 -95 -134 239 -186 -175 175 -300 26 60 203 -246 -240 277 134 104 35 -94 64 218 -150
4353 -150 161 943 -7 -580 106 56 539 5 131 653 -96 -255 -297 91 -132 -123 -48 -52 121 141 3 121 -27
4376 -27 87 229 264 144 -139 -95 77 99 -176 -104 108 -64 -6 86 -245 33 12 195 -201 170 -125 -15 -93
4399 -93 200 122 -59 265 64 -42 90 -159 260 192 218 -94 -156 -100 111 -158 221 81 -105 106 -142 27
4421 27 -100 -95 244 -230 -66 -64 49 -108 23 134 20 -59 55 57 -101 -147 -113 -187 -39 85 -135 -38 23 172
4445 172 -59 182 183 -52 141 38 -108 -124 -99 15 -19 49 75 -46 142 18 -39 98 -127 -154 -92 110 121 -32
4469 -32 -117 -38 -6 -88 -15 -2 184 20 20 -67 -21 95 -79 204 331 -74 -57 -59 224 -102 -70 -94 86 45 104 26
4495 26 126 -90 -177 154 158 41 61 100 212 122 59 101 247 190 43 98 -123 -48 255 244 -89 -149 -33 95 -42
4520 -42 -125 160 68 5 -49 -61 177 -195 33 -100 99 -47 -17 -44 -233 61 72 -152 90 60 169 -99 -202
4543 -202 -186 249 143 -94 -143 37 -3 102 40 146 -33 91 -129 -227 81 -241 -277 -117 38 -223 54 -168
4565 -168 -38 -108 34 -4 236 -89 -254 -118 19 -23 12 61 121 -49 -29 21 -198 -274 80 65 -137 72 185
4588 185 255 -66 15 -64 -168 19 201 24 -120 -114 7 -296 -84 -81 -70 -232 54 134 312 -75 49 -64 34
4611 34 123 -84 -59 -108 -194 2 16 247 -17 -123 -246 -140 68 130 -74 28 -98 -179 65 199 -34 221 -49
4634 -49 -99 -58 -91 -13 271 -171 -92 -308 88 332 127 336 24 180 -1 31 -139 -177 25 -163 -41 35 -44
4657 -44 79 -49 -80 176 -4 170 29 88 136 -6 -118 208 106 8 124 -250 -219 82 177 -86 -20 -77 182
4680 182 16 140 10 180 114 46 -58 -34 135 132 -92 258 40 -39 -118 -90 -117 -119 46 -124 257 -239 -121 -132
4704 -132 110 -78 36 133 -89 -311 -66 -129 21 -158 3 -266 -104 -167 84 -10 -171 105 0 125 157 -45
4726 -45 101 -86 -44 61 -108 -25 -14 -19 56 112 -155 4 155 77 80 -136 -173 -61 103 42 -64 -32 2 22 152
4751 152 245 -26 -316 78 -181 -84 -275 15 49 30 -116 81 59 145 -44 153 68 -163 -35 -109 28 -104 -209
4774 -209 -50 -50 -131 24 15 127 87 -221 -117 -114 -112 -164 -188 279 28 -58 -60 9 -107 27 18 28 -240 -323 15 111 -5
4801 -5 -156 -149 44 179 -71 -38 248 52 -357 -145 -125 15 -116 54 26 73 112 93 0 40 -64 -140 -150 117 149
4826 149 -13 175 -11 -32 111 113 46 -91 29 80 104 -35 -88 -17 -43 -138 128 12 18 171 -15 208 -129 54
4850 54 -20 213 -21 13 121 30 -7 -30 -123 -19 54 18 -21 -227 196 107 -11 -164 -87 157 7 113 -75 242
4874 242 -92 -124 -3 128 49 108 192 -180 -9 21 -55 70 -209 31 -92 -30 -91 -189 -184 33 -166 44 -84 -66
4898 -66 -123 -122 -75 -107 -266 95 -215 109 -120 -63 -31 77 -215 -9 -121 -181 -172 -86 -59 -83 33 -149 -68 1 13 117
4924 117 31 203 -44 -92 -15 40 291 -321 -9 167 20 -76 -85 -218 34 216 149 -98 -67 -155 361 -38 -205
4947 -205 30 -83 -157 -34 111 -33 89 -66 -217 18 27 125 111 -89 274 80 35 126 91 195 82 -3 -59
4970 -59 126 -233 41 -21 127 97 52 174 -181 -76 -11 113 -184 -14 248 -130 -205 212 -131 167 178 24
4992 24 266 137 35 218 139 -22 123 -34 -10 -61 -203 -92 -49 -18 68 -82 1 -43 92 119 142 108 -161 -136
5016 -136 -92 -63 157 45 146 -167 -74 278 -34 -29 54 11 -56 -9 -79 -271 44 20 93 -140 -1 35 -165 265
5040 265 -240 -29 -444 175 -68 -117 141 56 43 126 4 -32 -73 -102 -112 187 229 17 311 49 98 162 106 107 18
5065 18 30 147 19 -317 11 90 -30 -113 -122 -8 238 -11 -46 -91 37 -12 106 249 -77 -26 -44 -112 -72 47
5089 47 -176 -70 96 -63 -9 -4 4 -268 71 297 10 -46 -16 91 108 -66 -57 146 -141 -191 106 -75 101 -68
5113 -68 33 178 -22 -58 13 22 75 151 -332 38 -77 37 250 94 20 -36 123 -92 27 -125 -145 -96 259 14
5137 14 -132 -157 -35 214 -112 -90 5 -26 2 10 17 114 129 187 -150 117 48 -122 94 206 243 97 -217 97 -55
5162 -55 -16 179 144 -192 -40 15 118 -134 102 348 -96 -36 102 30 -96 -21 -60 -217 -148 -79 138 324 65
5185 65 2 -154 -23 46 150 -125 5 -41 -104 -113 13 -10 431 66 -16 -101 54 -95 -167 100 -85 132 86 -58
5209 -58 -20 -59 -52 -68 113 -23 -194 123 -11 31 -212 32 -60 -160 -200 -133 63 31 207 -80 157 -162 98 65
5233 65 -21 -61 4 -113 -125 213 66 169 97 59 -1 -76 -283 62 -19 21 -3 128 133 209 -101 42 35 213 -21 -117
5259 -117 49 -78 -109 107 -132 62 48 -185 123 89 353 152 18 245 -15 188 94 -1 90 175 -85 -48 56
5282 56 49 -55 74 224 -146 75 -144 -249 -34 -65 5 18 -35 -115 -7 -61 -67 -107 -132 -40 16 266 159 258 139
5307 139 164 -115 -7 6 -25 158 181 -38 238 -37 109 -22 -157 -116 -186 -293 -50 54 115 -42 46 44 12 -68
5331 -68 -32 66 -20 -8 -10 -323 -203 -118 -309 -67 54 -92 -85 73 123 -168 99 -32 -37 -106 -60 -31 -129 -174 -27 21
5357 21 -168 60 -203 168 62 14 148 -52 66 206 -5 29 -140 -299 -169 99 138 -99 71 71 -50 57
5379 57 215 -98 304 10 106 -23 82 -10 5 -157 162 -53 107 89 -254 164 45 100 -29 98 111 80 3
5402 3 47 -13 -34 -28 -79 -136 0 -38 -52 98 -24 58 83 -164 203 -210 -178 145 -340 -15 -209 39 170 -82 -172
5427 -172 105 139 -43 -9 32 14 11 -216 -56 -237 109 -194 -131 47 217 -64 -35 -104 139 -244 5 48 -67
5450 -67 166 157 -156 10 109 14 -278 -40 249 101 57 25 28 -159 -9 188 65 -6 -144 -221 -140 74 -79 111
5474 111 23 -227 24 92 70 151 -174 -53 54 -26 -129 121 -146 -109 112 -51 114 225 -113 76 456 9
5496 9 197 -159 15 109 -53 -273 16 119 12 -20 12 42 -258 -16 -142 -62 7 230 -15 301 42 123 99
5519 99 -201 22 -170 -63 -76 -140 -36 -66 147 21 -59 47 -194 -156 41 -61 18 144 95 -140 69 31 106
5542 106 71 167 -117 -25 258 58 63 188 41 -65 67 99 38 -130 -83 -91 107 67 72 -18 60 261 3 -77 -29 -71
5568 -71 -178 90 58 6 151 -98 -72 -82 76 14 -41 -62 191 42 21 -38 98 -240 -56 -455 7 -76 -113 -18
5592 -18 34 -179 -194 218 -119 72 -117 33 43 -249 70 -88 -68 78 52 -106 -106 354 22 234 -124 123 57
5615 57 156 -60 36 -165 -83 94 27 194 20 10 146 9 -249 -73 -142 104 231 161 -227 -120 5 69 -210
5638 -210 -72 -35 -77 36 94 -131 -1 -52 47 135 33 -19 104 134 269 -271 -6 -48 222 -16 106 -120 83
5661 83 98 -91 41 -39 182 387 -62 -178 117 404 -68 -3 139 -113 301 -8 -23 -20 167 16 73 51 133
5684 133 260 -165 -40 -48 -67 -112 131 56 -35 -18 -94 -18 -118 -66 309 -123 -38 -36 133 98 33 97 -211 -159 -167 112
5710 112 70 -85 112 -26 16 -4 22 61 -44 138 153 -20 194 234 198 13 -166 35 117 34 68 -142 -129 22
5734 22 -16 281 -7 47 -118 -274 96 -84 -185 -122 164 242 113 -11 -15 142 130 54 -65 -33 -25 -119 -6 40 -184
5759 -184 118 77 200 -139 -8 268 119 -2 178 -153 19 218 -241 -1 90 15 -159 -60 324 -126 -14
5780 -14 -102 14 -57 -180 -9 42 29 225 -119 -65 130 154 61 140 16 -31 102 -156 -85 -93 169 -84 -94 62 66
5805 66 99 19 1 -156 191 150 99 -70 10 76 -93 191 385 139 137 -37 11 185 -23 291 -71 68 -219 278
5829 278 321 232 -74 36 -124 -1 -149 55 -2 -110 -74 8 -161 -157 154 -99 16 48 -20 -137 80 95 -49
5852 -49 -147 96 10 189 117 -84 -129 14 179 -87 12 -53 90 201 -83 58 -56 -34 42 -37 16 203 44 182
5876 182 -115 -25 160 11 20 -81 65 61 103 -270 -41 34 -16 -100 86 -225 164 280 -163 44 193 44 -184
5899 -184 188 -45 111 -163 71 -31 103 -147 177 -12 -23 -146 -131 -101 -38 128 71 -30 -40 -80 -57 -83 155
5922 155 172 -40 -175 64 32 4 -114 87 126 52 -6 231 -58 40 296 -51 -86 54 65 -17 86 -174 114
5945 114 7 -106 60 105 -133 168 -209 -103 -192 42 16 -149 91 -74 182 -36 355 -114 135 -80 -13
5966 -13 50 -27 40 -55 107 178 323 -251 -233 116 98 27 148 68 -47 -188 12 15 323 58 -116 82 -164 146
5990 146 -13 135 169 20 -115 -96 -110 -110 -102 45 -32 -107 -227 -16 -220 -29 -39 -52 -46 -186 -131 197 3 -236 -22
6015 -22 -193 -165 -224 78 -52 -11 104 -325 -183 9 170 -26 -243 352 28 -60 173 54 61 -100 15 120
6037 120 13 -43 -286 -143 -238 -53 248 -211 20 -94 163 29 -150 54 -13 -195 216 -197 194 218 32
6058 32 -60 32 37 -92 -45 73 -254 -98 -113 29 -114 -221 26 -112 60 -11 -93 121 -128 -155 -81 -193 -170 -82
6082 -82 -59 -126 168 101 -138 -248 173 -45 -147 25 33 -102 19 58 -136 -40 -88 -13 22 147 9 40 -65 -184
6106 -184 -68 100 297 31 -21 21 -225 -50 -142 18 -28 45 -137 114 -81 175 -36 220 3 64 -11 -215
6128 -215 -283 83 253 10 111 -176 -100 -127 49 -274 -6 -207 -47 131 -149 62 -82 -53 -189 19 174
6149 174 -49 102 -59 100 -128 -270 -129 -103 69 28 -99 -1 -76 -163 -132 20 -136 29 47 -51 -52 109 23 55
6173 55 -54 162 283 17 54 234 214 149 -90 120 -25 -344 45 -287 71 61 -75 -101 214 167 50 -81
6195 -81 -7 -149 -305 210 -250 -22 54 55 14 57 143 -8 3 -82 -87 61 -96 95 33 -58 -34 40 -193 124 16
6220 16 -72 136 -219 -98 -5 1 -169 41 -95 12 240 -122 177 -23 -218 180 -46 62 207 80 105 13
6242 13 -283 47 -72 -88 230 78 -38 -11 -234 121 115 25 237 -201 -39 -41 154 150 77 178 60 87 163 114 -252
6267 -252 -59 -242 194 52 117 -94 -203 118 -32 -121 168 63 -85 -81 383 133 -142 -147 176 -117 69 -34
6289 -34 7 -58 -158 -235 -181 -166 314 -200 36 -114 74 40 -121 122 51 -146 89 82 80 174 2 70 -112 -179 -94
6314 -94 95 -69 181 177 -79 41 90 -37 54 122 49 85 124 8 -12 -42 124 248 -146 -195 -112 59 -95 27
6338 27 -182 129 86 -160 106 -144 98 144 -162 -96 -87 3 -39 -235 97 136 -129 -127 77 -123 152 21 223 -78
6362 -78 -111 -200 51 21 -126 108 -68 -236 77 52 103 12 -196 36 -28 -36 161 141 35 -62 162 -69 -223 27
6386 27 19 169 65 -62 -89 49 -78 101 8 -23 54 -177 -77 97 299 -94 24 -81 193 113 0 -45 106
6409 106 -38 135 -66 -189 -10 -190 93 -220 -257 35 135 67 53 30 176 40 -24 79 -59 35 20 107 -263
6432 -263 45 -126 -13 28 -139 80 205 85 -108 13 -18 54 -50 -75 -257 -134 -194 -88 100 -56 219 55
6454 55 -89 66 -96 -90 -85 15 280 116 149 263 42 -116 -118 -53 -128 -83 39 66 29 34 -5 316 -41 108 -152
6479 -152 -149 -56 52 9 -116 82 140 191 -83 -88 -193 -12 91 -176 -42 -138 80 -230 -35 165 123 9 140
6502 140 -5 -146 -184 220 114 27 55 -164 202 241 -54 -143 -24 59 70 27 -200 71 -196 128 105 61 -70
6525 -70 -59 -26 127 -135 -125 -35 -200 19 -68 -26 7 235 -53 -132 13 -64 -107 -11 -39 163 147 -61 51 -141 18
6550 18 -67 57 -115 -3 82 -159 -162 -105 -10 -79 -46 139 127 26 -159 181 101 -11 -37 26 -69 -39 43 158 19
6575 19 -66 -1 -47 56 97 184 -40 -173 135 347 -85 41 -228 31 47 -6 -6 105 -105 -76 50 79 89 119 116
6600 116 244 134 87 -43 -27 -13 59 -57 -20 146 1 263 -2 155 -188 211 -87 -105 -184 30 159 -161
6622 -161 25 -39 -222 58 -59 -14 8 -155 -62 -40 -27 95 150 -112 151 -185 12 -73 -124 6 -46 -13 -116 151
6646 151 69 -21 -123 183 157 50 -134 -158 73 103 147 -118 -13 -142 -202 -226 177 -228 59 -192 -101 81 19
6669 19 55 -24 188 39 -241 -242 184 295 -8 4 -31 10 202 110 -47 -158 38 -104 -156 -186 -236 12 51 -36 -168
6694 -168 40 58 94 178 -7 -268 198 -24 -63 -27 -155 33 -309 210 -85 -146 104 -58 10 98 -37 91 166
6717 166 105 -267 87 -185 15 -49 -148 140 -46 -93 94 8 255 50 -18 284 178 36 -2 91 -93 148 -125
6740 -125 -11 74 82 41 140 -101 5 31 -99 -115 -15 76 122 107 99 95 345 -52 221 39 97 21 -122 -118 -38 -182
6766 -182 -21 9 243 275 161 50 84 -165 20 79 200 -191 45 22 -116 55 218 -86 -15 -27 -29 -78 -36 81
6790 81 -24 80 19 23 -174 154 272 7 -99 -129 236 121 121 -6 -96 -33 -85 -83 78 25 85 -299 -190 129 -128
6815 -128 13 -13 -208 -238 -10 -40 -3 209 196 49 44 6 90 154 -191 -66 -252 14 53 155 207 -56 -12 230
6839 230 57 124 -217 82 211 39 -153 218 7 51 75 106 61 59 151 -173 -57 -269 105 20 249 -143 -144 -87
6863 -87 1 171 14 2 275 158 26 -349 87 249 108 70 110 -90 -294 -6 117 9 95 -50 183 -44
6885 -44 -81 41 -73 -188 -211 -94 72 -262 135 -103 299 -93 70 283 -1 35 -114 -225 -114 35 -67
6906 -67 -393 64 68 -1 -52 30 -126 75 -353 -47 259 148 -181 165 6 155 -110 -97 -105 71 -191 -35 -38 27
6930 27 40 96 269 -81 232 -78 -123 -58 -37 65 47 -57 110 244 -30 315 -49 41 165 -170 171 -101 185
6953 185 149 111 -106 22 -201 41 197 -13 75 -50 41 -16 -34 -237 -224 -38 45 66 231 106 -55 211 51
6976 51 -99 -87 64 206 31 -80 160 -152 -175 -121 180 -46 125 -95 49 59 -19 238 64 -16 113 -10
6998 -10 34 231 60 17 -119 -85 -52 109 -160 136 -25 177 57 -9 239 152 -1 -223 -71 -130 -125 -80 -123 -156
7022 -156 -46 -126 -26 87 20 338 -41 -40 84 22 128 16 -55 -105 466 -255 -181 -115 -76 35 -159 147 49 61
7046 61 -68 -93 251 24 -190 -31 -219 -167 240 32 72 -166 30 59 59 121 250 118 -131 -149 -71 78 19 -88
7070 -88 76 -159 125 -64 125 134 -188 35 69 -34 123 -126 -26 -120 -181 -111 -70 115 -13 36 -140 166 -185
7093 -185 -141 -367 190 -32 -47 -76 65 -58 50 349 85 -145 141 -150 116 -24 -27 -6 -308 -175 49 -35
7115 -35 -77 -44 51 259 -162 9 -98 -80 133 15 150 -117 110 94 257 138 -1 15 11 112 132 84 10 -117
7139 -117 175 54 -75 35 -78 107 -74 -103 -116 6 -43 22 32 -133 7 74 5 -88 -202 79 181 272 -143
7162 -143 -165 134 100 196 107 -31 -416 -45 50 -130 72 32 8 138 -168 21 59 -102 -45 -144 -102 -37 114 -244
7186 -244 -38 176 -9 -68 -96 29 186 -13 145 172 102 -60 134 104 16 -51 150 87 89 -129 59 165 359
7209 359 81 -19 -80 186 49 30 191 83 22 138 129 134 142 -45 -28 45 120 -39 114 177 34 11 160 -17 -135
7234 -135 158 -74 95 -109 -59 -1 62 -155 63 100 36 -43 74 191 31 -113 165 35 216 28 -55 100
7256 100 146 -27 -39 -103 142 -142 169 149 -285 -172 -175 -131 -245 -77 -17 148 117 -194 -265 118 -159 107 -21
7279 -21 29 -135 -120 121 32 140 -183 372 -38 -182 123 158 138 -7 29 5 109 44 -93 201 -69 26 172
7302 172 188 -88 -67 193 -16 -168 26 -41 -51 -108 0 -32 -49 -76 56 0 11 -39 -36 14 34 128 111 -214 -35 -101
7328 -101 47 135 -130 -103 -108 -62 -38 -80 -154 122 23 9 -33 -150 -76 64 236 91 -80 93 -85 -198 104 -77
7352 -77 -284 119 225 -51 59 86 79 76 185 130 150 -34 -57 -94 -16 -78 26 52 130 59 -28 -63 -118 -183 130 46 -212
7379 -212 172 13 -108 4 87 156 -82 10 -116 -38 69 107 162 22 -86 76 100 63 55 -293 73 -103 -146 73
7403 73 -45 135 61 -10 -136 -153 88 116 -297 -59 -13 5 -141 -109 -163 -189 -112 -61 -251 -27 -22 50 157 -35 -29 65
7429 65 19 -44 -15 84 418 48 -81 -63 -280 42 -73 -208 158 64 -42 -215 -90 -12 -27 -51 51 -81 -128 -77
7453 -77 83 -36 111 169 43 -215 258 -20 -132 -50 7 27 -58 -206 -24 -115 -479 -11 -168 148 -129 -155 5
7476 5 33 167 -35 217 94 -23 273 -110 -192 -32 -117 -17 135 -245 -65 172 -9 67 25 -23 -32 137 14
7499 14 27 -73 -20 211 -182 81 -23 132 33 -107 53 -20 -7 -69 17 9 80 -110 288 -74 36 -47 -8 -243
7523 -243 15 332 -113 192 -47 102 -69 37 -154 -3 46 68 8 121 -52 -32 -167 -46 -47 78 66 -43
7545 -43 -107 328 -11 -188 -178 138 100 -38 108 109 -176 -54 -28 -322 -35 2 66 -68 91 0 8 -70 28 -235 -105
7570 -105 324 -188 259 -168 -279 -90 7 -144 -13 -41 -173 166 220 137 12 104 188 -45 -63 82 7 80 -213
7593 -213 -73 151 -58 -120 -207 3 69 220 -74 -115 -69 -46 -14 -52 -88 -105 180 -41 -16 76 -75 -22 -124 -33 137
7618 137 -32 190 -174 -59 -71 15 217 -11 -90 -9 81 17 -144 115 -30 32 46 203 58 -111 -157 250 -110
7641 -110 -130 54 18 -133 31 -133 -64 13 -146 147 110 332 -249 -1 -281 -38 -24 139 -157 107 24 57 360
7664 360 -40 147 -337 -172 23 -100 -32 -161 102 -127 -79 244 -89 277 96 -26 15 212 -27 -56 -132 -1
7686 -1 -99 87 4 -41 -151 -102 -208 2 -101 -130 -60 -115 -124 -132 -143 -8 -142 -48 159 -201 111 10 25 108 213 -162
7712 -162 -79 -322 -91 -296 98 -49 -75 8 10 55 -98 -15 28 184 64 -47 55 128 11 -244 40 93 221
7735 221 52 109 -13 29 51 -73 38 -40 271 -24 215 205 -2 -2 -29 207 -86 -49 -173 311 -214 -129 29
7758 29 -214 -151 -57 -98 -199 36 75 -25 -10 -18 -106 -20 25 25 4 -41 -46 -66 20 -33 2 -119 -79 206 295 -183 -147 39
7786 39 -48 106 -94 20 -28 85 92 -31 154 2 199 54 95 -71 -27 -71 -78 71 14 -49 -35 135 -103 -194 34
7811 34 198 20 -165 51 -18 241 110 86 91 -154 161 -46 -137 -58 12 276 -106 65 102 -206 46 -41 57 2
7835 2 -38 -158 -27 267 -130 -121 27 -105 242 -72 43 -119 -111 -34 68 -71 30 45 32 357 69 -2 -107 140
7859 140 12 -5 203 -8 -32 -65 72 -45 -99 -9 -258 114 36 118 211 -95 -77 47 -6 0 -190 10 195 -4
7883 -4 128 -33 97 -131 -117 -61 -88 27 -41 6 266 -9 -8 38 125 -174 -34 46 154 -90 57 110 80 40 225
7908 225 -43 -59 -149 -46 -76 -56 11 119 -186 -46 -22 100 45 -49 70 14 174 89 -26 84 108 65 128 79 128
7933 128 -122 -130 285 -108 -48 3 -57 -155 -87 58 55 -64 40 -130 63 290 103 279 -159 113 118 -18 11 79
7957 79 92 -78 -21 90 41 135 128 90 -120 121 185 -38 -56 -123 20 -117 -98 45 74 -135 81 79 -7 120 -59
7982 -59 100 49 199 -42 -19 -246 -41 -108 -107 2 -11 121 -316 -37 193 -32 -103 83 -29 191 245 -8 -216
8005 -216 -59 -50 156 -32 227 5 77 -72 8 30 -4 -303 -43 15 265 -140 44 1 -62 101 52 196 -260
8028 -260 -66 4 -107 80 -6 -60 -58 -158 6 -33 -17 31 -142 212 -32 -144 -176 70 76 -169 204 47 -119 -154
8052 -154 148 117 56 -123 -58 -180 -170 -43 53 137 -62 -86 161 97 -107 152 -18 16 -13 -33 23 87 15 -81 38
8077 38 152 -120 -110 -14 61 54 86 100 45 -125 -60 -210 -93 165 -6 105 -18 -13 -85 -48 90 -105 195 -195 252
8102 252 363 -46 138 70 -59 103 9 -5 9 -90 11 53 8 111 87 -5 -173 -107 -69 10 323 -33 281 132
8126 132 -16 168 -148 86 -76 219 -135 -124 -194 -332 -39 152 -43 128 -10 172 -125 -75 -78 48 54 14 101
8149 101 -120 -4 88 62 102 41 120 -258 13 -173 45 69 -201 -48 55 6 -181 50 -10 -127 -63 337 -50
8172 -50 -98 118 -36 -131 -21 20 183 -4 -252 161 -26 202 152 228 120 -169 -55 83 210
8191B10
$$ Imaginary data points
##PAGE= N=2
##DATA TABLE= (X++(I..I)), XYDATA
0 0 0 0 0 0 0 0 0 0 0 8 -8 8 -8 16 -16 24 -32 32 -40 48 -64 72 -88 104 -120 136 -160 184 -216 245 -280 320
32 320 -361 408 -459 516 -579 651 -725 809 -900 998 -1106 1225 -1353 1494 -1647 1815 -2000
49 -2000 2202 -2425 2669 -2943 3247 -3588 3973 -4411 4918 -5504 6198 -7034 8061 -9356
63 -9356 11043 -13346 16679 -21929 31442 -53955 211457 107645 -206030 212069 -68722
74 -68722 43693 75494 -36202 110318 -30433 -51198 105780 -47889 -8076 35655 -8677
85 -8677 -54414 -16995 60482 -56134 -38984 -37193 11786 40194 -106362 41325 -26988 -52776
97 -52776 56214 -30924 19292 -7903 -38114 32608 -26372 47972 25337 -58571 47421 -47656
109 -47656 42075 68090 -80927 37934 -9711 22076 840 -31126 72451 -43541 -7208
120 -7208 28505 -16826 29351 -37228 6146 30996 -55945 62458 -14748 -71951 38211 1988
132 1988 36037 -58829 -5312 42635 -71972 28257 7317 2368 -13181 -46407 46899 -36112
144 -36112 -6504 71999 -86494 1376 53442 -43232 42621 -36559 3853 54501 -44629 22204
156 22204 26899 -15633 -3957 40653 -8943 3570 45609 -50216 8432 36586 -10882 32534
168 32534 -37709 -19291 54811 -51277 29636 9638 -65070 50452 -42148 -8783 23573 -23980
180 -23980 8849 -46846 11512 20800 -25586 2325 -16618 7568 12943 -19272 20984 -26650
192 -26650 -785 43902 -34563 18782 1493 -2732 -85 -16734 54490 -15173 -17444 9152 -12694
205 -12694 18697 8437 -936 -11523 -14192 22702 -2402 -14448 17241 -11894 1748 -16133
217 -16133 13335 18214 -36662 25359 -17888 3256 28908 -27151 6221 -12772 12772 26896
229 26896 -29079 1864 16834 -16753 5471 14081 8993 -18283 2724 10855 -26763 47429 -11427
242 -11427 -20474 14757 -27852 50624 -19430 -29378 47474 -33199 -1838 26989 -29179 16959
254 16959 -5610 -14525 23116 -21610 13973 -3848 -24746 12277 15804 -1750 -30510 15339
266 15339 -7429 -3462 20400 -19637 3750 -5615 -7601 12947 -9930 11306 4312 -32618 18582
279 18582 5689 -601 1893 -19143 22563 -14935 12667 6671 -26412 23253 -5759 5541 432
292 432 -6561 20121 -24354 1394 32303 -18666 6006 -5997 -8838 26728 -15939 21178 -13464
305 -13464 -21377 36364 -14472 538 5872 -1249 -3432 -10283 15570 2089 -6644 -1587 -6680 8716
319 8716 -323 -1450 6964 -30988 24226 11963 -29571 19718 -13684 2333 3720 -5341 15836
332 15836 -12786 -5182 2491 1790 4631 5845 -2538 -19478 8157 21354 -20273 7481 1068 -16485
346 -16485 22207 -21614 13135 2872 -27168 25515 -19963 -15 17216 -22048 -4136 883
358 883 7274 3885 -18351 5352 -981 -3920 16359 -9114 5696 -7559 6815 12301 -15429
371 -15429 29110 -7374 -12635 14351 2252 14853 -7767 -4225 11860 -8467 7777 9585 -16686
384 -16686 4531 574 350 -4289 -2926 8526 -17974 2808 1132 5485 -5559 -16881 16596
397 16596 -12069 5957 13179 -23003 5672 4857 -4421 12171 -12086 6966 2997 -19837 22924
410 22924 -4104 -3168 2119 -9566 8686 -6167 11424 -8658 -12385 14769 -4312 143 -1222
423 -1222 -5535 8570 -9982 3322 14612 -19458 9139 -55 -7240 13654 -3449 1890 -13052
436 -13052 4325 10072 -5563 60 -5320 3828 -6116 355 10567 -11554 -1051 7046 -12047
449 -12047 9262 2654 -4522 2061 -10848 21043 -2740 -7652 10568 -6261 9147 539 6092
462 6092 528 -7267 11563 -1587 -982 10009 -5358 -2738 -3886 3416 12599 -18859 4857 -2239
476 -2239 -10733 14300 -12379 1424 -5869 -5699 9789 -12062 2405 4881 -11981 557 4948
489 4948 674 -249 -6050 4725 -2878 5881 5961 -9243 3361 -4097 11201 -2752 -4972 12479
503 12479 -13600 1739 6776 -1526 2325 -5864 -353 1472 -2665 8732 -5445 -7710 6113 -539
517 -539 5560 -9365 6739 2041 -11960 15861 -5283 735 2641 -7237 9326 -2702 3062 6160
531 6160 -14148 4769 8959 -5808 4478 -5737 2631 -1544 -1414 9572 -9261 3290 -2494
544 -2494 -811 3344 -2244 6328 -9972 -1523 9543 -4141 -102 -69 -4618 4660 -3249 4369 -378
559 -378 -9582 8426 -5551 1146 2197 -1923 -1757 -8193 10119 -1740 -3237 1255 -5448 3014 -460
574 -460 878 2453 -9817 5043 3877 -9986 11556 -4439 -2692 1925 -3423 11600 -8544 533
588 533 3472 -5483 6275 1415 -623 -3487 362 7366 -3257 -508 6241 -7132 2670 1105 3222
603 3222 4054 -10167 7714 -3034 -170 8319 -5185 -507 -2170 4615 660 -3542 2490 -1726
617 -1726 -2283 2136 422 1701 -4619 -1128 3892 -6311 8445 -4435 -5718 5291 -4254 6976
631 6976 -5400 -1372 3128 -6864 5800 1778 -3836 1480 -2429 441 597 7 5444 -10415 1374
646 1374 4755 -3574 3798 -6708 4259 -2928 -2699 9428 -7930 -847 2730 -2185 1340 -214
660 -214 1805 -1076 -6243 6997 1602 -2748 1400 -2580 3892 -3554 6382 824 -6601 6478 -2499
675 -2499 3658 845 -739 3507 -5463 2909 5546 -3992 1627 -702 -998 4192 -2934 3839 -4992
690 -4992 -637 5402 -5919 5069 -3194 -1020 -355 -3244 6095 -4279 -1546 1776 -5523 2907 2180
705 2180 -3998 948 -4592 5210 -431 -4465 7291 -6806 846 1532 495 2362 -5205 4477 -1782
720 -1782 -1506 5155 -799 -2615 -1284 2272 3653 -4930 1859 2001 -6379 5129 -975 944 -2241
735 -2241 -3249 5330 -5318 3319 872 -3985 26 -842 4082 -1729 -2541 3319 -2961 827 4097
750 4097 -4193 3388 -3137 884 4551 -4119 6693 -4219 -615 4649 -1436 3256 -2205 413 470
765 470 -167 4095 -1443 -2788 3077 -2032 1212 95 -421 1268 -7205 5278 -403 -3388 1586 -3975
781 -3975 994 -3091 1926 1159 -6206 705 1111 -2158 80 -710 297 -2602 -1340 6206 -3891 -57
797 -57 814 -1473 3268 -1759 4719 -3330 -1467 4993 -1487 2383 -36 -453 1220 -1389 2754 2027
813 2027 -3809 3446 -2217 123 3320 -3048 1786 -4201 2356 1045 -3195 3050 -3746 -224 734
828 734 -40 1220 -2702 -184 1845 -2940 3228 1019 -3582 1317 -885 3462 -1857 506 1873 -3513
844 -3513 3242 -159 1891 -1643 -1598 3803 -2533 733 2872 -3159 -502 823 256 1486 -3866 2316
860 2316 -1160 -2178 4184 -3064 514 -2212 435 1235 -2962 2629 -2418 -2464 1275 -372 342 -674
876 -674 -2094 1358 -2000 1883 1137 -3919 2489 -1875 1870 277 -815 2370 -3708 3108 1558 -865
892 -865 1394 -374 450 763 1193 2681 -1892 -582 3235 -1350 2101 -933 743 -987 -2494 5345
908 5345 -2785 -146 421 -1590 989 -1134 1648 -1374 -2947 1716 338 -1856 879 -1445 550
923 550 -1489 1111 2498 -4381 2776 -1631 78 2428 -1579 1809 -2690 569 1995 -1349 674
938 674 -394 -1354 1399 -171 872 -760 -1388 2427 -3101 2323 161 -2157 647 -2068 2905 -1716
954 -1716 -1030 1538 -2480 399 1694 -101 -608 -1166 1187 554 -1600 3128 -1948 -595 1351 -37
970 -37 2427 -2847 2241 -43 -1525 3240 -369 344 -976 462 1629 -1165 718 1145 -2842 1631
986 1631 695 -235 807 -2503 2314 -2155 857 1624 -2984 1129 -802 687 58 -725 539 -1689
1002 -1689 -248 1513 -1292 290 -531 -1209 1628 -1722 2388 -1150 -1967 2489 -1440 1117 -752 292
1018 292 -643 -1439 2405 -595 -858 414 -587 -34 253 -284 829 -3007 1180 1213 -1796 2113 -2004
1035 -2004 651 -542 359 2021 -2285 808 127 163 1049 360 736 -970 -471 2828 -417 -323 1441
1052 1441 -1844 1618 -403 1369 128 -2090 2709 -1379 704 727 -934 -318 -888 1188 317 -1108
1068 -1108 101 -874 -985 1946 -1032 101 -1340 -138 1023 -2038 1965 -1408 -706 151 -13 1530
1084 1530 -1988 627 303 -1430 953 795 -1306 109 -503 1090 -252 -635 1824 -2388 1215 446
1100 446 -30 632 -1917 1467 -1290 408 1430 -1129 -217 119 330 590 -877 512 51 -1802 2088
1117 2088 -821 58 -26 -809 988 -1579 2315 -674 -1276 1405 -249 681 461 -75 627 -188 837
1134 837 1550 -1347 1064 -115 -83 1053 -548 1680 -2254 664 906 -1028 646 -1434 282 -1027
1150 -1027 -260 1015 -1743 -838 576 -1264 185 133 -924 113 -2168 2249 -802 -428 1216 -1596
1166 -1596 1198 -245 1098 284 -1176 1169 167 -152 860 -19 -4 -388 184 1326 -1510 490 -233
1183 -233 -1580 1627 -871 766 -1651 -295 1213 -1235 1189 -277 -918 257 340 608 209 -621 1166
1200 1166 -897 493 1438 -1009 1188 -1108 1477 53 -738 1682 -1709 470 416 24 190 -864
1216 -864 555 -104 -598 1130 -187 -1037 348 -511 1138 -777 382 428 -1689 1841 -571 95 -82
1233 -82 -682 706 -647 338 127 -1406 -194 236 -247 196 -933 466 -646 -125 1784 -1531 574
1250 574 -316 24 776 -429 1444 -1109 349 1049 -219 402 103 -169 478 -258 932 -81 -1058 1406
1268 1406 -995 428 -57 -370 618 -1449 1396 -93 -332 342 -514 385 -43 544 738 -915 -53 949
1286 949 -841 1316 -351 4 330 -452 1701 -1103 617 147 -792 525 -158 224 -809 -436 737
1303 737 -370 -165 533 -1182 191 -61 -94 262 -1172 1040 -874 -45 680 -692 185 -1045 780
1320 780 -46 -603 326 -645 -240 500 220 175 -341 -220 727 -924 1019 -101 -732 695 -591 1245
1338 1245 -715 83 476 -1060 920 460 -56 129 -91 144 318 -489 884 -817 100 600 -194 859
1356 859 -687 764 -244 -100 1126 -623 201 -20 65 121 -168 334 -375 -861 588 4 -542 361 -578
1375 -578 179 -836 553 241 -1353 900 -775 183 -161 -242 338 -1021 332 468 -417 134 38 -223
1393 -223 408 -323 1075 -719 -297 1014 -600 572 -369 -52 223 -577 936 -484 -2 132 -245 149
1411 149 413 -187 143 -753 572 223 -515 863 -1013 482 -107 142 364 -872 960 -323 5 625
1429 625 -25 133 -133 339 555 -253 386 456 -986 971 -108 94 -29 -511 1122 -899 822 -65
1447 -65 -601 24 -312 533 -174 -298 56 -663 -161 426 -439 81 -378 23 571 -708 962 -655 35
1466 35 482 -267 528 -645 77 32 -248 464 -47 -436 373 -219 210 -31 -300 447 -799 650 63 -173
1486 -173 193 -359 358 -676 607 214 -764 322 100 0 152 -13 154 -215 -187 943 -428 -29 466
1505 466 -306 587 -417 999 -367 -190 619 -428 141 -73 -200 -178 -206 319 37 -719 250 -334 -265 525
1525 525 -447 552 -683 381 97 -416 393 -428 -7 -222 68 396 -236 -16 156 -487 136 -58 -420
1544 -420 92 -581 564 -430 55 384 -889 676 -223 224 -224 -212 676 -123 209 359 -222 -163 215 255
1564 255 208 -706 335 -94 27 718 -366 27 -499 42 346 -450 586 -268 -207 223 -61 114 4 127
1584 127 89 -277 255 456 -463 514 -21 316 -72 82 581 -766 182 -54 -155 -39 -336 -125 -213 -267 547
1605 547 -651 -575 145 -433 188 -530 -55 91 -545 724 -574 -6 30 -278 343 130 374 6 -324 503
1625 503 142 -285 61 -207 140 -276 14 449 -841 290 -26 -28 400 -299 562 -574 9 303 -196 -13
1645 -13 -64 -178 59 206 243 -229 -511 360 -281 211 37 -340 299 -433 439 -138 139 44 -511 95 197
1666 197 117 -7 -57 64 160 -231 483 -148 -207 304 -75 266 -685 335 -243 -549 346 -108 -156 -245 -37 117
1688 117 -273 21 136 -330 249 150 -89 0 -547 300 -386 130 217 -486 198 -235 469 15 28 300 -200
1709 -200 -53 550 126 -33 -109 297 341 -153 380 -214 -297 498 -180 515 -130 -104 2 -218 587 -117 -43 42
1731 42 -231 24 112 196 311 -390 -112 338 -236 317 -146 157 -116 56 329 -598 192 -161 -92 67 78 -70
1753 -70 -200 -25 285 -309 -232 -148 -569 171 -20 40 -21 -348 490 -197 184 -186 -93 5 -201 202 30 78 65
1776 65 110 -189 264 -302 167 19 -118 289 -395 270 -363 -55 43 -56 423 -553 164 86 -252 37 54 136
1798 136 -70 -29 132 92 -78 167 -241 78 287 310 196 -206 150 -167 34 198 -272 -155 -56 -11 41 -23
1820 -23 81 -3 31 203 1 -82 -162 -136 127 -302 273 -212 -245 155 26 246 53 37 -58 -134 -171 -66 -235 287
1844 287 -84 -197 88 -75 258 -184 189 220 -20 161 17 192 16 196 84 -288 38 292 -22 93
1864 93 353 -58 146 -435 508 -165 -79 58 -110 182 -216 198 30 -205 -130 -151 -298 -15 158 -65 -161 130
1886 130 145 -101 200 -107 -236 213 -294 117 -98 31 382 53 168 -231 98 -191 149 29 -192 16
1906 16 -54 -129 -7 361 -270 -37 -397 256 -284 -171 21 -194 277 61 -65 14 -244 -78 -84 80 75 125 -96
1929 -96 195 20 324 -67 235 259 -479 342 -284 246 113 -81 -113 -256 -6 5 -89 -6 -30 60 62 20 293 -74
1953 -74 -206 408 -400 -85 35 -44 112 64 145 -234 -6 125 -100 -72 22 -273 22 -121 56 -161 -96 78
1975 78 -283 37 30 -30 -212 -228 123 -45 -67 169 15 -194 -21 51 -29 -161 -99 42 -295 149 -160 22 -131
1998 -131 -174 159 -376 345 -122 -64 59 68 45 -236 97 242 -282 -31 145 130 103 -70 -83 75 -233 456 159
2021 159 -6 348 13 156 -73 66 199 -73 194 -79 -53 -149 -85 -95 -60 -211 145 -372 91 -175 1 -99
2043 -99 -57 191 -356 -189 -34 -18 -11 138 -221 -155 -18 -64 -49 -158 322 -114 -158 -73 -223 -57 -213 64 361
2066 361 -46 -77 22 32 -70 -46 -21 -139 -207 18 -214 127 13 46 304 -73 373 -86 301 -101 -227 475
2088 475 45 387 -130 285 181 148 149 59 -75 46 216 -249 194 -40 188 -70 25 64 -259 453 -221 -110
2110 -110 233 25 254 -162 -96 83 -13 -139 185 77 32 -23 259 30 -157 51 -193 74 -120 -31 57 -53
2132 -53 68 39 -74 32 0 -44 92 305 2 -191 259 42 -171 258 2 34 -201 58 241 -380 122 -132
2154 -132 139 120 -161 -103 153 188 1 21 -16 230 83 100 117 142 272 -16 300 -11 81 -38 73 15 -13 124
2178 124 82 -33 98 163 5 -64 90 83 256 1 135 -140 66 33 224 46 -292 188 -120 166 -43 -137
2200 -137 -131 179 115 -124 -166 -291 64 -136 280 -23 108 -108 -164 68 -83 257 -148 102 9 42 -83 18
2222 18 106 -198 126 -98 -78 36 98 41 15 159 -143 -27 39 234 155 4 62 10 -5 -167 -56 109 23 -60
2246 -60 -128 139 -34 -30 -70 86 -227 162 -22 -114 85 -171 -15 -87 189 27 11 11 -90 116 37 42 -271 -19
2270 -19 -59 -133 -53 151 -115 72 2 100 -77 -459 -42 71 97 128 -10 -43 -134 67 -224 -134 29 76 -259 180
2294 180 71 -135 205 -134 -26 -148 -11 113 -132 -130 78 -92 8 52 136 52 282 156 -73 129 -122 -2
2316 -2 131 -102 68 164 116 7 30 139 67 142 74 -91 29 -59 -114 -19 80 -100 51 -186 -32 -77 99 371
2340 371 90 137 -98 -175 72 -138 19 -67 129 82 191 58 -319 127 -89 176 -17 -145 -161 -288 -107 137
2362 137 121 -180 121 -161 128 182 -247 -41 -158 -180 72 -119 -257 -65 4 48 -102 240 52 -263 -101 -223
2384 -223 218 -22 101 32 -66 139 124 126 -3 91 -2 65 67 55 -12 -24 -101 -217 -26 108 60 35 32 93 -327 -199
2410 -199 -83 87 0 78 -181 -107 -168 -32 65 -180 -82 -72 103 -146 84 -9 -22 -22 236 185 -151 223 -11 -66
2434 -66 145 48 80 111 295 -66 -57 -75 -20 -51 -41 -31 -77 127 -14 63 -81 71 16 -109 111 -83 138 292 -36
2459 -36 -159 75 -36 21 -131 4 52 5 -32 81 58 -51 -168 107 -58 120 -91 132 33 -159 156 -15
2481 -15 387 10 14 -110 -7 218 218 -43 -34 78 -203 -116 -271 163 -45 119 318 -135 117 -46 137 22 -48
2504 -48 96 26 -67 101 -159 -201 81 -46 173 -229 289 297 74 -24 -76 8 -100 -57 -12 32 9 41 -11 89 -156
2529 -156 193 -168 90 -93 -17 -182 -146 113 167 24 91 99 -63 57 5 240 22 183 -83 -95 42 264 97
2552 97 -37 12 126 -18 -212 -44 47 79 -236 124 115 -177 -158 129 -13 120 75 22 163 239 163 17 -94 154
2576 154 -76 -163 297 -7 126 -44 19 -87 45 102 -138 212 118 -113 -142 35 244 234 -119 429 -6 43
2598 43 279 113 232 26 225 398 114 -8 143 71 179 5 62 27 -117 -30 -69 42 -44 -73 193 -247 91
2621 91 33 -130 98 -67 46 -53 92 -369 268 -251 -232 6 167 15 -212 165 158 6 -69 -98 -4 149 150 -368
2645 -368 166 54 68 116 -161 157 -15 57 13 31 -78 221 68 -164 58 49 -258 -64 25 -372 -129 8 32
2668 32 57 -248 -208 -19 95 151 18 -81 104 -132 -127 -62 -355 -179 -175 37 35 86 79 1 152 -18 259 136 54 144
2694 144 -28 -53 -3 88 -114 91 -99 -93 -210 -49 104 26 53 -326 69 162 50 -18 -238 -130 -191 152 20
2717 20 -56 60 13 -112 -8 -222 49 -33 -349 -122 109 151 -256 52 7 133 6 -43 11 100 172 -66 -113 91
2741 91 -116 14 -32 140 -192 202 95 -146 -438 -77 197 -113 154 -124 -120 42 -48 -156 9 -143 -130 45
2763 45 -154 -69 134 65 64 -188 -25 -204 108 28 56 144 -243 40 104 45 65 -40 -41 5 -83 -47 -3 -228 10 -1
2789 -1 83 234 -49 -166 108 110 -29 3 64 346 -202 57 149 -37 -145 -22 87 98 202 43 193 -54 -10
2812 -10 -55 60 259 -223 183 -131 208 -153 -78 -164 -149 127 -152 -17 53 1 7 80 -169 152 -68 86 -15
2835 -15 -57 140 -141 -12 26 4 35 -113 83 -71 -78 2 17 58 213 4 -190 -162 15 -258 -17 -78 -177 2
2859 2 -14 -138 41 -9 -79 172 -122 186 -76 4 94 -57 -12 191 -197 -108 -61 26 56 -85 31 90 -3 -55 106
2884 106 250 -113 -186 -33 317 95 18 217 -155 -252 -100 -170 -90 151 -54 181 205 -6 136 -56 181 15
2906 15 -232 -198 -46 20 -22 -16 -15 198 -7 33 -13 181 -156 94 150 -35 69 -108 117 -205 12 100 103 138 -95
2931 -95 88 -145 -30 161 235 -24 92 78 110 -189 31 -139 -93 122 -82 -137 -151 64 139 -33 -199 -45 1
2954 1 -35 52 -88 119 -29 205 34 -117 36 -45 163 -35 -66 -166 -45 139 67 -40 64 -240 80 126 108
2977 108 78 103 23 -55 31 -190 -22 -122 74 186 42 196 -10 -19 123 204 249 -238 33 -16 -191 126 -189
3000 -189 107 112 171 -51 80 146 169 63 -59 -118 38 -167 163 -50 -43 90 -133 112 -21 114 -101 58 72
3023 72 -93 -130 -22 -130 -68 -130 65 167 -46 284 97 -41 11 194 59 -150 32 35 116 129 23 23 94 89 19
3048 19 -82 7 23 -151 -157 16 -194 -40 -20 106 -243 -66 -61 -120 -131 87 -43 -27 69 -34 193 59 2 237
3072 237 -20 -91 -102 -175 97 104 -5 -78 -109 -46 -49 -30 -34 132 -116 56 -77 156 -1 -54 -142 -26 34 -138 -155 60
3098 60 2 142 74 21 142 -155 206 -31 -167 106 1 27 -78 -28 -185 -120 110 -99 -30 -89 7 -71 -239 8
3122 8 -13 47 -25 -25 -114 136 69 109 -161 117 52 -9 70 -171 -10 -15 34 -90 -63 -111 101 -139 -117 -120 125 -85 -166
3149 -166 59 156 247 -87 -136 -23 -174 -214 -179 195 -2 103 162 -101 39 9 85 -5 -215 -88 -126 -257 -168 -121
3173 -121 -240 84 -15 94 -148 -55 118 -13 -126 -68 -30 -100 -91 197 47 -54 -22 150 -23 52 -3 101 178 -106
3197 -106 -55 -148 235 191 113 -48 237 154 -58 -3 -27 -73 15 -60 52 66 -76 40 125 45 92 -213 41 -176 65
3222 65 -119 -104 191 -8 -18 -47 -73 -256 95 168 -107 -38 -34 -47 97 -65 -70 -23 43 -33 50 -147 143 -71 299
3247 299 -174 -26 -29 144 -46 -100 191 92 151 -7 -63 -78 159 -69 241 -65 47 22 -157 -105 183 -242 105
3270 105 10 3 180 63 -91 -42 39 -26 56 58 -110 -135 -94 -6 148 72 -73 16 -187 238 9 39 103 -54 -11 -113
3296 -113 -54 120 27 -116 112 -156 -100 7 -291 -40 33 -98 149 178 8 -163 -98 -68 -100 -87 103 56 50 224
3320 224 12 246 243 -89 226 -43 -75 25 -146 146 119 -39 -156 17 28 -102 48 -191 92 76 -227 -36
3342 -36 -84 -148 -112 183 98 174 -3 -167 -216 61 -236 91 19 -101 -56 62 52 155 15 34 -133 71 55 -161
3366 -161 72 97 86 -10 -31 96 33 4 -66 100 118 132 -114 103 66 129 32 -14 -84 -145 -21 18 65 160 202 130 357
3393 357 -149 11 -85 21 -149 73 -12 0 28 -197 111 -28 -178 -219 -65 12 -117 50 -98 1 233 79
3415 79 -15 -105 -169 45 -143 203 -103 -157 182 150 -1 147 55 -134 -77 -264 -35 -19 108 30 -34 -442 -187 -89
3439 -89 -94 -128 -74 -66 -120 -243 10 -131 -12 -19 -75 51 2 -210 -33 -32 79 32 -233 -183 -44 -92 -43 28 104 63 185
3466 185 -34 75 -72 47 -53 53 -293 -38 -54 30 -17 64 -220 -108 -52 -242 -39 -245 121 3 146 46
3488 46 272 77 91 -147 -118 -250 38 -11 -4 190 137 27 175 91 -23 19 93 91 -6 90 -183 -278 27 77 -71
3513 -71 8 -29 242 251 149 -142 -112 20 15 70 191 348 195 -95 -36 2 109 154 -19 240 140 53 48 114 -99
3538 -99 247 254 66 -240 -138 230 -126 -52 -171 -17 -5 -71 80 49 -64 37 -161 229 -5 -164 51 -74
3560 -74 141 123 -200 -141 -19 -18 182 -176 -15 -424 -96 47 114 -21 54 1 -90 133 120 184 2 -62 -11 154
3584 154 171 220 -176 31 88 -112 -55 -56 -39 172 -234 112 -180 -31 52 158 68 -283 -98 -29 -63 149 -115 -79
3608 -79 37 47 -327 141 65 -106 -236 -127 68 -12 64 124 174 -47 -75 102 187 -88 12 -47 -55 71 -59 -239
3632 -239 -25 -227 90 -150 16 -146 -95 -44 -23 -6 -123 252 -61 -125 156 65 42 10 -208 122 -141 89 -23
3655 -23 -30 -3 0 -166 -26 -249 -235 150 133 -113 108 86 152 -24 -66 -135 -255 -43 -52 -56 -211 79 -84 130 35 212
3681 212 235 -94 -4 31 -76 145 -121 -213 169 -90 29 95 -18 -20 100 118 -94 -247 -119 269 40 -33 -5
3704 -5 68 -239 83 74 237 -202 169 4 164 -69 35 68 -20 -22 -149 172 280 -212 -141 -41 209 -72 41
3727 41 68 258 -62 283 3 -190 25 84 170 -324 29 -80 161 -139 -34 -69 -243 173 184 138 58 145 211
3750 211 14 210 -25 31 153 32 -63 67 -181 -66 -104 119 69 20 -91 -239 -107 -159 -25 -54 224 171 116
3773 116 -46 -165 90 25 46 19 89 -139 -90 -218 91 77 134 -35 -111 222 -16 9 202 -108 148 102 77 152
3797 152 54 143 51 43 -93 -136 4 100 -72 -127 -70 121 -98 -150 72 223 15 7 254 -153 -286 118 79 19 190
3822 190 -102 -78 48 202 190 133 -65 -56 -260 -85 3 147 -130 -151 67 -177 -46 137 -99 -24 120 -43 85
3845 85 148 -47 24 100 -212 8 93 -27 39 245 -149 345 -25 96 2 -98 -91 -124 40 -358 -57 26 125 81
3869 81 -314 -12 -114 109 45 -57 208 39 278 27 -88 48 0 -158 345 165 199 -8 -92 228 -57 92
3891 92 49 47 298 183 92 -124 57 -91 69 -51 -450 52 -68 -79 -119 53 80 72 -104 -112 -56 60 204 -147
3915 -147 123 -101 -169 -227 133 66 104 8 195 82 8 -23 -147 -55 38 280 -75 -178 -154 25 84 -80 -60 89
3939 89 -12 -117 126 38 229 27 160 -71 -76 -29 165 144 6 70 75 -15 70 70 -9 27 -77 105 -182 188 66
3964 66 172 125 5 116 -65 65 -111 -58 -115 -102 79 271 74 53 -80 -8 119 142 -193 60 -88 2 38
3987 38 -168 64 86 15 87 123 -37 -9 -66 267 -186 129 -148 32 -102 -45 -40 -130 146 -37 100 -42 58 278
4011 278 -39 -159 -68 192 109 249 -33 -258 -198 -285 61 12 85 47 51 -218 191 -201 -215 -2 -143 -55 -53 -269
4035 -269 -25 -78 -222 279 -102 -1 -32 -104 -213 -57 164 -22 -79 -86 -44 -3 -366 -187 -292 97 44 4 84 -106
4059 -106 36 -104 129 -175 -31 -122 -72 29 -206 19 -216 -32 -228 -164 -316 -203 163 -132 -34 -56 -133 81
4081 81 128 -192 80 -50 -15 -205 -23 38 172 123 278 51 -89 -8 100 78 -7 -63 115 -221 -131 -165 -102 -49
4105 -49 -190 102 68 41 -355 290 96 -3 56 131 49 356 -298 -189 -273 45 118 117 134 106 -131 89 -193 -153 -21
4130 -21 -156 42 -18 4 -158 -9 127 -141 -169 16 17 12 -21 38 48 207 23 -3 -2 59 -168 -47 14 -231 -265 -180
4156 -180 30 259 156 -31 31 -70 -77 -108 -81 51 -406 -140 46 -13 21 -22 -25 -136 -55 59 -94 33 -54 142
4180 142 -43 16 162 66 -302 111 214 -218 -106 -201 -38 -218 -81 -73 38 8 37 -76 -107 19 29 38 11 225
4204 225 48 -2 -316 -118 -74 -30 -261 -127 -23 171 89 80 -185 -43 39 17 -66 -2 30 45 -91 -6 -219 -118
4228 -118 134 57 147 28 60 67 -107 123 157 -130 13 -21 -22 -101 261 85 -11 -78 78 39 -68 164 -104 9
4252 9 75 -80 -51 236 172 -54 -38 88 81 -13 58 -76 36 -77 26 223 272 56 2 224 -57 -47 59 21 23
4277 23 -25 318 -150 253 -150 -133 -69 -182 -141 -211 -204 -69 -5 139 200 -155 18 -41 -126 57 1 -280 122 139 129
4302 129 -183 127 -151 -114 147 99 23 65 -120 -25 -193 -27 -130 -166 -109 -28 72 6 -109 -80 12 -41 -55 192
4326 192 0 -94 226 -109 -305 -74 342 -142 -86 -18 55 77 -90 182 -29 -102 45 -190 159 209 -280 -378 229
4349 229 202 -91 -111 249 487 9 -750 -492 121 521 778 373 -93 -55 408 146 -14 -347 277 -206 55
4370 55 -110 -117 57 -71 -94 -172 -22 -13 32 -116 -242 166 250 31 -156 27 -15 -137 -2 -316 95 -146 -74 -265
4394 -265 -73 195 -282 158 -87 282 22 -260 154 100 125 -139 -114 -53 96 127 252 -35 -87 -166 -166 -180 47
4417 47 46 -149 -59 -91 158 79 -130 48 77 14 129 32 43 -249 -165 20 212 11 -36 -10 65 -56 -22 -154 144
4442 144 61 -162 -69 104 -178 -278 -2 170 40 174 142 -127 88 -176 -48 -74 -260 23 34 -161 7 69
4464 69 -192 -94 74 62 -56 124 14 -28 -96 144 11 -44 162 -11 57 -9 118 35 257 -33 186 -67 -95
4487 -95 103 -18 182 281 -27 92 238 -133 100 -95 55 -145 170 -210 -32 195 -62 -105 119 -112 -57
4508 -57 -224 18 -85 -76 313 1 26 105 251 68 -112 -129 -261 -117 -25 99 117 189 161 209 -42 -52 -235 84
4532 84 77 85 73 -111 -39 -59 19 70 60 -159 -300 -102 -24 -74 -60 -6 114 -25 -109 -283 241 -34 -69 -80 -88 113 93
4559 93 -181 -153 -12 -71 -93 68 -48 -62 64 -103 117 263 -65 -72 110 -90 -217 -137 354 -175 -13 21 144
4582 144 -63 142 50 117 -148 -50 59 186 61 -85 64 153 -18 -25 69 102 -108 52 40 155 -8 -96 162
4605 162 -194 11 50 -51 -73 -215 -101 -13 22 11 42 29 -12 -181 -39 6 214 -75 -32 161 1 -103 64
4628 64 -123 55 132 -43 -59 111 199 -256 -71 42 201 -217 22 61 -210 -75 -175 -86 7 148 -85 76
4650 76 -169 -35 135 -179 47 -113 18 152 -37 -139 -67 198 223 41 -11 -110 79 79 -201 -146 186 -66 124
4673 124 104 325 -83 2 -82 -231 222 7 101 -64 72 -131 -259 191 38 -53 239 33 57 -171 100 105 -123
4696 -123 -31 -117 -54 -85 268 2 -27 0 22 79 -11 -149 80 -127 -313 -169 72 -106 67 -28 -92 22 244 -217
4720 -217 99 194 -24 40 120 -223 122 -115 -3 4 -33 364 10 -103 -185 135 -23 27 180 -199 -109 12 202
4743 202 114 -76 23 -135 -31 171 -58 14 -26 58 -44 45 -193 -80 67 -26 -19 -11 230 -185 59 -171 55 14
4767 14 367 24 59 -113 -126 153 263 175 -106 -116 -251 -139 69 179 50 176 149 -99 -122 40 -86 146
4789 146 229 79 36 -179 -3 -41 -143 -184 -302 260 98 -47 169 116 -166 59 79 -70 50 -2 -53 14 -119
4812 -119 -118 119 156 -71 27 40 182 -191 120 52 175 -84 56 28 95 -180 -81 -21 105 170 8 -27 104 -180
4836 -180 11 -92 -65 -189 -45 74 18 -5 -20 180 -37 16 188 -176 -227 -41 -14 108 -238 68 11 19 -207
4859 -207 -115 45 123 -137 88 -66 43 39 -107 172 -112 66 43 67 175 -89 -38 -48 -63 128 -49 244 -77
4882 -77 -24 25 -21 -6 -24 162 52 182 -249 -128 143 221 70 35 -62 94 -39 -33 -136 6 129 6 -6 -97
4906 -97 147 223 56 -67 88 -77 147 -125 13 30 -55 133 -83 124 266 192 -188 -36 -225 92 -77 88
4928 88 -96 -221 -40 47 92 -133 -41 -181 -33 38 6 -180 -158 -40 68 42 -77 63 106 -239 98 38 -43 -54
4952 -54 -114 144 136 92 46 -164 -120 50 -57 114 -104 12 197 94 -56 14 124 -129 16 91 -34 -229 -36
4975 -36 63 -13 147 -62 6 31 3 59 -287 -146 77 280 13 -46 330 125 -281 155 46 -187 -50 -131 111
4998 111 47 5 22 -76 158 -88 -297 -51 -16 -224 112 71 91 -260 13 164 71 79 -51 -139 -220 80 -72 -26
5022 -26 -171 160 -63 16 74 20 -167 -82 -97 70 -163 94 89 16 155 -26 38 -139 -131 -120 101 -86 -201 120
5046 120 -258 -109 55 -31 -99 -15 -70 -140 203 -123 111 -133 -11 -17 -305 21 95 -186 6 -242 54 159 226
5069 226 134 198 -48 -24 31 -260 23 86 200 -41 -95 5 293 -181 -110 99 135 -108 -36 45 77 -93 207 -76
5093 -76 6 -233 82 6 -151 37 13 -181 99 -29 37 72 -21 111 -25 204 29 -121 6 -56 -126 46 -26
5116 -26 171 95 -22 136 -33 83 83 -303 -4 -62 -64 93 -124 -63 -243 23 121 -11 -18 -62 110 -52 14 2 181
5141 181 -111 -190 28 -54 -1 240 -1 17 -37 -81 -99 -115 -231 -17 -138 -102 3 -26 -20 0 -89 204 74 -55 94
5166 94 57 128 86 -31 204 130 -61 15 -20 -44 89 -89 -119 204 220 -74 52 -94 -227 80 -110 -120 -105 -1
5190 -1 33 -163 132 47 -77 -9 15 -61 -62 59 -103 121 129 -11 -136 131 75 9 213 -257 -38 139 102 126 -56
5215 -56 4 -296 7 48 97 -109 -15 -1 76 36 -80 7 157 -67 -59 -107 -109 11 40 -45 -15 -221 32 -28 42 93 215
5242 215 -4 133 -149 -158 119 14 -92 -86 191 -64 34 21 75 9 188 83 32 -64 270 -80 12 72 -17 -6 -13
5267 -13 -52 123 21 64 161 -31 -26 -134 88 61 -222 178 -96 -63 -35 36 4 247 21 2 52 7 36 195 -93
5292 -93 33 37 -13 45 -104 62 -172 35 74 137 -369 -211 -137 -15 14 153 171 -227 54 -69 72 -7 72 112
5316 112 190 110 241 -9 -112 91 84 -36 -3 -108 259 206 193 285 123 -49 -60 99 -153 125 62 -16 292 -121
5340 -121 -99 40 -182 -99 -277 -92 -142 21 -25 23 145 5 -52 28 -138 -127 128 57 -89 223 78 -205 52
5363 52 -169 -86 79 -61 91 72 -37 56 69 125 -285 42 61 303 -128 16 163 27 -134 84 15 -89 -90
5386 -90 -38 -138 -90 -26 147 5 68 -11 37 -122 -46 51 15 77 300 -38 -22 66 223 86 96 213 -106 -193 17
5411 17 122 -97 20 -175 239 -8 18 123 126 -109 -166 87 205 103 -10 53 -70 -13 26 -50 -98 -279 -77
5434 -77 134 33 86 54 -25 -93 6 -58 -284 -270 -165 160 72 -68 -2 -57 -447 67 270 -179 126 305 -49 -122
5458 -122 -68 -146 -158 107 267 56 -131 128 104 18 -291 -145 162 122 -93 98 53 70 -110 -47 103 -263 207
5481 207 182 -207 -1 -40 -196 287 -60 -96 118 -20 112 177 -77 25 82 -185 156 -29 142 -11 8 226
5503 226 98 -416 99 54 -14 -125 -20 49 -23 98 199 -107 68 -182 193 -154 -95 -220 64 12 109 -1
5525 -1 -148 39 219 -24 126 12 -178 -157 42 -99 -186 -51 148 178 43 67 104 -103 -209 110 -221 340
5547 340 65 -294 30 -185 156 -2 19 128 82 -103 -182 -17 27 -63 -59 -54 -25 -100 340 -223 -69 141 116 297
5571 297 -20 142 185 38 -141 -25 -106 -55 86 -174 -5 117 -33 -36 -432 14 -14 -69 -31 -229 143 7 -75
5594 -75 -155 8 109 22 -212 -270 -175 47 -96 -64 76 4 -4 -113 -251 -72 313 -286 173 -139 -3 -44 -235
5617 -235 97 27 32 155 -167 -154 1 264 186 73 193 -76 100 115 -52 -181 -108 -66 -51 29 91 -92 210 -108
5641 -108 -74 -170 31 -171 -173 51 -68 87 164 -20 84 71 -47 -15 178 184 82 -11 34 163 22 -29 -22 -12 95
5666 95 -169 77 -207 9 110 0 246 152 -165 49 220 -164 66 167 275 -3 -55 -57 21 68 -145 -49 -194
5689 -194 50 179 -42 213 213 -66 60 -181 101 -56 69 113 175 77 -151 -189 -47 -40 -237 65 1 -19 220
5712 220 -18 79 62 6 116 -48 -49 -60 -184 128 160 236 189 -41 -103 62 61 67 233 74 68 -116 -49 112 11 5
5738 5 -171 261 28 56 -18 -165 118 52 -33 52 28 2 195 -188 70 109 155 76 -117 -22 98 -110 -26 7 -103
5763 -103 182 -204 -18 -24 88 -42 166 -49 24 92 -162 12 -52 -102 24 -84 270 -214 93 -119 21 -41
5785 -41 93 -142 2 48 -213 114 -93 56 97 -72 207 -82 51 -102 -75 191 -13 -53 -29 131 123 -41 -229
5808 -229 -178 -203 -195 217 -152 14 -41 93 317 -136 137 -44 -11 -118 -14 -175 -93 91 52 393 -26 -183 -78
5831 -78 52 -79 -269 -18 47 208 -152 -23 -65 135 206 14 125 27 135 35 -48 91 46 107 5 -31 -63
5854 -63 200 -209 189 -21 -50 -3 95 -52 -32 -142 -58 19 27 -299 203 100 -133 29 -80 -109 -177 140 -141 197
5878 197 -173 -195 -96 -178 10 42 -126 -6 7 -101 0 -180 37 47 -47 165 97 -253 30 57 -7 133 -112
5901 -112 -188 7 -174 109 -82 -121 -53 188 -22 31 151 72 -42 126 -352 106 -145 -69 209 167 231 105 -134
5924 -134 -88 143 -32 -64 -156 106 126 145 -51 -26 -86 233 -154 146 -105 -157 -193 50 172 104 -105 -60 69 -56
5948 -56 34 149 218 93 132 -106 129 30 48 37 -32 55 -57 16 212 285 174 129 80 3 -197 -212 275 -3 67
5973 67 65 -155 177 70 51 22 180 -33 37 -291 -73 63 -128 -1 -204 -65 238 266 207 240 -73 130 -87
5996 -87 -92 -71 -151 -207 -74 -4 303 -60 51 115 -101 152 -151 -37 105 -7 131 54 82 -123 23 117 -156 -22
6020 -22 -39 83 57 142 219 -239 -24 12 -74 39 221 -87 -7 162 -118 -59 144 -16 -127 -45 -138 97 103 -95
6044 -95 -4 -59 134 -64 -51 3 10 101 16 141 -78 158 33 -15 -6 130 -153 26 122 63 -15 -56 21 -208 352 47
6070 47 -84 -89 -40 -87 -138 128 115 15 71 -186 -90 -131 75 41 -35 -40 24 203 39 -25 -90 -43 122 -10 48 92 78
6097 78 34 -7 31 -21 208 -102 -39 -60 -13 107 120 -21 63 112 337 -73 298 -64 -12 61 13 2 63 143 -19 229
6123 229 133 25 -142 -33 222 119 150 64 53 -36 -40 278 -213 7 -92 -283 136 -132 91 65 -17 212 266 28
6147 28 -23 -239 -22 111 4 -174 -181 166 -29 95 -262 -78 176 104 367 -42 64 244 0 -237 -155 -253
6169 -253 156 9 -7 108 175 69 46 -29 156 -102 75 -2 -46 -21 -5 223 21 -115 -192 -26 161 -18 120
6192 120 55 -18 -116 -32 -126 146 162 -13 73 146 196 -24 -31 140 -175 -42 184 45 -133 88 209 -49 -214 -65
6216 -65 -185 -109 45 104 -153 -28 12 224 58 173 109 -64 -118 -100 11 75 -127 -128 12 155 -209 141 113 -76
6240 -76 2 -330 -116 -105 -38 -137 139 -51 11 49 -24 107 -113 -187 67 -73 157 -38 -215 81 179 252 -24 193
6264 193 -54 177 225 -126 302 141 38 31 69 -38 -47 20 -118 -17 57 84 122 67 -67 42 -156 182 -243 141
6288 141 108 32 24 2 -94 -34 -54 44 88 25 -102 258 53 19 -93 -46 -49 269 134 -87 109 -96 78 -40 76
6313 76 -199 32 -11 -31 18 15 283 -76 -121 -123 14 163 -24 -138 -2 -75 44 27 -49 38 72 -71 -31 65 -28 15
6339 15 196 -26 -126 -32 196 66 -376 111 -8 56 -53 17 182 -20 -218 -231 -63 -26 -118 -259 26 -2 240
6362 240 42 13 78 -8 96 -196 -42 -167 -135 3 -182 35 -78 -144 105 -4 59 303 5 141 30 -182
6384 -182 -34 -33 -8 -41 136 -164 14 100 6 40 -185 -1 -143 210 -32 47 55 87 -180 -303 32 142 158 -32
6408 -32 103 -66 -232 -24 172 -134 -169 -50 95 91 -271 34 171 -21 -73 98 -4 63 -28 -97 -47 -104 106
6431 106 -25 -131 164 73 69 -185 -88 45 120 -120 33 -70 -127 -110 -68 216 97 -93 -100 -92 -33 -40 62 -137 -21
6456 -21 -186 69 -210 -156 8 101 -267 97 61 2 137 -113 145 -126 79 -22 -151 -127 117 8 14 -39 -198
6479 -198 121 -103 23 -132 36 -181 128 37 -22 -113 62 -127 70 95 -12 101 -140 -185 1 110 -45 217
6501 217 310 34 -1 87 104 8 -134 -50 -67 28 91 -145 1 84 -28 -24 30 175 34 117 -121 101 -12 104 -138
6526 -138 -216 68 14 -42 -118 -43 -17 -7 -169 -22 79 -56 -49 23 -153 -118 73 87 -8 7 164 -36 57 73 -227
6551 -227 -99 201 2 -318 -150 -216 -55 -15 -7 -134 77 -29 -77 -82 -125 -200 -55 -166 -199 -209 -150 -98 65 8 32
6576 32 156 -18 -79 117 80 17 -240 236 -289 -398 -49 154 -200 -139 243 -244 219 46 21 125 4 171
6598 171 319 -185 -182 -122 -40 93 -84 -118 -37 -1 21 -163 107 -89 40 -17 -6 93 -151 -63 -25 17 -70 117 -269
6623 -269 -209 -27 44 -168 33 77 -178 -135 148 -277 -51 69 0 16 -142 66 118 121 66 -24 45 185 87 -84
6647 -84 -17 -82 -107 165 -50 24 27 25 -96 -82 -246 27 -65 -169 47 20 149 -168 -87 34 56 -30 30 85 50 114
6673 114 42 340 -142 -97 4 40 206 -29 147 182 -205 -341 -18 -79 -103 -179 72 -97 -98 -160 148 -66 -117 125
6697 125 -185 -27 -10 -93 -89 -77 105 -154 -67 -60 136 155 187 -184 -76 -41 -35 -188 -60 34 200 -15 37 -26 -102 -65
6723 -65 171 -9 224 122 32 222 128 -85 15 11 41 -236 57 -44 -17 -108 139 -14 90 162 108 -269 21
6746 21 62 -23 110 -169 -71 -276 98 -40 -134 16 137 -237 90 -28 32 130 72 -17 -181 -65 26 182 137 338
6770 338 -18 4 -172 -26 -95 45 174 97 125 -217 205 83 -141 -276 54 -91 158 1 22 32 65 66 -28
6793 -28 23 -17 225 36 -10 181 -21 -253 15 90 33 -110 128 -56 9 -25 73 -61 115 -46 -226 -36 -111
6816 -111 -169 -120 -133 -93 -275 -46 67 -175 217 -61 -265 -298 86 168 142 -169 -89 192 -211 69 221 67 -148
6839 -148 -197 190 25 -40 68 -187 292 -60 -58 70 -106 122 158 -145 -2 27 66 44 -137 3 274 -139 -271
6862 -271 -155 -74 -74 -161 9 -27 169 179 -267 -295 -86 -136 4 277 144 -42 -65 140 31 -218 -144 -40 -70 -252
6886 -252 18 33 -40 -101 -73 79 80 14 123 53 -97 8 -192 49 94 58 -47 -53 110 -19 55 66 -254 179 0
6911 0 -119 -80 78 -89 47 -394 -88 -85 71 -47 34 -83 87 305 28 43 -34 -168 -105 57 102 -134 -82 -3
6935 -3 -145 -290 81 57 9 -105 96 -121 -102 -30 -48 -19 -37 -71 -15 -164 70 -137 94 132 -342 -10 14 8 -28
6960 -28 -40 -17 26 19 -97 -29 242 -29 -354 -13 8 166 104 -15 -21 -183 -6 -28 -30 -106 -13 -86 135 58 164 -92
6986 -92 74 78 230 39 -233 79 -86 80 -27 -168 -166 -50 28 -207 -78 -1 116 235 -105 -57 -159 -96 -33
7009 -33 169 -25 -138 -236 8 -94 169 137 -65 -103 -58 -94 -50 11 -72 -149 -101 138 -67 131 62 -137 177 -221
7033 -221 173 -102 65 -177 -39 70 109 -68 -253 244 77 151 124 -27 66 25 -174 84 33 -106 44 33
7055 33 27 -49 -97 17 -185 35 80 98 138 -135 -87 129 -88 54 -131 -115 144 -189 -119 93 -91 18 124 134
7079 134 192 -31 -56 97 216 65 33 -170 104 60 76 142 -161 7 29 -35 -318 -82 -47 154 103 13 229 165
7103 165 36 263 -2 -43 169 -102 -73 96 142 -14 13 163 96 30 -24 216 -74 -271 121 120 110 -28 -195
7126 -195 -95 -89 27 94 7 302 -5 -1 84 23 -50 73 -177 170 -26 -37 -85 -67 29 9 -63 -8 -178 -76 -10 -139
7152 -139 148 -224 -146 -158 100 -117 26 87 -10 185 -142 110 222 -23 110 -55 -88 133 -19 6 279 -392
7174 -392 39 16 184 105 184 142 -14 57 -95 52 -6 193 -53 145 -113 -69 9 -70 80 100 -91 188 55
7197 55 -103 117 -39 27 -183 98 45 220 -77 -206 245 60 121 -199 -43 45 -21 118 -198 24 -1 39 -105
7220 -105 101 -126 -85 -42 -161 74 382 -142 -69 -137 238 -232 -33 19 -166 203 -75 -212 -148 116 120 145 106
7243 106 -71 -42 -10 -219 -64 -37 42 128 114 -158 -42 -103 -286 -66 112 35 86 79 66 42 25 -182 237 29 26
7268 26 -114 -41 -157 -94 -46 -18 30 83 -169 18 -35 7 -136 105 120 151 -137 11 -19 -15 -85 129 184 304 116
7293 116 181 44 159 264 -70 8 -90 107 156 -134 219 -186 24 -132 -267 -160 119 -97 -33 -296 -44 157
7315 157 159 -21 -77 -104 -34 164 2 130 -42 40 -252 86 26 90 10 32 -110 -75 126 -16 117 290 132 141
7339 141 35 -90 -80 -116 41 -116 -163 -144 144 38 172 108 126 -83 24 47 -58 -90 -422 62 -196 -2 -45
7362 -45 -173 68 -114 -34 152 131 175 -174 152 122 -78 133 -355 -86 -102 239 72 27 153 -147 225 40
7384 40 -133 148 -138 -140 229 -23 31 -210 -221 8 -94 199 -19 90 371 -98 65 20 52 -42 92 -133 126
7407 126 175 10 -360 -134 45 -59 -2 -4 60 85 -160 -48 -156 46 92 94 89 114 65 -245 101 124 62 58 -18 40
7433 40 37 -3 -77 -177 -115 229 71 53 -5 70 -184 117 41 -63 98 45 109 96 188 -161 74 -119 144 -128 0
7458 0 -94 -124 141 70 -165 -191 -99 -86 161 163 3 -51 38 59 -35 -113 48 9 -40 -98 202 -39 -47 47 246 -150 -12
7485 -12 180 144 86 211 116 -56 -94 -63 88 -82 142 211 -4 -63 -289 -40 75 -147 -109 95 20 -71 -177 -28
7509 -28 -72 37 -97 -97 49 -93 -59 235 204 -42 -23 23 74 -133 -70 54 38 -12 -86 -92 166 -167 -67 -90 210
7534 210 34 193 47 -68 34 16 50 -87 -172 56 140 -237 -85 54 -39 -72 133 91 -185 99 -41 -86 199
7557 199 -264 -152 71 312 137 -162 94 156 29 -53 -243 -112 -127 30 -51 -178 77 -184 -36 96 -1 -169
7579 -169 -103 78 5 200 -81 119 51 -160 -6 179 68 -92 44 26 123 12 8 7 33 301 -85 -130 53 171
7603 171 144 -204 229 4 2 -77 -87 -83 -71 197 65 -238 -198 162 -215 187 88 -133 90 265 48 87 100 212
7627 212 140 -87 2 129 4 282 164 -96 -36 -237 69 -28 119 -229 -67 -52 -98 -173 153 3 -66 12 -228
7650 -228 195 404 -120 102 202 -331 81 -35 103 141 -138 47 60 102 -93 263 -63 -43 -85 166 -40 -205
7672 -205 283 158 151 -265 -97 -119 185 -165 50 108 -10 66 118 130 -119 -27 48 60 19 -28 -96 -127 135 -187 -256
7697 -256 -18 -60 -82 115 6 31 244 -113 60 -45 -52 73 -31 -267 -168 -71 58 62 -139 -19 93 134 -97
7720 -97 -75 -210 -149 -148 142 94 142 198 -19 74 79 6 144 297 -20 173 -6 -73 117 6 160 -141 -108 231 -268
7745 -268 -199 27 102 -181 -41 -13 -53 68 107 184 115 157 21 88 2 -169 64 -261 -63 -63 -139 58 38 21 79
7770 79 76 -116 -39 -45 38 63 -56 -66 124 13 34 227 238 55 7 -7 51 -33 -117 224 -124 89 -36 47 77 -117
7796 -117 -67 -77 27 -114 -100 20 -27 165 10 82 56 -160 11 -35 -125 -295 -250 -119 2 -67 38 73 56 -6
7820 -6 -106 53 -183 102 -324 -92 -129 -152 16 108 -19 81 90 68 -48 76 -217 -157 -113 -20 165 153 102 150 -167
7845 -167 -12 -74 -29 -215 -270 66 45 -158 54 -239 102 111 84 61 237 43 -112 -127 -28 10 -287 -46 69 -102
7869 -102 75 -21 -6 41 -168 107 178 134 184 -41 54 -34 -294 -143 22 -92 93 155 16 221 9 119 234
7892 234 -104 115 102 -72 -1 -62 175 18 -117 -33 3 64 278 -116 -71 -142 -83 69 155 -80 209 305 -279 -42
7916 -42 284 -189 -130 -140 -140 32 -40 23 107 81 8 -104 122 -87 41 70 -238 69 -145 -182 128 -24 18 -60 131
7941 131 -46 36 -223 63 182 177 -5 93 72 47 39 -96 140 -134 -121 -76 -141 -20 148 69 17 51 48 -400 -59
7966 -59 232 -93 47 -161 76 -41 48 67 180 -66 -5 -401 -179 4 130 70 -173 -32 -76 115 -185 -6
7988 -6 -108 -67 -129 -42 137 91 -349 99 87 -146 204 -241 72 63 165 174 -261 25 110 95 -87 -19 -235 56 -75
8013 -75 34 -253 -35 177 -65 218 -37 -166 -2 114 -2 55 -56 254 -55 -95 -55 43 -238 103 -292 -42
8035 -42 87 100 197 -299 -142 141 -16 -139 120 -7 151 5 -4 -42 165 30 3 118 -127 236 141 -207 -61
8058 -61 -107 -83 -205 -3 -22 -274 58 -117 55 4 -285 -50 162 78 134 141 -57 -8 -80 -52 86 -206 -76 -297
8082 -297 114 77 -66 98 -179 -105 40 -90 56 -81 38 119 7 31 -43 -178 81 166 -138 -183 -77 313
8104 313 -30 -196 -63 -126 -36 -36 -62 227 55 55 118 -12 141 95 75 -53 58 51 -72 -52 -98 75 -127 209 -209
8129 -209 64 92 9 -192 -21 -153 -178 -5 55 -374 -134 48 -49 -20 123 171 -12 130 9 -96 69 144 -30
8152 -30 -59 114 30 -29 -52 -77 -26 99 -176 -105 157 8 82 93 151 -191 -187 -143 111 2 -75 114 -22 -65 34 -42
8178 -42 -44 48 -11 49 41 127 -61 136 -5 90 166 100 178
8191A78
##END NTUPLES=NMR FID
##END=
