##TITLE=1H_CA-8766
 DMSO, 8 sc, 
 25.9.2020
##JCAMPDX= 6.0         $$ Bruker NMR JCAMP-DX V2.0
##DATA TYPE= NMR FID
##DATA CLASS= NTUPLES
##ORIGIN= UXNMR, Bruker Analytische Messtechnik GmbH
##OWNER= root
$$ XWIN-NMR		Version 3.5
$$ Fri Sep 25 10:04:03 2020 Russian Standard Time (UT+4h)  she@DPX200
##.OBSERVE FREQUENCY= 200.1315066352
##.OBSERVE NUCLEUS= ^1H
##.DELAY= (6, 6)
##.ACQUISITION MODE= SIMULTANEOUS
##.ACQUISITION SCHEME= undefined
##.AVERAGES= 8
##.DIGITISER RES= 18
##SPECTROMETER/DATA SYSTEM= spect
##.PULSE SEQUENCE= zg30
##.SOLVENT NAME= DMSO
##.SHIFT REFERENCE= (INTERNAL, DMSO, 0, 15.7039)
##AUDIT TRAIL= $$ (NUMBER, WHEN, WHO, WHERE, WHAT)
$$ ##TITLE= Audit trail, XWIN-NMR		Version 3.5
$$ ##JCAMPDX= 5.01
$$ ##ORIGIN= Bruker BioSpin GmbH
$$ ##OWNER= she
$$ F:/spectra/data/she/nmr/H-F/1/audita.txt
$$ ##AUDIT TRAIL=  $$ (NUMBER, WHEN, WHO, WHERE, WHAT)
(   1,<2020-09-25 10:02:57.70 +0400>,<she>,<DPX200>,
      <created by zg, POWCHK disabled, PULCHK disabled
       configuration hash MD5:
       00 E9 B6 7A A2 85 ED C7 34 08 36 98 17 FE 4E 26
       data hash MD5: 16K
       70 D1 D5 67 83 59 53 B6 A7 09 6F C4 78 37 73 A9>)
$$ ##END=
$$ 
$$ hash MD5
$$ 52 39 20 76 B3 D9 6B 9D AE 24 B6 EB 45 8C 49 30
##$RELAX= 
##$RELAX= 
##$RELAX= 
##$RELAX= 
##$RELAX= 
##$RELAX= 
$$ Bruker specific parameters
$$ --------------------------
##$DU= <F:/spectra>
##$EXPNO= 1
##$NAME= <H-F>
##$PROCNO= 1
##$TYPE= <nmr>
##$USER= <she>
##$AMP= (0..31)
100 100 100 100 100 100 100 100 100 100 100 100 100 100 100 100 100 100 
100 100 100 100 100 100 100 100 100 100 100 100 100 100 
##$AQSEQ= 0
##$AQ_mod= 1
##$AUNM= <au_zg>
##$AUTOPOS= <>
##$BF1= 200.13
##$BF2= 200.13
##$BF3= 200.13
##$BF4= 200.13
##$BF5= 200.13
##$BF6= 200.13
##$BF7= 200.13
##$BF8= 200.13
##$BYTORDA= 1
##$CFDGTYP= 0
##$CFRGTYP= 5
##$CHEMSTR= <none>
##$CNST= (0..31)
1 1 145 1 1 1 1 1 1 1 1 1 1 1 1 1 1 1 1 1 1 1 1 1 1 1 1 1 1 1 1 1 
##$CPDPRG= <>
##$CPDPRG1= <>
##$CPDPRG2= <>
##$CPDPRG3= <>
##$CPDPRG4= <mlev>
##$CPDPRG5= <mlev>
##$CPDPRG6= <mlev>
##$CPDPRG7= <mlev>
##$CPDPRG8= <mlev>
##$CPDPRGB= <>
##$CPDPRGT= <>
##$D= (0..31)
0 1.2 0 0 0 0 0 0 0 0.06 0 0.03 0 0 0 0 0.0002 0 0 0 0 0 0 0 0 0 0 0 0 
0 0 0 
##$DATE= 1601013777
##$DBL= (0..7)
120 120 120 120 120 120 120 120 
##$DBP= (0..7)
150 150 150 150 150 150 150 150 
##$DBP07= 0
##$DBPNAM0= <>
##$DBPNAM1= <>
##$DBPNAM2= <>
##$DBPNAM3= <>
##$DBPNAM4= <>
##$DBPNAM5= <>
##$DBPNAM6= <>
##$DBPNAM7= <>
##$DBPOAL= (0..7)
0.5 0.5 0.5 0.5 0.5 0.5 0.5 0.5 
##$DBPOFFS= (0..7)
0 0 0 0 0 0 0 0 
##$DE= 6
##$DECBNUC= <off>
##$DECIM= 32
##$DECNUC= <off>
##$DECSTAT= 4
##$DIGMOD= 1
##$DIGTYP= 9
##$DL= (0..7)
0 120 120 120 120 120 120 120 
##$DP= (0..7)
150 150 150 150 150 150 150 150 
##$DP07= 0
##$DPNAME0= <>
##$DPNAME1= <>
##$DPNAME2= <>
##$DPNAME3= <>
##$DPNAME4= <>
##$DPNAME5= <>
##$DPNAME6= <>
##$DPNAME7= <>
##$DPOAL= (0..7)
0.5 0.5 0.5 0.5 0.5 0.5 0.5 0.5 
##$DPOFFS= (0..7)
0 0 0 0 0 0 0 0 
##$DQDMODE= 0
##$DR= 18
##$DS= 0
##$DSLIST= <SSSSSSSSSSSSSSS>
$$ [...]
##$SUBNAM2= <"">
##$SUBNAM3= <"">
##$SUBNAM4= <"">
##$SUBNAM5= <"">
##$SUBNAM6= <"">
##$SUBNAM7= <"">
##$SUBNAM8= <"">
##$SUBNAM9= <"">
##$SW= 16.880792210976
##$SWIBOX= (0..15)
0 0 2 0 0 0 0 0 0 0 0 0 0 0 0 0 
##$SW_h= 3378.37837837838
##$TD= 16384
##$TD0= 1
##$TE= 0
##$TE2= 300
##$TE3= 300
##$TEG= 300
##$TL= (0..7)
0 120 120 120 120 120 120 120 
##$TP= (0..7)
150 150 150 150 150 150 150 150 
##$TP07= 0
##$TPNAME0= <>
##$TPNAME1= <>
##$TPNAME2= <>
##$TPNAME3= <>
##$TPNAME4= <>
##$TPNAME5= <>
##$TPNAME6= <>
##$TPNAME7= <>
##$TPOAL= (0..7)
0.5 0.5 0.5 0.5 0.5 0.5 0.5 0.5 
##$TPOFFS= (0..7)
0 0 0 0 0 0 0 0 
##$TUNHIN= 0
##$TUNHOUT= 0
##$TUNXOUT= 0
##$USERA1= <user>
##$USERA2= <user>
##$USERA3= <user>
##$USERA4= <user>
##$USERA5= <user>
##$V9= 5
##$VALIST= <valist>
##$VCLIST= <CCCCCCCCCCCCCCC>
##$VD= 0
##$VDLIST= <DDDDDDDDDDDDDDD>
##$VPLIST= <PPPPPPPPPPPPPPP>
##$VTLIST= <TTTTTTTTTTTTTTT>
##$WBST= 1024
##$WBSW= 4
##$XGAIN= (0..3)
0 0 0 0 
##$XL= 0
##$YL= 0
##$YMAX_a= 146812
##$YMIN_a= -165663
##$ZGOPTNS= <>
##$ZL1= 120
##$ZL2= 120
##$ZL3= 120
##$ZL4= 120
##$ABSF1= 10
##$ABSF2= 0
##$ABSG= 5
##$ABSL= 3
##$ALPHA= 0
##$AQORDER= 0
##$ASSFAC= 0
##$ASSFACI= 0
##$ASSFACX= 0
##$ASSWID= 0
##$AUNMP= <proc_1d>
##$AZFE= 0.1
##$AZFW= 0.1
##$BCFW= 1
##$BC_mod= 2
##$BYTORDP= 1
##$COROFFS= 0
##$CY= 11.3945322036743
##$DATMOD= 1
##$DC= 2
##$DFILT= <>
##$DTYPP= 0
##$F1P= 16.9975609425685
##$F2P= -3.02152046262296
##$FCOR= 0.5
##$FTSIZE= 0
##$FT_mod= 4
##$GAMMA= 1
##$GB= 0.15
##$INTBC= 1
##$INTSCL= 1
##$ISEN= 128
##$LB= 0.24
##$LEV0= 0
##$LPBIN= 0
##$MAXI= 10000
##$MC2= 0
##$MEAN= 0
##$ME_mod= 0
##$MI= 1.114404
##$NCOEF= 0
##$NC_proc= 0
##$NLEV= 6
##$NOISF1= 3.799351
##$NOISF2= 2.8
##$NSP= 1
##$NTH_PI= 0
##$NZP= 0
##$OFFSET= 15.70392
##$PC= 1
##$PHC0= -10138.09
##$PHC1= 20.4009
##$PH_mod= 1
##$PKNL= yes
##$PPARMOD= 0
##$PSCAL= 0
##$PSIGN= 0
##$REVERSE= no
##$SF= 200.130013532006
##$SI= 16384
##$SIGF1= 3
##$SIGF2= 2
##$SINO= 400
##$SIOLD= 16384
##$SREGLST= <1H.CDCl3>
##$SSB= 0
##$STSI= 0
##$STSR= 0
##$SW_p= 3612.71676300578
##$SYMM= 0
##$S_DEV= 0
##$TDeff= 0
##$TDoff= 0
##$TI= <>
##$TILT= no
##$TM1= 0
##$TM2= 0
##$TOPLEV= 0
##$USERP1= <user>
##$USERP2= <user>
##$USERP3= <user>
##$USERP4= <user>
##$USERP5= <user>
##$WDW= 1
##$XDIM= 8192
##$YMAX_p= 0
##$YMIN_p= 0
$$ End of Bruker specific parameters
$$ ---------------------------------
##NTUPLES= NMR FID
##VAR_NAME=  TIME,          FID/REAL,        FID/IMAG
##SYMBOL=    X,             R,               I
##VAR_TYPE=  INDEPENDENT,   DEPENDENT,       DEPENDENT
##VAR_FORM=  AFFN,          ASDF,            ASDF
##VAR_DIM=   8192,          8192,            8192
##UNITS=     SECONDS,       ARBITRARY UNITS, ARBITRARY UNITS
##FACTOR=    0.000296,      1,               1
##FIRST=     0,             0,               0
##LAST=      2.424536,      0,               0
##MIN=       0,             -165663,         0
##MAX=       2.424536,      146812,          0
$$ Real data points
##PAGE= N=1
##DATA TABLE= (X++(R..R)), XYDATA
0@%%%%%%%%%%%%%Qj6J6j6K4l2L2m0M8n6P2q4R6j15J35j52J74k00K26k57K94l34
35a77L77m24M76n36O00o67P41q25R17j013J119j237J366j506J660j829K013k217
53a162K444k696K979l299L662m079M565n138N827o672P737r129J1039j3837J8387
68A0628k7426P6175j71138K0477K33056j28234l0027j7643j9647J31500l5794
79D1927j66886J28489O8569r6409m721Q722L0963O8083j24042m4085J72737r370
91G3977j51534K4817R5482K2609o8427o8987O8714R2215o7277r2035L9022R8282
103F6858j6895j05542J0559J05971p841r8375n618Q8338J2789q8327j4190Q0909
115B8636K7245n0663n5902L9589R5856n8878j19038P8504Q8436p1124m8497J5285
$$ plain form
0 0 0 0 0 0 0 0 0 0 0 0 0 0 0 8 -8 8 -8 16 -16 16 -24 24 -32 40 -44 52 -63 72 -80 94 -106 120 -137 157 -177
35 -177 200 -224 252 -284 316 -351 390 -435 482 -531 588 -649 717 -789 871 -958 1055 -1162
53 -1162 1282 -1414 1565 -1734 1928 -2151 2414 -2724 3103 -3569 4168 -4961 6078 -7759 10628
68 10628 -16798 59377 -111761 -91284 141772 13538 -16489 -34132 -53779 77721 41927
79 41927 -124959 3530 72099 -24310 -29031 -20309 10654 78737 -45305 -89390 83347 73977
91 73977 -77557 -52740 42742 65351 -3076 -72063 -3349 88866 21589 -70446 -31424 66858
103 66858 49963 -55579 -45020 60951 53110 -45265 -50883 37455 50244 -38083 -52273 28636
115 28636 55881 5218 -50684 -11095 84761 25883 -93155 -14651 73785 2661 -45836 -30551
127c0551M8148M3794q8763n3216J23175J3645j03391J3650M1173J9463l09q2918
139e6100J9919J20978o5985r8650Q3836N3166m4815l3648r424N4701L9029q7101
151b4094l6615R3147K3945p5058l1905N3862M7540m7245o1172M2840O3577l3352
163A5470o3840K0972P1566j4459p2925J0244O3006J292n2672k1767N1622M3364
175E1873n7903m8208N9474M4970m6945m8300K8614N9226j7391p0528J7033O9448
187D1363j2794n9405l318N6010K0682o1373k7157O5348K2522n2569k4107K9139
199e659M2861j7731o7532K3622P7475l5793o5018L2207M4603q043l9409j9861
211c8278M9730L3762o1678l0573O0062K5932m3933l2668K9398M6263k2308n7295
$$ plain form
127 -30551 17597 61391 -27372 -80588 42587 56232 -47159 -33509 7664 27127 26818 -56100
139 -56100 -36181 84797 18812 -79838 3998 57164 12349 -21299 -30723 23978 63007 -24094
151 -24094 -60709 32438 56383 -18675 -50580 3282 50822 3577 -57595 -14755 48822 15470
163 15470 -48370 -27398 44168 29709 -43216 -32972 30034 31326 -21346 -43113 8509 51873
175 51873 -6030 -54238 5236 50206 3261 -45039 -16425 42801 25410 -45118 -28085 41363
187 41363 28569 -30836 -34154 21856 42538 -18835 -45992 19356 41878 -10691 -34798 -5659
199 -5659 37202 19471 -48061 -24439 53036 17243 -47775 -15568 29035 20992 -18417 -38278
211 -38278 11452 45214 -16464 -47037 13025 38957 -4976 -37644 -8246 38017 15709 -41586
223d1586K1845O0637j9758n7069J2591N2365l754m5552r672M0376K6242m0775
235d110m0065M5910M5625n0909m0415M4219L4799k6773l8164R799M8892j602n7061
248b9855J605N2660L497m2244j8453L9473L3506m4955l8347M9591L1633m1396
260c285k7793K4130L5799j1948m8177R171N3847j0055m8157J872M0260J5519m1215
273a0032k9517M7960L2608n0600k6322M0829K2862k2840k9546R665M1116m021
285B2162n0281M989N2088m603m7924n94M3610Q834l9003j9256L6619K7565l4969
298g63l2105L0606L3749k2928l4073J0975L8530j352m5969k530M9801J147m7772
311b2684j017L8463P776l0556j9474K7842K9508k7600l4684K6450L5502j9394
$$ plain form
223 -41586 -19741 40896 21138 -35931 -23340 29025 25271 -20281 -29953 10423 36665 -4110
235 -4110 -44175 1735 47360 -3549 -43964 255 35054 8281 -29883 -20084 28808 27206 -29855
248 -29855 -28250 24410 27907 -14337 -32790 6683 40189 -4766 -43113 6478 38111 -3285
260 -3285 -31078 -6948 28851 16903 -31274 -22103 31744 21689 -26468 -24596 15664 31183 -10032
273 -10032 -39549 8411 41019 -9581 -35903 4926 27788 4948 -24598 -14933 26183 22162
285 22162 -28119 -23130 28958 24355 -23569 -24163 19447 28281 -10722 -29978 6641 34206 -763
298 -763 -32868 -2262 31487 8559 -25514 -14539 23991 22639 -23330 -25860 23941 25088 -22684
311 -22684 -23701 14762 22538 -8018 -27492 350 29858 2258 -32426 -5976 29526 10132
323A0132l6805J1247M0938m724m2559J271M2048K249l6558q423L1406J7351k9088
336a515k4881K7538L0110k7089l2186K2295L2174j5917l4419Q065L5937j522l8013
349a9423k409L6715O558l2335j2902K8510K0759k6430k7965K7523L0819k6436
361B984k9358K0921K9010j1878l0588K558L4708K595l6510o002L4460J0481l1152
374g771j5272K8029K0782k6260k3030K3477K4452j8001k6781J2568K9475p264
386A4404l2428K397L2411K432l2157r843L1698J4066l1160j7231K7835J8799k2335
399a112k1466J5972K6231j1976k8939R543L0742n581k9753J769K9944M627l0144
412a0143q181K9226J1700k6173j5843K1460K0131j7542k5731J4752K7355j2150
$$ plain form
323 10132 -26673 -15426 25512 20788 -21771 -20500 21548 23797 -12761 -21184 10222 27573 -1515
336 -1515 -26396 1142 31252 4163 -28023 -5728 26446 10529 -23890 -15825 20112 18590 -19423
349 -19423 -21832 14883 21441 -10894 -23796 4714 25473 -957 -28922 -1399 29420 2984
361 2984 -26374 -5453 23557 11679 -18909 -16351 18357 20952 -15558 -21560 12900 23381 -7771
374 -7771 -23043 4986 25768 -492 -23522 -45 24407 6406 -20375 -7807 21668 14404
386 14404 -18024 -15627 16784 19216 -12941 -22784 8914 22980 -8180 -25411 2424 21223 -1112
399 -1112 -22578 -6606 19625 7649 -21290 -11747 18995 13414 -16339 -14570 15374 20001 -10143
412 -10143 -18324 10902 22602 -3571 -19414 2046 22177 4635 -21096 -6344 21011 8861
424H861k8077P217K7897k699k8274j883K8511M892k6280q769K3722J3976k1384
437b290j8161J8955K2496j7011k4428J3774K5578r530k6797N435K6769j240k6501
450a2951k639K4578P540k2623j2677K2417J6378k0656j8407J8359K0373j4321
462E371k2312J0451K4356p340k4663K861K4397J171k4179o072K2832J0214k2890
475e803j3402K0848J5644j8552j7527J4957J9780j1052k1841Q621K2581m250k2496
488a2492R8K3494M142k3382p323K3177R718k0999j2646J8320J5294j5679j7588
501a5866J1864J9798r111k0986N338K1535j554k2236j832K2220N063k2074p061
514a4902K0241R912j7879j3145J6053J5384j3236j7635J0328J9163o948k0668
$$ plain form
424 8861 -19216 -11999 15898 13199 -15075 -16958 11553 16445 -9835 -18604 5118 19094 -2290
437 -2290 -20451 -1496 21000 3989 -20439 -6665 18913 9383 -17414 -11979 14790 13550 -12951
450 -12951 -15590 8988 16528 -6095 -18772 3645 20023 -633 -19040 -681 19692 5371
462 5371 -16941 -6490 17866 10526 -14137 -11276 13121 14292 -9887 -15959 6873 17087 -5803
475 -5803 -19205 1643 17287 -1265 -18792 -3835 15945 4893 -16948 -8327 14254 10004 -12492
488 -12492 -12394 11100 15242 -8140 -15463 7714 17432 -3567 -16213 2107 17401 1722 -15866
501 -15866 -4002 15796 6685 -14301 -8963 12572 11018 -11218 -13050 9170 14233 -7841 -14902
514 -14902 5339 15251 -2628 -15773 280 15664 2428 -15207 -4879 14284 7336 -13332
526a3332L664K1578q49k1184k585K0846N345j9272q125J7351J1329j5574j3577
539a4385J3385J5919j1108j7291Q229J8850n433k0038K991J9682L91j9654l567
552a2029J8918O239j7566r164J5825J1541j3563j4215J1736J5948r430j7057O622
565f195J8301m052j8421R97J8553J993j8091m855J7200P433j5911r471J3584J2170
579A3235j1821j4276J0095J5325p548j6457N000J7033k229j7565l59J7602K879
592A0914j6783n732J6036P831j4196j0248J2090J2629j0324j3994Q049J5140n861
605E551j5548L032J6280p45j6593j162J5815L805j5335n977J4137Q227j2614j0564
619a1691J1035J2224q896j3919O944J4657m400j5233J767J5848O7j5208k597J4635
$$ plain form
526 -13332 -9668 11910 11061 -10123 -12708 8138 13483 -5789 -13914 3437 14766 -808 -14385
539 -14385 -1000 14919 3811 -13480 -5251 13599 8166 -11872 -8881 10801 11192 -8462 -12029
552 -12029 6889 13128 -4438 -13602 2223 13764 201 -14014 -2278 13670 4240 -12817 -6195
565 -6195 12106 8054 -10367 -9370 9183 11176 -6915 -11770 5430 12863 -3048 -12519 1065 13235
579 13235 1414 -12862 -2767 12558 5010 -11447 -6447 10586 8357 -9208 -9567 8035 10914
592 10914 -5869 -11601 4435 12266 -1930 -12178 -88 12541 2217 -11777 -3728 11412 5551
605 5551 -9997 -6965 9315 8570 -8023 -9185 6630 10435 -4900 -10877 3260 11487 -1127 -11691
619 -11691 -656 11568 2672 -11247 -4303 10354 5954 -9279 -7512 8336 8403 -6805 -9402 5233
633E233M838j3623p030J2547R046j1405j0336R399J2144p797j3170N739J3734
646I319l172j4502J136J4386J226j4149l475J3406N756j2530q116J1851R290j0111
660C15j0869Q421J1948o581j2563M180J3325k210j3251k39J3283K328j2856m315
674i084J2086O568j1567q028J0457R444q992j0668P397J1498n335j2454L485J2644
688G451j187j2751j247J2699L119j1899n362J1250O931j0155q393Q979R499p593
702A341j0328N701J1399m176j1716K279J1936j23j2192j637J1770L756j1390n400
716h780J0456O955r149q570Q022R433o135j0559M644J1014k884j1256R76J1525
730E692O39j1235k618J1126M078j0293n682R293P256q266q272O619R435n195j0228
$$ plain form
633 5233 10071 -3552 -10582 1965 11011 -394 -10730 -1331 10813 3016 -10154 -4415 9319
646 9319 6147 -8355 -7219 7167 8393 -5756 -9231 4175 9931 -2599 -10715 1136 10426 315
660 315 -10554 -2133 9815 3234 -9329 -5149 8176 5966 -7285 -7524 5759 8087 -4769 -9084
674 -9084 3002 9570 -1997 -10025 432 9876 884 -9784 -2387 9111 3776 -8678 -5193 7451
688 7451 6264 -6487 -7734 4965 8084 -3815 -9177 2073 9004 -1151 -9544 -565 8934 1341
702 1341 -8987 -3286 8113 3937 -7779 -5500 6436 6313 -5879 -7516 4254 8010 -3380 -8780
716 -8780 1676 8631 -518 -9088 -1066 8367 2232 -8327 -3683 7331 4447 -6809 -5833 5692
730 5692 6331 -4904 -7522 3604 7682 -2611 -8293 1000 8256 -10 -8282 -1663 7772 2577 -7651
745g651L682J0497j714j0995J75J0861J639j0804l034J0190M602r251o156Q424
759D65P168o931q385N588R307m164r820K502J0343j086j0282o15J0226K166r989
774c507l511R142N114q531o166P306P360n994q404M765R063l125r760J955R746
789E453k40r658j348R647K561q885m183Q521N158p459o397O338P440n372q046
804f470L763Q979k784r143J200R213M06r174j700Q803L212q428m263P679N388
819F681o538o547N733P251m322q069L208Q465j928q596M41Q748O79q330k317Q170
835B729L421p588m529O723N712o018o328M747P292l648p900K591Q113j185q438
850d306J17Q085J454p945k673P468L758o799m882O083N551m915o538M044P231
$$ plain form
745 -7651 -3969 6528 4814 -6181 -6006 4855 6494 -4310 -7344 2846 7448 -1803 -7959 465
759 465 7633 702 -7683 -2095 7212 3048 -6772 -4270 6073 4987 -5295 -5910 4316 6482 -3507
774 -3507 -7018 2124 7238 -1293 -7459 -153 7207 1213 -7191 -2426 6637 3512 -6248 -4293 5453
789 5453 5213 -4445 -5793 3854 6415 -2470 -6653 1868 7026 -433 -6830 -492 6948 1576 -6470
804 -6470 -2707 6272 3488 -5655 -4455 4758 5164 -4010 -5710 3093 6305 -2123 -6386 1293 6681
819 6681 143 -6404 -671 6580 2258 -5811 -2603 5862 3934 -4662 -4221 4527 5206 -3124 -5441 2729
835 2729 6150 -1438 -5967 756 6468 450 -5878 -1131 6161 2513 -5387 -2796 5317 4132 -4306
850 -4306 -4189 3896 5350 -2595 -5268 2200 5958 -841 -5723 360 5911 996 -5542 -1498 5733
865E733l012p506J783P881p51p654n29P515J912p335k947O734M135o333m841N229
881A4N815m400o566L460O877k285p393J301P330l0p263j129P085K209o546l483
897e004O326M345n630n002M712N695l827o209K743O770j906o868P22O893N37o975
913b678j565O600K714o306l598N780M330m942n121M150N520k955o203K116O549
928D391j286o416J0O653Q46o406j984O227K768n756l575N085M435m489m899L414
944i82N621k590o045J607O225n54o432k92O198J350o140k079N603K870m999l872
960d511M616M460l811m993K946N511k083n793J136O154m22n901o67N879J572n654
976a561k282M940L312m623m001M006M521l191n136K455N393j537n808Q79N567
$$ plain form
865 5733 2721 -4785 -3002 4879 4128 -3526 -4055 3460 5372 -1963 -4910 1824 5959 -374 -5215 14
881 14 5829 1429 -5137 -1677 5200 2915 -4478 -3177 4153 4123 -3140 -4269 2816 5025 -1521 -5004
897 -5004 1322 5667 37 -4965 -253 5442 1615 -4594 -1851 4919 3013 -3855 -3133 3760 4297 -2678
913 -2678 -4243 2357 5071 -1235 -4833 947 5277 335 -4786 -636 4884 1929 -4274 -2158 4391
928 4391 3105 -3311 -3301 3352 4198 -2208 -4192 2035 4803 -953 -4528 557 4992 503 -4396 -982
944 -982 4639 2049 -3996 -2389 3836 3282 -3150 -3442 2756 4106 -2034 -4113 1490 4360 -639 -4511
960 -4511 105 4565 754 -4239 -1293 4218 2135 -3658 -2522 3632 3210 -2691 -3358 2521 4093 -1561
976 -1561 -3843 1097 4409 -214 -4215 -209 4312 1121 -4015 -1560 3833 2296 -3512 -2633 2934
991B934J77n534j196N498J809m980k760M639L386m088l994L529M549k856m877
1006c764J959N335j248n364M60N280O44n295j362N052K175m741k785M191L469
1021D006l618m179L129M303k255m764J457M974p66n059j41N154P27m936j655M699
1037A076K366m408k805L635L677l185m047K575M362j737m598J002M801j21n030
1052b437k15M713J203m519j915M363K371l702l109L250L568k653m080K052M311
1067C201j412m539M95M693j08m643o41M324J520m332k039L860K680l456l116K884
1083f29L691k185m113J870M162r10m347L70M424L13m215j039M147J576l727k349
1099b961L462K831l123l218K401L819k114l902J313M111p12m125o9M154O75m131
$$ plain form
991 2934 3111 -2423 -3619 1879 3688 -1292 -4052 587 3973 -115 -4109 -580 3969 1113 -3764
1006 -3764 -1805 3530 2282 -3082 -2622 2658 3302 -1993 -3355 1697 3872 -869 -3654 537 4006
1021 4006 388 -3791 -662 3641 1386 -3378 -1921 3053 2287 -2772 -2913 2241 2968 -1968 -3623 1076
1037 1076 3442 -966 -3771 -136 3541 356 -3691 -1116 3246 1509 -3089 -2087 2714 2593 -2437
1052 -2437 -2652 2061 3264 -1255 -3170 1193 3564 -138 -3247 3 3571 918 -3162 -1110 3201
1067 3201 1789 -2750 -2255 2438 2330 -2313 -2954 1370 2890 -1442 -3481 379 3059 -397 -3513 -629
1083 -629 3062 877 -3236 -1366 2796 1886 -2461 -2091 2333 2646 -1569 -2608 1539 3115 -612 -2961
1099 -2961 501 3332 209 -3009 -608 3211 1097 -2805 -1492 2619 1907 -2218 -2287 1867 2542 -1589
1115a589j117L600J976l561k445L167K765k609l328K157L599j582l849J070L911
1130B165k68l935l17M125Q02l660j432L514K093l159k443K773K893k351l226J779
1146f47L486j345l778O88L678n0l916n81L681J096l598j646L303K046k769k552
1162b904K539K875j883l239J537L545j006l487M00L623K15l624p17L443J246l322
1178g59j640K812K231k611k660K253K844j543l285J263L280n55l484J51L410M89
1194B196l414j005L303J331k934j977K690K188k280k610J735K955j483k989Q54
1209a440L219l97l217m5L160P88l162j049K951J686k712j935K388K235j882k714
1225b126J649K712j141k994N45L090j79l097m04L072P21k854j229K660J720k523
$$ plain form
1115 -1589 -2706 894 2870 -691 -3136 31 2796 187 -3141 -984 2615 1033 -2816 -1746 2165
1130 2165 1897 -2038 -2355 1770 2572 -1088 -2520 994 3087 -72 -2515 258 3151 800 -2426 -647
1146 -647 2839 1494 -2284 -1596 2082 2032 -1884 -2465 1216 2312 -1286 -2932 371 2417 -352 -2904
1162 -2904 -365 2510 627 -2612 -1075 2470 1464 -2023 -1623 2000 2215 -1409 -2126 1317 2563 -759
1178 -759 -2399 413 2644 33 -2627 -374 2470 927 -2358 -1095 2185 1630 -1854 -1703 1707 2196
1194 2196 -1218 -2223 1080 2411 -523 -2500 190 2378 98 -2512 -777 2178 695 -2294 -1440
1209 -1440 1779 1382 -1835 -1880 1280 2068 -1094 -2143 808 2494 -218 -2153 235 2470 588 -2126
1225 -2126 -477 2235 1094 -1900 -1355 1735 1556 -1541 -1945 1127 1848 -1006 -2235 425 2145 -378
1241c78j962K022K496j757k525J264K792p68k959L87K956J08k981n47K859R27
1257A934k632j386K389J746k157k112J885K338j460k556J053K759o21k722M7K885
1273A390K68k811o39K564J203k539j411K133J867j887k120J595K281j124k691
1288a921R10K609l83k686j6K667M46k584q32K442J108k140j595J997J816j666
1304A72k077J234K373j030k391N19K614j70k610k05K511O77k437r48K233J340
1320A805j970j728J888J802j384k179J191K248p72k347L99K464j11k346m61K421
1336I20O79k179j115K067J346j879j567J430J960j319k026R17K178n86k303L17
1352a160K195K14k360m10K181R24k054j197J903J438j497j791J459J826j045k024
$$ plain form
1241 -378 -2340 -318 2178 421 -2104 -840 1952 1184 -1775 -1388 1568 1676 -1305 -1852 1007 1934
1257 1934 -698 -2084 305 2051 -106 -2218 -333 2005 545 -2011 -958 1801 1180 -1542 -1495 1390
1273 1390 1658 -1153 -1792 772 1975 -564 -1975 158 2025 138 -1982 -387 1894 770 -1921
1288 -1921 -1011 1598 1215 -1471 -1487 1180 1626 -958 -1790 652 1760 -380 -1975 22 1838 172
1304 172 -1905 -671 1702 672 -1719 -1200 1414 1244 -1366 -1571 940 1617 -820 -1768 465 1805
1320 1805 -165 -1893 -5 1797 413 -1766 -575 1673 901 -1446 -1047 1417 1306 -1040 -1501 920
1336 920 1599 -580 -1695 372 1718 -161 -1728 -298 1662 343 -1683 -766 1412 826 -1477 -1160
1352 -1160 1035 1249 -1111 -1521 660 1584 -470 -1667 236 1674 177 -1614 -155 1671 626 -1398
1368a398O86K243m68k093p3K246K92k232o50J992J007j925j244J650J444j424
1384E3j744J178J891q45k110O66K055k35k094j48K176M22k020o75J902R89j622
1401a61j338J602J440j249j631R52J892o62j993L86K055j55j988k10J902N61j987
1418e84o86J610J079j582j382J394J472j114j764Q54J861n86j839K72J881Rj812
1435i17m01J944O41j747q67J523J265j429j344J155J566j021j486O03J681l04
1451H62j827J79J704K21j794m65J686Q20j663j025J486J106j183j509J089J434
1467A121q17j570L89J757k74j714j0J686L58j748n33J611R09j545q55J260J218
1484A243j016j360R05J423n23j599L88J614q4j735j09J631L06j569p14J510P53
$$ plain form
1368 -1398 -712 1531 1063 -1030 -1103 1143 1435 -797 -1447 545 1552 -373 -1617 33 1477 53
1384 53 -1691 -513 1378 533 -1577 -911 1144 909 -1185 -1333 843 1265 -755 -1430 472 1461 -161
1401 -161 -1499 103 1543 294 -1337 -385 1507 845 -1148 -762 1293 1138 -850 -1060 842 1403 -584
1418 -584 -1270 340 1419 -163 -1545 -151 1321 207 -1557 -703 1158 572 -1267 -995 886 895 -917
1435 -917 -1318 626 1267 -480 -1347 176 1441 12 -1332 -177 1389 368 -1118 -515 1166 862
1451 862 -965 -786 918 1139 -655 -1120 566 1386 -277 -1302 184 1290 107 -1402 -313 1121
1467 1121 304 -1266 -877 880 606 -1108 -1118 568 926 -822 -1355 256 1165 -380 -1235 25 1243
1484 1243 227 -1133 -228 1195 672 -927 -539 1075 991 -744 -853 778 1084 -485 -1199 311 1064
1501A064j269r84R39J302r30j390O85J548n06j576K77J662r8j521j71J409N14
1518I55j394o87J250Q97j105j114R26J284p29j466P00J355l07j481J63J550jj339
1536e43l20J323N92j222q74J193J015j120j172Q66J311q20j366N81J252k66j312
1553h82n8J366K65j364m52J237P73j248q54J287Q97q94j130Q35J170n34j212K39
1571e59J358j35j304k60J420L90j400n14J227P07j210q71J063R76q16j055N35
1588d48J186k35j372K06J336M4j422j79J461K44j230n76J179O13j007p71Q27R39
1606G95o23j053L21J354l28j358K37J263Q7j291j65J141L38j097m97R73O81p30
1624D8r59O98J043m94j303N16J247l56j232J78J145P0j104k64J066M48r14o89
$$ plain form
1501 1064 -205 -1189 -250 1052 122 -1268 -583 965 459 -1117 -840 822 724 -797 -968 441 955
1518 955 -439 -1126 124 1021 -84 -1198 -272 1012 283 -1183 -483 872 565 -916 -753 797 796 -543
1536 -543 -863 460 1052 -170 -1044 149 1164 44 -1128 -262 1049 229 -1137 -556 696 430 -882
1553 -882 -940 426 691 -673 -1125 112 885 -363 -1217 70 967 73 -1057 -222 948 414 -798 -559
1571 -559 799 664 -640 -900 520 910 -490 -1004 223 930 -280 -1151 -88 888 72 -983 -448
1588 -448 738 503 -869 -663 673 717 -705 -884 577 821 -409 -985 194 807 -200 -971 -144 795
1606 795 172 -881 -560 794 466 -892 -655 608 695 -596 -761 380 718 -379 -876 97 778 48
1624 48 -911 -213 830 336 -967 -451 796 440 -792 -614 531 601 -503 -767 299 747 -167 -856
1642h56Q57Q84q31r89P04J091n93j121M73J064k46j081RJ030K86j034n00J047
1660A94O17j001p67R56Q67p95r66P65Q94n30r14K50J053r8r49k28J045M04j099
1679c02m42J019N44r82n91P68P10o53p84M45Q99k27r91O3J029J01j118j91J131
1698D28K58j074l54R74M25p49o06O00P24l99q27K38J005j33j158J18J133K7j166
1717e36O1R21K49q83l69P29M98n68p87N42Q17l60j011L09J030k81r51P7R73%q02
1738c42k58Q18L55o48n98O40P33n81q23N40R81o05q80L34R02k28p26K7O88K63
1758E92p55l52P02N15p07o99P28P33n95p95N54P34m63p59K64P18pp28k90Q57L50
1779E97q36m29Q52M66q31n32P40N56n70n32L45N83j16o77m3P92J45q49j80Q85
$$ plain form
1642 -856 1 885 54 -935 -231 860 267 -854 -381 683 437 -644 -635 395 681 -353 -853 194
1660 194 811 -190 -957 -1 866 71 -895 -130 764 234 -680 -430 623 525 -424 -652 393 797 -302
1679 -302 -744 275 819 -163 -754 14 724 71 -713 -268 631 404 -587 -524 505 606 -512 -703 428
1698 428 686 -388 -742 232 657 -92 -698 -98 626 227 -600 -362 643 510 -648 -530 603 630 -536
1717 -536 -475 446 695 -188 -557 172 670 102 -685 -143 674 314 -697 -388 642 361 -590 -513 460 460 -342
1738 -342 -600 218 573 -75 -673 -33 700 119 -704 -164 817 212 -668 -334 568 340 -386 -359 329 592
1758 592 -163 -515 187 702 -5 -704 24 757 162 -633 -79 655 192 -567 -303 415 408 -320 -610 247 597
1779 597 -239 -668 184 650 -181 -713 27 583 13 -519 -174 409 293 -384 -427 365 510 -339 -519 366
1799C66K95r31l02Q05L35o01m30M96N22l41o30J33Q10j34q16j18J012M7r81nP64
1820B96J72p02k81N85L18l64n67L68O58j98q05J93Q74k29q13J29Q35l6o83j34
1840c84O36K04n17m20M31O13m88o60M04P46l40p74K80P30j73o76J09N38O2m85
1860a64k91N12M77n30o42N09P18n14o19M07N99l77o00L09N58r7m92j59N35L54
1880D93o34l67O03M83o35m08M31N87n11m80L48M28j12n56jO33R7o35k18O78K41
1901D65p14k59O19L87o48k72L80L90l15l55J22N27j3o20o6O85J20p03j57O62J60
1922C95n91j97M18L12l03m02K96L94r0o76J65O72p0o92O5O16l4n08j21N07J66
1943C22m36k00K97M53l25n41K13O80k31o90K37N55r2n87O4M41J28m05k30L93L39
$$ plain form
1799 366 661 -270 -572 233 568 -33 -463 33 555 214 -416 -283 527 393 -423 -541 471 518 -463 -468 296
1820 296 468 -234 -515 70 388 24 -543 -175 483 285 -520 -327 547 318 -495 -366 469 433 -250 -384
1840 -384 252 456 -61 -481 -50 563 75 -585 -181 565 225 -549 -269 461 288 -388 -279 259 321 -164
1860 -164 -455 57 534 4 -638 -129 589 75 -544 -137 462 85 -515 -206 352 255 -237 -396 139 493
1880 493 -141 -508 95 578 -57 -465 -34 553 42 -438 -90 338 226 -330 -331 302 399 -236 -454 224 465
1901 465 -249 -508 111 498 -150 -422 -42 348 33 -322 -200 327 314 -306 -372 313 433 -270 -427 235 395
1922 395 -196 -393 25 337 34 -368 -72 322 232 -444 -279 393 323 -369 -304 312 278 -230 -351 156 322
1943 322 -114 -314 -17 436 111 -430 -217 463 232 -458 -221 334 242 -345 -281 160 288 -117 -347 46 385
1964C85l28m87L68N20l55n26L25N57l17m56J47M39q0l74r7L94K70m61l44M26M52
1985D58m69m25L74N13m07m40L10L54o1m23k7M17J36m60k26M95K73n15k98N22K14
2006C15l85l07L41L47k54k80N5M14Nm76r9N60J29n91r4M69J69l88k68M15K12k31
2028E8l37J94L73r8n13J09M88j8m98p8N37L6m42j30M31J87l55k47K41L81k39l98
2050c18J28N39j87n24J83M94l7n01NM57k9l06j65L12K16k99k53K32L96k82m06
2071c45K92M20k13m14J15L71k6l84n2L37J64l38k32K92L66m02l14L64L03k60l97
2092c53K46L94j59l19O7K44P4l35j44M25J56l53k73L70K48l20l05K72L77k92k18
2113a98N8K84K5l95l1M51R6m04j46L77J71m22j66L28J53j39l05J93K61o3m17Q9
$$ plain form
1964 385 57 -430 -62 458 103 -423 -98 459 142 -314 -167 272 192 -182 -279 115 385 -76 -420 6 458
1985 458 -11 -436 -62 451 44 -396 -86 268 207 -216 -243 174 310 -150 -376 119 392 -123 -421 101 315
2006 315 -70 -377 -36 311 57 -223 -168 246 251 -225 -324 236 365 -226 -320 149 318 -70 -338 77 289 58
2028 58 -279 -85 288 190 -323 -214 274 256 -242 -320 217 253 -189 -319 112 299 -56 -303 -62 319 80 -318
2050 -318 -190 349 162 -362 -179 315 278 -223 -218 239 210 -96 -261 51 267 -32 -285 -53 343 61 -345
2071 -345 -53 367 154 -260 -145 226 200 -184 -236 101 265 -73 -305 -13 353 -49 -363 1 304 44 -353
2092 -353 -107 287 128 -191 -124 120 194 -141 -285 140 296 -57 -330 40 288 -32 -337 -65 312 20 -198
2113 -198 -140 144 169 -226 -257 194 290 -114 -260 117 288 -134 -300 28 181 42 -263 -70 191 128 -289 -200
2135b00M50l8m22m4N16J6m27j10L90J06k45j96J67L17k11l44J83L46j41l52R2
2156a47L58ml88KK99P1k54j17K26K15k75k27K16K85j51l27J14L58r5l41J7L24
2178A59J3l23k0K83Q6k54j69K44K27k89k07K17K90j73l09J22L16j06k95P3K36
2199A21K9k82q1K89J53l04k00L31J78k50k06J90L03j91k56J18K33j0k70l6L28
2220A87O1l59o4L00J33l22j45K80J66j93k21J18K37o1k78J1L57l8l05j7L06qk49
2243a04j23L05Q7k06j52K18J70j41k69J38L06m0l42L9K62J5l00j2K65ok09j00
2265a99K69R7j33k21J91J80q1l03J01K47m6k36j5K65J9j71j76L13Q4k31j03J55
2287FK39k40k00J43K65j53j96R4K42j05j96m4K32R9k62j06K92O9k26j46J87K03
$$ plain form
2135 -200 250 212 -210 -254 262 278 -149 -259 131 237 -8 -204 -37 280 69 -275 -92 254 113 -239 -147
2156 -147 211 207 -181 -179 120 191 -63 -180 46 261 -14 -241 -25 260 109 -218 -104 254 159 -182 -165 159
2178 159 172 -151 -171 112 198 -56 -225 19 246 -43 -250 -33 257 84 -225 -103 213 107 -188 -115 121
2199 121 150 -132 -213 76 229 -75 -275 56 234 -16 -222 -32 271 80 -176 -58 175 165 -105 -141 187
2220 187 248 -111 -175 125 258 -64 -209 71 237 44 -177 -59 178 117 -161 -150 207 169 -136 -153 153 145 -104
2243 -104 -227 78 165 -41 -193 25 195 54 -215 -77 229 189 -153 -114 148 163 -137 -149 116 110 -99 -199
2265 -199 70 167 34 -187 4 184 103 -200 -99 148 102 -134 -149 116 135 -36 -212 101 185 -46 -149 6
2287 6 245 5 -195 -52 213 60 -136 -42 200 95 -101 -145 87 186 -76 -182 110 179 -47 -193 -6 197
2309A97j51k07R0K67j53k31Q2K34J6k89k0K84L7k50l8J74J48k01j68K19J52j68
2331B4j70K0K71r4k10M7K07N7k82o4L48pk33j03K31J45j76k00J48K54j89j27K9
2354g4J98p2k30M9K42j1k16m3J87Q5j79j01J64J56j54j36J10Q8Kj71L3K21m0k21
2378a13j2K25nj93p5J98J36j93q9R8J71j24k01J56J61j21j46M9J59Rj80K5J85
2401A20L3k33m7J61P8j59j24J69J49j38j40J07J82j23j50mK88q2k09k1J58Q6j88
2424h7m6J72P6j56j21J04J57o8k01J01J35qk08O9K00qj59p0K38m5r3j07J51J10
2448A36j34j16P9J90j38j53Q6J76j09j66J4K32J6j98l0J63L1j48k2P6J19p6j34
2471a06Q3J53j48p3O4J08%j73j9K12o1r2r1J89J69k64p4R4J60j33j83J56J62r3
$$ plain form
2309 197 46 -161 -71 196 43 -188 -106 128 144 -145 -165 119 156 -94 -132 42 190 -11 -179 40 192 24
2331 24 -146 -126 145 51 -159 -112 95 152 -130 -194 154 147 -86 -189 42 187 11 -189 -41 213 24 -103 -74
2354 -74 124 52 -178 -129 113 102 -114 -157 30 115 -64 -165 -1 155 1 -135 -25 63 65 -106 -73 148 108 -113
2378 -113 -125 100 95 -98 -173 25 161 -32 -121 -23 148 24 -177 -21 140 19 -127 -78 81 90 -90 -65 120
2401 120 153 -80 -127 34 112 -47 -171 -2 147 9 -131 -24 158 35 -115 -119 169 87 -122 -143 15 101 -87
2424 -87 -133 39 115 -41 -162 -58 99 31 -170 -69 66 58 -150 -81 119 111 -48 -118 120 75 -18 -125 26 136
2448 136 2 -114 -35 155 17 -136 -50 126 17 -149 -135 97 113 -85 -115 48 79 -69 -91 -15 104 28 -106
2471 -106 -23 130 -18 -91 -27 81 81 -92 -111 101 40 -52 -143 46 215 -49 -123 -29 131 -2 -185 -29 133 40
2495D0j69R4J57n7j67j8J46R3j56j45J84J27k07q7J58O4q3o9J25M6n9j09L2K35
2519A75j14j31j7K13k9j60l6Q2J43j23j11J16O0m9j12K6J62o9j66N2K28m5j93
2542i8lJ53mq0qN6N6j13q0J40J11j14j55J48J43q4j86R4Q4K7j43J3N9R2j70n4
2568a16J74Rj08m9Q2Q1n5j07PJ88p4j30JK25l5j48l7J58L5j65J4N5J08j38q5Q3
2594b7J23o1j90J32R7k4r3m1J28K5r2q8J20Q2p4j34J50L3o3o7K9J48m4j43K8J23
2620G7J3j38o5J51M8j22n0M9J24j01r2Q7O2m3o7P9N9o0j20P5J01qj15k6J18qq3
2647e5q4J95M0o9j17P5O6j06j8P6R5l7j43M7J16Qj82L4J46k9p1q4J07L3L8j52
2673g1J05M2r0n7M7J33o1r9l6J35%j04PQ2K3n6j18J34N6q6n8L9Q5k8o8j1J29J0
$$ plain form
2495 40 -129 -35 122 65 -102 -120 26 119 -37 -182 2 129 -78 -165 -7 57 -26 -95 30 76 17 -92 -60 175
2519 175 61 -70 -87 126 97 -63 -99 -17 126 3 -108 8 68 19 -93 -67 95 26 -140 -88 140 95 -98
2542 -98 -101 52 48 -32 -40 16 72 -41 -121 19 130 16 -139 9 152 68 -118 -24 60 87 -56 -43 16 108 -62 -116
2568 -116 58 67 -41 -90 -8 73 18 -89 -82 106 32 -98 -97 128 93 -55 -92 66 101 -64 -50 5 113 -25 -110 -27
2594 -27 96 35 -155 -23 74 50 -43 -84 44 69 -23 -111 9 91 17 -117 33 66 3 -64 -35 113 69 -74 -46 77
2620 77 90 -48 -113 38 86 -36 -86 -37 87 -14 -106 -19 43 0 -67 12 71 11 -109 -34 67 59 -56 -82 36 28 -55
2647 -55 -139 56 96 27 -90 -15 51 -55 -73 3 98 61 -82 -35 81 89 -93 -59 87 58 -13 -97 10 43 81 -71
2673 -71 34 76 -14 -71 -24 109 48 -51 -87 48 48 -56 -49 33 56 0 -118 16 72 -14 -72 -33 52 24 -44 -55 74 84
2701H4j70J0J17mj00j4J08O5j00j14J22J37j51q9O8J02Pj57L2J30p3n0k2O8L3
2726C9q2l8J30K5j02j42J31N1M4j24O5J21j45%k0J41l2n0p4J26O4j49nQJ35q4
2752C3l8j0J11n9p4J2N2j4n5l5J14K7r7mL3L0q9n3J54K8q3o5M5J17r4q0L3J27
2780F6k3n6l3J05J0q7m3P8Q0j28K6k1Q8q6m1R6mJr3%Q2L0j29M9O8j0n8n1J21P
2810D4j03j1Q3M3q8m3M9P4k1p5J2J22k9n3j00J00P4j17J0N7M3j10JL8P1m5j25
2837i9J33K9n5m9nJ20j3m1r6P6L3p3n1J05K8n2p8N8J04j10J6RJ14q9n2RP5K0r6
2866c0J9P3m4j7p5R4O8p1o9P1O2p1l7o8J28J0j02L8N6M3j19k1J41l3q7qO2M3p9
2895b3m6L8J04n7q7L4J48n4j17L6M9j2o3J0M4J05j22p2J11K0m8m4M6L7l5n9OJ08
$$ plain form
2701 84 -86 -76 41 37 -63 -77 31 96 -4 -118 4 141 -10 -99 -31 71 78 -79 -47 83 10 -40 -62 6 39
2726 39 -43 -81 49 74 -28 -170 -39 12 56 -68 -3 118 -27 -27 -47 94 62 12 -62 64 128 -21 -26 -18 117 33
2752 33 -5 -15 96 37 -37 -25 27 13 -42 -77 37 64 -33 -37 -4 26 -63 -116 38 66 -17 -82 -37 80 -14 -94 -61 66
2780 66 43 -13 -46 59 69 -18 -61 17 97 -31 -5 -26 62 -24 -65 31 27 28 -65 -65 17 47 -82 -33 35 25 -33 -84 37 44
2810 44 -59 -70 13 56 -32 -75 -26 48 27 -48 -36 86 57 4 -96 4 78 -39 -29 28 71 -39 -38 0 71 26 -99
2837 -99 34 63 8 -41 -46 74 61 20 -76 0 33 -40 -91 14 42 -10 -88 -30 74 -36 -20 -11 103 14 -38 -29 46 66 -30
2866 -30 -11 62 18 1 -74 20 88 17 -52 19 81 10 -27 -95 33 43 -59 -21 35 78 -41 -62 79 46 -41 -49 13 56 -23
2895 -23 -69 -31 73 16 -71 -37 111 57 -60 -24 25 13 -50 -40 4 109 -13 -85 26 46 -2 -46 0 37 2 -57 -51 57
2923E7j3j05K8K7O7j21J4P6J2r8M1n9J19jr8N7M6k1o0j2J07k8p6KO7M8r5lL7M9
2953F4j05j9P0K9k2l2K6N0n4o8R9K3j3j08J4O7L2j05k1R5L8m3k5j7N9l3l4L3L2
2982C2L3j08L8R5n8l1p0J13l5n1M1j2N5k1p0K9L8Nj16P1M2L8n9o3J08q1J6m8J48
3011G9l1o2m7O7M3l7m2M0M7n4n3O7M4m6q2Q0mOk7k1N7Qn2l1Q4Ol7k5kL1O3p8r
3044a8O6n4n7O2k8R8p5qL5l6O1o4J3M9o6J1nM2J7j00Q4JK6q4k4P2k0k6J0K9P2
3075H3o1m8P9l2J0p6K2O8k3m3%nP1q8O8J9l0n9J8L5K4k7m1M6QJ7n0qQ6m5p4RM3
3108dK2m3j3O5kjl9K8J1o0l5M1R0j00k0M5N5j1j0r3J26ro2L3J6j9L1q4N5K5j4
3139B4j03P9M8n3l3O5l6O1l1r6J43lp3o3P4j4K9n9N1M3o9l3K5Q2o3m0OO1l0J8
$$ plain form
2923 57 44 -61 -33 -6 61 -60 -46 30 42 -56 -15 -74 45 44 -54 3 49 28 -32 -44 63 35 -41 -39 28 76 -19 -22 15 64
2953 64 -41 -60 10 39 17 -15 11 61 7 -61 38 61 48 -60 -46 21 53 -52 -73 22 60 17 -8 -25 34 1 -33 0 32
2982 32 65 -43 -5 90 32 1 -69 44 9 -42 -1 -13 42 21 -49 -20 18 23 -93 -22 20 58 -1 -64 44 -37 -21 -69 79
3011 79 48 -14 -61 6 49 12 -30 10 57 3 -50 17 61 15 -67 13 9 15 -12 -33 24 32 -20 -51 33 39 2 -23 -25 6 69 -9 -18
3044 -18 48 -6 -63 -1 -29 69 -6 -14 21 -15 46 -18 -5 44 -22 -11 -16 26 43 -57 27 28 54 -30 -54 18 -2 -28 -18 11 83
3075 83 22 -26 53 21 31 -45 -23 45 22 -21 -21 -26 45 -43 25 44 14 -45 -27 8 32 5 -36 10 18 35 -15 -23 63 18 -56 -47 -4
3108 -4 18 -25 -38 27 25 24 -15 13 24 -36 -71 -30 60 -40 -60 -15 40 29 19 -74 52 43 -19 14 30 11 42 -42 13 38 24
3139 24 -79 0 48 -5 -38 27 -9 52 21 -75 68 65 -8 -71 3 -11 18 -41 10 53 -16 -49 -24 58 -5 -45 -39 22 -8 10
3169A0K0MNn1p1O0O6o2m0Q1k0J3m0k4J27kj11L1N7n6JK2j3M1m5k2L3N6j05K0l4
3200d9M8J8q1M9L6k4K3k5llk0l8J11k3Lp6O1L0n9L8m1M7K1l8j9J9Rl9J9M7l1n9
3232d9L7K2k0Kl2K6R3o4n2MQ9p8l7M4N2m5k6k9J01rp7O8pL0j02J4R0J7q5k6N6
3263GK6Nq7P3M0J0p6m2LQ5n4mO3pm1k9N3%m2l5M0M7m1L0m9M0j6j7J8L8k4k9j0
3296b5J3K6Km2K6M8mj02P4l8K0l0kQ0pm5n8O6mJ0n7Q9j9m1m1P6lK3p1J8J01r7
3328a4L3l8mj3lKK7K8Nq2O1%n9L7L1Ok7l0K5P4q6J2lO6o4J4l8L2M5rl9r%K8l8
3363c0N1jk8m5N8l9L1J6k0J6k0l7N%M7J3l7RJ1l2j2J3J4MJ9m0J05n6q8N0lM7k3
3396bl1L5Q9j33M3nrJ8l6j2J06m1n8J8N3k5j4j6O4n5K8m5K8K8J2k0N3K1p3k9L2
$$ plain form
3169 10 30 34 39 -12 -83 -23 43 -19 -59 22 2 15 -25 -49 78 76 -35 -4 53 -3 -2 20 7 48 3 -19 14 70 -35 -15 -49
3200 -49 -1 17 -64 -15 21 -3 20 -5 -8 -11 -31 -69 42 19 22 -54 7 37 -22 16 -25 22 43 5 -14 5 14 -25 -6 41 10 -49
3232 -49 -12 10 -10 -8 -40 -14 79 15 -37 -33 56 -22 -59 -15 37 -8 -34 -63 38 29 -48 20 13 43 -59 -45 45 62 -23 -49 7
3263 7 33 38 -49 24 64 74 -2 -44 -41 44 -10 -14 49 42 1 -28 25 25 -17 -52 -12 35 -6 24 -25 15 -1 -18 0 38 14 -15 -25
3296 -25 -12 14 16 -26 0 48 44 -58 16 -22 -2 -32 -34 46 39 -6 -64 2 -2 8 -49 40 21 -20 -61 15 12 35 -36 -18 83 -14
3328 -14 19 -19 -23 -36 -39 -37 -10 18 23 -59 2 2 -57 -20 11 17 -10 -40 -15 59 -27 -15 -18 48 -16 -2 -40 -8 37 28 -11 -20 -20 8 -30
3363 -30 21 20 -8 -53 5 -34 -3 13 -7 9 -11 -48 -43 -43 4 17 -20 -11 0 -32 -44 -31 -17 -13 6 -34 71 15 -73 -23 -26 21 -2
3396 -2 -33 2 91 -42 1 -4 -13 5 -31 -43 63 22 -36 -18 35 10 -4 -20 44 -11 17 -28 0 28 40 20 73 94 21 -8 24
3427B4L7p0m9N7M0k1m4J6K4N3q4l4O4N8p0j7M2L3j6q5L1O7n3Jm5O6J2o7nJN0r
3459Go8Q2M7n1k6O8k1n3Qn4R1J2m9qN3m7p4N7O1Jm0k1K1M6m0l2K9M3o5M0j3k1
3491a7J0Nk2N3l3q3J17m9N5k9n0O2lk0L5m2j9Q1p3J7L2m4M9m4K2N6o2m5J6L2l
3522DNl6O9n1k8J7O1n4o3Q5K5p0kN1k0J2K8q7M4n3M6n2J06l8mJ8l9J15j16M4j9
3553bN6mo6Mm0P9o5MJ0Ml7nJ18n1Pk3M2l4l8J4j8K7rrL6j7pM3j8M0Qk4j9JJ7k
3589B2qm1O1n0l6M2L4n0J3K0oK6k7OjoN0n1j2K9j3l1j1L6N5l7k4RJ3OK6qk1L5
3623E0m3nK0m5j6P5k0J9rm4O6q4M2k4JN8k2n7kR6j5r8M1J07m1p6M3o9K4L7l3L6
3655A2J7m1j0K3L1l5k4RO0p4K0j1K6M2m8j6L5L0j8n0j8Q9n6j1Q1o2J5q0P3M7q1
$$ plain form
3427 24 61 -9 -58 -1 39 18 -26 -10 14 67 -17 -51 13 71 1 -16 26 59 43 -42 -11 56 3 4 -41 25 37 -30 -35 -34 16 7
3459 7 -61 21 68 17 -9 59 38 -15 -7 -61 30 42 -7 -15 38 -9 -83 -26 35 36 -4 -25 -4 42 2 -30 -1 42 -23 17 4 -17
3491 -17 -7 -2 -24 29 -4 -87 30 -19 36 7 -43 19 16 -4 31 -11 -30 51 -22 -5 27 -17 32 -12 10 66 4 -41 -25 7 4
3522 4 9 -27 42 -9 -37 -20 41 -13 -76 9 34 -36 -38 13 -7 5 33 -54 -10 -63 -17 -69 37 -1 -5 13 -26 89 -27 17 -2
3553 -2 54 50 -16 -12 -52 27 -38 -34 -24 -20 -57 -62 56 5 12 -11 31 -3 -41 -27 -45 -18 -27 -36 0 -17 -24 19 1 41 49 25 6 7 24 22
3589 22 14 -27 34 -16 -52 -10 24 -26 -13 7 1 27 0 6 5 -1 49 -2 -14 15 2 -29 -40 -4 51 14 -10 -1 12 18 44 36 15 50
3623 50 7 2 22 -23 -39 36 16 35 26 -18 48 -36 6 -18 -17 41 19 -38 -40 56 41 -57 -16 91 50 -26 17 -52 -28 9 -24 12
3655 12 29 -12 -22 1 32 -3 -27 -18 42 -32 -12 -23 3 45 -3 -19 16 46 28 -22 -40 49 -7 -18 63 1 16 -64 9 56 -25
3686b5L4l3J3M5m0Kk8K0J2k2M7j9k6J2j1L6k8m5O6K2l3L6n2M8k8n2M3K5n3L0n4
3717e8J29m4l7k7OL7Jj0k3M1l8L6K4p4K5k5qO7k5k2Om1O6j4lN3nNr1R1k0l3l1
3750d2K4J7k4OJ9O8o9j3J9oJ9n0N5o7N7j5k%pj3K2N1m9L3k9L7q3N0j7k6L3J6j3
3783Al7K3L3m1P2j04P5J3k8kJ5K8k7k8nL4o8M9k1M3r5P1k6M6m5L3k5MJ3k6M2k8
3815a1K9J4p2JK6nj5j9P0o%j4On6L9J5lL2o7O2J9k6j5k7JrL6o9L6L1J4m4j2M5
3849Fl6J6qR4q7n3M6K3O1n5qMQLNn3Q6j20K6O0m3nqN8m2K8j5K6n9Q6p5j1L1JJ7
3884Gj6K9L7p1M4l2L9n3NM7l0koj8J4N1r7O0k2k5M6qM0q0L2L4n6N8l4Ql1M4l6
3917b2j5J8N4Rl0m4L9pK2m2k6lL2j5O1q5K3J3K3m9M7K1m9O2Ro6L0L1p0N1m3Q9
$$ plain form
3686 -25 9 -24 -11 34 -6 -4 -32 -12 0 -22 25 6 -20 -8 -19 17 -11 -56 10 32 -1 35 -17 31 3 -49 -6 19 -34 -4 -58
3717 -58 71 27 -10 -37 -31 6 7 -3 -26 15 -23 13 37 -37 -12 -37 -45 22 -3 -25 -19 -60 6 -8 -11 42 37 42 -49 42 22 -11 -42
3750 -42 -18 -1 -25 -19 0 68 -1 -14 5 -1 18 -32 23 -44 13 -2 -4 -4 -11 -24 -2 49 0 33 4 41 -42 8 -9 -35 -2 14 1
3783 1 -36 -13 20 -21 51 -53 22 35 7 5 20 48 21 -7 -12 22 -46 3 -18 25 -70 1 -25 21 -24 9 -16 -12 1 -25 17 -11
3815 -11 18 32 -40 -39 -13 -18 -33 -52 18 12 12 -2 4 -52 -13 2 -1 31 -36 26 45 19 4 -23 -22 -31 5 -64 -28 3 17 -27 -39 6
3849 6 -30 -14 -22 72 -15 -68 -22 1 62 7 -1 3 11 14 19 -34 52 -68 -42 18 -25 -30 -38 20 -22 6 -9 17 -42 44 -31 -42 -11 -10 7
3884 7 -9 20 57 -14 30 -2 37 -16 -11 36 6 4 -2 -20 -6 45 -52 8 -14 -39 7 -1 39 -41 -9 25 -31 27 -7 1 -30 14 -22
3917 -22 -37 -19 35 44 14 -30 9 2 24 -18 -44 -47 -15 -30 31 -54 -31 -18 5 -44 3 24 -25 37 46 -20 10 41 -29 22 -21 68
3949F8r2M6o0qL1j0L5o6M8P7k5n2kL3K1k4j8jk7M2n9R0m4m4K9M7l5l2RLL8l2J8
3982DJ9k1Jp5Q7l1M2o4J4Q8o8l2L2K0mL9o7K6Jj8k0L9j5k4l6L7Q5n6m1J1K1lQ
4015apLOn6L9O0o7P7n3lP1j00M1qoOk9N1Jm9qnK7N9o5lL4J6j3q7P0nJ9o1J36n5
4051C5j0k9j1M9J0p7L8m6Q2r7K5OK0k6L1Lk6K3j5J8RJ7n4L2Nk4k3L8L1m5K2l3
4083b2NNJ5l2PN1Ml1MrL8k3%j9Rk5J5k0O3n0QN1J1k2l7Pk2O3m9qJ5K6k1N0j4o9
4119b6pJ6LJ0K8m6oK4nrRR2q3j3j5M1k1%l2K5K7j3Mql5M2L0l2l9L1ok0K5k2j2
4154d3N9l0Nl0K9k9KL2j6%L4l3j9M3j9j6N1k6M6Pj0j6k0j0J5m0j6L4%k7L5qmJ6
4188djJ3K2%m5K8Rk1l0M2K5m8O9m1ml7OnjM4j1j6K4k1oLk3L8n8O1jj8k2L5l0o
$$ plain form
3949 68 -24 22 -38 -46 -15 -25 10 -56 -8 69 44 -8 -10 23 44 20 2 1 -26 16 -43 47 3 -41 -12 35 0 -32 -23 -20 18 -14 4
3982 4 23 2 3 -72 15 -16 26 -38 -24 64 -4 -36 -4 16 12 51 -16 10 11 -7 -27 12 -3 -27 -63 -26 59 3 -38 -27 -6 -9 -1
4015 -1 -8 -5 1 -55 -16 44 -23 54 1 -2 69 -31 10 2 -4 2 -27 24 25 -24 -32 -37 -10 49 -16 -19 15 31 18 -69 1 -4 15 -46 90 35
4051 35 25 -4 -15 34 44 -33 5 -41 41 -56 -31 -25 -5 -31 0 3 -23 0 -15 3 12 29 -25 7 12 -12 -35 3 34 -11 11 -22
4083 -22 -17 -12 3 -29 -22 29 33 2 6 -3 35 12 12 -7 2 -23 -8 -28 35 -15 -7 44 55 33 -4 3 -19 44 -5 -13 2 28 7 57 43 -26
4119 -26 -33 -17 -14 -4 24 -22 -28 -4 -9 -18 -9 83 0 -13 -28 13 -8 -8 -40 -15 12 -1 3 -5 -40 2 32 0 -39 -8 -14 -34 -9 -31 -43
4154 -43 16 -14 -9 -39 -10 -39 -37 -5 -21 -21 13 -20 -39 4 -15 -31 20 -6 40 47 37 21 1 -9 6 -34 -50 -16 -16 -43 -8 -16 -20 -4
4188 -4 -5 8 30 30 -15 13 22 1 -29 13 38 -10 59 18 14 -23 -17 -22 -23 21 10 -6 18 -3 -9 -6 -29 9 -49 12 11 -7 -29 6 -24 -30
4224c0MK2L3j1k6N5n4L9p1N8k4J1m6M3J9%J8r5M2LN6r2O3o8N4M9m6NKo4K7J0O3
4257D9o3l6k0J16%n2j9R2l7l3rJ5%N5m2l9RJ17j22j4J2M3o1L9l0K5JK2k6j5k7
4288e0j3N8m3J9J6m1L7K7j6K5j4M7r2O0j9K0n8j0J2O5o2LN6o2NK6pJ7Om4L3L0
4320C1n0L6l4M8%r1L3L4j6kQnK9J0l7OQjm0K3j1N3o0N2qL4m1J0n5K0N3l4k3j0
4354c0K2p6Q5j6J6j3K2J5k4o7L5J0O9q8K8k9N1K4p0N8jPj5Kk4M6n8PKjM9o3O2
4387C5o0KO2n9j4M8J1j9M7m3j6k0oJ8Rj6L5j7L8o4K6M3j3o3K7Ql0K5L0mj9k8k4
4420e1P0qk9k5K4L7%l6JK1l3L0KJ2On%k4K0m5L0PQL4o0L1pr8Q7kl4K7L9l4k2K1
4456fQl5J8J1l6K7L2L2q2O7Pm2j3k0L6L2m3L0k3Nl4mK8m4N3Rj5Pn6L8rJ4nJK1
$$ plain form
4224 -30 -26 -4 29 18 -8 47 -7 32 -39 19 -5 6 -40 3 22 22 40 -55 -13 -10 46 -46 17 -51 3 52 6 11 13 -51 -24 -14 49
4257 49 -14 -50 -70 46 46 -6 -25 67 30 -3 -12 3 3 58 16 -23 -14 103 -19 -33 -21 22 -39 0 -30 -5 -4 18 -8 -23 -50
4288 -50 -63 -5 -48 -29 -13 -54 -17 10 -6 19 5 52 -40 20 1 21 -37 -47 -35 30 -32 -29 27 -35 -30 -4 -11 6 12 -32 1 31
4320 31 -19 17 -17 31 31 -60 -27 7 -9 -11 -3 -8 21 31 -6 0 8 7 -33 -10 -21 32 -28 24 16 50 9 19 -36 -16 37 3 -20 -30
4354 -30 -8 -84 1 -15 1 -12 10 25 1 -66 -31 -21 48 -40 -12 -41 10 34 -36 22 21 28 13 15 -9 37 -21 -14 -12 -13 36 -27 35
4387 35 -25 -23 39 -20 -34 14 25 6 53 10 -6 -26 -32 -14 -5 -21 14 -3 35 -29 -3 40 27 -36 -9 -1 -31 -6 24 20 1 -27 -51
4420 -51 19 11 -18 -43 -19 18 18 -18 -17 4 -29 1 3 15 21 16 16 -8 12 -33 -3 4 12 46 -14 17 10 -88 -1 -3 -37 -10 29 -5 -27 -6
4456 -6 2 -33 -15 -4 -40 -13 19 51 -31 36 43 1 -12 -32 4 36 -7 23 0 5 -29 -33 -5 -49 4 13 -2 5 -51 -13 -22 -8 -13 -12 9
4491Ip7R8j8m7P7o9qNK6M4Lp4N6l4M6l7j6%L0o%L4n7mK9L1m4M6q3N6l2O5l5mk4
4526a4K4j1M3q2N5M4j8j5j6Kl9K6LMj5K0j8K5rqn0J6N7j5J9m2p4R7j0n2M1JmO0
4560D5j04J17m3k7J5oJ3K2o5J4j7K8%Rn5K5K4MK0j4j3Rl6K7M4l6qM4k2LM6j11
4592d8L7OM5o0OJ3j1q%M2Ll6j1K3J8l0j0J0k4rO1l7%L2Kl2QL8k2l5K9kL5n5L1
4627IK2ql7J8ok9O5k6ojqK8o1O3k3k2N7n8J8J2rj7J1Nj2m5M3J6%oj4J3p7M9J4
4662b2%M5oo2O8ml9K3J1k3qL7K8l7M5q9N1n1O2k3p4P6k0K6J5lo0K2K5lj6K8n9
4695c7N0lk3K3RPpn4P9m8K5p4P8q2M3K8qj5M9k5k8K4Om7oO9o2K2k4O4n4P9n9n
4729fJ6l1kk8K4N3k6K6n1K0k0N0n1PJK2M9n8L0qo5N8p8R5J5K0m7j1%K7nJ7p0r
$$ plain form
4491 9 -68 30 12 -35 42 -27 -35 -30 -4 40 43 -31 25 -9 37 0 -16 -16 14 8 8 42 -15 -19 10 41 -3 43 -40 16 -16 49 14 10 -14
4526 -14 10 -1 42 -40 15 59 41 26 10 12 -27 -1 2 6 -9 11 -7 18 9 1 -49 -33 24 9 28 -14 -88 9 -1 -53 -12 -11 -15 45
4560 45 -59 58 15 -12 3 -3 10 32 -33 -19 -36 -8 -8 1 -54 -29 -5 -1 19 5 -8 1 -35 -8 36 0 -8 36 14 17 63 -48
4592 -48 -11 -5 40 -20 -14 -1 -12 -20 -20 22 25 -11 -22 1 19 -11 -21 -11 -35 -44 17 -20 -20 12 14 -18 -10 28 6 -29 0 -2 33 -22 9
4627 9 31 23 -14 4 -2 -31 34 8 2 1 -7 21 -40 23 0 -22 35 -23 -5 7 -2 -19 -8 -3 -15 -60 -17 -1 -1 -7 -21 -8 -85 -36 -22
4662 -22 -22 23 17 -45 23 19 -20 3 14 -9 -17 20 48 11 56 -33 18 -33 29 6 -68 8 -12 14 29 26 -34 -12 13 10 -6 22 -37
4695 -37 13 10 -13 10 19 26 19 -35 44 -4 21 -53 25 -57 -14 14 6 -9 40 15 -13 11 17 -30 -36 33 -29 -7 -31 33 -21 58 -1 -6
4729 -6 10 -21 -23 -51 -27 26 0 26 -25 -5 -25 25 -26 -19 -18 4 53 -5 25 17 -48 10 -68 27 42 62 15 4 4 31 26 43 -27 -36
4763c6P0Kn7J7j9L1k6J4j0K8Kl0K4l3K9m2N1Rl5j7L0m4L6k9J8K9m9mL5Mj6K2j5
4796a1L2m1lRK9mJ5jqm7K8J5N2r2N7k8K5l9k8P6m8J4j9k2K5Nm4L3OJ9k9kK2Nl9
4831c8J3L2M1l7qJ6L2q9J9L9l4KM2j9m8K5nJ5l7N7K9m8J9k2j6QQ4p3k1M2j0m2
4863c2L7l3M7n0N4Rm8KK8k0l8L2K0m6Q1q6O5m5L1k5j5K3l8O2j2k1k4J7O6m8oq
4895b1j9j4M2l9L0j4J1L4o8J36p5j2MKp3K2oP7k2L5l4L1m0JLrJ6J6K5j7mj32Q5
4928b9J3L9rqJ5j9J2r5P9l5J6J8j3K2l7N7l6J9j3k2j3NL7Mn1J5J6o0O6rJ3j2J2
4961coJM4k7M2p5J4L0l2%k3kjmK7N5p7P9l9plrMPO0p8K7k3K3Qk6P2q2N4Qm5m0
4998d7Q5k1o0J1j4L8n7P6j2orJ6j4%L6o8L2KK0l4JL0k6rk6N8k5J6Q9j33M4K3m2
$$ plain form
4763 -36 34 36 -21 -4 -23 8 -18 -4 -14 14 16 -14 10 -23 6 -36 15 24 -11 -28 2 -42 -6 -35 -17 12 -37 -41 -6 -2 -18 4 -11
4796 -11 21 -20 -23 -14 15 11 26 25 17 -30 -2 13 65 -27 30 2 27 -12 -40 36 -12 2 -17 -39 -14 -9 -53 -20 -14 5 -24 -26 -4 1 -38
4831 -38 -25 7 48 11 3 19 51 -38 -19 20 -14 -12 30 11 -37 -12 -17 -2 -39 18 47 -1 18 -4 -20 -12 72 -1 -22 20 10 -32
4863 -32 5 -28 19 -31 23 32 -16 -14 14 -6 -44 -12 8 -38 43 -43 22 -23 8 -17 -32 -9 -47 15 3 -18 -42 -25 41 -7 -13 -21
4895 -21 -40 -54 -12 -51 -21 -35 -24 10 -58 78 3 -9 -5 -3 -76 -54 -60 17 -5 30 -4 27 -13 -12 -9 -18 -2 14 39 22 18 -114 -29
4928 -29 -16 23 14 6 21 2 14 -81 -2 -37 -21 -3 -16 6 -31 26 -10 9 -4 -26 -39 -34 3 7 -44 -29 -13 -73 -7 -16 -3 -15 -3
4961 -3 -9 -8 36 9 51 -24 -10 20 -12 -12 -35 -37 -38 -42 -15 40 -37 42 3 -4 -7 -16 -12 -5 55 -23 4 -19 4 12 -14 58 -24 30 38 -7 -47
4998 -47 38 17 -43 -32 -46 -8 -65 11 -1 -7 -16 0 -14 -14 22 -46 -14 -12 8 -26 -25 5 -21 -30 -56 2 -23 -7 82 -51 -7 16 -26
5031b6L8o9P6N2q3L7o7N5j6j2L5l5k7M1j3O8p5J6Nl4L0l2Q6k6n6M8Po6M7nl3L6
5063Bk4L0m0J7M0m4K8n0L0qN4m6Nj0N1k3k7K5k9%RL0k0J5m1N1n3M6mo3K4j0L1
5096dL5m5jJ3l1O8l5L%m5KJ06k1n0l4M0k4RPk8M6Qj9K8%n3N5K9q3K7k6M6l7j7
5130c1K8l6K6Rl9M1j5J8j9l1N0j0j9QjJ0Mk3L4KK2K6m0l2L6qonr1O5j7Q4l3k3
5164a6K1L0j05Q0k9M8Mk9k9L1ql3M3l3MJ2J2j4M6n5J6Pm5M4M3l4J1l3lL0o8N3
5196AL6n0j3L4rk7rO1K7o8L6m0JO4p0N8o5P3o0K7mQK4Ml7m2K3J4J1l7N3n5O2p6
5230d5JL2M1l1k1k0J01m4j8%m8M4QQm8N9J9m0qOl2k0K3P2l9n6J04qn9J3j6M7J2
5263C7o4n0N3K0J4j4nm6R5k2nrJ9n1K2l8N3J0l2N1rmpJ3j0k2J8o3K9qMM9l9m4
$$ plain form
5031 -26 12 -57 19 71 -12 25 -42 13 -3 -15 20 -15 -42 -1 -14 54 -21 -5 0 -34 -4 -36 50 24 -32 16 23 -43 4 -1 -34 2
5063 2 -22 8 -32 -15 25 -19 9 -41 -11 -19 35 -11 -6 -16 35 12 -15 10 -19 -19 -10 20 0 15 -26 25 -28 18 14 -49 -25 -35 -4
5096 -4 31 -14 -15 -2 -33 35 0 3 3 -42 -40 66 45 -5 -39 1 -23 -14 -7 -35 11 19 0 28 28 -25 30 59 -24 3 -23 23 -14 -31
5130 -31 -3 -39 -13 -4 -43 -2 -17 1 -18 -49 1 -9 -28 -20 -21 -11 -7 -30 4 6 28 54 14 -18 18 10 4 -1 -92 -27 -44 40 7 -16
5164 -16 5 35 -70 10 -19 29 33 4 -25 6 -2 -35 8 -25 -21 -9 3 -11 35 -20 -4 3 -42 2 45 11 22 -11 -14 16 -52 1
5196 1 37 -13 -26 8 -1 -28 -37 24 51 -17 19 -21 -20 44 -26 32 -33 40 -20 7 3 11 35 39 2 -40 -17 -3 8 -29 24 -31 31 -45
5230 -45 -44 -12 29 -2 -23 -43 58 14 -4 -4 -52 -8 0 8 -40 19 38 -2 -10 -4 -36 -56 -33 39 0 -56 48 40 -19 -6 -22 25 37
5263 37 -27 -77 -24 -4 10 -4 -9 -55 40 18 13 4 23 -28 -6 -44 9 19 -13 38 29 25 18 31 21 -1 17 -46 -17 -25 -21 28 -11 -55
5297e5M4L2m8L2J7r3J05l7K8l2M7l7l5K6J4K0l2J8p9K7K8L1k7qL3l8K4N6k8k9
5327DL6n3L2O8r7lK7k0rk6M4m2P3o2J3M0m1J6k7L2ok2L1l4J2K9k7J5J9n3L6l1
5359b6N9n7N3l0j4M7k7o7J31p2k3L6mj8J8oj4J5m4QJ3L6m1J5K1mm2L8k8RnQL0
5392A5J0l7NooJ7j7oJ8K0J9o6L0k8L0j1pL4n8J5M7qRm8M0m4NM2l7jO7m0LK0p4
5427d8P8p3lJ2M2J7l3K5l0N6m5K6N1o9Nrk4l4M7n6Q0l7L5kljM6p1M5m2M5p7N2
5460Ej0m8R4j9q8R8Qn7k1R2k1k6pk7Q4p2k1M7N1l0J6r2OQ1p5OR6q2j5qM1Oj7L7
5494C2k7J7pqoj8k1J9K7j2j6K4L1o5K7l0k6N3pL2K3Nk2Lp5J7N1J6l8Rj6rK6n2
5528d3P8m3j0M4n4K8m0M2l0J6j0Kl2J04j38R6J7l8L8k0oN1j7m9mL0m6N6o1M4o
$$ plain form
5297 -55 -11 21 -27 5 22 -71 34 -3 25 -7 40 3 -32 -6 8 28 -4 14 -65 -38 -10 21 -6 -14 19 -19 5 61 33 4
5327 4 40 -13 19 87 -10 -13 14 -6 -15 -41 3 -39 34 -28 -15 25 -16 0 -27 5 -1 -23 8 -26 -14 15 -12 3 22 -31 5 -26
5359 -26 33 -24 29 -1 -15 32 5 -62 69 -3 -26 10 6 -12 6 0 -14 1 -43 -35 -22 14 -27 -12 9 5 -37 1 -27 -18 -23 -15 15
5392 15 25 -12 -7 -13 -19 -2 -19 -25 -7 13 32 -34 -4 -32 -2 -13 -20 14 -44 -29 18 10 19 -29 11 -33 -28 14 -23 -24 43 3 6 26 -48
5427 -48 30 -43 -46 -34 8 25 -8 17 -13 43 -2 24 75 6 11 2 -22 -56 -9 -65 15 -22 13 11 8 7 53 -18 27 -15 30 -47 5
5460 5 -5 -53 41 22 -66 32 40 -17 -38 54 33 7 0 -27 57 -15 -36 11 62 32 48 -44 -38 43 -32 -26 70 -12 -27 -35 6 12 -5 32
5494 32 5 22 15 7 1 -17 -38 -19 8 -4 -20 4 35 -30 -3 -33 -59 -6 -13 19 42 47 25 28 -47 -30 21 37 -1 8 -8 -17 9 -43
5528 -43 35 -8 -18 26 -28 0 -40 2 -28 -12 -22 -20 -52 52 -86 10 27 -11 27 7 1 52 35 -14 -18 12 -34 22 -39 5 -1
5559ajJ1k5J1k7L2n2O2j3m4L4L1k1J6l0m8R2n5Nkl2M8K9m3N9o7Jl0M2J2Nj3k3
5592c7N7n6L3M7l3j9lN0k9pL3j00K6O5Om3LJ7k0Qn1M4n0J9R8n8j7k1L9n6M9lJ7
5625HJ3MJ6m0J1l1O1o0M6j8%Ql8nM7Jk7QJ9J3ql3Nk4L4m0L4K7j19J02pk6j5L9
5659Ej0Kk2K5J8l3j1J4M5Pj15P5N5m4qm3P4q6M6Ll0P4k6lj4n1J8M8j9k0n2j5J07
5692A4m5K2M7l3o1Q7j4j3mpM8l1j3LP5p6jl2rQ6q0L4J1Rl0N3k4NKm4RJ5mk9k1
5727e1N9K0l2J5j6M4q5N6L8n7jl6JL6mL6Lo1K3P1n5l0L9l5L3o0L6L0ol3O8n7n
5760a6pL9n6M9j8oJ1M4jl0k4l3O8Ql5j7O2l6m5K5L7l6L7p3M6k3k0M3l0M2jK9k1
5793A2j7Jj6Q2r6NM0j8L9o4M9Pn6O7o5N2k9J0ml8kN3Jj8mjm7M7m3L1oJ4kK7l6
$$ plain form
5559 -1 -2 9 -16 -5 -32 0 -52 10 -3 -47 -13 18 -3 13 -17 -65 27 -28 -23 -25 -57 -9 20 -23 36 -31 -30 -60 -18 -6 -1 -14 -37
5592 -37 20 -36 -3 44 11 -8 -11 39 10 3 36 -64 -38 27 33 -10 -7 10 -10 -2 -53 -9 -59 -40 58 0 -17 -38 1 -55 -6 -9 8
5625 8 21 25 41 1 12 -19 42 -18 28 10 10 18 -20 -25 22 23 -4 4 23 36 28 -5 0 -24 10 -30 4 31 -88 14 7 -19 -34 5
5659 5 -5 -3 -25 0 18 -15 -26 -12 33 40 -75 0 55 11 3 -40 34 -52 -6 -3 -33 41 15 12 -2 -53 -35 13 -6 -26 -78 -93 14
5692 14 -31 -9 38 5 -56 31 17 4 0 -7 41 10 -3 0 75 -1 -2 -34 -43 43 -37 -3 8 17 -13 40 16 21 23 -21 -12 3 -1 -30 -51
5727 -51 8 28 -4 11 -5 39 -46 10 48 -9 -10 -46 -45 -9 -13 23 26 -35 -12 59 4 -26 13 -22 11 -49 -13 17 11 -22 46 -11 -16
5760 -16 -23 16 -40 9 -9 -15 -4 40 39 9 -15 -48 20 28 -7 -24 38 2 -43 -18 19 -17 20 -53 -7 -30 -50 -7 -37 5 4 33 12
5793 12 -5 -4 -20 62 -34 -29 11 -7 32 -32 17 24 -32 35 -30 22 -7 3 -1 -39 -41 12 13 -5 -9 -10 -57 -10 -53 -22 -28 -14 -16 11 -25
5828b5J7L0l7L6m4j1J8j9O9k8N%l6RJ1%m9M0N6o6k6N1oP1n3l5L7J0l4nqK5l6N6
5862B3j5j5L2m7K5J9k2J8j0k3L4L8o9L6r6P8k0K9J1l3k5N3Kpj4l0j5O5l2J2Ol7
5894b9j8L5M1o1L9K8o5mO2l5rRln5M7J1k5K9M4p0M5j9j0mK1N8m5K3j6l9J4j0L3
5927B2K0p0L4n4M5Mj9k5QM4J3k2Kll3%N3nm3M4j5j3M9Nq2J5K8k7oRO2k8l2rK6
5962cJ3k7j8j1M9j0k8N1k4JL2n3OK1J7m7K9Mm4N1l4K3rm3K6rJ1Qj3L2j0k1L9l3
5996b4L6oj7k9M5l8O2n8J9K5k2Pm2K4k1N9l0NL4n3J5O5k9j8%l8KnK5KL2Nk2j8
6030hl8mL9J2K7l2N0j04L9L6rl2K7N5n4K1k7L3m9rL7m7L2qjJ8j9M1qn4J2LJ7j6
6064b0JM5j5j5k0O0l8j3J9j9O5l8k7j6J0jPJ1L0m7K7%k8L9pL8l3pPJ4o7J4j5O8
$$ plain form
5828 -25 -8 22 -15 21 -23 -34 -16 -35 34 6 11 11 -25 -16 -5 -5 -54 -14 42 -24 -50 1 -5 66 13 -22 15 25 -9 -14 -22 3 -33 23
5862 23 8 -7 25 -22 3 22 0 18 8 -15 19 57 -12 24 -72 6 -14 15 26 -7 -32 21 23 16 2 -28 -43 22 -10 2 8 -29
5894 -29 -47 -12 29 -32 7 35 -30 -34 28 -7 -16 -7 -10 -65 -18 -7 -32 -3 41 -29 16 -3 -13 -17 4 62 17 40 24 -15 -1 -11 22
5927 22 42 -28 6 -48 -3 1 -18 -43 -35 9 22 0 2 -1 -34 -34 19 14 -29 15 0 -13 36 41 -41 -26 2 -25 -31 -22 40 12 -20 -29 -3
5962 -3 10 -17 -35 -46 3 -7 -35 16 -8 -7 25 -28 -22 -1 16 -31 -2 2 -42 9 -25 -2 -11 -54 -28 -37 -26 -18 -31 1 -9 -30 9 -24
5996 -24 12 6 -11 -40 5 -33 29 -29 -10 15 -7 0 -42 -18 -39 20 -10 -5 29 -24 -9 56 27 9 9 -29 -27 -32 -7 -5 27 32 10 -8
6030 -8 -46 -50 -11 1 28 -4 46 -58 -19 17 8 -24 3 58 4 25 -2 31 -18 -27 10 -37 -5 -13 -14 4 -15 26 18 -36 -24 -21 -4 -20
6064 -20 -19 26 11 -4 -24 36 -2 -15 4 -15 50 12 -15 -31 -21 -22 -15 -4 26 -21 6 6 -22 17 10 48 15 8 15 29 -38 -24 -39 29
6098B9k4k0Lk4M4qm9oO1L6l6k0J8j3Pl4O3n5J8OL6k3J3k5Pj8j0J1J8Qk4R%J0J7
6133B5k2rK2jJ0m2K4m2M3j1Pok3Q6l5o8M8l6k2K2j4L3nn8Q2k0L7Qk5mL1J4j02
6166e3P5l7N4l2Km3J4mK1k3pJ5N7m4k0l0O1j5Ol9M1J8PK2n4J6K6o2K4j1m1J15
6198E9l1m8Q1k7k6MJ6l6K4j2NJ6k5J6l8L6J2k7jom6P5k7k1J4J2M3n3j4J4j0NO4
6231D8l5k6j2K6Ok7KJ4JJ9M0k1k8m3N8qj1N3j01N7%J3K4k4on4j1Mj9K0M0nJ7l0
6265a9l0L4o2J07l9j9%K0k0j7R2j13J04j7j6lj5l9K5j1j1K8L3j6Oo0J12o8M9m2
6295gnqQQRj2oL2m3mj9M0J2Kn1N7k0L2p0L1j4K5O0n5qK4j4Lj0kOL4Kl0l4k9lM9
6333a0O6l7l1nM7n7j3J9L7m6K3nK5J0prmO2p6K6ql6K2JJ6K7l9m2M2Rj8J3l9O4
$$ plain form
6098 29 5 -15 -12 -36 8 0 -49 -55 6 42 6 -14 4 -9 -2 -36 27 -28 -10 -4 32 9 22 -3 4 -14 -24 -13 5 13 -11 -2 -2 8 25
6133 25 3 -6 16 15 25 -17 7 -35 8 -3 4 -2 -25 61 26 -42 6 -30 -52 -30 -44 -11 -16 -74 8 -12 25 33 8 4 35 49 -53
6166 -53 22 -15 39 7 9 -34 -20 -24 -3 -26 -33 -18 39 -5 -25 -55 6 -9 -3 -42 -1 17 24 46 -8 8 34 -28 -4 -15 -56 59
6198 59 28 -20 61 34 8 12 28 -8 16 4 9 25 0 16 -22 14 26 -1 -2 -8 -54 21 -6 -27 -13 -1 42 -11 -25 -11 -21 -16 48
6231 48 13 -13 -25 1 7 -20 -18 -4 -3 16 56 35 7 -36 22 14 3 56 -45 12 12 25 49 25 19 -35 -46 -42 -61 -41 -1 -6 11 -19
6265 -19 -49 -15 -77 30 -9 -28 -28 -8 -28 -45 47 -66 38 21 5 2 -13 -52 -27 -38 -49 -21 12 -4 2 -58 54 -14 35 -7
6295 -7 -12 -20 -12 -4 5 -7 -13 19 -24 -28 -47 -7 5 7 -44 13 -7 25 -45 -14 -28 -3 57 2 -6 18 4 7 -3 -5 1 35 37 7 -27 -56 -59 -10
6333 -10 56 19 -12 -17 30 -27 -40 -21 16 -30 -7 -12 13 23 16 7 3 65 -11 15 7 -29 -7 -6 10 37 -2 -44 -2 7 -11 2 -37 27
6367B7J2n5mJ7J9o5Q1m4J4J6l9l5N2O8q4J8nJJ3j7J6j4M4Mo0M0J2mj6j2L9m4N
6400@mj5K7J1l5j1qK0J2j5k3%K2k9P6l0K2k5pJ0%m0O4Kn7%O8n1J5rrKM0l7LL3
6436B2n4J8J5j7K1k5l0O6j5l4%J9L3JN3j02J6j9J1k7R2l1l4K5n1j6L4j8O8l6J3
6467bM0m5k7K3n3M3K0Pk3K8k5MM3j02R4l0L4q2N0K9q2O2j5L6j7rJ2Ol3K1j1mJ3
6500El4J1J0KL2m0KM0k4J1m5LK3k5L3m2J1N1m0O0m8rL7o6N3npqK8K0o5M1m7L2
6534@m4RM4J4qKj3M0l9l4J7nMK3m3J0K3l7K9J0j9Pk5J6M6rm0K3j0K9NlRk9j0R
6570Al6J5M0m2L9jn0MM6Om6J4M9q0L5J3k8k9pP5o8O3rJ2l8N4n8M3l4L1K1j6K0
6603C9p0N3Kk2K2k5j1N7j5k9PJ2j9KJ9o2K3NJO0q4N0n0K2kJ0l5O5k7l2kJ9J5j2
$$ plain form
6367 27 39 -16 -20 -3 16 -49 32 -12 2 18 -21 -56 -4 64 -20 -2 -7 -6 7 -10 6 -8 36 40 -20 20 32 28 12 0 39 -5 0
6400 0 -4 -19 8 19 -16 -27 -35 -15 -3 -18 -41 -41 -19 -48 28 -2 20 -5 -12 -2 -2 -42 22 24 -33 -33 35 -16 -1 -10 -19 -17 23 -14 -11 22
6436 22 -32 -14 1 -16 5 -20 -50 16 1 -33 -33 -14 19 20 73 -29 -13 -32 -21 -48 44 13 -21 4 -47 -63 -29 -47 21 -15 -2
6467 -2 38 -7 -34 -11 -64 -21 -1 6 -17 11 -14 -10 33 -69 25 -5 29 -53 -3 26 -56 6 -9 27 10 1 13 19 -14 7 -4 -8 5
6500 5 -29 -18 -8 -6 26 -14 -12 28 4 15 -30 -27 -4 -29 4 -38 -27 24 -16 44 -4 -13 24 -42 11 6 -1 -9 19 39 -26 15 -32 0
6534 0 -44 -35 9 23 15 17 4 44 5 -29 -12 -17 -13 10 -33 -23 0 -37 -8 2 -17 -10 -35 -19 27 18 -22 1 -9 20 25 22 31 2 -8 1
6570 1 -35 -20 20 -22 17 16 -34 -30 16 22 -24 -10 39 -41 -6 7 -21 -50 -57 18 -50 13 4 16 -22 32 -26 17 -17 14 35 19 39
6603 39 -31 22 24 2 24 -1 -12 45 30 1 8 20 1 3 22 -40 -17 -12 -11 49 -35 15 -35 -13 -15 -5 -40 25 -2 -34 -36 -17 -2 -14
6637a4k2L4NK6l9L7l3K2J5k5n6K3N5K2n6k5M2k0k0LO5k7l7K3nM8n0J4Pk9KJ2M0
6670C7n8J2M4j8Pm9M4j6Qj5K7J0k0JlJ3l0J5pK9k0qjj2J6J6k5J7Jk1Oj8k2O1k9
6705hl4O1l5KOm9Q5o2N3n1J6mNm1O3jk1N7rj5k0rPPnrN3j8q2P1k1k6P1l9m1O1
6741A8p0K6NO4o4L1j8p7J00K0m9k2M0J3q6R4Nr6Q5L3k4nl1K8L2l5k9k9J4QnK3
6773aj2M6o1q%J8j8K3j7kL4j6J6j1kJ7k8m2L2M2L9j4o4K0Mmmk2M1j6K8j3k8L8
6807A5K6p1L8j7M1K2mn8j1J9K6l2j3l4R6p9M3k1M2j00oN2J4J0LkK3k6lNMo1KO3
6841Fk5N0m7nJ6Ll1L6KK7n9L1K2rLNp3O1o0P3l9J7Jk0m6M8j3K8l5M3j9J5K3l5
6875fL4J2m7P6l4lnn8O1l5N2m1J4n8JK1L3k5K5l0jL0j8Pm0N2k0pk0K0K6m1J0K3
$$ plain form
6637 -14 -36 -2 3 29 -10 27 -6 16 31 6 -50 -27 28 50 -6 -31 11 -9 -29 -26 39 12 -25 -2 -7 41 -9 5 12 -17 -15 -3 37
6670 37 -21 -9 35 17 24 -25 19 3 11 -4 23 33 13 14 11 24 -6 9 2 31 11 3 2 -10 6 22 -3 14 15 -6 0 -18 -40 21 -8
6705 -8 -42 19 -16 -14 -8 -57 28 -34 19 -32 -16 -20 -15 -56 7 6 -15 42 33 18 -2 -11 -4 3 -2 -11 42 24 -58 13 -8 -34 37 -2 -43 18
6741 18 -52 -26 -21 43 -21 10 -8 -85 15 35 -14 -36 4 17 -69 25 30 -66 19 52 28 23 -8 20 52 17 -12 -41 -27 -19 -24 -1
6773 -1 -13 33 -28 -36 -36 -18 -36 -13 -30 -32 2 -14 2 -9 -11 6 -22 -64 -32 10 49 35 -29 -9 -5 -9 -13 -35 6 -10 18 5 -23 15
6807 15 41 -30 8 -9 32 54 50 -8 -19 0 26 -6 -19 -53 43 -36 7 -14 28 -72 -78 -26 -12 -2 1 -1 22 -4 -7 -2 2 -59 -57 6
6841 6 -19 31 -16 -21 -5 -2 -33 3 5 32 -27 4 26 17 20 25 -48 13 -47 26 -13 4 5 -15 -61 -13 -26 2 -33 10 -9 6 29 -6
6875 -6 28 40 -7 69 35 32 27 -31 30 -5 47 6 20 -38 -37 -16 17 -8 17 -13 -14 16 -2 5 -35 17 -3 -10 -30 -10 16 -25 -15 8
6909HPnmmL4o2l1K5J6k9P3o3L2l3L1K7l7J6l2O7m8L9j8n0PJ5nL3m0L3n4M9j9j7
6943c9M3l1nK7J1Nj4P1n5M7l3k9j2L4o0N5K7rn0L7Q%k4L5k2Mm6K2K9km2N5l8r
6977a0J5j5K7k4J2J7Qm2K6m0L0%km5N2JKM0o6N1l4K1l7O2n1J8J2L1j08N2O4p9
7009a2J8Nn1J4M0j7j5oK2L0j5l1k5K5Mj8MjM5l6j7L9lL9j20J11k0pK1ONn0L2q
7043HNk7k9N6kl4K8JK1j5m8L3J0l1M5Mm4K2j0k8J4K7l9M3Kj6o1M1j0M8n0N9o6
7076d3M3N1o7L8J7k9qk7N1Pn5J7L4j8m0rJ3l0L0k9P4j4J6k0LPk8L5J8m8K2l6%
7109b5k2QO5Kq8O4jk5L4j4J2Rk7L4l4K2l4L2m4J05j01O5j4k6RQj2lk5Pj4J7oL0
7143Hn7K1K9J9j1j1j3N0l3l2M4o6N7J2m4rL2l4RM6o1O4r3J10m4K7J2mJ4n7rO9
$$ plain form
6909 8 15 10 6 2 36 -26 -57 -32 -16 -45 28 -35 -3 -36 -5 22 -15 1 -31 36 -12 27 9 -41 -34 -19 -24 9 -31 2 -52 -3 -22 -39
6943 -39 4 -27 -32 -5 6 11 -3 68 13 60 27 -2 -14 20 -40 15 42 33 -17 20 28 28 4 39 17 21 -25 -3 26 24 -18 37 -1 -10
6977 -10 5 -10 17 -7 5 22 30 -12 14 -26 4 4 2 -43 9 10 12 52 -14 37 3 24 -13 49 -2 16 28 59 -49 3 67 -12
7009 -12 6 11 -40 -26 14 -3 -18 -24 -2 28 13 -18 -43 -18 -14 -32 -28 -29 16 -20 -37 2 -1 38 -82 29 9 2 23 29 34 -16 16 8
7043 8 13 -14 -43 13 11 -23 5 6 27 12 -36 -3 7 -24 21 25 -19 3 -7 -35 -21 6 -33 10 12 -4 -65 -24 -34 14 -36 23 -43
7076 -43 0 51 -16 22 39 10 2 -25 26 33 -22 -5 29 11 -29 -38 -25 -55 -25 -54 20 6 22 2 5 12 -16 19 37 -11 11 -25 -25
7109 -25 -47 -39 26 28 -60 4 3 -22 12 -2 10 19 -8 26 -8 14 -20 12 -32 73 -28 37 23 -3 6 14 2 -1 -26 -19 -33 -16 -22 8
7143 8 -49 -28 1 20 9 -2 -15 35 2 -30 14 -52 5 17 -27 -36 -4 -38 -29 17 -44 20 -73 37 -7 20 32 28 42 -15 -24 45
7175D5j1l8L7n3mK2L6k5j8m3M1J3n4M1J3J8k8JJ1m8N8j0l4qM3k2K6l2L4m4OqK8
7208gm3O6Rj8J5n2jJ3Pj1K6K%LK7n7j5J3QqL4m0J9k7K5j7L1L5k7OM8m0JL0m0l1
7244a6M7l3oJ4m2MLM9J7k4J6k2k5K1m4M3%k1mK4p8O8J3pK3n6L4k1j1M6j0mpJ7
7278HLl0K9rNlJ9k3L1jnj7N7o7K6qrJ6q5N5n6O6Qj5k5j1J8Q3j07M9jl4J2N5n8
7313b4O7j5m8L5l2K9j4j5j5L5n0L0l2R4k6p2M6j7N2m7P4n9j4N0j0kn3J7N1n4J4
7344eM4r3N3k4lM7Rk0l1Q8p1N1k4k5j2P5l3Lk0K3op0R7q5L7k7K4k0lK6rKj5l0
7378d7L3J1j0L7rrJJ8m0K1k2l8L1k6N0pq%K4n0N3k4j9K3K0K7o6L9Mj3j5m2J9Q3
7412D9p4K2QK3j3N3n9ln4NN0J7n4M7qQmn2j6l3P4k4j2N3K6q0N5l7J5K1k1K3m1
$$ plain form
7175 45 34 -4 33 -20 -24 -2 34 9 -9 -52 -11 2 -52 -11 2 20 -8 -7 4 -44 14 4 -30 -38 5 -17 9 -23 11 -33 -27 -35 -7
7208 -7 -50 16 25 7 22 -30 -31 -18 -11 -22 4 6 6 9 36 -21 -36 -23 -15 -23 11 -29 -10 -37 -12 -29 2 37 10 16 64 24 25 55 15 -16
7244 -16 31 -2 -8 6 -36 -32 -29 20 37 13 29 7 -18 3 -41 2 2 -19 -23 1 -77 -9 4 -3 20 -36 -2 -23 -34 12 2 -2 -9 8
7278 8 11 -19 10 1 6 3 22 -1 30 29 24 7 64 -3 23 15 6 22 -63 -8 -64 2 10 -5 -30 -41 -23 60 -47 2 1 -33 -21 34 -24
7313 -24 43 28 -20 15 -17 12 -2 -17 -32 3 -47 -17 -49 45 19 -53 -7 -24 28 -19 55 -4 -18 32 22 20 -33 -16 35 -19 -5
7344 -5 39 -54 -1 -25 -28 19 28 8 -23 65 -6 45 21 -4 -16 59 26 29 9 32 26 -44 53 -32 5 -22 2 -18 -21 5 -4 -2 -17 -47
7378 -47 -14 -3 -13 24 15 6 7 25 -15 6 -16 -54 -23 -49 1 -6 -14 -14 10 -40 13 -11 -30 -7 13 40 -26 13 17 4 -11 -53 -34 49
7412 49 -25 -3 5 28 15 68 9 6 -48 -43 7 24 -30 17 9 17 13 -39 -55 -88 -14 -38 -50 3 29 -51 4 -33 -18 3 -18 5 -36
7445c6R1n0k7rO0p8J08l1l4j3j0K2L4k6k3J2J8j6oK7q6M4O1m5K2J1K9o9k0L3m6
7476e3L2PM1k5L2k7k4PJ6LK9k3Pk5Ml4L6l3K8J0m6M0M8n8k8P8m4j6M1Qo8J9L4
7509A6q5L8L0nM8Qk4n1L4K2kk6J9k9K2Lm1Op9R6MqMj3O9n5rl3K1Ok2LNK6K1k7
7545hM5m3lJo8J15k9J7j4J3m7N2jl3K1k8QM6l7pJQJ0%J1k3l4K1K5k3Rj0L8Lj3
7580B3n6M2o5P3l9rK7NJn5N9%qJk7K7l4N8m7J5nj2J2k3P3l7o7L7L1LJ9J4n4J0
7614hj7L6l5O7k8o9M7k2j0N4n7J8J2K4J2J1j12R1j8J2Qm3N3n7K1L9j3POj4Kl4
7646a7Q7j04K0L4mn1M4N3m6p0K5M8rk6J5Qjm1M8ln9N0K8m6K8o5N9m3L5K8m0P1
7678E6m6j8p2P4rrJ9L7j8J1p8P6m7K3L0m7nM3k2l5K9OK0o3O3l3JL5n3O7l0J3o0
$$ plain form
7445 -36 55 5 -22 -31 29 -49 59 28 -6 -19 -29 -7 27 1 -22 -10 8 -8 -14 13 -73 -29 32 -13 9 20 49 -20 -40 -7 -53
7476 -53 -21 -14 27 2 34 7 -17 -10 6 9 38 15 22 -3 1 -33 3 -30 -2 8 -38 2 50 -8 -36 42 -2 -18 23 31 -37 -18 16
7509 16 -69 -31 -1 -6 42 50 26 -25 9 31 29 3 22 -7 15 18 -23 -17 -96 0 4 -4 0 -13 56 1 -8 -41 -20 -14 -36 -33 -28 -2 19 -8
7545 -8 37 -6 -9 -8 -76 39 10 27 13 26 -21 31 30 -3 18 -10 -2 44 7 0 1 9 19 19 30 7 -27 -6 19 -4 5 -5 33 36 23
7580 23 -33 9 -56 17 -22 -31 -4 1 2 -53 6 6 -2 -1 -28 -1 -35 23 -24 -9 -14 -26 -14 -37 36 -1 -68 -31 0 3 22 36 -18 -8
7614 -8 -25 11 -24 43 15 -54 -7 -29 -39 15 -42 -24 -12 12 24 35 -77 14 -4 8 16 -27 26 -31 -10 29 16 23 29 15 17 -17
7646 -17 70 -34 -14 20 16 -35 9 62 16 -54 -29 19 10 -16 -1 7 6 -35 13 10 -49 1 29 -17 11 -54 5 -38 -3 25 -15 56
7678 56 10 -8 -80 -6 -15 -24 -5 32 14 25 -53 23 -24 -1 29 -18 -23 20 -2 -37 -8 -2 18 -45 18 -15 -14 21 -32 35 5 18 -42
7711d2Q2l0k1J1n2P3lLm8qMN2l2N1m1J5J7k9J9k1n3O6L7q5R8m5j6j2jM2J4o6k1
7744d2RO2l0j9mO7l9k1J0qK3j0%njK1m8J2M7J9k8n0M7J3j3j5j2L2%Qm4J3Oj5N6
7779D1m0Kk2Rm1J32o0k9oqK9l3M9l1n9L7L5k3j4O2p6LN1kK0l1npJ4lJ5l8J2OL1
7814B0n6J4kl2J6O1k6jj6j8P4k9k9K2j2J0m4J8qP1k4m5poL0l6M2k0O0j1M3l7m7
7847b5m6P2k2L1j2J4j8L2l4N6j8l5k9j0P0n0M2Nq1k0N6N8n1o2N5LJ8k0j1NO4r3
7879e6O3QrnPPJ5o6P3l6j1mk2L5k4N2o7O6k8L4rJM8m2p0P3j00O4J5l5l9L0L8K1
7913B7l2rnPP2n5m7nR0p6M2L5l4m6L3nJ0pP1q8k7L4k0K1K7l6M3Qqpl7K8j9%pL0
7949Hj0k0L1n0P0m7PrP9o4ql8L2N8l2L6J2l9j9l0K8j7P6m1j4K4k0L5l0K4K2q3
$$ plain form
7711 -42 40 10 -11 0 -52 21 18 21 -27 -35 -31 21 -11 40 -1 14 31 2 21 0 -53 13 50 -35 63 18 2 -10 -11 31 45 -21 -42
7744 -42 -33 29 -1 -20 -24 43 4 -17 -7 -15 8 -2 -2 -7 -8 13 -35 -23 24 43 15 -35 12 25 12 -3 -15 17 17 25 -19 -6 0 -15 41
7779 41 1 3 -19 -10 -51 81 21 -8 -14 -22 7 -26 23 -8 -67 -30 5 -18 -32 30 -46 -43 8 6 26 -5 -10 -17 -3 -6 9 -29 -17 -11 20
7814 20 -36 -22 -24 -56 -40 21 -5 -6 -22 -40 34 5 -24 -2 -14 -4 -48 -30 -38 33 9 -36 -43 -49 -19 -55 -13 -33 27 16 59 22 -25
7847 -25 -71 1 -21 10 -2 12 -6 26 -8 48 30 -5 -34 -44 26 -24 18 23 -58 -78 -22 36 -15 -77 -22 -19 -1 -21 -32 -27 37 -56
7879 -56 7 15 6 1 8 15 30 -36 37 1 -10 -14 -36 -1 -25 27 -40 26 -2 32 23 24 72 30 -40 33 -67 -3 12 -23 -62 -32 6 27
7913 27 -5 -14 -19 -12 60 5 -42 -47 43 -33 9 44 10 -36 -3 -8 2 -5 66 -22 -49 -15 -35 -14 13 -23 20 28 20 13 -24 4 -15 -15 -22 8
7949 8 -2 -22 9 -41 29 -18 -11 -20 59 -5 -13 -51 -19 39 7 43 55 16 -3 -33 -5 -22 54 13 -1 23 3 38 8 32 54 -29
7981b9L3l2N8l8J7lrL1m0K8m0M7l6QPj9j6KJ6K4j0l4Q3n2M0o1K4L7m9J2Ok5K2
8014BJ5J4n5K3J4K8m1rOK7o5K3j2J9L5m0OJ6j6Jm3L9L6k2J4LrJ8k3jMM9J1p3O
8049@j5J3J4l3pO0p9N5nl5N6m6K0qk7J9J1j4pJ4k6j0O1J4k0jo3KN5%j3L2j9M0
8083C8n1nP7k4k0K0n0J3j2N1k4Mj4NL2j7L3o2J3k3k0M6k5QK0l4nP1m0k2K7RJM0
8117F0q3L5j2L0Ml5K1Qj5j8P8o9Lk0j6O3J8l2n8K9M7l0ro9P0K3m6j2P4q4N9k2
8149hl1M5m3PnRJ8rNL1oLm1mM1qM6n8qJ1MQl3j2MQ2r0M6J4kjk6J8nm0K2K8J0K
8188B4n3L6K3
$$ plain form
7981 -29 4 -28 30 -8 9 6 -3 28 -12 16 -24 23 -13 -5 2 -17 -33 -31 -15 9 -1 -35 48 -4 36 -25 -1 36 -13 -1 5 -20 2
8014 2 17 31 -24 -1 13 41 0 -9 -3 24 -41 -18 -30 -11 24 -16 -10 6 -10 -9 -52 -13 23 1 15 18 9 27 4 3 7 56 67 -6 0
8049 0 -15 -2 12 -21 -28 32 -47 8 3 -32 24 -22 -2 -10 -37 -18 -7 -21 -28 -14 -40 -50 11 25 5 4 -59 -57 -2 -2 -15 17 -2 38
8083 38 -13 -18 59 35 15 35 -15 -2 -14 37 13 17 3 8 40 23 56 -6 7 -16 -36 10 -15 -7 13 -21 -26 45 5 -17 10 19 20 60
8117 60 -23 12 0 30 34 -1 20 28 13 -5 73 4 7 -13 -29 34 52 20 -38 -9 38 8 -1 -70 0 23 -23 -35 39 -45 14 -8
8149 -8 -39 6 -37 -30 -35 -26 -8 -17 -12 19 13 16 -25 -29 12 4 50 -8 -16 -5 -1 7 -26 -38 -34 48 -42 4 18 16 15 -11 7 2 -38 -16 12 22 24
8188 24 -29 7 30
8191C0
$$ Imaginary data points
##PAGE= N=2
##DATA TABLE= (X++(I..I)), XYDATA
0@%%%%%%%%%%%%%qJ6j6J6k4L2l2M0m8N6o4P2q8J04j20J36j59J83k08K37k66L01
35A60l37L77m24M73n26N86o52P22p99Q84r76J078j188J308j441J586j748J927
53A010k125K347k600K890l220L602m056M602n269O111p210Q709j0877J4297k0484
68a2273L4985j25505o2870L12475j14414j07370N9270o678P1322N018j77160R2144
80c1056J19973j21553k5590O3193P291M4864p6727o4573J54794J5728j73316K6019
92f0953J21333l842p7500m6902O5295Q4042p3546r4383N2850R3582k5448j00362
104f5834J4567J10194p926j01621J153R0928P317r0901j6796Q5672J7699o5410
116b0958l7335M3888P8635m4520j11802O9966J07704q3193o8476M5452M0603J7878
$$ plain form
0 0 0 0 0 0 0 0 0 0 0 0 0 0 0 -8 8 -8 8 -16 16 -16 24 -24 32 -32 40 -48 56 -64 72 -87 96 -112 125 -141 160
35 160 -177 200 -224 249 -277 309 -343 379 -420 464 -512 566 -622 686 -755 831 -917 1010
53 1010 -1115 1232 -1368 1522 -1698 1904 -2152 2450 -2819 3292 -3918 4791 -6086 8211 -12273
68 -12273 22712 -102793 -165663 146812 32398 -74972 -15702 -22380 48942 53960 -123200 -31056
80 -31056 88917 -32636 -58226 4967 12258 57122 -19605 -84178 70616 86344 -86972 -60953
92 -60953 60380 56538 -20962 -67864 -2569 81473 7927 -86456 -33606 59976 34528 -65834
104 -65834 -51267 58927 51001 -50620 -49467 41461 48778 -42123 -58919 26753 44452 -20958
116 -20958 -58293 -14405 64230 19710 -92092 -22126 85578 2385 -66091 -20639 19964 37842
128C7842o4425n4296J12840L8896j19401P164P4048m697j4709n1678K873J08444
140G2901m3011j16239Q1994P5035p0347l8756J5462L9488K7966p2479m1029R4788
152B5773K9527q5559k5230O2830L9154m9988n6060M4908O3507l8531o2163K7917
164b3915O8489j5795p3154J3124O8798o052n7805j1093N0299L3631n4461m7784
176e5718O0632M6892n4351m5272L7831N2887k1672o5871J6194P1778j6649o4292
188c7611N822N6395J2915n7971k5725O4596K5391o1485k1402M0543L1559k1136
200A1891n5819J8849P5285l0226p3719L7044N4142k1794l9402o647M3427K9269
212D2300n6347l3679O3389K7221n2758k7768L5887L9394k4831n2619K1654O0094
$$ plain form
128 37842 -26583 -80879 31961 70857 -48544 -41380 32668 27971 13262 -38416 -35543 72901
140 72901 29890 -86349 -4355 70680 333 -38423 -22961 16527 44493 -27986 -69015 25773
152 25773 55300 -30259 -55489 7341 46495 -3493 -59553 -14645 48862 10331 -51832 -23915
164 -23915 44574 28779 -44375 -31251 37547 31495 -26310 -37403 12896 46527 -7934 -55718
176 -55718 4914 51806 -2545 -47817 -9986 42901 21229 -44642 -28448 43330 26681 -37611
188 -37611 -31789 24606 37521 -20450 -46175 18421 43812 -17673 -39075 1468 33027 11891
200 11891 -43928 -25079 50206 19980 -53739 -16695 37447 15653 -23749 -30396 13031 42300
212 42300 -14047 -47726 15663 42884 -9874 -37642 -1755 37639 12808 -39811 -18157 41937
224D1937k1568n9244J6521N4795q503m9120k337M2474J7821l9800l3784M2656
236A848M4318m9065m3962M9489L6753l6024l5200J7632M2902m230n4191J282N6491
249B8043n46m7042j0188L9604K6743m1554l7700M8173L5830m7427k8393L2953
261a504L0523j6900m2118R501N2447r950n2148P674M3453O506l9503k3525M4422
274H878L2663n0341l0002M7492K3369l1898k4995J5243L5151n829m6474M088N2187
287B9532n547n0254K506M5771M351m1217j3943L7416K3917l6174l0416L2920L3216
300C2078k7490l3749J7168L5642n274m2342j145M8561K169m9751o00M3570L350
313B2187l3778j3479K8895K5156k7371l2541K7768L5562k3556l5650J5141L8879
$$ plain form
224 41937 20369 -38875 -22354 32441 23938 -25182 -27519 14955 32776 -7024 -40808 1848
236 1848 46166 -2899 -46861 2628 39381 3357 -31843 -14211 28691 24461 -29730 -28448 28043
249 28043 27497 -19545 -29733 9871 36614 -4940 -42640 5533 41363 -6064 -34457 -1504
261 -1504 29019 12119 -29999 -20498 31949 21999 -30149 -22475 20978 27484 -12019 -35544 8878
274 8878 41541 -8800 -38802 8690 32059 161 -24834 -9591 25560 19731 -26743 -22655 29532
287 29532 23985 -26269 -23763 22008 26359 -14858 -28801 8615 32532 -3642 -34058 -1138 32078
300 32078 4588 -29161 -11993 23649 18375 -23967 -25112 23449 25618 -24133 -24733 18837 22187
313 22187 -11591 -25070 3825 28981 1610 -30931 -3163 32399 8843 -26807 -11666 27213
325B7213p706m2155K743M2722K24l9845n075L3310J2743l0379k1478K8003K7771
338B8091k7469l1584K5232L2057j9326l3266J2076L5001m504l7108n57L8218M466
351B1327l4348r336L0661J6860k7024k4741K6673K9924k7715l0221K4135K8995
363B5190j6709k9345P099L2598N28l6197m193L5706Q051l2856j2816K9374J8168
376B4598k6985k2401K5177K3434k0983k5653J5065K7965r909l1230M693L2739
388A6510m15l2178o276L1798J2275l1643j5642K9957J8457k5066j9440J9294K4125
401B1756j3442k7652J0913K9945p582l0547L870K9592J334l0121o766K9806R614
414B0720k8082j4022K3801J7560j9396k3363J5875K6989j3748k7673R862K8119
$$ plain form
325 27213 19507 -22648 -19905 22817 23041 -16804 -21879 11431 24174 -6205 -27683 320 28091
338 28091 622 -30962 -5730 26327 7001 -26265 -14189 20812 16308 -20800 -21357 16861 21327
351 21327 -13021 -22357 8304 25164 -1860 -26601 72 29996 2281 -27940 -3805 25190
363 25190 8481 -20864 -13765 18833 19361 -16836 -21029 14677 22728 -10128 -22944 6430 24598
376 24598 -2387 -24788 389 23823 2840 -22813 -7748 20217 10308 -20922 -16229 16510
388 16510 16095 -16083 -22359 9439 21714 -9929 -25571 4386 22843 -2223 -21663 -2369 21756
401 21756 8314 -19338 -8425 21520 13938 -16609 -12739 16853 18187 -11934 -18700 11106 20720
414 20720 -7362 -21384 2417 19977 581 -22782 -6907 20082 6334 -21339 -11477 16642
426A6642m820k7922M14K8639L715k7564o531K5017J1485k2532j6145K0111K0445
439B0954j8042k3760J5578K4977j1658k6345P700K6907l262k6691n97K5714M875
452A6350k3349j0285K2601J4659k1683j7303J9546J9333j6642k1297J2108K3397
464A7435r063k4951N136K4400q79k4464l557K3421Q352k2855j1899K2226J4666
477A7968j9611j6525J7206J8672j2818k0771R923K2564o601k2406K073K2954J999
490A4627k3448o039K3347Q447k2334j1180J9469J4092j7271j6492J3675J8710
502A5603j0443k0478P360K1243l315k1972j29K2352L614k2309o027K1355Q310
515A5164j8918j1656J7012J4340j4708j6570J1801J8529q735j9906N223K1296
$$ plain form
426 16642 11822 -16100 -15686 12953 16668 -10896 -17427 7590 19075 -3457 -19602 509 20954
439 20954 2912 -20848 -5270 19707 8049 -18296 -10596 16311 13049 -13642 -14239 11475 16350
452 16350 -6999 -17284 5317 19976 -1707 -19010 536 19869 3227 -18070 -5962 17435
464 17435 8372 -16579 -11443 12957 12078 -12386 -15943 7478 15830 -7025 -18924 3302 17968
477 17968 -1643 -18168 -962 17710 4892 -15879 -5956 16608 10007 -12399 -10326 12628 14627
490 14627 -8821 -14860 8487 16934 -5400 -16580 2889 16981 -290 -16782 -3107 15603
502 15603 5160 -15318 -7958 13285 9970 -12002 -12131 10221 13835 -8474 -14501 6854 15164
515 15164 -3754 -15410 1602 15942 1234 -15336 -3535 14994 6259 -13647 -8424 12872
527A2872k243k1374r12K1068M147k0266o572J8319R774j6571j2501J4511J4726
540A4978j2295j6782R768J7993o714j9703M130K0045j443j9632k142J9398M952
553A2553j8266p735J6786J0346j4646j2867J2594J5288j0644j6449P960J7773
565A2693n284j8518K632J8399O03j8395l456J7632O270j6772q444J4817J0779
578A2956j2566j3451J1141J4704q874j5891O299J6784l656j7332Q23J7796J524
591A0257j7160m306J6411O895j5206q952J2935J1635j1322j3409R298J4541o924
604D693j5442M465J5948j853j6572j55J6284K434j5624m978J4918P040j3350r477
618a1669J1930J1355r903j3160P897J4404n785j4849K980J5684q32j5577j329
$$ plain form
527 12872 10629 -10745 -11657 9411 13558 -6708 -13280 5039 14813 -1758 -14259 252 14978
540 14978 2683 -14099 -4331 13662 6948 -12755 -8625 11420 9977 -9655 -11797 7601 12553
553 12553 -5713 -13448 3338 13684 -962 -13829 -1235 14053 3409 -13040 -5080 12693
565 12693 7409 -11109 -8477 9922 10525 -7870 -11326 6306 12576 -4196 -12640 2177 12956
578 12956 390 -13061 -1920 12784 3910 -11981 -5682 11102 7446 -9886 -9063 8733 10257
591 10257 -6903 -11209 5202 12097 -3109 -12061 874 12509 1187 -12222 -2924 11617 4693
604 4693 -10749 -6284 9664 7811 -8761 -8916 7368 9802 -5822 -10800 4118 11158 -2192 -11669
618 -11669 261 11616 1713 -11447 -3550 10854 5069 -9780 -6800 8884 8052 -7525 -8854
631h854J4857L875j4270n936J3159Q112j2155r693J0450J1209q465j2864O914
644c661J3335m374j4210K138J4495M6j4316k389J3899M547j2944p023J2231Q809
658A0583j1053j0069R201J1599p603j2259N362J3054l150j3351J027J3239J424
671H004j3230l187J2355N492j1790p367J1089Q713r730j0173Q286J1057o328j1996
685h805M351J2564k274j2698j46J2838K077j2256m236J1608O161j0774p580R567
699C97R105q477r878O722J0869m993j1623L348J1812j131j2157o85J1944K695
713G948j1527m697J1030O127r736p858Q724Q964p176r943N416J0878l879j1054
727f783J818J1524j75j1445j616J1114L509j0820m797R750O460q815p702P533
$$ plain form
631 -8854 6003 9878 -4392 -10328 2831 10943 -1212 -10905 -455 10754 2289 -10575 -3661
644 -3661 9674 5300 -8910 -6772 7723 7769 -6547 -8936 4963 9510 -3434 -10457 1774 10583
658 10583 -470 -10539 -1338 10261 2658 -9601 -4239 8815 5665 -7686 -6659 6580 8004
671 8004 -5226 -8413 3942 9434 -2356 -9723 1366 10079 349 -9824 -1538 9519 3191 -8805
685 -8805 -4454 8110 5836 -6862 -7008 5830 7907 -4349 -8585 3023 9184 -1590 -9170 397
699 397 9502 1025 -8853 -2131 8738 3745 -7878 -4530 7282 6151 -6006 -6691 5253 7948
713 7948 -3579 -8276 2754 8881 -855 -8713 11 8975 1799 -8144 -2728 8150 4271 -6783
727 -6783 -4965 6559 6384 -5061 -6677 4437 7946 -2874 -7671 2079 8539 -276 -7978 -445
741d45Q755n892r857M499J0344k607j0885J004J0971O63j0714k534J0655L814
755G771r728n391Q833O723p716p773O195Q944m958r548L294J0151j807j0296K04
770e102J0219J505j0221k763R537M309q835n642P983O757o578q016N503Q775m022
785C409r412K518R864j198r655o55R735J893r302l333Q662M669q049n699O836
800B83O937n821p853M589Q552l174r188K153R054l25r223j030R017K486q583l765
816e891Q130M698o987o064O157O913n072p615L613Q373k692q485J114Q748J34
831E074q673j478Q252K980p995l891P080N190o392o026N425O758m104p656L133
846b323P914j808q320O31Q262O28p987k166P797L253p133m298O414N251n567n889
$$ plain form
741 -445 8310 2418 -7439 -2940 7404 4797 -6088 -5084 5887 6550 -4164 -6698 3957 7771
755 7771 -1957 -7348 1485 8208 492 -7281 -1086 7858 2900 -6648 -3354 6797 4990 -5306 -5102
770 -5102 5117 6622 -3599 -6362 3175 7484 -1351 -6993 990 7747 1169 -6847 -1344 7431 3409
785 3409 -6003 -3485 6379 5181 -4474 -5129 4606 6499 -2803 -6136 2526 7195 -854 -6553 283
800 283 7220 1399 -6454 -1865 6687 3513 -5675 -3522 5532 5207 -4016 -5046 3971 6457 -2126 -5891
816 -5891 2239 6937 -50 -6114 43 6956 1884 -5731 -2118 6255 3563 -4922 -3808 4940 5074
831 5074 -3599 -5077 3175 6155 -1840 -5731 1349 6539 147 -5879 -454 6304 2200 -5456 -2323
846 -2323 5591 3783 -4537 -3906 4356 4984 -3003 -5169 2628 5881 -1252 -5550 864 6115 548 -5341
862e341M278P046l563p386K376P752j267p814P7P606J280p607k385P027L572o631
878i80m589N915N153m649o292L935O747k891p146J815P438p41p234o37P304J708
894D856o868k890O486L852n984m599N078N430m320n990L281O452k249o904J349
909c020O873r1o970j011O807K059o428l196O124L948n374m749M596N362l589n960
925d619K586O450j770o473N84O555M05o509j415O312K404o026l182N454M028m824
941d0m714M011N210k904o008K172O189j176o306P2O405Q15o142j755N956K439
957D224n226l438M746M251m219m667L250N366k488n767J644N994p36o158q4N827
973B519J228n865j907N311K768m753l722M348M207l591m873K947N163j957n619
$$ plain form
862 -5341 -1063 5983 2420 -4966 -2590 5162 3895 -3919 -3842 3764 5044 -2563 -4948 2079 5651 -980
878 -980 -5569 346 5499 850 -5442 -1507 5240 2349 -4797 -2982 4456 3715 -3519 -4156 3148 4856
894 4856 -2012 -4902 1584 5436 -548 -5147 -69 5361 1041 -4949 -1668 4784 2535 -4369 -3020
909 -3020 3853 3762 -3208 -4219 2588 4647 -1781 -4977 1147 5095 -279 -5028 -432 4930 1341 -4619
925 -4619 -2033 4417 2647 -3826 -3242 3313 3718 -2791 -4206 2106 4510 -1516 -4698 756 4784 -40
941 -40 -4754 -743 4467 1563 -4445 -2273 3916 2740 -3566 -3494 2911 3726 -2416 -4171 1785 4224
957 4224 -1002 -4440 306 4557 338 -4329 -1079 4287 1799 -3968 -2324 3670 2934 -3224 -3308 2519
973 2519 3747 -2118 -4025 1286 4054 -699 -4421 -73 4134 543 -4330 -1383 3780 1823 -3796
988c796J211N759m60n507o49N559J488n319k155M860L061m378l683L830M310l241
1004H90m674K467M953j518n343Q73N243J53n311j085N245J764m905k616M561L063
1020C760l841l936L398M275k800m450J780M946j186m994L20N107M02m940j194
1035c353M811K074m602k466L914L302l344l918K992M164k075m536J431M712n11
1050B595n102L3M894O04m472j660M464K068m072k727L440L335l063l803K287M187
1066C008j789m272R04M608k90m708k64M526J117m307j724M126K404l656k865L200
1082A8L400k421l987K075M165j398m261O31M442j56m298p44M195J257l974j966
1098c022L627K521l338k961K671L621k329l832J731L929r80m143L49M163L69m206
$$ plain form
988 -3796 -2585 3174 2714 -2793 -3442 2117 3605 -1714 -3869 991 4052 -326 -4009 -179 4131 890
1004 890 -3784 -1317 3636 2118 -3225 -2352 2891 3044 -2267 -3352 1893 3657 -1248 -3864 697 3760
1020 3760 -81 -4017 -619 3656 856 -3594 -1814 3132 1946 -3048 -2728 2379 2781 -2159 -3353
1035 -3353 1458 3532 -1070 -3536 378 3680 336 -3582 -590 3574 1499 -3037 -1606 3106 2595
1050 2595 -2507 -2474 2420 3024 -1448 -3108 1356 3424 -648 -3375 65 3400 337 -3466 -1179 3008
1066 3008 1219 -3053 -2149 2459 2169 -2539 -2803 1723 2840 -1467 -3191 935 3339 -317 -3182 18
1082 18 3418 997 -2990 -915 3250 1852 -2409 -1778 2664 2508 -1790 -2534 1661 2918 -1056 -3022
1098 -3022 605 3126 -212 -3173 -502 3119 790 -3042 -1311 2618 1638 -2505 -2156 2007 2376 -1830
1114a830q79L853J637l632k218L398K623k847l120K440L515j865l669J352L978
1129B736p36l879l3M048O36l921j115L502J917l540k273K965K604k647l121K063
1145g94L292j500l806J048L677l53l766k80L897Q16l573j353L481J862l026k223
1161b601K667K817k282k977J660L509j413l447O64L545j08l664m62L439J074l478
1177a057j480L110J929k707k435K393K722j831l081J475L255r25l378L61L447
1192A798P1l394p28L344J085l111j608K751K142k574k355K090K798j626k959J214
1208a062L168n73l275K48L214M43l203q33L025J322k840j856K506K086k208k493
1224b331J753K693j342k959Q26L093m19l085r3L093O24l026r72K853J468k527
$$ plain form
1114 -1830 -2709 1144 2781 -851 -3069 329 2952 105 -3015 -575 2940 1075 -2594 -1242 2736
1129 2736 2000 -1879 -1912 2136 2772 -1149 -2264 1238 3155 -385 -2658 307 2911 264 -2857 -794
1145 -794 2498 998 -2808 -1760 1917 1564 -2202 -2482 1415 2231 -1342 -2695 786 2648 -378 -2601
1161 -2601 66 2883 601 -2376 -716 2793 1380 -2067 -1403 2142 2034 -1630 -2092 1347 2421 -1057
1177 -1057 -2537 573 2502 -205 -2640 -247 2475 644 -2437 -962 2293 1368 -2010 -1649 1798
1192 1798 1869 -1525 -2253 1091 2176 -935 -2543 208 2350 -224 -2579 -489 2309 683 -2276 -1062
1208 -1062 2106 1533 -1742 -1494 1720 2163 -1040 -1873 1152 2474 -366 -2222 284 2370 162 -2331
1224 -2331 -578 2115 773 -2186 -1360 1733 1314 -1771 -1864 1229 1853 -1173 -2145 708 2176 -351
1240c51j856K223K304j878k591J594K627j000k911N90K917j11k986l67K923O94
1256A821k684j178K617J500k282j922K006K240j733k350J163K763q23k820L70
1271a312K828P9k857m97K711J008k656j297K382J599k006k046J827K151j335k488
1287a909J070K548o68k532J11K742J82k598o55K453J138k443j334K095J771j915
1303E6j981J523K193j047k425Q27K459l40k595L1K507M84k526p36K300J104k092
1320b58j487J892J743j647k032J372K189j083k267N71K416k56k415j66K389N89
1336A550k343r07K085J328j999j499J689J823j419k024J153K064o49k294N05K251
1352A314n7k248l22K334N57k032j062K008J364j782j637J463J868j288j947Q04
$$ plain form
1240 -351 -2207 16 2320 442 -2149 -555 2072 1072 -1839 -1249 1668 1557 -1429 -1796 1127 1821
1256 1821 -863 -2041 576 2076 -206 -2128 -122 2118 385 -1965 -802 1961 1138 -1682 -1312
1271 -1312 1516 1595 -1262 -1759 952 1960 -696 -1993 389 1988 -18 -2064 -237 1914 579 -1909
1287 -1909 -839 1709 1041 -1491 -1380 1362 1544 -1054 -1709 744 1882 -561 -1895 200 1971 56
1303 56 -1925 -402 1791 744 -1681 -854 1605 1265 -1330 -1299 1208 1692 -834 -1570 730 1834 -258
1320 -258 -1745 147 1890 243 -1789 -417 1772 689 -1578 -1007 1409 1153 -1262 -1428 961 1550
1336 1550 -793 -1700 385 1713 -286 -1785 -96 1727 308 -1716 -563 1501 852 -1442 -937 1314
1352 1314 1257 -991 -1313 1021 1578 -454 -1516 492 1856 74 -1563 -100 1768 480 -1467 -663
1368f63K182o49k165J54K190J52k288l66K053P58j937j124J813J379j565j589
1384a665J383J663q75j990P58K106m01k049K1K165K20k021n57J947Q66j816j135
1401a380J579J452j451j605J132J789q61j981M87J998l20k018j5J906M09j968
1417h47o42J784R46j574j244J518J354j205j590R51J869p54j797L59K012k04j774
1434h38k10J791N96j849o83J597J090j532j338J360J501j167j561Q41J631n05
1450G24j838K46J774P0j747m44J737P00j732r45J575J081j417j282J182J411r54
1467A41j433O27J636l35j697J16J741K59j731l87J603P82j548q77J402J050j123
1484B26j302R85J334p75j520L66J670k39j726j4J720J68j650m53J428P81j429
$$ plain form
1368 -663 1519 870 -1295 -1141 1049 1201 -1087 -1453 600 1358 -579 -1703 110 1489 -76 -1665
1384 -1665 -282 1381 506 -1484 -726 1380 979 -1070 -1049 1116 1336 -685 -1242 705 1571 -245 -1380
1401 -1380 199 1651 200 -1405 -273 1516 655 -1326 -839 1159 839 -1179 -1194 712 1121 -847
1417 -847 -1489 295 1241 -333 -1577 -59 1295 90 -1500 -549 1320 566 -1231 -872 1140 936 -838
1434 -838 -1048 743 1339 -510 -1193 404 1494 -38 -1376 -16 1485 318 -1243 -402 1229 724
1450 724 -1114 -868 906 976 -771 -1215 522 1222 -510 -1455 120 1201 -216 -1498 -316 1095 141
1467 141 -1292 -665 971 636 -1061 -945 796 1055 -676 -1063 540 1322 -226 -1103 299 1349 226
1484 226 -1076 -91 1243 468 -1052 -686 984 745 -981 -995 725 893 -757 -1210 218 999 -430
1501d30q17J143J165r62j299Q08J434n50j554L40J635j03j682kJ482L50j465n92
1519a099J392P54j143j069J036J196p76j437P57J526n71j396K15J554j61j448
1535f70j66J311M78j250p41J131R97j241j067R17J268q26j374P11J329l65j333
1552h91J01J439J41j311l83J333O74j298q40J304R28j116j014Q53J166p38j189
1569h41M44J181j55j341j23J406L01j436m35J288O38j198p72J190P97q24r84O91
1587a73J056m30j212K34J275jj374j97J467K10j398l30J163O20j148o64Q63R33
1605H94p08j015N06J260l85j388L41J237k8j365j9J292K20j159m40J000O43q60
1623B6q84Q28R64o46j105M27J284m37j197K05J239m0j155j45J104L47j055n42
$$ plain form
1501 -430 -1247 -104 1061 99 -1200 -392 1042 492 -1062 -722 913 810 -872 -874 608 958 -507 -1099
1519 -1099 293 1047 -96 -1165 -129 1067 291 -1146 -389 1137 566 -830 -615 939 778 -670
1535 -670 -836 475 953 -297 -1038 93 1090 -151 -1218 -301 967 141 -1233 -522 807 442 -891
1552 -891 -790 649 790 -521 -904 429 1103 -195 -1035 269 1197 81 -933 -80 1086 348 -841
1569 -841 -397 784 629 -712 -835 571 872 -564 -999 289 927 -271 -1043 147 944 120 -864 -173
1587 -173 883 453 -759 -525 750 749 -625 -822 645 855 -543 -873 290 910 -238 -902 -39 894
1605 894 186 -829 -323 937 552 -836 -495 742 714 -651 -670 622 842 -317 -757 243 886 26
1623 26 -858 -30 934 288 -817 -390 894 457 -740 -535 704 664 -491 -636 468 815 -240 -782
1641g82Q90Q00q92r43Q01R92o12j143O28J020l13j124K26J009O6r67l60J012N50
1660H58j012o83R70Q92r37r27Q34Q83o33r02L68R63j59r76m0R93K58j096l85J027
1680B96N43j021o02Q73O91p57p66O14P70l37r50J43J030K6j013k66J228K30j042
1699c10m11R93M77r06m43O60P31o08p71L69R02j74j065J21J026K0j100k8R70J47
1719F00r24k98Q00M00n98o52M97Q56m71r21L12J040k89r55J52J037j37q91m2Q05
1739C21K64p28m05N76O96o25p64N51R13n03r90N09Q08k19q74J60P15Q5o93l80
1759e83P78M09o36o49P30O39p12p27N99Q02o11o60L56P43j60p05j06O84M51r08
1779b66m02Q66M74q09n00P48M65n39n77M71N51k28o84J01P83R4q98k48R53K40
$$ plain form
1641 -782 108 908 16 -927 -126 866 254 -889 -261 759 446 -678 -452 557 623 -344 -704 308 858
1660 858 -154 -837 133 1025 88 -839 -5 878 245 -657 -289 674 515 -461 -501 492 750 -346 -731 296
1680 296 839 -182 -784 89 780 23 -743 -129 641 304 -646 -503 527 553 -460 -726 502 732 -310
1699 -310 -721 272 749 -157 -600 60 791 183 -588 -219 683 509 -556 -435 591 611 -489 -517 453 600
1719 600 -324 -622 178 578 -20 -672 -175 681 210 -711 -399 641 352 -603 -451 586 449 -442 -484 321
1739 321 585 -143 -548 28 724 99 -665 -114 799 296 -694 -185 623 404 -470 -310 405 490 -203 -583
1759 -583 195 604 -32 -681 49 688 -24 -751 -152 650 39 -621 -265 478 318 -387 -493 191 642 -266
1779 -266 -668 198 672 -137 -637 111 576 37 -540 -69 482 254 -430 -329 454 548 -350 -598 355 595
1799E95r05l10Q15M03p99l56N26N24m30n66K02O99q9q56P8Q57M6r04p8R30Q8p38
1821b68k23O63K43l80n39M30O30l23p04J43R12k19q28R9R17j35p78k8O23J85n73
1842a53l32M58N85n07o52L73P92l40q23L47P67k53p14J79N66Mm94k73N87M14n38
1863gn71N47O13n71n99M77O70m17n97L05N02p7n58n2N43K60o09l35O60M39p49
1884a26m46O57M11m54n46M70M07k42m82J3O01P2n94k37O88K80o93k55O82K98o27
1905a23k98N03L31l11m66K23M88mo45m8N78J80p39j31P04J37o18j44N47J68l75
1926d3l39L32L87j69n26Q7P16j14o89JP19m9n26r4N52J20n31j45K98M05k92n08
1948d08K79N61j83o95K59N77j62n53M6N63jm77j17L92K73l97l51L26M50k51o45
$$ plain form
1799 595 -310 -620 195 598 -201 -557 -31 493 63 -503 -301 398 309 -547 -469 388 434 -470 -548 382 470 -268
1821 -268 -491 172 415 35 -504 -74 556 233 -471 -328 584 365 -463 -364 553 418 -360 -388 235 420 -153
1842 -153 -485 -27 558 51 -601 -228 564 224 -599 -252 515 262 -452 -273 293 297 -197 -470 117 531 -7
1863 -7 -578 -31 582 11 -588 -111 559 142 -455 -150 352 275 -283 -335 208 468 -141 -476 184 623 -126
1884 -126 -572 85 496 42 -504 -34 373 131 -351 -338 263 335 -259 -496 192 472 -221 -476 206 504 -123
1905 -123 -421 82 413 102 -364 -141 347 343 -302 -350 228 408 -331 -462 242 379 -239 -383 164 332 -43
1926 -43 -382 -50 337 168 -358 -271 445 331 -358 -357 362 313 -213 -307 245 365 -166 -311 -13 392 100 -408
1948 -408 -129 432 249 -446 -187 390 228 -325 -279 284 283 -194 -311 81 354 -43 -394 -68 382 131 -514
1969e14M59N15l22m84J60M45l7m42l0L18K96m46l54M45M27m51m37M92L81m02m46
1990d27L57M05j72m23L6M96j9m53k07N67K03n52k71N55K74m82k37L20M02l06l18
2011b52J18M29l4n40k6N49R0n57j38N21K29n22k42M80J51l01k87K34L68j50l98
2032b78J8N33n2n29m2N26M0m38j02M59J70m34j29J71L80k27m03J58N04j97m77
2053c49J13N35r5n02P8L80K3l28j37L83J54k43l99L52M04l12l73J79N31k89m30
2074c25J41M40o9m71Q3L10O3k82k11L52K92l07l44L36L84l35l72K55L25j86l12
2095b33J3M00Jl26j25L85J42l79j72L04K89l61k75L37K27j92k81J16L64j01l25
2116a92k0L62J48n05q8M34J46l72j89L06K37k72k81K41K49r6l46N2L93k3l86J1
$$ plain form
1969 -514 -55 460 138 -346 -186 259 222 -220 -250 68 364 -82 -436 9 436 -15 -452 40 421 19 -427
1990 -427 -70 335 163 -260 -224 272 253 -200 -407 160 363 -189 -460 95 369 -113 -350 -30 372 66 -252
2011 -252 -134 295 261 -279 -305 244 334 -223 -361 160 389 -133 -375 105 256 -45 -332 -98 270 120 -278
2032 -278 -260 273 221 -308 -350 176 216 -222 -324 135 305 -129 -258 -87 293 66 -337 -179 325 128 -349
2053 -349 -236 299 204 -298 -220 160 183 -145 -282 101 255 12 -387 -35 369 57 -316 -137 394 105 -325
2074 -325 -184 256 187 -284 -201 109 172 -110 -321 31 323 16 -328 8 392 57 -315 -60 265 79 -233
2095 -233 -220 180 181 -145 -270 115 257 -122 -294 10 299 -62 -337 0 227 35 -246 -130 234 133 -192
2116 -192 -212 150 298 -207 -295 139 285 -87 -276 30 267 -5 -286 -45 204 108 -238 -186 207 184 -202 -191
2138a91M04K8l87o7L15J57l64p5K09K36k53k65J67L00p1m23J22L67l4m12J7L63
2160A43L9k99o6K70J70k66k60K82K72j88l19J18L38j25l20J08K86r9k27n4L06
2181A09J17l23j45K67K29k78k63K27K97j76k93J89K95j54l00N5K95M6k93j41L31
2202I1J85l16k38K95J95k44k31K49K41j72l03J67K87j16k46k1L15M8l13r0K86
2223F9J26l07j13K96J54k95j76J68K76j34k73R2K84j5l19J5K84N0l40k5K89J80
2245B86l61j29K38R7r4k55J27K33n0k62N2K54Mk83k7L14J15m00o2K81J04j82j81
2268a81J24J94j09k29N7K88o9l03M3L22Pl04K2K22J01k85p0J65J82k17j89K30
2290AK12j51k62J72K03j81j64l2L11k8j76m7K09Q5k25j35K25J54j91j98K01K66
$$ plain form
2138 -191 213 241 -146 -213 102 259 -105 -180 29 265 12 -253 -86 214 143 -280 -158 209 175 -237 -220 143
2160 143 182 -117 -183 87 257 -9 -269 13 285 97 -222 -104 234 109 -211 -103 183 84 -143 -197 109
2181 109 226 -97 -242 25 254 -24 -287 -60 237 61 -232 -43 252 98 -202 -147 148 194 -99 -240 91
2202 91 276 -40 -278 17 212 -32 -263 -14 227 55 -248 -81 206 90 -156 -177 138 186 -127 -217 69
2223 69 195 -112 -225 71 225 -70 -246 -78 198 64 -209 -117 167 152 -167 -152 132 182 -158 -183 106 286
2245 286 -75 -204 34 131 37 -218 -91 142 92 -170 -118 136 140 -143 -170 144 259 -141 -203 78 182 0 -181
2268 -181 -57 137 28 -201 -144 144 75 -228 -185 137 144 -160 -138 84 185 -100 -170 -5 177 -40 -229 1
2290 1 213 62 -200 -28 175 -6 -170 -202 109 81 -95 -142 67 152 -73 -208 17 171 -20 -218 -17 249
2312B49k23k04O6K06m6j58n4K72P7k69j12K51J04k35k07K69J83k36j22J81J38
2333A30j14j55m2L59n5k18n8K72L1k36r8K01J22j77q2J00K00j04k53J01J94l2
2355H6k75P3K27j8j87o7K31Q8k85m8J58J42j24j86J75J67j44j22L1K15j09j87
2377a59O5K71l3k35k5J48J26k34p5J97J57j74j99K19M6o1k28J23J74j8j59k1J37
2400D2N7k02MJ62N5j50r9J47J34k01o0N6J59n9j93Q9J83m0k31Q5J12N5j22o3J07
2425B7J18j85j28J91J13q1j99J31J77j50j28O1K01r9j00j6J86Ok11lJ05O7j83
2448a00n5P6J87j09j02M2K25r6k37Q6J41J1j74nJ70O6j41r9J49J03j41r6N6J83
2472A40j06j34M2K34j68j45K2K31k3j85j9J35J47k65KJ23N2j02j01Q7J29n9j92
$$ plain form
2312 249 26 -178 -112 94 48 -110 -164 108 185 -84 -196 55 159 -76 -283 -14 169 -67 -189 -8 130
2333 130 16 -139 -181 178 123 -95 -153 119 150 -86 -184 17 139 -38 -120 -20 180 76 -177 -76 118 86
2355 86 -189 -116 111 93 -94 -161 70 158 -127 -175 -17 125 1 -185 -10 157 13 -109 -78 137 28 -159
2377 -159 -94 177 144 -91 -116 32 158 -76 -151 46 203 29 -170 49 95 34 -194 -71 103 85 -74 -95 42
2400 42 99 -103 -99 63 118 -32 -131 16 150 -51 -111 -55 104 45 -148 -59 124 84 -147 -62 50 105 -17 -80 27
2425 27 145 -40 -168 23 136 55 -144 -13 164 14 -114 -53 148 49 -51 -67 119 125 -86 -89 16 83 -100
2448 -100 -155 -79 108 -1 -103 -61 164 68 -169 -83 58 69 -105 -110 60 126 -15 -114 35 138 -3 -99 -43 140
2472 140 34 -100 -58 176 8 -137 -115 116 93 -92 -111 24 171 -94 -92 31 83 -19 -120 -33 96 37 -155
2495a55J10J60K4k77L9K01m8j56p1K10J27k50n2J80R8q7j41O1J92j18j62Q8J55
2518A28J4k15m0J06J13k02pJ36J01j91r0J38P5o9j76J58J27r3j50J04J63n6j74
2541a00L5J33N0j37m7J04R7j78q6J94P8j15m8K4J26l2k18R7R5K6j97j2K54r1j36
2566h4m7J38J28j69p3J47P6o6j25PJ63o3j40L8J50O2k40L8J00J00j33q3J31N7
2590A12q4m1O1L8n4j31L0J80o8j08J3Q7P0j75j6J13O4r5j03J52M6j57o5J00R0
2615E9n4j29P6J49o7j33P3J29j5j20j3O9M6j17j3J24%j7j42R7R5k2j58N1J26p1
2641B3j4o7J43l5j44J5O3Q6p3o6J05Q5j16r7P9R0j8j20L0J04k5q7j0J21L6j41
2667c3j06J54K1q9l2N8J51j00q6K4R9p4l4o0J59j3r3JJ08K6j29K6J5P0o4n2N7
$$ plain form
2495 -155 -45 115 139 -138 -99 102 54 -102 -173 37 164 -86 -138 42 140 53 -88 -27 165 47 -115 -27 128
2518 128 142 -73 -113 -7 106 -96 -103 33 134 -57 -147 -9 66 -3 -179 -21 106 13 -137 -33 130 74 -100
2541 -100 -65 68 118 -19 -66 38 135 -43 -129 65 143 28 -20 4 130 98 -120 -23 72 98 -99 -111 143 52 -84
2566 -84 -131 7 135 -34 -107 40 116 50 -75 -68 95 32 -108 -70 80 142 -98 -60 40 140 7 -76 55 112
2590 112 28 -13 48 86 32 -99 -69 111 43 -65 -52 35 105 -70 -86 27 91 -4 -107 45 91 -66 -131 -31 59
2615 59 5 -124 -48 101 34 -99 -26 103 88 -32 -45 24 70 -47 -60 64 64 47 -95 2 97 75 -83 -32 94 23
2641 23 9 -58 85 50 -94 -79 -16 70 -3 -69 36 121 5 -92 -13 77 59 -61 -31 73 48 -39 -49 72 108 -33
2667 -33 -139 15 36 -53 -85 -27 124 24 -62 -38 61 -13 -47 -107 52 39 -54 -53 55 81 -48 -22 -7 63 -1 -53 4
2694DQ2k9j39O1J33l8j12L4R6n9m7p6J71k0p0m6J11P2j57j7j0J18o2n5L9O8jj50
2722i9N0J00k4j00QJ27j7o1j17J61J4Rj37Q4J18j18m5J1J01Nj03J0R7kr5NO4k8
2750A8j3n1P0R0j33r9N6R5nj22M1J25k6j11JJ32r3N9r5N8R5j16%n7J43r0l6N3
2778a1P8o4j9k6Q8P1j60L0P6J9j02o9P2Q0n5j50J69J8q0o3O0Q3k9j04L2J17p4
2805a3k0m5J22Pj7j13J30J2q0l9mJ39j2r8J3O3l0n3L9N0j5l8r4J97m5n6n9P6K8
2834D5k0j39N7J19k9p6oJ09j8n5r4J55q5Jj9Q1L8q0n8Q8L4n6k7RQ2o3l2L5J07
2863A03p4n2m5J04K8q5o4J11MNp3L8P8pj15L5O0m2j00M5O6J3q7J0P6qq6PK0P2
2893C7o2o1J32ll6r8J10K3n5mK8Q7j04m3QR0K3j04L5j3L2j4n7L0J16n2p6J0J14
$$ plain form
2694 4 86 57 -82 -21 112 74 -38 -4 92 33 -14 -90 81 61 -9 -55 56 128 -29 -46 -56 62 0 -55 -16 52 51 -99
2722 -99 -49 51 27 -73 -65 62 45 -16 -133 28 42 51 -86 -2 116 -2 -47 -36 65 70 -33 -23 74 72 -23 -18 46 18
2750 18 5 -46 24 114 -19 -118 -62 33 28 -94 -53 72 46 -65 -64 68 -25 34 -61 -3 92 -24 -24 -81 62 -28 -64 -11
2778 -11 67 3 -16 -42 46 117 -43 -13 63 82 -20 -89 -17 63 8 -142 27 45 -35 -98 -38 45 16 -88 -56 61 -13
2805 -13 -33 -78 44 51 34 -79 51 63 -17 -56 -60 79 67 -31 -18 45 15 -38 1 51 36 -2 -96 101 56 0 -59 17 45
2834 45 25 -114 -57 62 33 -43 -49 60 42 -13 -107 48 -37 -36 -55 26 64 -16 -74 14 48 -8 -35 -26 56 -7 -39 -4 103
2863 103 29 -23 -68 36 64 -21 -85 26 30 35 -38 0 78 71 -44 -9 51 9 -91 -46 20 33 -54 -44 32 24 -62 -55 -35 37
2893 37 -25 -86 46 43 7 -91 19 42 -13 -17 11 98 -6 -49 -41 49 72 -32 3 -10 22 8 -49 -19 97 45 -31 -21 93
2922I3q9p9L6N3J7l8l9J0M1k2oK0P5l8q2M6L8l2kl7J28n9r4J4P5M7r2j0M6K6o8
2953b2k9R0J0q4k8J10M6j7j48P2j3O4r6p9J23L3m9j0K1K3l2JMQ6j13j2O6R2j00
2982Il8L7O1l7k3O1m9Om7K9k8Q7q6n5O9O3n0p7N4M4m8l2K9N8Pp2J7pK2k1j4M1
3014A0K1n9k5N0K8rj11J08k1K6j14R0K9k9qp0J26l3J8j03L3N9lj9MM3l8j1J8O3
3044G3l2n2L4j3q4M3j6N3M5o0o0M7O7m0r2Q3J5L5r1K3N3l5on8P9NOo1L3Q1j09
3075c4k2N6M5o5NK1Q2m8j05J7P2l6n4P0POk4n2P3K7nm9m2J12j01k9J8P6kp3OO5
3107A7L0j01mP4Ro5K3L7L7n1k3J0K3m1j5J4J7N4j32O2L0L9m3l4P8rp7M3QO6n1
3138B5o9L6K4k7n2O9jnk9K9M7n2Rp9J07J1p8k7N4M7j1o9P4L5p1p5O8L1k9l0M4
$$ plain form
2922 93 4 -75 -39 14 31 -7 -46 -36 5 -17 -23 -3 72 34 -48 -2 36 4 2 -35 93 34 -60 -46 29 76 -16 -26 20 46 -22
2953 -22 -51 39 49 -35 -63 47 93 76 -72 0 -13 51 -45 -124 -1 32 -17 -27 -6 17 -15 -14 -10 76 -37 -49 17 109 9
2982 9 -29 8 69 32 9 70 21 27 -20 9 -19 68 -18 -73 -4 59 9 -68 -14 30 -18 -50 -21 37 44 -28 -11 -18 4 -17 -31 10
3014 10 31 -28 -53 -3 25 16 -95 13 -8 18 -96 -6 23 -6 -14 -84 42 9 27 -76 -43 16 13 -6 -2 41 3 -8 10 73
3044 73 41 -11 23 10 -74 -31 -47 6 51 -9 -69 -22 45 5 -87 -4 11 46 -45 -22 31 -4 -10 -68 11 16 22 -39 -6 75 -34
3075 -34 -56 0 45 -20 -15 6 88 40 -65 -48 24 -12 -66 4 11 17 -7 -59 14 41 36 -13 -55 57 -44 -73 -55 21 19 -54 -48 17
3107 17 47 -54 -58 16 25 -40 -17 20 57 6 -17 -7 16 -25 -40 -26 -9 45 -87 -25 5 44 1 -33 45 36 -41 2 10 76 25
3138 25 -44 -8 16 -11 -63 6 5 0 -29 0 47 -5 4 -75 32 43 -35 -62 -8 39 28 -41 33 68 -3 -78 -10 21 -8 -38 6
3169FK1j8ql1N8m5J6k6QO7n1njO1n7k1J9M1j6k3J1k0N1n7J4K3mj0n5P3K5o2L6
3202B0k9QM9o7k5Q0n2J5l0O1k7k2l7N7M2j0m9KN1l3k0k6Q3p3Mj5J27k5r3KQ0k3
3234B5m1J2J2M9l4p3Q9k8K2r0J29l5l4p6M0K9K4kp2Q5Nkk0m4P2p0l7J65k5j00
3264b5J8N3l2K8m6k7P5k5m4m2J09K0r6K3l1Q8l9n1j2L2N9n8J8M7n3l2J5k2R0m5
3294ek5J6O1o0o3P5M6o0m5K8O4N0q9mM6n2ol6J27l1o0L5J3K1o4J7K4Oj0m0J6l
3326hkm3J4Q6mr3M3K7K8p2k4M8J0J5p9L2O9k1m4J1J8jqn4M5l8O6n9N1N4p8J0J7
3359A6k5K9o7nO1Kp3N4k8O3l8k9O6k3n5k2Q6K9m6m1O4K8p2k8M1M3n4L6L9m%l7
3391A0n1O7L5q2rO9k7o1K6N7l4J6l7OP3j04JJ4M0j9ok7L3K8j9m3L0O9r2J5K4j3
$$ plain form
3169 6 27 9 1 -30 28 -17 -1 -27 -19 48 -3 -8 -9 52 -5 -26 -7 34 18 -5 6 -14 37 -20 -6 17 13 3 -52 21 46 -16 20
3202 20 -9 -1 48 -19 -44 36 -16 -1 -31 30 3 -19 -56 1 43 33 -16 -14 37 4 -16 -42 41 -32 -28 -43 84 59 -34 -32 48 25
3234 25 -16 -4 8 57 23 -50 39 11 33 -57 72 37 3 -73 -33 -4 20 18 -54 31 36 34 14 -30 42 -28 -65 100 75 -25
3264 -25 -7 46 14 42 -4 -31 44 19 -25 -67 42 62 -34 -11 -42 46 7 -44 -56 -24 35 -23 -5 42 -11 -43 -28 -50 40 -5
3294 -5 -30 -14 47 -13 -76 -1 45 -15 -60 -32 32 82 -7 -11 35 -17 -23 -59 68 37 -23 12 25 46 -18 -1 23 29 19 -21 -5 -8
3326 -8 -10 -53 -39 47 43 -50 -7 20 48 -24 -48 0 10 25 -54 -22 47 26 -18 -7 11 10 2 -52 -7 -45 21 -38 13 67 -11 -1 16
3359 16 -9 20 -47 -52 9 11 -62 -8 -36 27 -11 -40 26 3 -52 -74 12 41 -5 -46 18 46 -26 -54 -13 30 -24 12 51 47 47 10
3391 10 -41 26 61 -21 -30 39 12 -49 -23 34 0 16 -21 -15 58 -46 -45 -31 9 -10 -16 -43 -10 18 -1 -44 -14 55 -37 -22 2 -11
3423a1M5p0jK9k2m2J30j0j4k5k8N7l3j1n7P6k9j9N0K0K4q5j7jO9m4k9N1ok3j9
3454d5K6j6L6l2KO1L4m4m7L1P4p7k7J6J4J1o0rM2O0n6K3K4l3mm4J10p5K5qL0j3
3486B9o9rj6N0Rj8k5L8M5j04K5N4j6j6m9R5l2M9l6k8L0K1m8K3QK2l9k0R5m7r8
3517g7J02l5P4p7K1j6N0j8p9M9J3J7n6PQ1p2J8RK0j4J8q3L7J0J0ll1N6o0M4n6
3548d1J8j9K6j7n0J32m7k9L0J2qNl9N2rl2J3k4K3j4lM2m0K5Mm1J6J5j8J3J2l5
3580b8MM8J4k8k9KK2m8JP5j3k2m7Q0l5P5o8K6k5N3o9k4P2j6l7RMKK4j2m8O7No0
3614b6j1M5Ll7RK1qj1J0K9L2o1m9O2j8J4p6N3P8k1l6n0R3Mn4K3k3l1N2m0NM5j5
3647A1l2j5j6J03j0l9L2m3l7L1nLj1K4jM9n9p8J21o3K2K0k5M8l1oml4ON0rQL1
$$ plain form
3423 -11 34 -36 -37 -8 -30 -72 58 48 34 9 -19 38 5 -6 -63 13 -16 -35 15 35 59 -26 -43 -44 25 -19 -48 3 -3 -26 -45
3454 -45 -19 -35 1 -31 -29 32 66 22 -25 6 80 3 -24 -8 6 17 -43 -52 -10 50 -6 17 41 8 4 -40 70 -5 20 12 42 29
3486 29 -40 -49 -65 -15 -6 -24 -49 -11 34 -70 -45 9 -7 -23 -72 23 -9 40 4 -24 6 27 -21 2 10 32 -7 -27 68 21 -77
3517 -77 25 -10 64 -13 8 -8 42 24 -55 -6 7 24 -32 -25 56 -16 2 11 31 17 35 -48 -11 -1 9 6 -25 31 -29 15 -41
3548 -41 -23 -42 -16 -33 -83 49 2 -27 3 15 7 12 -27 25 16 -16 -3 -27 -4 -18 -21 21 -19 6 10 -31 -15 0 -18 -5 7 -28
3580 -28 -24 24 38 10 -19 -17 5 -43 -42 33 20 -2 -49 31 -4 71 3 29 4 57 -12 -36 36 20 -17 -8 -4 -2 22 10 -38 29 34 -26
3614 -26 -37 8 11 -26 -17 4 -4 -15 -5 24 56 -5 -54 8 -10 4 -72 -19 59 38 2 -48 45 49 -5 18 -5 -36 16 -24 -19 26 11
3647 11 -21 -36 -52 51 41 2 34 -9 -46 -15 -20 -17 -28 -4 -5 44 -15 -93 28 -35 -13 7 -18 30 -1 -7 -11 -45 -39 11 2 10 41
3680D1m3l7J1N6m7j5KP8o7%O2o4N3l5j1nM7j8j3j1k3O1j9L2l0oj8M7k0K0m9K6
3712EkM7n6k3O2m0m5L1qK7L2m7j1M8qr%M4o1j5M9qnq3O4%L5rl7PPn2M8o6J30l6
3748A5p2N6j3J2l2M6J2J5p7K6K0%k2M4l2J2j1k1M7l4n1O9K0j8J2j1l6M0Jm9J0
3779b2O3m1PqoLj5k4O1k2k2K5jK1ol0J7J0Ll9K1k7N3k4j3M9Nl1rRk7M1l5j0j3
3814c7J4J4j9K7K3p8J6K2L1m3jJ9L1rOJ5n7O1o1PO8j3k5j7P0r0kj3N2N2q4J0J7
3847FK7J0l8qQk2k2LO8o1rPjJ3L3RJ8k2l4oM0j0j8RJ5jK2m2K0J8m9Qo0P1M6n2
3883dn4M3M0k3m5O6k1K0ql0J7j7j6K9Orpj2K9j8J08j28M8j0j7Rj7Q5k2m8j2P2
3915E4o6nL6j1n0J3pK3L8km2jJ1l5J4M1kpk0mJ3Jk7%M2J6r0N0J6M1j7o5M1J8l4
$$ plain form
3680 41 -2 -39 -28 28 -19 -34 -32 46 -21 -21 41 -23 30 -5 -16 -21 26 8 -5 -16 -39 22 3 35 5 -1 -19 28 8 28 -21 5
3712 5 3 50 -6 -29 33 -7 -52 -21 -29 -2 30 -17 -28 20 12 3 3 47 -14 -29 20 12 7 -76 -12 -12 23 14 -23 -16 -9 -61 -13 -79 51 15
3748 15 -57 -1 -14 -2 -34 12 24 39 -38 -12 8 8 -14 30 -2 10 -1 -22 25 -9 -60 9 29 11 23 12 -24 16 17 -32 -22
3779 -22 41 0 7 -1 -7 -4 -19 -43 18 -4 -26 -1 -2 19 13 -17 0 10 13 -26 -5 -32 21 -3 -16 33 38 7 -2 7 -20 21 -14 -24 -37
3814 -37 -23 -9 -28 -1 22 -56 -40 -18 13 -30 -31 -12 19 10 16 31 -26 35 -26 -19 49 36 11 -6 64 -26 -28 -41 11 63 -21 -11 6
3847 6 33 43 5 -3 5 -17 -39 -36 32 -29 -38 -31 -32 -19 14 23 41 19 -15 -21 19 9 -9 0 15 14 36 -6 14 32 -17 -9 -69 2 48 -4
3883 -4 -58 -15 25 2 -43 23 2 22 14 -16 1 -16 -32 -3 3 -6 -13 -25 4 -14 94 -34 14 4 -13 -4 -21 64 42 -6 -18 54
3915 54 -12 -17 19 8 -42 -29 -36 -13 25 23 -19 -20 -9 -44 -30 11 9 2 -18 -22 -9 -8 -35 -35 7 23 -67 -17 -1 40 23 -42 -1 17 -17
3950a7N6m2j3J2p4P8P5m0o8M9l4L5k2Jj5M3J0n3J8p1P2p2L7M8Jk0n5N5pK9j4p0
3982f8P6J8l7M3j4j5l4N8j4j6K7J6n5j1Q4q6L9lK6J4n9Mk0k3K7R6j00J7J1m1M3
4013CJ2n5NN0o5M0JpL7m9J18j55N1Pj2L1J5m0RK6n6j3P1n9K9Ml0K5pL9m8qK5O5
4047E9r1N9j4m8K6J8K1r4P8k6M7l3kj8j1M4n4m3P9J7j2NK5j6QJ1j8pO0j04K6J0
4079BMk0K7m3M4p7N0P7p4lj7N8m0J8n5L8j2l8P0k5LL6lm1OJ8K2m2%lQ1m3j3j9
4113a4M0k4j7P0o0JJ3l2M3ml5J3L5j8j6l6J3OL1k1OL5o8j1M1k6JK2Q4q4O1o0r
4146b0M5k4M0n7L4k5NMm0j1M4l6L3L1qp3OM7Nm0R3p2l8m5O2L5j1L8l4M3l8j1K3
4179Ek7k2N7l5J1j7N5l6Pqk6l6P1J9J4L4o1J5j5j6pJ4L6p8N5jj8K9k2K9qnj0N1
$$ plain form
3950 -17 39 -3 -16 -4 -78 0 75 35 -33 16 -18 17 -5 -4 -19 24 34 -19 -1 -72 0 -72 -35 13 14 -6 -61 -6 -13 16 2 -68
3982 -68 8 26 -11 32 18 3 -31 27 13 -3 24 40 -15 -26 58 -28 11 8 34 48 -11 -7 -27 -50 -23 73 -27 -10 1 -40 3
4013 3 15 -40 -35 15 -50 -10 -9 -16 21 -28 90 -65 -14 -7 -19 12 27 -13 -4 22 -34 -47 24 -35 -6 -2 -32 -7 -14 25 -23 -31 -6 59
4047 59 -32 27 13 -35 -9 9 30 -64 14 -12 35 2 0 -18 -29 15 -39 -82 -3 14 2 7 32 16 24 35 17 10 70 -34 -8 2
4079 2 6 -14 13 -30 14 -63 -13 64 -10 -13 -30 28 -12 6 -49 -11 -23 -61 9 -16 -13 23 20 -21 -15 3 25 -17 -17 -20 61 18 5 -14
4113 -14 26 2 -15 55 -5 -4 9 -23 20 16 -19 -6 29 11 -5 -41 -28 -22 9 -12 -6 29 -39 -50 -9 -35 -34 -12 72 -12 49 -11 -20
4146 -20 25 1 41 -16 18 -7 -2 2 -38 -49 -5 -41 -8 23 15 -58 -52 -5 0 -40 53 -19 -57 -102 -40 -5 -16 22 -12 31 -7 -18 5
4179 5 -22 -44 13 -22 -11 -28 27 -9 -2 -10 -36 -72 -1 18 32 66 5 20 5 -11 -18 -4 32 -46 9 8 -10 19 -3 26 18 13 3 54
4213E4o5j6K4k4J6qK0qJ3J9l9J2m3M1M9p5K5rL3k9J5j3N4m8OJ1L0q7K6M5Km5J9
4246Enj8pj2JM2PK0l3Mk8M6q1L3j3L8K8K3m7j1K9l5N9j1k2rK3Qk3m5P0r1M3Lr
4281a8J0k8P2m5N1l7om7L8M4rk4MQ%k4J1PM8p2RL1o2j5O3k0L3l5L4Mm4J1j7P5
4315E0k2p8N4M4l6k4M1l5l1K0Mj0K9j2j8K2m3J03r8j3M3j7K2l7L3K4j1MKj4ql1
4347d3J02j00M9k0j4mJ2lKP5Kl0k8j2K3Nm3J0P1n8k1K3rL4j7pm3P2n4J6L3n7L7
4380Cj5MM1m9J4RN2q3QK9j9L6o6J6PM4k5oLM5n0k6M9L1l2ooL4k2k6rL8J5l2l8
4415c2rPJ5J1K6mk3k2L0l7J5L4k8K8Kk5m9J0K2O2l7J7KJ8l1K1l2MK2j4l1P3n2
4448gm9M9Pj1KpL7K4p3N7pj0NOp0LJ9J2K4k2M5p3pM8J3K9k9j2j2l4L3mJ4k3J9
$$ plain form
4213 54 -11 -27 -3 -27 -11 -19 1 -7 6 25 -14 -2 -45 -4 45 -30 -5 -14 19 -10 5 -8 46 -2 4 15 45 -42 -16 29 31 -14 5
4246 5 0 -18 -25 -37 -36 6 13 33 0 4 -24 22 -59 -26 -39 -1 27 50 3 -8 21 -14 45 34 12 3 26 34 11 -34 36 -55 -12 -9 -18
4281 -18 -8 -36 36 -9 42 5 -1 -48 -10 34 25 1 5 13 13 -11 0 7 55 -17 -8 23 -39 -54 9 -11 22 -13 21 25 -19 -8 -25 50
4315 50 28 -50 4 48 12 -12 29 -6 -37 -17 -13 -23 6 -6 -24 -2 -45 58 -40 -53 -10 -27 -5 -42 -9 15 4 8 10 -4 -12 -43
4347 -43 59 -41 8 -12 -26 -30 -18 -21 -19 56 58 28 0 -12 11 16 -27 -17 54 -4 -25 -2 -11 23 6 -1 -44 28 -26 -10 23 -34 3
4380 3 -12 -8 33 -16 -2 7 59 -24 -16 13 -6 30 -36 -20 -13 31 6 0 3 48 -2 -28 21 52 20 14 8 42 20 -6 -15 23 38 6 -32
4415 -32 -41 -34 -19 -8 18 14 -9 -31 -1 -38 -23 11 -17 11 13 -12 -61 -51 -29 33 -4 13 15 33 2 23 -9 -5 17 3 -28 45 -7
4448 -7 -56 -7 0 -11 -9 -16 21 45 -28 29 22 12 17 23 -47 -44 -25 -13 11 -11 34 -39 -46 2 15 44 15 3 -9 -43 -10 -14 0 -23 -4
4483dj4%M9M7n3j9K2k2m4RM1jk1j2P5n6M5o4K7L1q1L1O3m1j4ON0p4l5K4N9l1O6
4516E9p8K6k2K2k3j4NK5QN4r4L9k2M2k0o8j8L4L8l8N1M5o3N1l0l3RJ1OL0l2pk
4549iK5kl0kK6J3n9J20j17L4K7j9J3m0M3o8J6K3mL9k0jnj8k3J4O2o9L7k1J0l3
4581c8L7l7J05m8k7l6N5j1K1k3J8M9m2nJ8k9KOlP8j09j1M3rNqm1K4nj3j1K7L8
4614B0k8K4pl7L6K8j0k8k7JN0K9jk6m4K0M4m5J2KJ0pl3K3N3j03J11p1j6K1K3M
4646B8k7OPj6M1k1j2q9J08lmJ6K7p7oO8o1jLk6J7%J1L3ko5JK1mO8j1l4K5ol0L6
4682B1k1J0Jj6Rj7k7kK9K6l1J2K3k3n1J3L0rK2Pm0K0K0k2O0o5k1N8J6ql5j9L7
4715Gk1N2l9pmO0q3j4JK9J4k6J5KK9l0pPJ4J6j8m4K6L6j2J1pJ3m0M5Kn7N6k5o8
$$ plain form
4483 -4 -18 -18 31 78 25 6 28 6 -38 -29 12 11 -10 -22 53 -3 42 -22 5 36 -45 -14 49 8 -6 0 50 -24 -59 -35 24 -7 59
4516 59 -19 7 -15 7 -16 -30 -25 0 8 62 -32 7 -15 27 7 -61 -79 -45 -7 -45 6 51 -12 39 9 -24 -15 -4 2 32 0 -7 -9
4549 -9 16 14 -16 -18 8 21 -38 82 -35 -1 26 7 20 -20 23 -45 -29 -6 -10 29 9 8 3 -15 -38 -24 38 -31 6 -15 -5 -38
4581 -38 -1 -38 67 19 -8 -44 11 0 21 -2 16 65 23 18 36 7 9 15 12 90 -19 -30 13 4 9 1 -40 -16 -21 -34 -45 -18 20
4614 20 -8 16 9 -28 8 36 26 -2 -29 -28 22 51 50 24 -20 0 44 -1 11 13 23 16 -17 6 59 -44 67 -4 -20 1 24 28
4646 28 1 7 14 -2 39 18 6 -83 25 22 18 34 61 -16 -22 46 -15 -16 -13 -39 -22 -22 -11 22 20 -45 -44 -23 -27 41 30 -4 21 15 -15 21
4682 21 0 10 11 -5 4 -13 -40 -42 -13 13 -18 -6 17 -6 -57 -44 -14 -23 -1 6 -34 -14 6 -16 44 -21 -42 16 32 24 -11 -30 7
4715 7 -14 38 -1 -8 -12 48 -35 -49 -48 -19 -5 -31 -16 -14 15 -15 -22 -15 -1 15 -3 -47 -21 15 3 14 7 20 -20 25 27 -30 26 1 -67
4750f7K9M4j7qM1p4N3j4M1j6k1qJM8j0j4J9k4j5K4N6p0l2M7MK4m6K5Rl1l4N3k6
$$ plain form
4750 -67 -38 6 -11 -19 22 -52 1 -13 28 12 -9 -17 -16 32 22 8 27 3 -12 12 68 -2 -34 13 17 41 -5 20 29 -2 -36 17 -9
$$ [...]
8191a4
##END NTUPLES=NMR FID
##END=
