##TITLE=1H_CA-8765
 DMSO, 8 sc, 
 20.11.2020
##JCAMPDX= 6.0         $$ Bruker NMR JCAMP-DX V2.0
##DATA TYPE= NMR FID
##DATA CLASS= NTUPLES
##ORIGIN= UXNMR, Bruker Analytische Messtechnik GmbH
##OWNER= root
$$ XWIN-NMR		Version 3.5
$$ Fri Nov 20 11:09:29 2020 Russian Standard Time (UT+4h)  she@DPX200
##.OBSERVE FREQUENCY= 200.1315066352
##.OBSERVE NUCLEUS= ^1H
##.DELAY= (6, 6)
##.ACQUISITION MODE= SIMULTANEOUS
##.ACQUISITION SCHEME= undefined
##.AVERAGES= 8
##.DIGITISER RES= 18
##SPECTROMETER/DATA SYSTEM= spect
##.PULSE SEQUENCE= zg30
##.SOLVENT NAME= DMSO
##.SHIFT REFERENCE= (INTERNAL, DMSO, 0, 15.7039)
##AUDIT TRAIL= $$ (NUMBER, WHEN, WHO, WHERE, WHAT)
$$ ##TITLE= Audit trail, XWIN-NMR		Version 3.5
$$ ##JCAMPDX= 5.01
$$ ##ORIGIN= Bruker BioSpin GmbH
$$ ##OWNER= she
$$ F:/spectra/data/she/nmr/H-F/1/audita.txt
$$ ##AUDIT TRAIL=  $$ (NUMBER, WHEN, WHO, WHERE, WHAT)
(   1,<2020-11-20 11:06:28.79 +0400>,<she>,<DPX200>,
      <created by zg, POWCHK disabled, PULCHK disabled
       configuration hash MD5:
       00 E9 B6 7A A2 85 ED C7 34 08 36 98 17 FE 4E 26
       data hash MD5: 16K
       24 79 32 0D 21 B2 F3 B7 D5 9B BF 1F B6 87 10 10>)
$$ ##END=
$$ 
$$ hash MD5
$$ 63 22 88 8C C7 C7 DB B7 71 17 DB 76 AB 51 D6 72
##$RELAX= 
##$RELAX= 
##$RELAX= 
##$RELAX= 
##$RELAX= 
##$RELAX= 
$$ Bruker specific parameters
$$ --------------------------
##$DU= <F:/spectra>
##$EXPNO= 1
##$NAME= <H-F>
##$PROCNO= 1
##$TYPE= <nmr>
##$USER= <she>
##$AMP= (0..31)
100 100 100 100 100 100 100 100 100 100 100 100 100 100 100 100 100 100 
100 100 100 100 100 100 100 100 100 100 100 100 100 100 
##$AQSEQ= 0
##$AQ_mod= 1
##$AUNM= <au_zg>
##$AUTOPOS= <>
##$BF1= 200.13
##$BF2= 200.13
##$BF3= 200.13
##$BF4= 200.13
##$BF5= 200.13
##$BF6= 200.13
##$BF7= 200.13
##$BF8= 200.13
##$BYTORDA= 1
##$CFDGTYP= 0
##$CFRGTYP= 5
##$CHEMSTR= <none>
##$CNST= (0..31)
1 1 145 1 1 1 1 1 1 1 1 1 1 1 1 1 1 1 1 1 1 1 1 1 1 1 1 1 1 1 1 1 
##$CPDPRG= <>
##$CPDPRG1= <>
##$CPDPRG2= <>
##$CPDPRG3= <>
##$CPDPRG4= <mlev>
##$CPDPRG5= <mlev>
##$CPDPRG6= <mlev>
##$CPDPRG7= <mlev>
##$CPDPRG8= <mlev>
##$CPDPRGB= <>
##$CPDPRGT= <>
##$D= (0..31)
0 1.2 0 0 0 0 0 0 0 0.06 0 0.03 0 0 0 0 0.0002 0 0 0 0 0 0 0 0 0 0 0 0 
0 0 0 
##$DATE= 1605855988
##$DBL= (0..7)
120 120 120 120 120 120 120 120 
##$DBP= (0..7)
150 150 150 150 150 150 150 150 
##$DBP07= 0
##$DBPNAM0= <>
##$DBPNAM1= <>
##$DBPNAM2= <>
##$DBPNAM3= <>
##$DBPNAM4= <>
##$DBPNAM5= <>
##$DBPNAM6= <>
##$DBPNAM7= <>
##$DBPOAL= (0..7)
0.5 0.5 0.5 0.5 0.5 0.5 0.5 0.5 
##$DBPOFFS= (0..7)
0 0 0 0 0 0 0 0 
##$DE= 6
##$DECBNUC= <off>
##$DECIM= 32
##$DECNUC= <off>
##$DECSTAT= 4
##$DIGMOD= 1
##$DIGTYP= 9
##$DL= (0..7)
0 120 120 120 120 120 120 120 
##$DP= (0..7)
150 150 150 150 150 150 150 150 
##$DP07= 0
##$DPNAME0= <>
##$DPNAME1= <>
##$DPNAME2= <>
##$DPNAME3= <>
##$DPNAME4= <>
##$DPNAME5= <>
##$DPNAME6= <>
##$DPNAME7= <>
##$DPOAL= (0..7)
0.5 0.5 0.5 0.5 0.5 0.5 0.5 0.5 
##$DPOFFS= (0..7)
0 0 0 0 0 0 0 0 
##$DQDMODE= 0
##$DR= 18
##$DS= 0
##$DSLIST= <SSSSSSSSSSSSSSS>
$$ [...]
##$SUBNAM2= <"">
##$SUBNAM3= <"">
##$SUBNAM4= <"">
##$SUBNAM5= <"">
##$SUBNAM6= <"">
##$SUBNAM7= <"">
##$SUBNAM8= <"">
##$SUBNAM9= <"">
##$SW= 16.9725356469052
##$SWIBOX= (0..15)
0 0 2 0 0 0 0 0 0 0 0 0 0 0 0 0 
##$SW_h= 3396.73913043478
##$TD= 16384
##$TD0= 1
##$TE= 0
##$TE2= 300
##$TE3= 300
##$TEG= 300
##$TL= (0..7)
0 120 120 120 120 120 120 120 
##$TP= (0..7)
150 150 150 150 150 150 150 150 
##$TP07= 0
##$TPNAME0= <>
##$TPNAME1= <>
##$TPNAME2= <>
##$TPNAME3= <>
##$TPNAME4= <>
##$TPNAME5= <>
##$TPNAME6= <>
##$TPNAME7= <>
##$TPOAL= (0..7)
0.5 0.5 0.5 0.5 0.5 0.5 0.5 0.5 
##$TPOFFS= (0..7)
0 0 0 0 0 0 0 0 
##$TUNHIN= 0
##$TUNHOUT= 0
##$TUNXOUT= 0
##$USERA1= <user>
##$USERA2= <user>
##$USERA3= <user>
##$USERA4= <user>
##$USERA5= <user>
##$V9= 5
##$VALIST= <valist>
##$VCLIST= <CCCCCCCCCCCCCCC>
##$VD= 0
##$VDLIST= <DDDDDDDDDDDDDDD>
##$VPLIST= <PPPPPPPPPPPPPPP>
##$VTLIST= <TTTTTTTTTTTTTTT>
##$WBST= 1024
##$WBSW= 4
##$XGAIN= (0..3)
0 0 0 0 
##$XL= 0
##$YL= 0
##$YMAX_a= 842415
##$YMIN_a= -842880
##$ZGOPTNS= <>
##$ZL1= 120
##$ZL2= 120
##$ZL3= 120
##$ZL4= 120
##$ABSF1= 10
##$ABSF2= 0
##$ABSG= 5
##$ABSL= 3
##$ALPHA= 0
##$AQORDER= 0
##$ASSFAC= 0
##$ASSFACI= 0
##$ASSFACX= 0
##$ASSWID= 0
##$AUNMP= <proc_1d>
##$AZFE= 0.1
##$AZFW= 0.1
##$BCFW= 1
##$BC_mod= 2
##$BYTORDP= 1
##$COROFFS= 0
##$CY= 11.3945322036743
##$DATMOD= 1
##$DC= 2
##$DFILT= <>
##$DTYPP= 0
##$F1P= 15.9154993809931
##$F2P= -4.1035820241983
##$FCOR= 0.5
##$FTSIZE= 0
##$FT_mod= 4
##$GAMMA= 1
##$GB= 0.15
##$INTBC= 1
##$INTSCL= 1
##$ISEN= 128
##$LB= 0.24
##$LEV0= 0
##$LPBIN= 0
##$MAXI= 10000
##$MC2= 0
##$MEAN= 0
##$ME_mod= 0
##$MI= 1.114404
##$NCOEF= 0
##$NC_proc= 0
##$NLEV= 6
##$NOISF1= 3.799351
##$NOISF2= 2.8
##$NSP= 1
##$NTH_PI= 0
##$NZP= 0
##$OFFSET= 15.70392
##$PC= 1
##$PHC0= -11035.73
##$PHC1= -15.39911
##$PH_mod= 1
##$PKNL= yes
##$PPARMOD= 0
##$PSCAL= 0
##$PSIGN= 0
##$REVERSE= no
##$SF= 200.130013532006
##$SI= 16384
##$SIGF1= 3
##$SIGF2= 2
##$SINO= 400
##$SIOLD= 16384
##$SREGLST= <1H.CDCl3>
##$SSB= 0
##$STSI= 0
##$STSR= 0
##$SW_p= 3612.71676300578
##$SYMM= 0
##$S_DEV= 0
##$TDeff= 0
##$TDoff= 0
##$TI= <>
##$TILT= no
##$TM1= 0
##$TM2= 0
##$TOPLEV= 0
##$USERP1= <user>
##$USERP2= <user>
##$USERP3= <user>
##$USERP4= <user>
##$USERP5= <user>
##$WDW= 1
##$XDIM= 8192
##$YMAX_p= 0
##$YMIN_p= 0
$$ End of Bruker specific parameters
$$ ---------------------------------
##NTUPLES= NMR FID
##VAR_NAME=  TIME,          FID/REAL,        FID/IMAG
##SYMBOL=    X,             R,               I
##VAR_TYPE=  INDEPENDENT,   DEPENDENT,       DEPENDENT
##VAR_FORM=  AFFN,          ASDF,            ASDF
##VAR_DIM=   8192,          8192,            8192
##UNITS=     SECONDS,       ARBITRARY UNITS, ARBITRARY UNITS
##FACTOR=    0.0002944,     1,               1
##FIRST=     0,             0,               0
##LAST=      2.4114304,     0,               0
##MIN=       0,             -842880,         0
##MAX=       2.4114304,     842415,          0
$$ Real data points
##PAGE= N=1
##DATA TABLE= (X++(R..R)), XYDATA
$$ [...]
1754a98Pp0J44J68O6R8j2l10J21k74K87J21j80J53l24M27k31J02j09J00j6O6l6
1777A00J9p4m2J7l86L19K74l40K39k23R6l9J03J61k91Nl3J04P9j63o1l7J49l6
1801f0KJ03J25n8j13M0j94K87j09n0R9j17J00j02J7J0r7L05J3j37k8o7p0j03J06
1826i8J21K10k28j47L23j48n2Q1J2j6K3j31R2q5J31k71l0O4N9o8J88o7l11L65
1850A7j58k56L97P8K8j24j8J39l17J42R1o0J23l5l6K44l02n0K12K8J6O5l42K9
1874h9m5k0K22P1j12P0r0j5r1L08k51J92k16j42K03M8M9j46n9k38lL31M6j8J0
1899A5p8Lj1J56qk05O4J14M5J2j68J4k59L80j61j69M34r3k14L08l01K84j11k92
1923b41N0O9K50j30k36K66j75M16l71N0J42j12J44m1k49J01p9J67O7k03J20r9
$$ plain form
1754 -198 -191 -261 -117 51 117 215 203 -107 14 -260 27 148 -32 121 -203 224 -7 95 -14 86 70 136 100
1777 100 119 45 3 20 -366 -47 227 -113 126 -97 -1 -40 63 224 -67 -62 -95 9 88 -75 -136 -173 -24 -60
1801 -60 -58 45 170 112 -1 39 -155 132 23 -27 72 -45 55 -47 -30 -20 -117 188 201 64 36 -31 -101 -204 -98
1826 -98 23 233 5 -142 181 33 -19 62 74 58 81 -50 42 -43 88 -183 -213 -149 -90 -158 30 -37 -348 17
1850 17 -141 -397 0 78 106 -18 -36 103 -214 -72 19 -41 82 47 11 255 -47 -97 115 143 159 224 -118 -89
1874 -89 -134 -154 68 139 27 97 7 -8 -99 209 -42 150 -66 -208 -5 43 92 -54 -113 -351 -354 -23 23 5 15
1899 15 -63 -60 -71 85 77 -128 -64 50 95 107 -61 -47 -306 74 -87 -256 178 85 -129 179 -122 162 51 -241
1923 -241 -191 -122 128 -2 -238 28 -147 269 -102 -52 90 -22 122 81 -168 -67 -146 21 88 -115 5 -94
1945i4o7K01j5Q2j64J53O8j77J32k31J09K21k14Nj3J23K01j95j24l0P1n2j58L2
1969a36O8MM3k10K75j96q8K17K36k91Q9L1k59K37k10J25L24k34N8PL1k52J83j3
1993C9M5j58K29l04K57n8j22K53p7j51M5k5j75L45k66o3K35j89K2K93j93M6R7
2016A25Lk04J19r6J45R5l97K06J35L8l32K13j4LpN5J1k44J39j25n7M8M36k11k19
2041a35J93J53j10n0K8m0j90K18P8j17j3m9Jj11J99n0J43k93J05J21rj53m7O7
2065f1n7l7N9J45o8p4J55Q2l55J97J43k7k7m1M8p1j95L12j78j47L17K4k81K99
2089A62J17m16J37p8J84p8l93J49M06k22J21j6N7N7k77J86j10j96J30j23L74n2
2111A19j23M9%l4J25p7k29L24o2k12J38r1J01k46O8Q6J9j34j4K39J32j44j40P7
$$ plain form
1945 -94 -161 40 25 107 -57 96 164 -13 119 -112 -3 218 4 9 -4 119 320 125 1 -29 42 -10 -168 -136
1969 -136 -68 -64 -21 -231 44 -152 -240 -23 213 -78 11 42 -217 20 -190 -65 259 25 83 90 121 -131 52 39
1993 39 84 -74 155 -149 108 50 -72 181 104 -47 -2 -27 -202 143 -123 -186 49 -140 -118 175 -18 28 125
2016 125 128 -76 43 -53 92 187 -210 -4 131 169 -163 50 36 39 32 87 98 -146 -7 -132 -189 -141 295 84 -135
2041 -135 58 211 101 51 79 39 -151 67 145 28 15 -34 -33 -144 55 5 148 -145 -40 81 72 -81 -128 -61
2065 -61 -118 -155 -96 49 -19 -93 62 144 -211 -14 129 102 75 34 82 11 -184 128 -50 -197 120 144 -137 162
2089 162 279 -137 0 -78 106 28 -365 -216 190 -32 89 73 130 187 -90 96 -14 -210 -80 -203 171 119
2111 119 -4 45 45 11 136 59 -170 154 92 -120 18 -73 28 -218 -150 -64 -45 -179 -193 46 178 34 -106 -29
2135b9O0J01n3R0k34K4l7K4n0K21j65N8J69l16L5K70k50P8j8j80N8J45M4j20r2
2160a67K57l32K19K6Q2n3J43p3l52L44k11M0K2K53j81p5P2R8k07J58q9r7J83l90
2184c30L68K13r9j11o5O6n3O9o3K14J23j86j92j05q2K70L6j39j47j6K57j03l2
2207a07L7k1J79k65K10J93j01l0m4J46k13p2o5M01o0l20J9L06j53o6pK68l03K94
2231B26j05j21l3j13K65k10n1P6N1J63l1j81L57l19k8QM7J92j67k97L67qk55J56
2255a1J46j99K77k86Q6J17k31k7O3O1J35N7j89l7J05R4j46l1m8J92l01J87J55
2278A69n1R8l24J32p3K11rj14L03m98J04o1j56L82o1k3j76J12No7J69j51q6J22
2302d3l3J01K1k28J36p9J89K51k77K97m20R1N7J53j39p0j02K25r3JK42q6m7q6
$$ plain form
2135 -29 31 132 79 169 -65 -41 -78 -54 -104 117 -48 10 179 -137 -102 168 -82 -4 -22 -202 -144 1 45 -75 -167
2160 -167 90 -242 -23 3 85 32 175 102 -250 94 -117 -77 -55 198 17 -58 14 112 -95 63 -26 -123 60 -330
2184 -330 38 251 152 41 -24 42 -11 58 -5 209 332 146 -46 -151 -233 37 73 -66 -213 -229 28 -75 -107
2207 -107 -70 -91 88 -177 33 226 125 95 51 197 -16 -88 -153 248 188 -132 -113 193 40 -26 -33 235 -68 226
2231 226 121 0 -33 -146 119 -91 -142 -66 -15 148 117 -64 293 -26 -54 -46 1 193 26 -271 96 88 -167 -11
2255 -11 135 -64 213 -73 13 130 -101 -128 -65 -4 131 188 -1 -38 67 161 15 -16 -64 128 -173 14 169
2278 169 118 216 -108 24 -49 162 153 39 342 -156 -52 -113 -269 113 52 29 -147 -35 -30 -97 72 -79 -165 -43
2302 -43 -76 25 46 -182 -46 -125 64 315 38 335 -85 6 63 216 77 7 -95 130 37 38 280 194 147 61
2326F1k9j1pj4J46j30K01k66J34l15K60j19j4O7J0R8j17Q8K8N1N6q1p7J38j95
2351c7P5NmnP2qKj6q8n0p6J8J66k61L49M3k44J66r9mK1n5j6R3J36l08J29k8O3
2380C9l26L94K38k32j53J75j7j48p0N8R0k05K69k24K25k5j9N1k8n0j25N5M5Q8
2404A05q9j43J39l8j12J53P8J1J10l54P6L1q0Q5j63L63j37j28J46jPP0j70O7j03
2429g7Oq8N0P2q2n0Q6K00J16l47RK67k66J20j69J23Q2k4k02N0J67J8k4j99K97
2454A35k66Q0r0K24k28kK18j82m2M0j81J13Q6p6J5K42O7k88K27j28O9k28RM7K20
2479H1mj83k3K86k63K15k9K8l12J25l1J31K7o8m4R5k68J91PK52R0k81l3k67J97
2504h1P8j33J55K7l4k10O9k3K58j36L17l16j31J58j49J1N3L6K79l43r7J28j1K3
$$ plain form
2326 61 32 21 14 0 146 16 217 -49 85 -230 30 -89 -103 -36 -26 72 -45 43 71 122 178 97 20 158 -37
2351 -37 38 43 39 34 106 98 100 84 -4 -54 -130 -112 54 -207 142 185 -59 107 8 4 25 -30 -46 47 183 -125 4 -24 39
2380 39 -287 107 345 113 -40 135 118 -30 -100 -42 48 -157 112 -112 113 88 69 120 92 42 -83 -28 17 105
2404 105 16 -127 12 -26 -138 15 93 104 214 -140 -64 -33 -113 -28 -191 172 35 -93 53 52 59 129 -41 26 -77
2429 -77 -71 -159 -109 -37 -119 -169 -83 117 233 -114 -105 162 -104 16 -153 -30 52 28 -174 -124 43 61 37 -162 135
2454 135 -131 -51 -141 83 -145 -147 71 -111 -153 -113 -294 -181 -95 -171 -156 86 153 -135 92 -36 33 -195 -186 -139 81
2479 81 77 -106 -129 157 -106 109 80 108 -204 -79 -110 21 48 -20 -64 31 -237 -46 -39 213 303 22 -11 -278 -81
2504 -81 -3 -136 19 46 12 -198 -129 -152 106 -30 287 -29 -160 -2 -151 -140 -87 -51 228 -115 -212 -84 -95 -72
2528g2O3l3M1Kj22J07K50q6q9P2n6n3j98J81j38J66j3Q3j08k4o8J47L6j80K81
2553A89q6K35r0j36j86L29k84R4m21K43J53m1m7J40j82J30n5NN6J9k50J34QQ7
2577D4j12p5J58J51j48J61k59qM26n81L69Q9l6k61J51J76n13JM17K1q7k59J06
2600f9J48J19k40j35M52j72l90J47L43n6k31O2j81p4K23J1J6J35m3Jj41n3J02
2623b6p3J23J50k22m7k9J54j34j19L9K31pk5m2J52j31k13J02l1J46P8l27J08J88
2647D5j43j61J91K7R6J6JJ95j88k65P3R2%M8j59N8n3R8J93Qj81L7J01k32K44j74
2673c3o7J62n3L2J5o8P9j97j5J54J08m10K81j06k06M13J39j59j48J02j72J05P0
2696B6K21l22K83j06l27J83p7O8J90m96M75Pp4j19k1o7L20j4J05j12Rj18j64L62
$$ plain form
2528 -72 -9 -42 -1 1 -121 -14 236 150 61 133 77 24 -174 7 -131 35 22 105 -3 -27 -95 52 88 -92 189
2553 189 103 338 248 112 -74 255 -29 65 -356 -113 40 -1 -48 92 -90 40 -15 -10 46 65 -185 -51 -43 44
2577 44 -68 -143 15 166 18 179 -80 -88 338 -243 126 215 179 -82 69 245 -268 -267 150 171 84 -175 -69
2600 -69 79 198 -42 -177 275 103 -287 -140 203 147 -84 -22 -203 -277 -54 -43 -27 108 65 66 -75 -128 -26
2623 -26 -99 24 174 -48 -95 -124 30 -104 -223 -184 47 40 15 -27 125 -6 -219 -117 -148 -2 76 -251 -143 45
2647 45 -98 -259 -68 -41 55 71 72 267 79 -186 -113 -21 -21 27 -132 -74 -127 -29 164 172 -9 28 129 -103 141 -33
2673 -33 -100 62 9 41 56 -12 67 -130 -145 9 117 -293 -12 -118 -324 89 228 69 -79 23 -149 -44 26
2696 26 247 -75 208 102 -225 -42 -119 -51 139 -357 118 125 51 -68 -89 -156 164 150 255 143 152 34 -130 232
2720B32j99JR2m19L25Q1l74K94n7KMj5Q8m8k27L9K38O8l54K78o8Q5m1j86L12k87
2746a36J83O8j25NP9k27J30P1j49J44k02L16Jk61J06J23k14K8J09O2l01L87k75
2769g8P9k7l8J32J56k64j03m4P2p1L62m64J71P7M6j35Q5j22K23j64K04O7l18J79
2793B5j70J77j01K57k10J10j5j40k1L0l5P9p5J43k11L1N8M96l17l29L14j24p3
2816a01K04j20J56k07J79j34M2k11j22L73k13J61K2MJ35O5j59r1j54j23L82k55
2838a67K97r4j71K31k75J71n5K9O0n7M7m3j00J13J59k08J51l13K53j23J3J3Q9
2861B0P3r7J68k18K45k09P3j26j05K60o7j84L20k15m5K99j25L6k9R0k95L20k20
2884c1Q6j32QK31j91P0r5nN8k32L22n9J96k90q2K96l68L40L4j35L7j86J47m2j08
$$ plain form
2720 232 33 34 126 -293 32 113 -261 33 -24 -22 -18 -33 55 7 -220 -181 57 125 -229 49 -19 66 25 -161 151 -136
2746 -136 47 115 -10 -5 74 -153 -23 48 -101 43 -159 157 158 -103 3 126 -88 -60 49 111 -190 197 -78
2769 -78 1 -26 -64 68 224 -40 -143 -187 -115 -186 176 -288 -117 -40 6 -129 -44 -166 57 -107 97 164 -154 25
2793 25 -145 32 -69 188 -22 88 73 -67 -88 -58 -93 -14 -89 54 -157 -126 -68 428 111 -218 96 -28 -101
2816 -101 103 -17 139 -68 111 -23 19 -192 -314 59 -154 7 29 33 168 233 74 -17 -171 -294 88 -167
2838 -167 130 36 -135 96 -179 -8 -63 -34 26 -31 16 -27 -127 -14 145 -63 88 -225 28 -95 -82 -69 20
2861 20 93 -4 164 -54 191 -18 55 -71 -176 84 17 -167 153 -62 -107 192 67 103 74 164 -131 189 -31
2884 -31 55 -77 -69 162 -29 41 -54 -59 -1 -233 89 30 226 -64 -146 150 -218 122 156 21 58 -128 19 -23 -131
2909a31J88J3J0j25Q4l28M13k16P8J27Kj06J74k50j68K90r5J17J48l3j21o5o2
2932e6K56m1On1k21n0J69j25K02q0J03m37N06j23j13J04j83J47p4J56J41k99J09
2955D6l66L43J56j63j63N2J07l4N7j28Q7j02J44K81l85j4k5N6J23j62M5J19O4
2978A38L4o5k15J50l00L75j18j24M5l5m6K59n2pk10J46J36k52Q2J38j94j19O6
3001a68J28j01K68j59J06P0j71L82n06J69J90l12Q4J62j33j08P9L5k94M4L96j51
3023A0J19j14O0j82J76L2j02J18l4no4j21J26p4M0j51K39k91N6K44o7m0j27J94
3047D2P6o2M2J53k67j31k1J37J07l11J86n2J62l7p3J15K25k43Nj43J20O2K8j15
3071EQj35q6K34j01Mr2L1J72m0j61J48N5J15j25j41L47l13l7Q4J91j91k50M41
$$ plain form
2909 -131 57 70 80 -45 39 -289 124 -92 -14 113 115 9 183 -67 -235 55 -40 77 225 192 71 6 -56
2932 -56 200 159 165 114 -107 -157 12 -113 89 9 112 -325 181 58 -55 49 -134 13 -61 95 236 -63 46
2955 46 -320 23 179 16 -147 -95 12 -22 35 -93 -6 -108 36 317 -68 -82 -107 -51 72 -90 -45 74 138
2978 138 172 107 -108 42 -258 117 -1 -125 -80 -115 -161 98 46 39 -171 -25 111 -141 -59 79 -115 -234 -168
3001 -168 -40 -141 127 -32 74 144 -27 355 -151 18 208 -104 -20 142 9 -99 -20 15 -279 -235 161 10
3023 10 129 15 75 -107 69 101 -1 117 83 78 14 -107 19 -55 -15 -166 73 -218 -162 82 15 -25 -152 42
3047 42 118 56 98 251 -16 -147 -168 -31 76 -235 -49 -101 61 24 -49 66 291 48 53 -90 30 92 120 5
3071 5 13 -122 -208 26 -75 -71 -163 -132 40 0 -161 -13 42 157 32 -109 238 -75 -112 -28 163 -28 -278 163
3095A63j96n7j33J67K72j5j76j5K62j52M5j14J49k69n8K7K85k48O4n7k28K76j8
3118b6R0j46K9q2L8J25q5m0J59r5R2K13k74m5J24j31Kn0R8p5k08J57J84M8j47
3143d5J22l07L90j53N5j27J16n7J8J24l27J77R3k42K33K19l6k80j16m2k7J83J79
3166A50l9k59M3K42l52K66J40k73J01J62k29J70o9j76o9J97r2L91l47J68j15J43
3188A53N4k77J9J13p9J87Kj15K84l68k5l9M7l8J55j84J25j41J69J64O5m55J18
3211f6J72k36K45j08m1j8n5j43L59r1j5Q0k72J70q5M1P0O4J03j35l03M39k73j1
3235a09L4l4K23l12O8J81K8j07n4J5M8j04K27j66L10r2k96R2J29r0M7P2j98N4
3259c4K86k05K18k14o5K7J42j05j42j06K68j54K44j41k84K81K3p0j8K01l87j03
$$ plain form
3095 163 -33 -90 -223 -56 216 201 25 10 272 120 165 51 200 -69 -127 -100 185 -63 1 -56 -284 -8 -26
3118 -26 64 -82 -53 -135 -97 28 -57 -97 62 -33 59 272 -2 -47 77 -54 -52 -102 -4 -79 -287 -130 54 102 -45
3143 -45 77 -230 160 7 62 -65 51 -6 12 136 -191 -14 79 -163 70 289 253 -27 -143 -185 -212 -29 150
3166 150 111 -148 -105 137 -215 51 191 -82 19 181 -48 122 53 -123 -192 5 -87 304 -43 125 10 153
3188 153 207 -70 -51 62 -17 170 172 57 341 -27 -52 -91 -44 -82 73 -111 14 -127 42 206 271 -184 -66
3211 -66 106 -130 115 7 -34 -52 -107 -250 109 18 3 83 -189 -19 -104 -63 7 71 174 39 -264 175 -98 -109
3235 -109 -75 -109 114 -198 -130 51 79 -28 -82 -67 -19 -123 104 -62 248 156 -140 -48 81 -9 38 110 -88 -34
3259 -34 252 47 265 51 -14 13 155 50 -92 -198 70 -84 160 19 -265 16 39 -31 -49 152 -235 -338
3281c38K70J04j07j44K41Q6J32lj93m8j33J47J34j71l18L39L67k26k3j26J96L5
3303B21k95OO9m8L9OkL9L8r7o0Q3q5j21L28j12J94q0K5m00K19L33q6k72nj46J18
3330i1k3LJ64k44j7J54J67j31j21j13L5K80o9j7r1K52k42J79o9l6O0j47O8K80
3354B31k01j10k92M85k84L29P1k28Q3R6m3k34J74j05r6J1K00j9N6P6m24K00K18
3377A94l26Q5PK30Jj05j21j69j3K84o6l4J39q5j0m6J5p0j35L12J54k79K19l84
3401b03j4J16K88j34J3J5q2n7p3J84k62K64k49N01k40N4j18J58j52K8j80M3K31
3424A31k38K39n2j44OL26k86N9l39L56p5O9N7l2J79k78pj0K17K7l59K9J02K5L0
3449C2J0Q6j21j8n0K5j45J08Q4m3Lm9p5j19L63p2J13L3k96o9K17p8j29J76k51
$$ plain form
3281 -338 -68 36 -71 -215 26 112 244 241 48 0 -133 14 148 -23 -341 -2 365 139 116 -10 186 221
3303 221 -74 -68 1 -47 -8 -2 -4 35 73 -24 -84 -1 -86 -207 121 9 203 123 148 -252 -33 300 214 -58 -63 -209 -91
3330 -91 -114 -111 53 -191 -208 -54 113 -18 -139 -252 -217 63 -6 -23 -114 138 -104 75 6 -30 30 -117 -49 231
3354 231 30 -80 -372 113 -171 158 229 1 84 180 137 -97 77 -28 -124 -113 87 68 124 200 -224 -24 194
3377 194 -132 -47 -40 190 191 86 -35 -204 -217 67 1 -33 106 21 11 -35 -20 -90 -225 87 241 -38 181 -203
3401 -203 -217 -101 187 53 66 81 -1 -58 -131 53 -209 55 -194 307 67 121 3 161 9 37 -143 -100 131
3424 131 -107 132 80 -64 -58 268 -18 41 -298 58 -17 52 109 77 256 -22 -29 -39 178 205 -154 -125 -23 2 32
3449 32 42 128 7 -11 -61 -36 -181 -73 11 -32 -29 -78 -153 -272 91 19 132 165 -131 -200 17 -61 -190 -14 -265
3474b65L62rr7M5p8L58j28k12P1J05k25NP4M66o49J37M1m8J75p0rJ19j20P6p2
3499E2j03qj70K60j05k1J04J32k08o4J47K37l58q2J73j55J74j61K94j53O8%M7
3522A00L6j12p8J02m6L5J48k86j3K59j01k21Q6J63k94J42K64k94K53k59j20L15
3544G9o4k06J31K0n6J67j18J0K59j62o6J0p9J96k25O3J49n2q0q5K05j93Q5j18
3568a30R1K47j31j30K33k28L6K3J1J14O6j42k38J99J4l9K01j36j18K99j54j71
3590h3K14k69m0KK17J25k48J12k77P8M66l02p2P4N7J00j69K38k38m0J92j89o3
3613a15J14l77K97J34m2k67M44j49j28JJ87k61J81J59k37N6J19k04L80k50N9m6
3635E5k0q7j18J25j3P8l9k61M11m9k57J17J36j35j14L17L2j17j79J37M3P9J4j62
$$ plain form
3474 -265 97 88 -9 36 -42 316 188 -24 47 152 -73 -68 6 472 -177 -40 1 -47 128 58 49 168 48 124 52
3499 52 -51 -59 -229 31 -74 -95 9 141 -67 -131 16 253 -105 -187 -14 -169 5 -156 138 -15 53 53 100
3522 100 136 24 -54 48 2 37 185 -101 -114 145 44 -177 -91 72 -222 -80 184 -110 143 -116 -236 79
3544 79 15 -191 -60 -40 -96 71 -47 -37 222 60 -6 4 -75 121 -104 -41 108 56 -24 -109 96 -97 -12 -130
3568 -130 -39 208 77 -53 180 -48 -12 11 22 136 202 60 -178 21 35 -4 197 61 -57 242 88 -83
3590 -83 131 -138 -178 -176 41 166 -82 30 -247 -169 297 -5 -77 -3 54 154 -15 223 -15 -55 137 -52 -115
3613 -115 -1 -378 -81 53 11 -256 188 39 -89 -88 99 -162 19 178 -59 -3 116 -88 292 42 101 55
3635 55 35 -52 -170 -45 -58 20 -19 -280 131 82 -175 -58 78 -57 -171 146 178 61 -118 19 62 141 155 -7
3659gk69J63J26k22J23K37j94j45K68p8L55o13J22K62r9r9l9P0J28k52K19R2k39
3682i1j51J56OO8M0k11L21J20l78K15j61m5J54j89J79Q5r3p0J81j08j06J68k10
3705a20J56J0n8p3K86j99k18J23o2K45l5K3J8m2p0J2J42j60j91K29J76m28J27
3728a09J09L4q6R1n7J00J7r3M9j92L8M46o8k69R5l4k70K57J55m98N40m83M33k04
3752AJ70k09N3j35L94k35O0k5O5p8j58N9J1j7J7j05mj00J94J45k68j03R0K26J25
3777A73j56J27l03M04K8k66j6l4J32L9k02MR6j51J81M9j51O5o5J71j31l36K02
3800a40N56m36O0j66P1m5L37n02M15q8j14k36L32Jm1J05j34j13J71l62K38K46
3822A55m10k5L96o3k2k83J94j5j5L72l10K25j80L7n9JK50j69l6N2K4M4j46r4K4
$$ plain form
3659 -7 -276 -113 13 -209 -86 151 -43 -188 80 2 357 -256 -134 128 29 -70 -109 -39 89 -163 56 148 -91
3682 -91 -242 -86 -80 -12 28 -183 138 258 -120 95 -66 -111 43 -146 33 118 25 -45 136 28 -78 90 -120
3705 -120 36 46 -12 -85 201 2 -216 -93 -155 90 55 78 96 54 -16 -4 138 -22 -213 16 192 -236 -109
3728 -109 0 34 -52 39 -18 82 99 6 55 -137 -99 347 279 10 105 71 -199 58 213 -285 255 -228 205 1
3752 1 171 -38 15 -120 274 39 99 74 139 61 -97 -38 -27 -44 -27 -132 -136 -236 -42 103 -165 -268 -178 48 173
3777 173 17 144 -159 245 273 7 -9 -43 89 128 -74 -70 26 -125 56 105 -46 19 -46 125 -6 -342 -140
3800 -140 416 -20 40 -126 -55 -100 237 -265 150 62 -52 -288 44 45 4 109 -25 -138 33 -329 -91 155
3822 155 -255 -280 116 53 31 -252 -58 -73 -88 284 -26 199 19 56 -3 -2 248 79 43 95 119 163 17 -77 -53
3847e3J33j04j77K2J82R7q8ok16K76k52J52N45m80K44l43L03q2k14J7%O7p0KJ9
3872b6J69l1J0k43K99j61L3k3k8j95K19j51J81j16J34o5l1p4rL1O0j01J14j9P7
3897E4j40J01r9K4K5J99j46j92K35N8O8k81O4j14K23j11O8j05K50N4k21j75J22
3920c9p7J71l6J17l10J11j05M06o6j01J08m82L31O9k20J30j12J97m42M28J3j40
3942d9K63j25j63MQ4L4K43l16l1j33J48J00np7pM0N2j39K84j79q9J26M9K2j03
3967C3j93J56r4j6J13N0j89n9J79M3J83k67N7L8j55R5N7K5p4m9j5J70j22J15m3
3992C8O6L7k93J36K7j75J10n8J72J05k55J62j96Q4Q5O0j22j80J47k3J26m6q0k09
4016b82K80j39K94O1k43N5mj42r6P9K91j19j61n7K90j62j2N2j19K75j50n0k03
$$ plain form
3847 -53 80 -24 -201 -179 3 100 12 6 -210 66 -186 -34 511 31 275 -68 235 153 -61 -44 -44 23 -47 -45 -26
3872 -26 143 112 122 -121 178 17 50 27 -1 -196 23 -128 53 -63 71 6 -25 -99 -108 -77 -17 -118 -4 -23 54
3897 54 -86 15 -84 -60 -35 164 18 -174 61 119 187 -94 -30 -144 79 -32 36 -69 181 235 14 -161 -39
3920 -39 -116 55 19 136 -174 -63 -168 238 172 71 179 -303 28 97 -123 7 -105 92 -350 78 91 -49
3942 -49 214 89 -74 -70 14 48 291 -25 -56 -189 -41 59 54 -23 -30 10 62 -77 207 28 -61 65 114 136 33
3967 33 -160 -4 -98 -114 -1 49 -140 -199 -20 23 206 -61 -4 34 -121 -26 31 56 -18 -67 -82 88 -34 81 38
3992 38 104 141 -152 -16 11 -164 -54 -112 60 165 -90 72 -124 -40 45 105 -17 -197 -50 -73 53 7 -73 -282
4016 -282 -2 -141 153 214 -29 26 22 -120 -216 -137 154 35 -126 -183 107 -55 -67 -15 -134 141 -9 -59 -262
4039b62M34j53M4j02R9n2j82K77j46q6K59r0l46K73K74k86j05j00L99l01L4K66
4061A48k99L30o9k1k49J21j22J21l9J81k36K53k1k62r7J31J81j33nj00K19k07
4083a75K26k07l4L55k90J6N1L85k68k70K54j62J4K44O9r0k04k55M10j81J78j88
4105a22K08j60k51J99Q9l3Q1K2n4J75j10K01k39J35k34J16o0r7K95l05J2L7J36
4128D1j65J41J24k78J82l5P5K4j11O9j77L00j23k50K90r7j60L10j94m3N93o04
4150h8K18Q4l10K21q0l02J88J07P6k28RL5J5NP7K3k07K10k58n8J53n6K19k24J54
4175a7Q4J1j4j3j7Q1k15N09n62O56p64K06K35j41j5K5j09K2K50j78k7P1j29J66
4199A15j3l08M58k64J62k01qJ4j18M07l37j52M04j80j21N3K85m57K17L8j12R3
$$ plain form
4039 -262 172 19 63 -39 60 8 -174 103 -43 -129 130 40 -306 -33 241 -45 -150 -250 149 -152 -118 148
4061 148 -151 179 110 89 -160 -39 -161 -40 -79 102 -134 119 98 -164 -261 -130 51 -82 -87 -187 32 -175
4083 -175 51 -156 -190 165 -125 -109 -58 327 59 -211 43 -119 -105 139 208 118 -86 -341 69 -112 66 -122
4105 -122 86 -74 -325 -126 -37 -70 11 33 -21 154 44 245 6 141 -93 23 -37 -134 161 -144 -132 -95 41
4128 41 -124 17 141 -137 45 10 85 109 -2 67 -110 190 67 -183 107 10 -150 160 -34 -77 516 -88
4150 -88 130 214 -96 125 45 -257 -69 38 114 -114 -105 -70 -55 -50 27 50 -157 53 -205 -263 -110 -166 53 -171 -17
4175 -17 67 78 64 51 34 115 -100 409 -153 503 -261 -55 180 39 24 49 -60 -38 212 34 7 78 -51 115
4199 115 102 -206 252 -12 150 -51 -59 -45 -163 244 -93 -245 159 -21 -142 -89 196 -261 -44 -6 -118 -25
4221b5J87l37J81k2q8K9J79j78K1J04J7j40J02j72N0J79J30j89l5j19J61p9J4
4244c0l5J67k1J02l28M6k7Jj83J46L7J50M8j63K01j79K86l04J82k93M02q1J2m7
4268H9j52K80j89P6k1r8J7j0R9n1r1K98j71k8J56k65M7j42J01R9o1l0J86N2j84
4293Gk15J27m1J41j27j2J0O7J48l04L50m54K33K93j15O7k10k29L80j6k16n4J55
4316a5j87M5M05m09J08J47j10K10j89k92K85p6M3n6J14j41Q8Q5K0k7j75l3L94
4339B34k00j82K38j34j39k7L4J49K5r6J91r9r1P3L23k76J51k12R4k95K87l0J13
4362A31m38L67k18lJ76n3j83L59n1k27l0k5K91l70K53J7j67r9K07J07k98L02r6
4385d8L23m28J18K12k53J00R0O4j02j0j3P0j59J08j12K30j62rK20k35L3k06J20
$$ plain form
4221 -25 162 -175 6 -16 -104 -75 104 -74 -53 51 68 -72 30 -142 -92 87 217 28 -7 -126 35 -44 -30
4244 -30 -65 102 81 183 -145 -99 -126 -125 -308 -162 -125 25 73 -90 111 -68 218 -86 96 -197 205 124 136 89
4268 89 -63 217 28 104 83 -15 2 -8 91 40 -51 247 76 48 204 -61 -14 -156 -55 44 -17 -47 139 191 7
4293 7 -208 -81 -122 19 -108 -120 -110 -43 105 -199 151 -303 -70 223 108 175 -35 -264 116 100 -116 -170 -15
4316 -15 -202 -157 248 -161 -53 94 -16 194 5 -287 -2 -78 -35 -91 23 -118 -30 55 75 48 -127 -160 234
4339 234 34 -148 90 -44 -183 -210 -176 -27 -2 -98 93 -6 -97 -24 299 23 174 -38 56 -239 48 18 131
4362 131 -307 60 -158 -161 15 -38 -221 138 87 -140 -170 -195 96 -274 -21 -4 -171 -270 -63 44 -254 48 -48
4385 -48 275 -153 -35 177 -76 24 114 178 76 66 53 123 -36 72 -40 190 28 19 239 4 37 -169 -49
4408d9P8J1j71K33l06L71j44R1k99K29P7p0R0J50l21K1j08K66m1m42N50l15R1
4431hl1q7J06K36j09j8l1j40k8Q0J65j29J2J37j23J26j23jj05j09l8J88j90K81
4455F1k29J32P6N1k1J09k46L1n2K06rL5j38J33o7k47J75k19Q9J98N9k37J02l5
4479d3j03J80OL2P5k8j05k59N06n2m1r4j79j18K76m6J70l54J38r8J02J96l27K60
4503I4j41J40k3j78j16J76M0m2K2J33M4p3p9K54m71J93J58l43P8R5O3k01L27j81
4527c1J63j05nJ34j89m03N17j01J47j30o7J90j26J7K41j24k33J38P4Q1j12J74
4549B50l63J12P2P0l27J31Q6K07l16J46J12m85M12J73j40l65K34j25J98k84J15
4570h7k4J37n4k36L20J8j0J6P5k24L72k88l5J64m05j20O37l75M60m62R5P0j61
$$ plain form
4408 -49 29 40 -131 102 -204 167 23 114 -185 44 121 51 141 291 -30 -9 -117 149 108 -334 216 -99 -8
4431 -8 -39 -126 -20 216 107 89 58 -82 -110 -30 135 6 18 155 32 158 35 34 -71 -180 -218 -30 -220 61
4455 61 -168 -36 40 91 70 179 -67 -36 -88 118 109 144 6 139 72 -175 0 -219 -130 68 127 -110 -8 -43
4479 -43 -146 34 40 72 147 119 14 -245 261 209 168 74 -105 -223 53 7 177 -177 -39 -137 -35 161 -166 94
4503 94 -47 93 70 -108 -224 -48 -8 -50 -28 105 149 76 -3 251 -220 -27 131 -212 -134 -39 24 -177 150 -31
4527 -31 132 27 22 156 -33 -436 81 -20 127 -3 -70 120 -6 11 252 128 -105 33 107 188 76 250
4549 250 -113 -1 71 141 -186 -55 31 238 -78 68 180 -305 107 280 140 -225 9 -116 82 -202 -87
4570 -87 -111 26 -28 -264 56 74 64 80 155 -69 303 15 -20 144 -261 -381 256 -119 341 -121 -26 44 -117
4593a17J27p7j4o1J24J13j32J12o3k19J05p1K9o0p3M10k82K6J6j1k8K6R5m2K05
4618A38j17k35J00J11o3J78m69L72q1j66Q1J19n0J12j5J36j38k8K25j90J24m3
4640A01M8k59N8nK35n0k08K0K08k3n3j53k5N0p5K07j60L7m7O9J13j26J49j5k64
4665a68K29l61L49j17J63l47J79JP6n7N0O4j74M5K16q0J99k34j60J12O5M9j2j81
4689i4r3K57l0k4j7R9J17J1l52J27j14M6j31M30j56J79j69j02l21N78j21J75l63
4712f8J0n8J15o4K15j03P6j99K14k17P7j34k3K91j48M9K20n93L77j25j11J8J42
4735c9J21k55J93nj4k2m5R8j21k43L12j75J83k74J28R5m9K17j23L0j60k0J17k71
4759c22N55k14j21Q1N9r5j94K61k02J49J08J05l55K95m0k21K24J1j85K45j18j77
$$ plain form
4593 -117 10 -67 -81 -142 -18 95 -37 75 12 -207 -102 -173 -144 -204 -277 133 -149 -123 -107 -118 -146 -120 -25 -67 138
4618 138 21 -214 -114 -3 -66 112 -357 15 -66 -232 -151 -32 -82 30 15 151 13 -15 210 20 144 101
4640 101 149 -110 -52 -57 178 128 -80 -60 148 125 72 -81 -106 -56 -131 76 -84 -47 -94 -25 88 -38 111 96 -168
4665 -168 61 -300 49 -68 95 -252 -73 -72 4 -53 -3 61 -113 -68 148 68 267 33 -127 -15 50 99 87 -94
4689 -94 -187 70 40 16 -1 98 215 226 -126 1 -113 -67 -198 232 76 255 86 -16 -337 241 120 295 -68
4712 -68 -58 -116 -1 -65 150 47 123 -76 138 -79 -2 -136 -159 132 -16 33 253 -340 37 -88 -199 -181 -39
4735 -39 82 -173 20 15 1 -21 -66 32 -89 -332 -20 -195 -12 -286 -158 -63 -112 105 -18 12 -148 -168 -51 -322
4759 -322 233 19 -102 -21 38 -57 -251 10 -192 -43 65 170 -185 110 70 -151 73 84 -101 144 26 -151
4781a51P2Q4Q6j44L4j39J41J01J52j9k94kJ57J72K4j71P5J6l24K76J34m20L5m6
4805a51K02P2P3k02K15o5j98Q0K2J10k32j11L45j46k75L23l0J7r2k98L95r0p1
4828a07j61L38J98l51RQ8rM2K0N7n4l46K89j82J72l0K30k53K91m3j17j72l7K9
4852i9N9K31k52n3j8k5K81l6l07J42N3j9J89Kk04k2J70L4M9j79QJ56j41J87J23
4877C29l52J25k11P4J9o9k20K08K35pl64J03J56N2j56l42L09J83l48R8J42J37
4899A01k0m9m8k5J29j00n4O2J88k49O9r5J39j33J07r7%R3J19j58J52j81k4M56
4923C82n50J28n3p1K90m3k31K09j24l2J49n4p6M1P5O9k41J96k95J60J78r3j20
4946a06J69J05k35j17K95k49J62q2l6j0P3r4N07k64j01M4j96K96n4l90L09M1j48
$$ plain form
4781 -151 -79 5 91 -53 -19 -158 -17 84 236 217 -77 -79 78 250 274 103 178 194 -130 146 280 -140 -105 -151
4805 -151 51 123 196 -6 209 144 -54 26 48 158 -74 -185 160 14 -261 62 32 49 -43 -341 54 -36 -107
4828 -107 -268 70 268 -83 -74 14 5 47 67 124 70 -276 13 -169 3 -27 203 -50 241 198 81 -91 -128 -99
4852 -99 -40 191 -61 -114 -132 -157 124 88 -219 -77 -24 -43 146 148 -56 -78 92 126 175 -4 4 160 19 206 329
4877 329 -23 102 -109 -35 -16 -85 -305 -97 138 131 -233 -130 26 78 -78 -420 -111 72 -276 -178 -36 101
4899 101 81 32 -16 -41 88 -12 -66 -4 184 -65 4 -91 48 -85 22 -75 -75 18 137 -21 131 -50 -74 382
4923 382 -168 -40 -93 -164 126 83 -148 61 -63 -95 54 0 -76 -35 40 109 -132 64 -231 -71 107 14 -106
4946 -106 63 168 -67 -184 111 -138 24 -58 -94 -104 -31 -125 382 118 17 61 -135 161 107 -283 26 67 -81
4969h1K12N8l06R8p6Q3n3L3q3J43J34k29N5O0j17K01m7jP9k50K80M9l45J08n7
4994e2P1j34L9k1O0J91J10m59K68Nj36J24J4Pk18o4J68j36J61Q0l2J21q4j34j11
5019a62L86l47L11k37K18l72M28k11L9K0j57J18l52J90J43P6n23L52P2J39j2O3
5041A82m7k2oj00N3P7M3j84j43l3PO9J21nP2j92r1L28l05J02J5l5Kk0J12k74L11
5068C7l84L72n4Q3j29L9p9K90J11o35M98r3L2p3m8R6m8j11K04j95J23O3j31k41
5092b73K29j96J81K18j98K05k81J58j30J02k8k21L76j70N5q3K1LO5r3J12k07J80
5115B5K08k04K05j20J4j57P3o4k3J83k64K52j31J47m1J1j95k4J25k86J76Q9j30
5138a31K04j63L6j78J76N1q0K33k90K59j73l63M93j21J11r4J85k63J83k92L07
$$ plain form
4969 -81 131 189 -117 -19 -95 -12 -65 -32 -115 28 162 -67 -12 48 -69 132 85 84 163 -87 193 242 -103 5 -52
4994 -52 19 -115 -76 -97 -37 154 264 -195 73 78 -58 66 80 87 -131 -195 -27 -163 -2 78 46 167 83 -51 -162
5019 -162 224 -123 188 -49 169 -203 225 14 53 73 -84 34 -318 -128 15 91 -432 -80 -8 131 119 182
5041 182 135 113 107 7 60 137 180 -4 -147 -180 -173 -104 17 12 84 -108 -199 129 -176 -74 -59 -94 -92 -112 0 -274 37
5068 37 -347 25 -29 54 -75 -36 -115 175 286 -349 149 56 88 15 -33 63 15 -96 108 -87 36 99 -32 -273
5092 -273 -44 -240 -59 159 -39 166 -115 43 -87 15 -13 -234 142 -28 27 -56 -35 -32 33 -60 52 -155 25
5115 25 233 29 234 114 128 -29 44 -20 -43 140 -124 128 -3 144 103 114 -81 -105 20 -266 -90 -1 -131
5138 -131 73 -90 -54 -232 -56 -5 -85 148 -142 117 -56 -419 74 -47 64 -30 155 -108 75 -217 90
5159I0l91N78j27lj27o7K3R0J61j95P6j04l3Q0j43o1K23q8p4L14k20P1r3J59j17
5184B2P6R0j73m9KK9j17jL0J97j25J02j02K15k42P6Rj37O4m8p8L13j97L9M7Q7
5210A29k72J99j22MJ63j7j44J20k4j0j26k0q4J62K24j47k52L08j75J26L5j64K33
5233A46l14J80lQ1k87J30K6P5m8M8R8o5k40O4P5J05j42N1p3J10O3P0k68J33J97
5258B12k65J98j52m8J72Lj71q0Q8k66L40K9J42l48J59p8q3K91k50j1J08k78L02
5281A4M8m3J48j33q4k29L67j72K8o5K44q6k72M96m69pK71k29j17Q1K60j06K10
5304A55p2j37j19k0PJ80K68k19j27J11m2j56K15l1J71k75M2K27j34j38N7k4P3
5327A2J25k56J3J36o0j18j10L67n3P9k13L5P1k61K16j18Q2j09L4o6L08m52L57
$$ plain form
5159 90 -301 277 150 147 20 -47 -24 66 227 32 108 4 -29 51 -92 -153 70 -18 -92 222 2 73 -20 139 22
5184 22 98 188 15 -34 -32 -3 -120 -121 -91 106 -19 83 -19 196 -46 30 39 -98 -34 -82 -160 153 -44 -5 42 129
5210 129 -143 56 -66 -62 101 84 -60 60 36 26 -100 -120 -204 -42 182 35 -217 91 -84 42 77 -87 146
5233 146 -168 12 9 90 -197 -67 -41 34 -14 34 132 67 -173 -109 -34 71 -71 -20 -93 17 80 150 -118 15 212
5258 212 -53 145 -7 -55 117 120 -51 -131 -43 -309 31 60 202 -146 13 -65 -148 143 -107 -118 -10 -288 14
5281 14 62 19 167 34 -50 -279 88 -84 -56 -121 123 37 -235 261 -208 -215 56 -173 -290 -209 51 -55 155
5304 155 83 -54 -173 -193 -186 -6 262 43 -84 27 -15 -171 44 13 184 -91 -49 178 44 -94 -37 -61 12
5327 12 137 -119 -106 30 -30 -148 -258 109 56 135 -78 -43 28 -233 -17 -135 -53 -162 -128 -194 114 -338 19
5350A9P9k74J23j15R8j08J93L9j16J0K37k61j22K90q5J41k81J81j0p9K3R9J91
5373B72k40j99L32k3l02K65K27m32J33l7O2k29J48O1P2K3k33mJ80r3K3J6j03k1
5397a02J8K08l03K17o7N7p1J18J02pk02J94l97K98m9l4j49J65K4m5j23K08R9k97
5421a38K91j09K79m64j39P3K78k2n1K4J01l3J98k25Q0k2j88j25K72M4q6j51J26
5444A3N1L9j50K11k56J42j45J75%N9N2l38L06k62Mj47J88j13J54J39k82M34m13
5467a39j4q4K55q3J18k30K49k3j00R2l5N5k46J74L5o9N6j02J85K2k05L20l18R5
5491Hr0J81k15J56L7k09K30j6N0k36j62J73J71j28L1k70K84j92L81nm14K90J41
5514A96o9j98L44l87l9J82J65k36J3n7K01m3j6J10l15K78k54R1J56j33kk63K99
$$ plain form
5350 19 98 -176 -53 -168 -70 -178 15 54 -62 -52 185 -76 -198 92 7 148 -133 48 38 -41 -18 81 272
5373 272 32 -167 165 142 -160 105 332 -100 33 -4 58 -171 -23 38 110 133 -100 -104 76 -17 6 22 -81 -102
5397 -102 -84 124 -179 38 -29 28 -43 75 177 170 -32 162 -235 63 14 -20 -169 -4 20 -25 -148 60 159 -138
5421 -138 153 44 323 -141 -280 -207 71 49 -2 22 123 90 288 63 143 121 -67 -192 80 124 38 -113 13
5444 13 64 103 -47 164 -92 50 -95 80 80 139 191 -147 159 -103 -99 -246 -58 -171 -17 122 -160 274 -139
5467 -139 -153 -237 18 -65 53 -177 72 49 -51 41 6 61 -185 -11 24 -45 11 -91 94 116 -89 231 -87 8
5491 8 -82 99 -116 40 77 -132 98 82 132 -104 -266 -93 78 -50 -19 -289 -5 -197 184 179 -235 55 196
5514 196 127 -71 273 -114 -153 29 194 -42 -29 -86 115 72 56 166 -149 129 -125 -34 122 -11 -13 -276 23
5537B3k92J60J01l9M1M5K8Nj19N6P5j07M1j58J41J19nn2j69k8L47o0l1o9j80J79
5563E2j50J48l4J1Q6k77J01J43k28L26k02j5J06P7k07J62m4j19j7j8l0J11p0J57
5587F9j02n1P2J26n0k1J69q1m12J95K33k98n5K09r5K09k24J00L4Ml41K28O8J27
5611A13K4p9k17K81j92J40K0k8l9J8N7p7k74K59N0k63j38M96o3j96N3j10K33l45
5635b77J76J99k56J5J51k63K95rj69J85n2j46j5R1q7J76l7K65k30K35m27K07k83
5658b56K19O9k08J57J06q7m7j53J60j67m3J16K70J8j96J79k35K69k06K29k70L9
5680c7o8k21M26j27J24j35J50J27l40K74k00Ml63N26k05R6m07M87j31j53J61j49
5702a61L21l65L40k23P1m8J11P6k20Q5j18L50k98M8n3N9q6K92k73L4J28K0L3K54
$$ plain form
5537 23 -269 -109 -8 -47 -6 39 67 72 -47 9 84 -23 18 -140 1 120 115 63 -106 -134 213 153 122 53 -127 52
5563 52 -98 50 16 27 113 -164 -63 80 -148 178 -24 -39 67 144 -63 99 55 -64 -81 -99 -129 -18 -88 69
5587 69 -33 -84 -12 114 64 43 212 131 -281 -86 147 -151 -206 3 -92 117 -107 -7 27 31 -310 -82 -14 113
5611 113 137 58 -159 122 -70 70 90 62 23 41 98 21 -253 6 56 -207 -345 151 88 -108 -55 -165 68 -277
5635 -277 -101 98 -158 -143 8 -255 40 31 -138 47 -5 -151 -166 -75 -162 14 -23 242 12 247 -180 27 -256
5658 -256 -37 32 -176 -19 87 0 -47 -200 -40 -207 -250 -134 136 154 -42 137 -98 171 -35 194 -76 -37
5680 -37 -105 -326 100 -27 97 -38 112 239 -101 173 -27 -23 -386 140 -65 31 -376 111 -20 -173 -12 -161
5702 -161 160 -205 135 -88 -17 -65 46 122 -98 -13 -131 219 -79 -31 -84 -25 -111 181 -92 -58 70 90 123 377
5726C77k77q3j47J95k30K61k00P4R3l20p1M78l50L30n9k23J65k56K12O4kJ37K8
5749A96j94J83J02j67r0m1kP5K90l05r4K10l14L30j58p1K10O4k72L3K3O6q6o3
5773g5O2J64k15Rj18J42mj04L1M8o3J54o6J01k70K46n4J58k36K38j41k51J26P1
5797d7K18o5j96O8LN9p5K1n0M9j07O2n5K61j81M0L0j12K0J15J70j45M8O6l65o2
5823b30K77J31l85K27k11L33m13J44L21j75O5k25J15J16q8j29k6K04K8pj75K78
5845A75m43J46J42L6rn4J9l3J47M4J21l12K49k61j9J5r5m5K28J1j26O1O5r1J8
5870a1l3J02N7k77J34O1Q5Q4m87K90j38K51Pj31P7K9q9n9k4J95j92K19l79K55
5894B6p2k1J23k10j92M34j07K03M4j38k9p5J88l61K12M6j51k3L36l01O9J46k38
$$ plain form
5726 377 100 17 -130 65 -165 96 -104 -30 63 -257 -328 150 -200 130 71 -152 13 -243 -31 33 31 168 196
5749 196 2 185 287 120 30 -11 -13 62 352 47 -47 163 -151 179 21 -50 160 224 -48 -15 8 74 -12 -75
5773 -75 -13 151 -64 -55 -173 -31 -35 -139 -108 -60 -123 31 -35 66 -204 42 -12 146 -90 148 7 -244 -118 -47
5797 -47 171 106 -90 -22 -19 40 -35 -14 -64 -15 -122 -60 -115 146 -35 5 35 -77 -57 58 228 83 131 197 -168 -230
5823 -230 47 178 -207 20 -191 142 -271 -127 194 19 84 -141 -26 90 2 -127 -153 51 79 72 -103 175
5845 175 -268 -122 20 56 47 -7 12 -21 126 170 291 -21 228 -33 -52 -37 -132 -177 51 62 -64 -3 62 -29 -11
5870 -11 -44 58 115 -162 -28 33 118 202 -285 5 -133 118 125 -6 71 100 11 -48 -72 123 -69 150 -229 26
5894 26 -46 -67 56 -154 -346 88 -19 184 228 90 61 -14 174 -187 25 71 -80 -103 233 -68 1 147 -91
5917i1q7L29p2J2j81L67l16p3LM8j16J49O0k34L00k73K56R8j11l59M45j51K8j42
5941a11m2K04p9jO6o1j06K14j18P9J67j89Q0j31J86j47P8Ok22k31M51q3k53J11
5965a32K35k02K42j76K91R0l65r3p8K14l94K89K50O1k25J60k67L64k40r8J53l09
5987b30J00J23J91l57J05L32m37K11L7l9J10l43J68k34K24P8mM2j89J9L1O7j93
6010a88K70l4k47K65J36l35K6QJ2J80l46J78j71M52O0n60K53N1p9n8J41p0p2K22
6034I4j22n4M3j80J55O1Q4J6j46J75O6j00r2N1p1J37l5p3j49L32m40K55J05k9
6058H3QQ7j48j61L0K21k9k97J15K83k99R7MQ8jJ09l2k05P4j61J8r0L15q6J46r2
6084G7j53J83j22J9q8KKR2m9K44q7k71J84l37K38NK63j91k19J79Q7j20K7J42k47
$$ plain form
5917 -91 -178 151 79 91 -90 277 -39 -112 -109 -61 -177 -28 32 -202 98 -175 81 179 68 -291 154 3 31 -111
5941 -111 -153 51 -28 -29 37 -24 -130 84 -34 45 212 23 103 -28 158 11 89 95 -127 -358 93 10 -243 -132
5965 -132 103 -99 143 -33 258 348 -17 -110 -188 26 -368 -79 171 232 7 167 -100 264 24 -74 79 -230
5987 -230 -130 -7 184 -173 -68 264 -173 38 75 36 146 -197 -29 -263 -39 39 35 77 -112 -93 -62 5 -188
6010 -188 82 48 -199 66 202 -133 -107 -99 -87 93 -253 -75 -246 206 266 -294 -41 10 -69 -127 14 -56 -128 94
6034 94 -28 -82 -39 -219 -64 -3 81 97 -49 126 192 92 0 51 -20 117 82 9 -140 192 -248 7 112 83
6058 83 91 178 30 -131 -101 120 91 -206 -91 192 -107 -10 -6 82 81 190 158 -47 27 -134 -116 -206 109 23 169 77
6084 77 -76 107 -15 4 -84 -82 -80 12 -37 207 120 -151 33 -304 -66 -61 202 11 -208 -29 58 -62 -35 107 -140
6109a40J22M8l99L02K05j86J04l4kK23k29j75K8J82k27L66n74M40k52N4J49K16
6131B21k96J14k48J63p7J05K07j21k24m9J26R4qm1Kj49Q5J05j2J35j87J24r1N
6155a7J76p8j4J05k06Q6l5n9J80n38N69n8%k04j65K44j25L03k77J00J65l41M73
6178B84m16J38K45l67M8K04j47K38q7k0n7J44k26j13J4M6N0K19k49m6O8J28k12
6201a14J31J69l20j88L25K6lJ33j61j8J05p0M2j09M9J78j46k96k5L25j64Pj0L31
6225A97k94J12nO2P9o0P5j56j5j53O9J15l3k78M60j36o4J85m21rP4M28m20J56
6249c2m7J7J40LL7O8j71j2M5r5N3M00l62qj73N5O8n7M4P8P3l52L8K63k03J01q0
6276a09L1k52M60M3j45j4k02Q7q8J52J27J45rl61j15J07K20ml5k24J38M1L3j13
$$ plain form
6109 -140 -18 30 -369 -67 138 -48 56 22 20 243 14 -161 -133 49 -178 188 -386 54 -198 -144 5 221
6131 221 -75 39 -209 -46 -123 -18 189 68 -156 -205 -79 15 7 -34 -32 -181 -96 9 -3 132 -55 69 -22 -17
6155 -17 159 81 67 172 -34 52 17 -42 138 -400 169 111 111 -93 -258 -14 -139 164 -113 -13 152 -189 284
6178 284 -132 6 251 -116 -68 136 -11 227 140 120 63 207 -19 -132 -118 -72 -22 197 -52 -98 -30 98 -114
6201 -114 17 186 -134 -322 3 29 26 159 -2 -20 85 15 57 -52 -3 175 29 -267 -292 33 -131 -124 -134 197
6225 197 -97 15 10 72 151 91 166 10 -5 -158 -89 26 -7 -285 175 39 -25 160 -261 -270 -196 232 -188 -32
6249 -32 -79 -62 78 81 118 186 15 3 48 -47 6 406 44 36 -137 -82 -14 -71 -27 51 124 -228 -190 73 -130 -29 -109
6276 -109 -78 -330 130 173 28 14 -188 -101 -189 -37 90 235 226 -135 -250 -143 77 73 38 -186 -48 -7 26 -87
6300h7J94p0N6m9%j2L1K8K3j11J16j65k28M79k50J3j10Q7R0l1j4%J61k50P7J00
6326G8k79J4J33J81j45Lj87j65J48Q8K52l40K71j14L0qn3L9J01j19J83j6l2l4
6350B9K4j84K02r9j02l6K89j31O6j08J60R1o3j09P8K91m79M60j16l43J41J5j1
6373F5jk93K75J92l15J38j00m7N9o8O0P8j30K9L0n8J53j4j05k8Lq5J08L6K52j99
6399C5j01O1k4OJ15J70l82L5n4J19K04k45m6J71MN6Oj25j91K73k39Q3J08K2Q8
6424A49l34J34J17k01L46m80K00J67j41J16O1o3j11P1j83J84q5K96M0l08Kj94
6446b17KK79m1p2%o8L3P9L1K09N0j94L3o3j53p7J40J65j30k1L9m87M68o5l9o1
6472a60K84Jj4l6m3n5J29p6L7l4O0j5k37M49l00L90j92j34j51K57j51k05L35j58
$$ plain form
6300 -87 107 37 93 44 44 32 63 91 114 3 119 -46 -274 205 -45 -32 -142 -55 35 4 -10 -10 151 -99 -22 78
6326 78 -201 -187 -54 127 -18 -15 -202 -367 -219 -131 121 -219 52 -62 -32 -40 -93 -54 47 -72 111 95 63 29
6350 29 53 -131 71 -28 -130 -166 123 -8 58 -50 110 201 138 29 107 398 -81 379 263 -80 61 76 65
6373 65 64 -229 46 238 -77 61 -39 -86 -27 -95 -35 43 -87 -58 -28 -86 67 53 -52 -80 -77 -162 -54 -18 234 35
6399 35 -66 -5 -29 -23 92 262 -120 -85 -139 -20 184 -61 -107 64 68 124 130 5 -186 87 -152 -69 39 61 149
6424 149 -185 -51 66 -135 211 -269 -69 98 -43 73 134 71 -40 31 -152 32 -53 243 283 -25 -23 -217
6446 -217 -215 64 23 -49 -49 -117 -84 -5 26 235 285 91 124 61 -92 -169 -29 136 6 -15 24 -463 5 -60 -99 -160
6472 -160 124 125 111 75 32 -23 106 30 67 33 93 78 -159 290 -10 380 188 54 -97 160 9 -196 139 -19
6496a9P7PJ59j84j37J2m7K9P2J50nj6n2J04l17R2J66p8j76R7j00l3j55K23L04
6521A73q5j96K17M3k83J78j19K32j60j83l1J44R4J73l22J3M2P5j50o1K63l5k4
6544bR5O2k03P7K0J20p1l77L95m7j77nM8m4j61M66k91K6L86l88J09P9l3j24P2
6569C2j10m0q1k0J44K87k83P1M15n18K5r9J22j2q7K57j35qp7K60k05N7K09o4l0
6594A10q0J1j8j60m6P6K83l03l3K39J7j57j62K43r4N2k59K63q3P5J34K1J6Ml23
6619a74J48j8J7j16R1J75o2l2O5K29l81J42n4j88L85k06j81J48p7J6O3R6k71J08
6643g7J25R7j44M68k17m0K2l42k8j0K24j83o4kN6J43j8p5j32L80j46j58O0K13
6667A52j99j7q9J36J7L35P3m19r2N6r8K26j34K58j04j81Q7q4k1J47q3J56j98Q9
$$ plain form
6496 -19 58 65 224 40 -97 -85 -132 -103 -31 119 114 98 46 150 -167 -75 91 13 -163 -66 -166 -199 -354 -131 173
6521 173 88 -108 109 152 -131 47 -72 160 0 -183 -214 -70 24 197 -125 -112 -70 5 -145 -206 57 22 -2
6544 -2 93 155 -48 29 49 169 98 -279 116 69 -108 -113 -65 -109 -270 196 -95 -69 317 -71 38 117 84 -40 32
6569 32 -78 -118 -199 -219 -75 212 -71 0 415 -103 -78 -177 -55 -67 -154 103 -32 -40 -117 143 -62 -5 204 140 110
6594 110 30 41 23 -137 -183 -107 176 -127 -160 79 96 -61 -223 20 -74 -22 -281 -18 -101 -26 108 129 145 149 -174
6619 -174 -26 -44 -27 -143 -52 123 61 29 94 323 -58 84 30 -158 227 21 -160 -12 -89 -73 -10 86 -185 -77
6643 -77 48 145 1 469 252 212 234 -108 -136 -146 78 -105 -169 -171 -115 28 10 -65 -197 183 37 -121 -61 152
6667 152 -47 -64 -153 -17 0 335 408 -11 -103 -47 -145 81 -53 205 101 -80 7 -77 -98 49 -34 122 -76 13
6691A3J79j86o7O3K13k58R0L9q6K0o0Q6j42K90j39j55j26LK43K22k27P8M3j3j51
6716b8J37l1l73L98m95K89J79j3P4Lj16j23k35J62K50l15L91q0q1M6J12r4q1j04
6740a28K46j5J96l14q2R5m8K85m56J55J0l9L0K42l20l4q8K98J46j59L4k11J93
6763C6L9m7J00j78J38L7k43J9L8J4j04K00j02m1J2O1O7J09k33Q3J91k66J99k3
6787A06l34J60j7J79k17L6l1R1M5l8r4K04K11k41j77j61L74L8j54K25j51j19K00
6810A35k94J48O7m7R0K6l37L41L9l82M34r0L6j0j98J93l00R3J67k5p1k28K10o2
6834f5K1J63j27k35J04O8J68nj23j3J08K9M0j64m5L10k44L5K65k93j2J98j1n51
6858c79M25j20J48j33J81k78K87q8N8n1k14K16r0J89l75J59J1o0L89j03m05L44
$$ plain form
6691 13 192 6 -61 2 215 -43 47 86 0 20 -40 46 -96 194 55 -100 -226 -223 20 242 15 93 136 123 -28
6716 -28 109 78 -295 103 -392 -103 76 63 137 140 24 -99 -334 -172 78 -237 154 74 -7 39 151 57 -24 -128
6740 -128 118 103 299 -15 -97 -2 -50 235 -221 -66 -56 -95 -65 177 -143 -177 -265 33 179 20 54 -157 36
6763 36 75 28 128 -50 88 125 -118 -99 -61 -47 -151 49 -53 -94 -82 -21 46 155 -78 5 196 -70 129 106
6787 106 -228 -68 -85 94 -123 -87 -118 -27 18 -20 -114 90 301 60 -117 -278 96 134 -20 205 54 -65 135
6810 135 -159 -11 56 9 99 125 -212 129 168 -214 220 130 166 156 -42 151 -149 -56 111 86 15 -213 -3 -65
6834 -65 -44 119 -8 -243 -139 -71 97 92 -31 -44 64 93 133 -31 -76 234 -10 25 290 -3 -15 183 172 -379
6858 -379 46 -74 74 -59 122 -156 131 43 101 50 -164 52 -38 151 -224 -65 -54 -114 275 172 -233 111
6880A11J3k7j79J40k1K1j44o4J5K46r1Pk11o0M94k23j43Q2L3Ql14M89j34j66K89
6905A71k33J30k55L21N9l18J48k35R1J80k02K54K1j61K29k72J07q4L08l51J5O8
6927ik09L45j34k17L79M4k58L88J52n77L23m18L2K77k52K02k39K5O5J90j20j85
6949a96J76K4l5J20k02P3j08j14K29O5K30k10r3R0j68J36Q6k2j62r9K59j2N7k40
6973a16m5M06m40L83j82r6m2l9j04M17k51P4J36l12P9K12J71j14j97k57M55j7
6995A21J3p2N0M1q3k20kM7K8J68Nk10K45j58k4R4j99R5L23l4l41o1Q2J12q9O3
7021fk0K84l51J92R5l67L24l82J04J41M9L18k27j55M8k2Q5k8k57J11k16L61j81
7044a00J30n7N0q1N3L6J7Mj98L84j46o6K34k50j78K71p5N9j82L58n20K89k31J99
$$ plain form
6880 111 124 97 -82 58 37 58 -86 -150 -135 111 20 27 -184 -244 250 27 -116 -34 -1 7 -307 182 48 -118 171
6905 171 -62 68 -187 134 193 -125 23 -212 -121 59 -143 111 132 -29 200 -72 35 -49 259 -92 -77 -9
6927 -9 -218 127 -7 -224 155 199 -59 329 481 -96 227 -191 -159 118 -134 68 -171 -146 -81 109 -11 -196
6949 -196 -20 4 -31 89 -113 -40 -148 -262 -33 32 262 52 -41 49 -119 17 103 81 -81 -180 79 67 124 -116
6973 -116 -161 245 -195 188 6 -90 -132 -171 -275 142 -109 -35 101 -211 -132 80 251 137 -60 -317 138 121
6995 121 134 62 112 153 70 -150 -152 -105 -77 91 96 -114 131 -27 -51 43 -156 -61 262 228 -113 -174 -92 20 -69 -6
7021 -6 -26 258 -93 99 194 -173 151 -231 -127 14 63 381 154 -1 47 25 110 82 -175 -64 -280 81 -100
7044 -100 30 -27 23 -58 -5 31 48 52 -146 238 92 26 260 10 -168 103 28 87 -95 263 -257 32 -199 0
7068@k50P0mK07L6l1J71j51K5j24j40J27J04Qk90L88p6j9K28q0k27K1O7op7k59
7094b82K77j03J26J01j74K28k40O7j3M5k12J93njp0L22n20R3O8R1N4o0lL1N3k24
7120a58PK66p4m4L3Q6l33K21J38J0o9k20K02j07P0J83l26R9j00J05J55j4k10q6
7144a66K22j24J12k21J52k66M45k11PK26k39j69K50o8p6R0m8K79jj82nl8Q5O1
7168A15L1k14J81k23Q5J7j08K29k7j01J04n5j93K07R0j43j24j16K25M8O9J24j54
7191F7o9k4l45N61Q2j56j49J57j13L6J68j81n2j57K62j17Q8r6K97q1j01J12m23
7214b34L63j29J32k6J87m14K12o7J17j15Q2L6l46J98R8j20n3J16j37N1j28J53
7236b4j07Q1J33J16j63k55L71k04j4Q1R7mj38j07J53L31n73R5K13k56R9l1N3M4
$$ plain form
7068 0 -250 -180 -184 23 59 28 199 48 73 -51 -191 -64 40 48 -242 146 70 51 279 199 -28 -7 60 54 -23 -282
7094 -282 -5 -108 18 119 -55 173 -67 0 -13 32 -180 13 8 7 -63 259 -261 -168 -100 -9 45 -15 -18 13 66 -158
7120 -158 -151 115 41 -3 30 116 -217 4 142 152 83 -137 65 -42 28 211 -115 -16 -116 -11 144 130 -80 -166
7144 -166 56 -68 44 -177 -25 -291 154 -57 -50 176 -63 -232 18 -50 -126 -36 -84 195 194 12 7 -31 54 115
7168 115 146 -68 113 -110 -25 -8 -116 113 86 -15 89 34 -159 48 138 -5 -129 -245 -20 28 97 221 67
7191 67 -2 -26 -371 190 272 116 -33 124 11 47 215 34 -18 -175 87 -30 58 -38 259 178 77 189 -234
7214 -234 129 0 132 106 293 -121 91 24 141 26 108 144 -202 -4 94 -26 -79 37 -100 -49 -177 -24
7236 -24 -131 -50 83 199 36 -219 152 -52 -66 15 112 108 -30 -137 16 347 -226 -131 82 -174 -75 -106 -53 -9
7260iJ00j31L0j8J51K2k15J78j21P3O0j62P0m9q4J37q2N6o1J42k41K67l27J76
7284c8N2k9L00m62K58j09j1J4K81j73j36J31j4k9j32K20j70J61k37Q9N4J16k89
7307a53J12O1J0O2j05j8J8R5l52M30r4j5m2K40k27M8j60P3o6P5r9J81k15J20j38
7332a59j9K3K09j84J60j91L53l14M20k67k02K33k50j4J76J6j29N9r5L5l1J72o6
7355f5K24l8k41J44ro6R8l3j23J69j99J81k49M14k58p6J27kK32m67K80m6L7o9
7379c5M8l26L4K20q6K9N3K01k28K28J3kq8o3K27j05m18N01k80K79j01J30o3R2
7403B60k02k26rK95k00K38j79K32O1k85J64l41L98k60K11k54m5O6J59j10n9NJ72
7426I1J30l00j3L04l00Q9j70L41j19no8J12l94K83j98J02l1M0K55l89K84o6P0
$$ plain form
7260 -9 91 -40 -10 -28 123 145 -70 108 -13 60 120 -42 28 -21 -105 32 -50 6 -55 87 -154 113 -214 -38
7284 -38 14 -15 285 -177 81 -28 -39 -25 256 83 -53 78 64 35 -97 123 -47 114 -123 -34 20 136 -153
7307 -153 -41 20 30 92 -13 -31 -13 82 -270 160 66 51 9 249 22 70 -90 -17 -83 -8 -107 74 -141 -21 -159
7332 -159 -178 -155 54 -130 30 -161 192 -122 298 31 -171 62 -188 -202 -26 -10 -139 -80 -175 -140 -171 1 -65
7355 -65 159 121 -120 24 15 -51 47 14 -109 60 -139 42 -207 207 -51 -127 0 -2 230 -237 43 -3 34 -35
7379 -35 13 -313 -279 -59 -145 -116 -63 138 -90 138 151 149 61 -2 225 120 -298 203 -77 202 101 231 168 260
7403 260 58 -168 -177 118 -82 156 -23 209 270 -15 149 -192 206 -54 157 -97 -142 -76 83 -27 -86 -81 91
7426 91 221 -79 -92 212 -88 1 -169 172 53 48 -20 92 -302 -19 -217 -115 -146 -106 149 -240 44 -22 48
7449D8N1R8k28N7k5o7L0K49j26M8j03q3n2L7M0p0O9K5M8K0l2n2J32j22j8j6j22
7476a64Q4K64k63j39R6K83j64J68l09M6K70j77K64l26O5QP8L3q9k33L69j34lQ5
7500A12k91J53j87L89l50j01K45r7R1J14j03j14K47J11l45K09j36J14m6r1J23
7521D7Nl6J3j32o7K34l16J99j16L74j25k4l5k26L01o4o2l68M51K7j08J43j77O0
7545bk14K56jK5J7M5j53L0k49L34R5j22J63L0k66J33J57l16k39K42j65J41J78
7568A19j57J52m9n8L4J68k05j84%J31K06j51L01j80j17j10LJ22K35m9l51J50J81
7591A91j41j22j87K15J80j00Q4j49%o5k11L23J17m6j18O0J06Q0k23J83j57l47
7613c27K87J40j75J16j00k3J11j0N3N2q1J31j44j02P1j42J19n0J6j29J36N2n4
$$ plain form
7449 48 99 197 -31 26 1 -66 -36 213 87 135 32 -51 -103 -66 -26 -96 -27 -2 46 66 34 -18 114 -8 -26 -42 -164
7476 -164 -80 184 -79 -218 -122 161 -3 165 -144 -98 172 -5 259 -67 -2 6 84 117 28 -205 164 30 27 112
7500 112 -179 -26 -213 176 -174 -275 -30 -127 -36 78 -25 -139 108 219 -126 83 -53 61 15 -76 47
7521 47 52 16 29 -103 -170 64 -252 -53 -169 205 80 56 21 -205 96 32 -30 -398 53 80 -28 115 -62 -2
7545 -2 -216 40 39 64 81 126 -27 3 -246 88 183 61 224 254 -12 121 278 -38 -277 -35 -200 -59 119
7568 119 -38 114 65 7 41 209 4 -180 -180 -49 157 6 307 127 10 -100 -97 25 260 211 -140 10 191
7591 191 50 -72 -259 -44 136 36 120 -29 -29 -94 -305 18 135 89 -29 31 137 217 -6 177 20 -327
7613 -327 -40 100 -75 41 -59 -82 29 19 72 124 43 174 30 -72 -1 -143 -24 -74 -58 -187 -51 1 -53
7636e3m9j0J62K6K0J30j58j55L6j55K26M4r8O6r3j74K60J3nN4k27K59q3m1k5J34
7662A04j93L00j67j60Q0R4J9KJ5j57J80l0k50K37M9p3j56J06J4J6P1p4j29K91
7686A89rl45K20k51j7O4k2j67L36J33k46j73K92j0r2J36K49l53M0P6N0k67J70
7709CK22j05j64n8p4K59j53P9P9q9Rk4Q2j12j07m6J83O1k9Mk23K94K19l63M7M4
7735C8L7k10K16m6j45K05O5l23J20Q0j52L07j29J5J81j21k73K10j46M6J03k04
7757a26oK10j06K13l56JL4k0L38n0l1p6O7k69J99k19L0K23k08K35l0PJ20j32J85
7782B33j30k01Q6P8k42K64l57L67j57R3qO7l51L29j99J29M0r7K21j79P9j24M4
7805a5j46M05k18r2k21K26l4J5p8M07j05O5L7j17n1j10J31L7k12r8J37K2j27L17
$$ plain form
7636 -53 -102 -112 50 76 96 226 68 -87 -51 -206 20 64 -34 32 -61 -235 25 38 33 87 -140 119 36 -5 -30 104
7662 104 -89 211 44 -116 -36 58 77 79 94 -63 117 87 -163 74 123 50 -106 0 14 30 101 27 -102 189
7686 189 180 -165 55 -196 -213 -149 -171 -338 -2 131 -115 -288 4 -6 -98 38 287 -66 -26 50 100 -167 3
7709 3 225 120 -44 -102 -176 83 -70 9 88 -1 8 -16 66 -46 -153 -199 -16 45 16 20 -203 91 310 -53 -6 38
7735 38 75 -135 81 35 -110 95 160 -163 -43 37 -115 192 63 78 259 138 -135 75 -71 -25 78 -126
7757 -126 -132 78 -28 185 -171 -170 -136 -156 182 132 101 25 92 -177 22 -197 -167 56 -152 83 53 60 180 48 233
7782 233 103 -98 -12 66 -176 88 -269 98 -59 34 26 93 -258 71 -128 1 41 -56 165 -14 65 -59 -15
7805 -15 -161 244 26 -66 -287 -61 -95 -80 -158 249 144 209 246 129 78 -32 99 136 -76 -174 -37 -15 -142 175
7829A75k69R8j30p2M45k65j46J04J74j63K43l45n1K87k63K47KJ20j09N7k3J6j11
7852B1o1J93j9j01L7n7M2p0K9n5l0J14N2k23N5J76r3l1j61J92r5J50j7k26J88
7877A0K32k6k21p2k6q8pK19l84N02j87R3q4L02k03Q6m27L52j51P1j15K71l65K21
7901Coj14J21qQ9k27j9QK14n1j0J28l16R9k3M2J71j81J57K32k05j85K17l6J36
7926B36l08K40k88o2P6K5M1L9j00J53j21L20l13K63j70J9l24K70k56L70l8j46
7948g4nL6J99j96J12j11Q0j34K4N1J50j82j7J56j58M8J17l7m0J70P0m2m58oL00
7973E3k01m5J42n2M92p20M10j01L8K77k54j35%K34o9K2n4j31N1l9Q9jJ02k07R9
7998@L44k24J21j64k15L62m38J26j45J77J28k66J76m0l5N2J9l0j23L11j7l73K50
$$ plain form
7829 175 -94 4 -126 -198 247 -18 -164 -60 114 -49 194 -151 -202 85 -178 69 71 191 82 139 116 132 21
7852 21 -40 153 134 33 70 13 55 -15 14 -41 -71 43 95 -128 -73 103 10 -21 -182 10 -85 65 48 -178 10
7877 10 242 216 -5 -77 -103 -191 -198 21 -363 139 -48 45 -39 263 60 146 -281 71 -80 -9 -124 147 -218 3
7901 3 -3 -117 4 -4 85 -142 -161 -153 61 10 0 128 -188 -89 -112 -70 101 -80 77 309 104 -81 136 100 236
7926 236 -72 168 -120 -182 -106 -81 -40 -1 -101 52 -69 251 -62 201 31 50 -274 -4 -260 110 72 -74
7948 -74 -79 -43 156 -40 72 -39 41 -93 -69 -18 132 -50 -67 89 -69 -21 96 59 19 189 259 217 -241 -247 53
7973 53 -148 -193 -51 -103 389 -331 79 -22 16 293 39 -96 -96 138 69 91 37 -94 -43 -82 7 6 108 -99 0
7998 0 344 120 241 77 -138 224 -214 -88 -233 -56 72 -194 -18 -58 -93 -41 -22 -52 -175 136 119 -254 -4
8021dK51r6m26J42N9nO6p1P7J27q9k29L50L4m44M73j46q5J76j49J67k2O3k86N
8046f2l65O37j4l49J28O5P1l38L23K6k82j1K09q6l7J51j60jL12m16J46Q5j02P7
8070Gk15K14k29Q8J95J39k27j06j6L3J63J46j60M5k09L48r1k58K23j11p1K60L01
8093D69k31k46l6o7J21K16k93J32J61Lk24j18q7J3J75k23J90m8R5K51m91K12m9
8116g5J86J74l11Q8m1J07r4M2m8j20K38j86J74j68K12j19Q7Kk4k07k4J89J16j73
8140B5L50n84N3kL59n09K61J75j62J69k28J88j85L21k61j96J92j85L1L56m19M5
8162b06K18r1J2J45L7k96J41k8N3N7M4l4j82M89j95l19J49j66j64P0K95j24j6
8185a11J02j14J42l98L25K2
$$ plain form
8021 -4 247 151 -275 -133 -74 -79 -13 -84 -7 120 31 -198 152 186 -258 215 69 -16 160 11 178 156 219 -67 -62
8046 -62 -427 210 196 -153 -25 40 111 -227 96 122 -160 -171 38 -48 -85 66 -94 -95 217 -199 -53 32 -70 7
8070 7 -208 6 -223 -135 60 199 -28 -134 -150 -117 46 192 32 77 -132 216 125 -133 90 -21 -92 168 469
8093 469 238 -8 -44 -111 10 226 -67 65 226 229 5 -113 -200 -187 -12 -235 -45 -93 2 253 -238 -26 -75
8116 -75 111 285 -26 62 21 128 34 76 28 -92 146 -40 134 -34 178 59 146 148 124 -83 -107 82 198 25
8140 25 375 -209 -156 -158 201 -308 -47 128 -34 135 -93 95 -90 231 -30 -226 -34 -219 -188 168 -251 -206
8162 -206 12 -79 -67 78 115 -181 -40 -68 -15 42 86 52 -130 359 164 -155 -6 -172 -336 -266 29 -95 -111
8185 -111 -9 -123 19 -379 -54 -32
8191c2
$$ Imaginary data points
##PAGE= N=2
##DATA TABLE= (X++(I..I)), XYDATA
0@%%%%%%qJ6j6J6k4L2l2M0n6P2q8J08j32J58j90K26k66L12l66M28m98N77o66P65
30D08q74R96j131J280j444J627j829K047k286K549k838L155l500L875m285M733
46B483n221N756o342O986p695Q478r346J0312j1395J2614j4000J5594j7448J9631
60A0407k2251K5463k9501L4761m1917N2252o8527R7917j66856O12813L10324j657765
72h42880L98347J053794o8175o54380j57292J72277L86900L1649m99923k15735
82c95418N35477K00950m30925k26009L11338K26926j53272k58003M9458K47616
92A08138N8236k34912j06393J89101J46684j36048j54482N8391J58263j755j41124
103e5901m7248J17121P4239p8813r3028M1542R7219r34r3389k5685Q3766M6301
$$ plain form
0 0 0 0 0 0 0 0 -8 8 -8 8 -16 16 -16 24 -32 40 -48 60 -72 86 -104 122 -144 168 -198 230 -268 309 -357 408
30 408 -466 530 -601 679 -765 862 -967 1080 -1206 1343 -1495 1660 -1840 2035 -2250 2483
46 2483 -2738 3018 -3324 3662 -4033 4445 -4901 5411 -5984 6630 -7370 8224 -9224 10407
60 10407 -11844 13619 -15882 18879 -23038 29214 -39313 58604 -108252 504561 814885 -842880
72 -842880 -444533 609261 541086 -113294 -270586 -98309 288591 320240 -179683 -395418
82 -395418 140059 341009 -89916 -315925 -4587 222339 69067 -188936 -139478 108138
92 108138 166374 -68538 -174931 14170 160854 24806 -129676 -71285 86978 85223 -55901
103 -55901 -103149 13972 88211 9398 -83630 -42088 55131 54197 -39192 -64877 18889 65190
115F5190o9133n2778N0637N1908k6480m5726K432L8703J7522l1341l3212K3313
127h965M0448j5744l9858P436L2526J029k3805q638J4512J4159o323j7648J056
140i815J8721J883j6985l782J3707M961r460n786N034O278p01o909k616O937M182
155E649o202n270N565M432l220m358K162L159o9k663j021K018J392r60k431J360
171d57K427r89k465N99J997k92j638q7J192N69m66j304L71J454l96j177Q0J117
189E35n0p71k98N37P40n05o77M65N55o9q45L5O91Q9k15p88N95K01k17k64J39J63
211D6L87n86k52N86K81m43n7P2J05k49P0q0k9K26j12j55L04j11m7J0M8K14q1j87
235d0q3J32p1m6r4M59k57k3J20n5L8q3M3n8J4M4j92J05K62k08K9l09K74J01j61
$$ plain form
115 65190 -3943 -56721 -6084 45824 19344 -26382 -23950 14753 32275 934 -32278 -8965
127 -8965 31483 15739 -24119 -16683 15843 16872 -6933 -15571 -1059 13100 6777 -10871 -9815
140 -9815 8906 10789 -6196 -9978 3729 8690 -770 -6556 -1522 4756 4055 -2854 -5470 1467 5649
155 5649 -553 -5823 -258 4174 954 -3404 -1242 1917 1848 -815 -1836 182 1574 614 -1817 -457
171 -457 1970 981 -1484 -885 1112 820 -818 -905 287 856 390 -914 -543 911 515 -662 -582 535
189 535 485 -286 -584 -47 693 188 -489 -24 531 462 -383 -348 343 432 217 -571 24 225 8 -256 -117 46
211 46 433 -153 -405 181 462 19 -38 34 139 -110 -40 -120 -149 77 -35 -190 114 3 -44 -34 14 228 147 -40
235 -40 -123 9 -62 -108 -202 257 0 -23 97 42 80 -3 40 -18 -4 40 -152 -47 215 7 36 -273 1 102 -59
260e9K5M4K7n1Q2K3J2K7r0k6O7j0j87PJ33l08K55M6j54K17j51K18k13j96K16l
286d9J7O3J72m3k47K15K6l29J33M4j11p0K19j95j25L18J4q4L02k41J65j00J0j94
310i0j78K85p2j75J93r8J83J20p9q4j25K9J08l2Q8k75M07R6j91k49R9j21N1j97
334c07L15N7M3n8L0j8k20Q2K51m03J46oN7O9j34J04j00J22r6q4L79j61k27J38
358b1m3O2o3q3O7p4J54K18k85J6j62N43k35o8r1J45K2j52Q2N3j72Jj73M4M13j54
384D4jj26j63J87O8Pj95N2P3J74l30K47J00r5L5J96j54j71L17m23K60k01r7K15
408A9O0Q8J1l15K04k31J99j47R9J15k4k17J79k2n4K0q3N4Q1J13q5l98M28j0n3
433C1l30J32J65J68l49N8L13k07L97l30j14j8j25J17o9K69k59n2K62l65K84J47
$$ plain form
260 -59 -34 10 37 -14 68 91 103 130 40 14 81 71 -116 -109 24 -284 -29 17 -137 80 -71 147 -66 -262 -46 -49
286 -49 -32 31 203 160 -87 128 154 -175 -42 2 -109 -179 40 -155 -280 38 52 -32 270 29 194 94 104 -90
310 -90 -268 17 -55 -230 -37 -135 48 168 89 5 -120 -91 17 -15 73 -202 205 301 110 -139 -40 -161 -110 -307
334 -307 8 65 108 50 80 62 -158 -76 175 -228 -82 -88 -31 38 -96 8 -92 30 -66 -150 229 68 -159 -21
358 -21 -64 -2 -65 -148 -81 -155 -1 217 -68 -52 -214 329 94 26 -65 80 102 -50 32 85 -87 -86 -259 -215 198 44
384 44 43 -83 -246 -59 9 16 -179 -127 -54 120 -210 37 137 42 77 273 119 -52 265 -158 102 -99 -196 19
408 19 79 167 178 -137 67 -164 35 -112 -13 102 78 -139 40 18 -36 -16 -99 -45 36 149 64 -334 94 84 31
433 31 -299 -167 -2 166 -183 -125 188 -19 378 48 -66 -84 -209 -92 -161 108 -151 -203 59 -306 -22 125
455A25j16J93l1k55J10L8n7Q6J5K4j75J55k44K58nj97K6R4J15k05j19Q9K56k81
479a01k3P1J78l10L32k09K69l11M22l29r8j49N11m48k6m3N2K92j89nJJ96k11K76
503A48j40N3o7j4M07n47K47P4n9k7j6j32k08O7J23j29J1J83jok4L74j90j48K3
528Bj28J77J63m19K18j10K44l29K53J40k81J0n8L75k59P0p8K3K73m13K81j42j65
551a53J62M7j09J53r0J20o8j57o9L36j32L6k19M1K06j88K37M3j84J72J9Jlm54
575b53L93j89j02L32k02q9kll6M6n8J88r5K14k32J20Q5k63J46l04N70k81L5N7
599G7j47o0K0K2k80L55j56M46m69Q0L07K0l05R5J70l4k41Q2QK30j39j62K36p7
623G8J07j19j99m7n4M50l56L50l27K03j10Q9J75k62k2m8M2j66J92j85m8M45k46
$$ plain form
455 125 9 202 171 -84 26 64 7 93 108 132 -43 112 -132 126 121 -76 -50 44 159 -46 -165 -76 180 -101
479 -101 -124 -53 125 -185 147 -62 207 -104 318 -11 -109 -258 253 -195 -221 -264 -212 80 -109 -114 -113 83 -128 148
503 148 8 61 -6 -20 387 -160 87 161 102 75 59 -73 -281 -214 -91 -220 -209 -26 -27 -33 -57 317 127 -21 2
528 2 -126 51 214 -205 13 -97 147 -182 71 211 -70 -60 -118 257 -2 68 -10 13 286 -127 154 12 -153
551 -153 9 56 -53 100 10 130 62 -95 -164 172 40 76 -143 -102 104 -84 153 196 12 184 203 204 201 -253
575 -253 140 -49 -151 181 -21 -110 -112 -115 -151 -105 -163 25 -70 144 -88 32 117 -146 0 -304 266 -15 20 77
599 77 -70 -130 -110 -88 -368 -13 -169 277 -192 -112 195 215 -90 5 175 141 -100 -18 -10 220 81 -81 155 78
623 78 185 66 -133 -180 -234 216 -140 210 -117 86 -24 65 240 -22 -44 -92 -50 -216 -24 -209 -257 188 -58
646e8Q0P1l2n1k86L98p4k8O7o4r1p6J25j96J37K95k39j60K00M2j41L03k51N7J10
671A38o9k17J49J30q8Q6j78k0m1l2J30j0M0j93M57m97K61N5Ok37J56k37K77j02
695c6J62j84J69j01Njj18J15K8K14l03k0j90L23JP3j6j59K62k94j46K29l73M47
719H7j55j61J55L36l52j8K06k02j22L42k05J57n4K96k93j7j90L94k19k98K71%
741d2R1j44M8J26J46m74M8J47p2Q0j33J72O8k28J83j97K48m51M25q9K10k33k0
764i1q3J3J58j13J12k2J95j14q9K09j23j06j4K64K13k54j78k41K33K4J19j26m0
787e4K98k80j40L67l10K86k46R0q8l16N89l12J17n4J43k58K21r4L2L0J04M4J02
810B71k33J60m58n1L32J0p9j58L78k76J93O9j21J87Pk40k85L87k46P7Q1Kj64j2
$$ plain form
646 -58 22 93 61 10 -276 122 48 20 87 23 -68 -144 -19 -215 -78 217 -22 -182 18 60 -81 222 -29 28 138
671 138 69 -148 1 131 43 129 -49 -69 -110 -142 -12 -22 18 -175 282 -215 46 101 107 -130 26 -211 66 -36
695 -36 126 -58 111 10 15 14 -104 11 39 253 -50 -70 -260 63 64 137 121 -38 224 -70 -216 13 -360 87
719 87 -68 -229 -74 262 -90 -108 98 -104 -226 116 -89 68 14 310 17 0 -190 204 -15 -313 -42 -42
741 -42 49 -95 -47 79 225 -249 -201 -54 -126 -46 -179 -7 61 -167 16 -181 67 -384 41 -48 162 -71 -91
764 -91 -174 -161 -3 -116 -4 -26 169 55 -34 175 52 -54 -68 196 409 155 -23 -264 -31 -7 112 -14 -54
787 -54 244 -36 -176 191 -119 167 -79 11 -77 -393 196 -116 1 -53 90 -168 53 -41 -9 21 125 169 271
810 271 38 198 -260 -311 21 31 -48 -206 172 -104 89 158 37 224 231 -9 -294 93 -153 -76 5 7 -157 -169
834a69K22l52P71o74j05K52K02j48k5m3k53K50J14j81l9J90R9j98K6P9M9k5j70
857a28L46j78MK8k22J41l0q3p3J72M5j39j31j68L23O9k13R3J68o2j31K47j99K14
881I3j61p4L89l17K93m88N68k46rp0j15J56J42j42l9l7p0j05R0O3mM04n21J22
905g8J77j60j3J33j85n5M22J2l41K73j99R9j88J28o7J25m7%q4Q3L7Q3k79J76M0
930I2k19P3j02R1j63J74j53L82K7k83J14P5j48K44j57j39oK13j26m3L02l86J52
953A4J10j79j3m5J92L2J24m40K12m9J3Q1K1q2j04R7J09j34k0J23Kj53K15l8q9
978aJ93k44j0J35l92L53p4J32j59K33Q6j26m47K76j64M02k21M0J42l46N61k93
1000G6q0j5L9J72j83n9O1pK07q7j94J3J09k12L01k00J64j57J34K18k57J65q4q2
$$ plain form
834 -169 53 -299 472 -202 -307 -55 147 -1 -26 -69 -322 -72 42 -139 -178 12 111 -87 -61 18 67 42 -128
857 -128 218 40 44 72 -150 -9 -39 -122 -195 -23 22 -117 -248 -416 -93 -24 -237 -144 24 -38 -169 78 -121 93
881 93 -68 -142 247 -70 223 -265 303 57 48 -22 -137 19 161 19 -20 -57 -127 -232 -142 -79 -83 321 -200 -78
905 -78 99 -61 -74 59 -126 -181 241 253 -88 185 -14 85 -103 25 -42 83 36 36 -48 35 72 155 -124 52 92
930 92 -127 -54 -156 -65 -228 -54 -207 175 202 -81 33 108 -40 204 47 -92 -98 115 -11 -54 248 -138 14
953 14 124 -55 -68 -113 79 111 235 -205 7 -42 -29 52 73 -9 -113 -16 93 -41 -61 62 64 -89 126 88 -1
978 -1 192 -52 -62 73 -319 34 -40 92 -67 166 252 126 -321 -45 -209 193 -28 12 154 -192 369 76
1000 76 -4 -19 20 192 9 -50 11 4 211 124 -70 -57 52 -160 141 -59 105 -52 82 300 43 208 124 42
1024D2o0N5o0J21k7K15l63J00l4R0l8o9J51k45O9J93j46k5Q7r4J15k02L12j95
1048hj57J13P4p3M9l7j08N2J81j14J26p0j54Q0J04K1M8o0j11j16K13J25j36j9
1072B3J26k70L8J04%n3n2L6J71k73O3K81m24K04O8j67J4Q0M5J34k28L45m30K72
1096A07J59k49O6j80J73%l7j44j10L36j6l0P7q7k1q6J22o4q6j60L24k32L07m02
1120b33MP4J80oo3K3J90o8j24k1K04j11L2p9n4J27J9l84M52m3O9N0k45q3j21L73
1146A62l14J85j16l51M51p0K28k55k3j52J44R1L15l63K22Np1j06J81j37p2K2O3
1169C9rM4l9K0K2qj06J03Q6j21Q8k77L06L6o0j57Q1k62J28J12j24J18j46M1N2
1194c3r1J54j80J60o6j06K14l9lMK2K25l75J68J2j02P8o6J05j99K30k87J49k21
$$ plain form
1024 42 -18 37 -23 98 71 286 -77 23 -11 79 41 -28 123 -122 -53 140 -6 -31 56 -38 77 -125 187 -8
1048 -8 -165 -52 22 -51 -2 -39 -147 -95 86 -28 98 28 -126 -46 58 79 127 67 -44 -160 53 178 42 23
1072 23 149 -121 -83 21 21 -32 -84 -48 123 -150 -87 194 -230 -26 42 -125 -111 -31 14 148 -80 265 -165 107
1096 107 266 17 83 -97 76 76 39 -105 -215 121 105 75 152 65 44 -42 80 16 -70 -230 94 -138 169 -233
1120 -233 -229 -155 25 19 -44 -21 169 101 -23 -44 160 49 81 2 -52 75 94 -290 162 119 188 238 -7 -90 -211 162
1146 162 -152 33 -83 -434 17 -53 175 -80 -103 -255 -111 -20 295 -68 154 159 88 -18 163 26 -46 -24 39
1169 39 30 74 35 55 77 69 -37 66 152 31 119 -158 148 184 124 -33 48 -214 -86 26 -98 20 -126 -85 -33
1194 -33 -124 30 -150 10 -56 -162 52 13 10 14 36 261 -114 54 66 -36 42 -24 81 -118 112 -175 -26 -247
1218b47J68K66q9P6m3l64L81l02J93J15j60o7j38K62j21Qn5L25j33o1p3j8Q0K4
1242B7rj99K25m4J7m8j9K71k60J24P9L0l5j58j16K24M3j41J78j98L80p05L02J05
1266G3j00K62k95K18l22J86J34m9R5k30k05J72J41k92J30L91k86J39o7k19M5j61
1288b40M50O0k85n8K53l11J17k85J98O1P2j06j01J19r1P9P4j85N4J61J8j7j68
1311a31J4J62L2p0R0J8o0m1j65L14j80o4k5K74j40J39k73K05j74K63k50K61j44
1334E5R3j57m1K30j42K17j43J0j86R2J35k76K4RQ9J51p4k07K4J91j22n1N7Q1j61
1359a02J99J63j72j17Rq6n2j9J74j54J78k2J52qj59p4J32M8k8k24J27M6l9k57
1383b85K49R3j15j01J05J51n5K25j82j36K28m8K6p1k77K44J45j51O2j45k57K08
$$ plain form
1218 -247 -79 187 98 174 131 -233 148 -154 39 154 -6 -73 -211 51 -70 -62 -117 208 75 14 -59 -77 3 27
1242 27 18 -181 44 0 17 -31 -50 221 -39 85 164 194 159 1 -115 109 152 11 189 -9 371 -334 -32 73
1266 73 -27 235 -60 158 -164 22 156 107 202 -28 -233 -61 80 -212 -82 309 23 162 95 -124 -79 -240
1288 -240 210 270 -15 -73 180 -131 -14 -299 -101 -40 32 -74 -175 -56 -147 -68 6 -179 -125 36 54 37 -131
1311 -131 -117 45 77 7 97 115 55 14 -151 163 -17 -81 -106 168 28 167 -106 99 -75 188 -62 199 55
1334 55 148 -9 -50 180 38 255 112 122 -64 28 163 -113 -89 -80 9 160 86 -121 -97 94 -28 -79 -22 59 -102
1359 -102 97 260 88 -29 -20 -106 -158 -177 -3 -157 21 -1 151 143 -16 -90 42 90 62 -162 -35 11 -28 -285
1383 -285 -36 57 -58 -159 -54 97 42 267 85 -51 177 129 155 84 -193 51 196 45 107 -38 -295 -87
1405h7j3Q5%J4J11K5l20N0M17j91k8l6k0k3J09j74m4J07K90k40j46p1J18k4L10
1430B19j67J39j4k73K58l32J24P6j09J37k97L19N5j67k56L32k4J56l27K11m4J38
1452A54p6j81J22j04Jr6K28j54j20M3K17R8j96J18j86K93p2k76K32L6k37L2O0
1475f4j41J16k5R4J18P9k75P5J65j29j10L7J86j92N7q9J05j32M9J68j54k5q2K8
1499a41j30K05J36P8L2l03L59k66J11J1Jn9J82j46J7l32J10M0R5jj71P2J39L4
1523G3j9j07J45m86O08l76K13N8L0o9R0k85L53l32K3j1K2m9R0J7j44r8K41m2K51
1548A96j23j21n5L26j66j97N6L0qP0n3L0j1N9J79k02j5J61o5j32J34j48J27n5
1572A7J85o0k15j34J24rJ84j25M0R7j28j30m3K86j40p8%J37Q3P9q9QR2j72k41
$$ plain form
1405 -87 -100 -15 -15 -1 110 135 -185 -135 282 91 63 27 7 -16 93 -81 -125 -18 272 32 -114 -185 -67 -91 219
1430 219 52 191 177 -96 162 -170 -46 30 -79 58 -239 80 135 -32 -288 44 20 176 -151 60 16 154
1452 154 78 -103 19 -85 -84 -180 48 -106 -226 -183 34 132 -64 54 -132 161 89 -187 45 81 -156 -124 -64
1475 -64 -205 -89 -114 -20 98 177 -98 -23 142 13 -97 -60 126 -66 -9 -98 7 -125 -76 92 -62 -87 -169 -141
1499 -141 -271 -66 70 148 180 -123 236 -30 81 92 93 34 216 70 87 -245 -135 -95 0 -1 -172 -100 39 73
1523 73 54 -53 92 -394 214 -162 51 109 139 70 160 -125 228 -104 -81 -92 -70 -119 -29 -12 -156 -254 -13 -55 196
1548 196 73 -48 -103 223 57 -140 -84 -54 -62 8 -45 -15 -26 33 212 10 -5 156 91 -41 93 -55 72 17
1572 17 202 142 -73 -207 -83 -92 92 -33 7 104 -24 -154 -197 89 -51 -129 -129 8 91 170 81 89 181 9 -232
1597b32K89l05K35J24j68n9J83q5n3K0L23k54n8J3k14K62J5j36j7J89j47l6j06
1620b17K20o1J55q0o3J46j87M9K11j87l4KM0K98j67K71k79j2l2k52R7J8J33RK40
1645C18n38K03j92K0J70J30j47k10N6K37r3j08J60q0J59J72m24N86n52K30j16
1666a9l0J0j17J69k83L70j33M21l83o2Q1J37l22K50j36J12l15K29J70k20j0J58
1688G7P1m11L30%J66l95n5K13L2j2L32m12J45p5K3N0j92M22k50j31J0QJ03l0j0
1713IK63k23l2K10m10j70N10j93K19K2l44J36k58J76J29K1K09J2k14j60m8m9J13
1736g2l4m1J76J19N4j62J7j22N7K6J02l37K14J5O1j32p9j66L80M6k31K5J97j52
1760c9P4n4J95J0k77K06n0l3m8j69J63J16J1m5l10J52LL8j97K40j7J29j07n2r5
$$ plain form
1597 -232 57 -248 -13 111 -57 -116 67 -18 -71 -51 272 18 -40 -27 -241 21 36 -100 -117 72 -75 -111 -217
1620 -217 3 -58 97 17 -46 100 -87 -38 173 -14 -48 -46 -6 292 125 396 117 105 73 -179 -82 -64 69 78 318
1645 318 -220 -17 -209 -189 -19 111 -36 -246 -190 47 -46 -154 6 -74 85 257 -167 419 -133 97 -19
1666 -19 -49 -39 -156 13 -270 100 -33 388 5 -57 24 161 -161 89 -47 65 -250 -21 149 -71 -81 77
1688 77 148 -263 67 67 233 -162 -217 -4 28 16 348 -64 81 6 29 79 -113 309 59 -72 -62 -54 49 19 9
1713 9 272 49 17 227 -183 -353 157 -36 183 205 -139 -3 -261 -85 44 65 274 286 72 -88 -136 -185 -72
1736 -72 -106 -147 29 148 202 40 57 -65 -8 18 120 -217 -3 12 73 -59 -138 -304 76 122 -109 -84 113 -39
1760 -39 35 -19 176 186 -91 115 65 32 -16 -185 -22 94 105 60 -250 -98 -95 -57 -254 -14 -31 98 -9 -61 -156
1785a56LJ25K01L4m0k81J06J33l03L11r5L3o7k48L18k62K51j20M93m17J22k20
1807g9K83k54J87k19n0L8o2K53M7k04J53M7j88q5L52k4j90J73n9Kl59L24q3K4
1831B7J2J42qk73J32m4n7J07J04l71J36K36q6P4k37J26m8Q5j06J4P5J56q1k80
1855a65Q3Q4K48j58j26j81M00k11j65J46J90k13l5M3m1M4J24P4N4k72K93l56J00
1878d0K32k50Jj85K92j98M46k39k45K86p2o4J72l0J15k12J15j35J94j83o3J03
1900D0q1m9K53Q7k99J73k32J22q5j04K20j86N5o4P1K03K6j21j4j47o2M2o7K12
1924gKN8R1M8r8Mj92j7R4R0P0j85P9j64K64j64j40K25l17K36p2K39L1j70j11K13
1950A07j22O5J05k51J80K2P9j41J09j43n0P9j1j20j67K46L26l04j6o0o1J73k1
$$ plain form
1785 -156 -153 -28 173 207 167 -114 -8 125 -178 133 38 71 4 -244 74 -188 63 -57 436 19 141 -79
1807 -79 204 -50 137 -82 -132 -94 -156 97 144 -60 93 140 -48 -133 219 195 5 178 119 121 -238 86 3 27
1831 27 39 181 173 -100 32 -12 -69 38 142 -229 -93 143 57 131 -106 20 -28 57 -49 -35 40 196 115 -165
1855 -165 -82 2 250 92 -34 -215 185 -26 -191 -45 145 -68 -103 -60 -101 -57 67 141 195 -77 216 -140 -40
1878 -40 192 -58 -57 -242 50 -148 298 59 -186 100 28 -36 136 106 221 9 124 -11 183 0 -63 40
1900 40 -41 -90 163 250 -49 124 -108 14 -71 -175 45 -141 -86 -150 -79 124 150 29 15 -132 -194 -152 -219 -7
1924 -7 -5 53 144 192 94 98 -94 -111 -17 73 143 -42 37 -127 137 -27 -167 58 -259 -23 -95 144 175 5 -106 107
1950 107 -15 50 155 -96 84 106 185 44 153 10 -40 39 28 -92 -259 -13 313 9 -7 -67 -128 45 24
1973B4j8O2m5j05J03l1K42nl98J05J56Ml2o7k2J4k27L43Q9j17j28J53r3j13K06
1998A00k72K19R9k45K10p4k06L56j83j7J83k30J01q1l05K65q0j67N11j77J16k66
2020a43P3J91j88J27L6K8o2j02p5L88k57j46J44j85LJ16J62j10J77k20mrp3J63
2044C4j9j4k5l9J51m2q3K47j50j49K03n6q6K3j8k79L94j50j61J54P8J48k40JJ98
2069A20J37k64J68l20J75K3j08J16J12p3j85K09J15m06M90m03O3p1J76k47J70
2090cK58k22r9O3J32r4l6N6n3N8j93J19j70K30N0k35J10l5O7j54K61j78J07o1
2114b2j01K86k41p6J9o7K74l73L92L2k07j41L07J98k29o9J14J36m29L3K40k74
2136a98j7J68M8k8p5J62k08l4J83J26k66J78Q3j80j62L65o5j44K80%k45J02j42
$$ plain form
1973 24 6 68 23 -82 21 -10 232 227 -171 -66 90 94 62 -5 -27 -13 -240 103 192 75 -53 100 7 -106 100
1998 100 -172 47 146 -99 111 37 -169 187 4 -13 170 -60 41 -40 -345 -80 -160 -327 184 7 123 -143
2020 -143 -70 121 -67 60 96 124 62 -40 -115 273 16 -130 14 -171 -168 -52 110 0 177 -43 -47 -56 -129 34
2044 34 15 1 -24 -63 88 46 -37 210 60 -89 114 58 -28 -5 -23 -302 92 -58 -219 -65 13 161 -79 -78 120
2069 120 257 -7 161 -159 16 39 -69 47 159 86 -99 110 225 -181 309 -94 -31 -102 74 -173 -3
2090 -3 255 33 -66 -3 129 35 -1 55 2 60 -133 -14 -184 46 96 -139 -29 -64 3 -151 110 -68 39 -22
2114 -22 -123 163 -78 -154 -135 -202 72 -301 91 123 -84 -225 82 280 51 -18 96 232 -197 -164 76 -198
2136 -198 -215 -47 1 -27 -102 60 -148 -182 1 127 -139 39 122 -58 -220 145 80 -64 216 216 -29 73 -69
2159f9K3M2R6k65J55k10K04J33p4J85j75m8j46L25k08J64pQ8j64J06j50j20J33
2182A8J57r9k00k5K16m85L80K04k41N6r6M5l8N52m27J57k90K92k40M6J83l51R1
2205i5oL35j62j20j06J89K12k85RR4l0J43l01k4L28j04J02k37j76L59l67K59K50
2228B67l10K70l31J62j25K1j97L87j76j45K37j13J63j80P7L4Q3J7k10o0NP5q4
2251a33K52l36Q7K05%n0J25o7Q9p3M0k64J59Jj58J10j32L12q2K2k89J38j49K68
2275G5k34R7L38k86J0q8k7J18J01n8L9l9J89o3k05K19j78J94l00o5Q9J00n9N2
2299A9M6n1Np0J58N1j08J03j91k08J28M5M6J03k17L77l68J63j5j99J47k3J33j66
2323i2K7j03M4J59J15j09j51K02L1l95J31J43L9k83L37o0P4j35n0j27K04J51k04
$$ plain form
2159 -69 -46 -4 92 -173 -18 -228 -24 109 35 220 45 -3 -149 176 -32 132 125 213 49 155 5 -115 18
2182 18 175 76 -124 -149 67 -418 -38 166 -75 -19 -115 -70 -108 444 17 174 -116 176 -64 -18 165 -186 -95
2205 -95 -101 234 72 -48 -154 35 247 -38 -29 65 35 178 -123 -147 181 77 179 -58 -234 125 -242 17 267
2228 267 -43 227 -104 58 -67 -46 -243 144 -32 -177 60 -53 110 -70 7 41 124 141 -69 -129 -124 -49 -133
2251 -133 119 -217 -130 75 75 25 150 83 172 99 139 -125 34 35 -123 -13 -145 167 85 107 -182 -44 -193 75
2275 75 -159 -62 276 -10 0 -88 -115 3 104 46 85 46 235 172 -33 186 8 202 -98 -163 -74 26 -33 19
2299 19 65 14 19 -51 107 158 50 153 -38 -246 -118 -73 -27 76 -141 236 -132 31 16 -183 -36 -59 74 -92
2323 -92 -65 -168 -124 35 150 41 -110 92 123 -272 -141 2 41 -242 95 35 109 -26 -76 -203 1 152 -52
2346e2J93j67n9N7M6J60q2n8K7j80M1L05l21J99k28P2K5Q9p3P4j98O2J55J03m01
2371b11M31j21j00N1n3K26n41J97j04J26J63k0k4J05k70O6J48p8o8q4J1P5j13
2394a88N1j08K66J69j9j70p2k91K74QN1J47k34J89J89l25L3N4J02l77Q8K4K90
2417A51Q0l20K31l76K51m7O8L6R3o3j0k00l39N97j78L1m0j2l9K92j87l8N0j87
2441a56J7P3K79k96K08p3J6r7np1K07l49L20K2j46J80k31j8O7n3J30o2J01k65
2465b02J25K52j3j56Q9j37lj78L98j82R1j41N8j99L78n1l9K6k31K26K7k86Q7K41
2489A80l29K62k30K34k12K98m58J70k11K51O5J7j74M71k32j94L24m51M29r1j77
2510e8R3l9M8k26r3J77J5J59k29K30l66J87L31j3o6l0j48J04k42N8J89J2k07J94
$$ plain form
2346 -52 141 -26 -85 -28 18 178 96 38 65 -115 -74 231 -90 109 -119 -47 -22 67 -6 68 -130 -68 87 190 -211
2371 -211 220 99 -1 50 -3 223 -318 -121 -225 -99 64 44 20 125 -145 -79 69 -9 -77 -161 -150 -75 -188
2394 -188 -137 -245 21 190 171 1 -71 -362 -88 -80 -29 118 -116 73 262 -63 -30 24 126 -251 -163 -139 151
2417 151 231 -89 142 -234 17 -30 38 74 167 104 94 -106 -445 152 -26 5 -35 -47 -86 206 19 -19 31 -156
2441 -156 -139 -66 213 -83 125 52 68 -29 -34 -105 102 -247 73 95 -51 129 -102 -120 -53 -106 24 -38 63 -202
2465 -202 -77 175 162 6 95 -42 -45 -223 175 -7 84 -57 1 -198 180 129 90 116 -115 111 138 -148 -61 180
2489 180 -149 113 -117 117 -95 203 -255 -85 -296 -45 20 37 -137 334 102 -92 232 -219 210 119 -58
2510 -58 35 -4 44 -182 -275 -98 -83 76 -153 77 -289 -102 229 216 150 120 -28 76 -166 -108 81 93 -114 80
2534H0M4j95L99o66N72k46o4K37j05lL6M2q2k28K05j25P4o6q3K94jo9m3oR0k5
2560F6m4n0k7J99j80J69j50J73m08J82Kj46L50j44R7q2k72K98k69J71O4n2K49
2583A96m29L71m3o4J85j72J19k13Q7J26k55J4L77k53J83k79l8J49j65l8K52Rk70
2606a51K96m4M0k32J25K5o8k17K66q5l4j02K11J48k45L20j86K9L15n18kJ27r8
2629h0j48J98K6j30o9J10K44J27m44K04n4M2j9K2J31k83K42l14R5m6J35k89K16
2652h4K92k89N2j33K1J31q3K74j56n1j36L8q0O9J15j01J35k39K37k35M01j87k17
2675b26N7L11l31K92j32J1L5k00p8K77K44n23K96k7J0k23J95j61J12j20N4K67
2697A40k12N3J5K5J15n2k11L79l30m5J85o4j81L49j42j05O1L4K0k87K73O7p2j4
$$ plain form
2534 80 124 -71 328 -338 234 -12 -76 161 56 53 89 131 49 -179 26 -99 -25 -91 -174 120 119 50 7 1 91 66
2560 66 22 -28 -55 144 -36 133 -17 156 -252 -70 -68 -214 136 -8 89 7 -265 33 -236 -65 -1 -53 196
2583 196 -233 138 95 31 216 44 163 -50 37 163 -92 -78 299 46 229 -50 -88 61 -104 -142 110 119 -151
2606 -151 145 101 141 -91 34 59 -9 -226 40 -45 -79 -181 30 178 -67 253 67 96 411 -107 -109 18 -80
2629 -80 -228 -30 -4 -134 -203 -93 151 278 -166 38 -16 26 7 29 160 -123 119 -195 -100 -146 -11 -300 -84
2652 -84 208 -81 -29 -162 -141 -10 -93 181 25 -26 -162 -124 -204 -135 -20 -121 14 -225 12 -223 178 -9 -226
2675 -226 -169 142 -189 103 -29 -18 17 -183 -261 16 260 -263 33 6 16 -207 -12 -173 -61 -181 -127 140
2697 140 -72 -19 -4 21 136 84 -127 252 -78 -123 62 -2 -183 166 24 -81 -20 14 34 -253 20 87 15 1
2721Ak62L07j0j84M83m06J89k39J11L63n48J77N6J13J35j93j20J17L9o6K56l91
2743g2K9J76j63j77K74N6j34R5j05j10JR8j1P7j28J87n8k6L1N1J48m39J39mo1
2768a26R3l0P1pj27K2L50j44j68J61k18J24q1J4r1J18N5k10K38l67K52K87j40
2791G6n0k4j26J70jJ77j68K0j39l8PJ71n5N7j46K08j72Q0j78q5L18J59k78J45
2815A28m7jm6j84J92l2J38l31J78j4K40k50p3M6K83J2j97M0M3k6K04l28P9k9o6
2840d1J09j2J15k02K94m40L36j98Q3m0P9K82l22q8o6J12j28L11m56J98J29J06
2862A61j46J1r6R8J0j1l9Q5K17n10J51J29J35j03l4P4j92k57M47j46j63n9M41
2885B03j81k5N8j32j15M19m51J32L01k30j08J0K26m4j63K29k16R0J38k32J98q5
$$ plain form
2721 1 -261 46 36 -148 335 -71 118 -121 -10 353 -195 -18 38 151 286 93 -27 90 129 63 319 -72
2743 -72 -43 133 -30 -207 67 123 -11 84 -21 -131 -130 -32 -43 34 -94 93 35 9 40 91 239 -200 -61 -65 -126
2768 -126 -33 -63 8 1 -126 -104 246 102 -66 95 -123 1 -80 -66 -157 -39 16 -194 44 -323 -71 216 76
2791 76 26 2 -124 46 45 222 54 74 -65 -103 -96 75 20 77 -69 139 -33 47 -131 -216 102 261 -17 128
2815 128 81 80 34 -150 42 10 148 -183 -5 -19 221 -29 -102 -56 227 239 42 82 125 99 303 -25 54 25 -41
2840 -41 68 56 171 -31 263 -177 159 -39 44 4 83 365 43 -45 -111 1 -127 184 -272 -74 55 161
2862 161 15 26 -70 28 38 27 -12 73 290 -220 -69 60 195 92 58 132 -60 -317 130 -16 -179 -238 203
2885 203 22 -3 55 -77 -192 227 -224 -92 209 -21 -129 -119 107 63 -100 129 -87 3 141 -91 107 22
2907B2l41K77M7p1L7J22j22J82k35r2J06J55N9j49p3J2j02L52k58J29m26M09q0
2930d0J99o5k35J99j00k9k07L38j50L1J22k83R0J89q1J2m0L39l02J30m7k76L44
2953A38k9k04P9m9p8J94J51k25q1K93q6k51n2L03j12q4j97M65q5m1l6L83q2l83
2977f9oKK02j53k2p1J6l9L49l41K15j13J6Q1L5M1j37L3K5k81J20k9M7n3L20j00
3003H8k8o4J94k83J7J43q5o9RK08p8k74L50m33K71k0J06Q7l12L20j05rJ98j43
3027H8r7K55l23N6J60J23k76M4q1J08k10l7J31K52k08l7j3q3K23j53N7K56m33
3050a98L19l35K45j16J48j00j28L07l13K13Po6k7Q8j86K58P1k59n4J32K69m81
3072b06L59l23n8J28L3k3J29p0J55j0l41L81j81QK02j84j60M10M9l31N5k3K03
$$ plain form
2907 22 -319 -42 5 -66 -29 93 -29 153 -82 -174 -68 87 146 -3 -76 -64 -166 186 -72 57 -369 40 -40
2930 -40 159 94 -141 58 -42 -71 -278 60 -90 -59 63 -220 -130 59 -22 -10 -50 289 -13 117 70 -206 138
2953 138 109 -95 -16 -65 -143 51 202 -23 -104 189 103 -148 -200 103 -9 -93 -290 175 90 49 13 396 314 -69
2977 -69 -75 -73 129 -24 -46 -117 -101 -140 209 -132 83 -30 -14 67 102 143 6 39 64 -217 -97 -126 -79 -132 188 88
3003 88 60 -4 190 -93 -76 67 -18 -87 -78 130 52 -222 128 -305 -34 -54 52 139 -173 147 42 33 231 88
3027 88 -9 246 -77 -21 139 262 -14 30 -51 57 -153 -190 -59 193 -15 -52 -65 -148 75 -78 -21 235 -198
3050 -198 121 -214 31 -85 63 -37 -165 142 -171 42 49 -17 -44 44 -142 116 187 -72 -126 6 275 -206
3072 -206 153 -170 -228 -100 -67 -90 39 -31 124 114 -227 154 -27 -19 183 -1 -161 249 298 -33 22 -1 202
3095B02k03J65q1K12k94j15J50N5O4j21j64J31o1N8j18J26O0Ro9O8j24M6K58l01
3119d7J11m1n3r2J15m9N8k8j73J27K5r6P0J83M3k95J93j97K07k05Q7q2j6N28k82
3144I1r3j45L08k18J73j57j67L91j40N9j24L06l70J30k01K51j01o9J11l0j47K9
3166a13k9j02K78p7n9MK07k34R2M3k21q8O04n12K54k44K64L7j88J39k68J40L6
3189c7M1O8k15O1K48k34j26J91j59q3J94PK31j02K7n1j88J09Rl26N37k77J12J79
3213B16m5j41r6J77J10M1k83J05M3n8N1k91L86m5J6J2m12K15j88PL42k25k25L56
3237F8o0q1R0k28L96j45j02K0J88Q9k74K97m82K58K05l17n3J37j59O4J87j57O1
3260Bk8pL3j99K17n1j95l2L01n9MJ28j53J66k59k3K22P6j90L05j98r1j91J29J96
$$ plain form
3095 202 -1 164 83 295 1 -114 36 91 155 34 -130 1 -60 -2 -120 6 66 75 6 74 -50 -4 254 -47
3119 -47 64 23 -30 -122 -7 -56 2 -26 -199 -72 -47 -143 -73 110 153 -142 51 -146 61 -144 -57 -139 -155 373 91
3144 91 -2 -147 161 -57 116 -41 -208 183 43 102 -22 284 -86 44 -157 94 -7 -76 35 5 -142 -113
3166 -113 -142 -244 34 -43 -102 -98 109 -125 -33 10 -211 -299 305 -207 47 -197 67 104 -84 55 -213 -73 -37
3189 -37 4 72 -143 -82 166 -68 -194 -3 -162 -245 -51 -44 187 85 112 61 -127 -18 -9 -335 202 -75 37 216
3213 216 171 30 -66 111 221 262 -21 84 127 69 120 -171 215 170 186 198 -214 1 -187 -180 162 -63 -288 68
3237 68 8 -73 17 -211 185 40 -62 -42 146 235 -39 258 -224 34 239 -78 -131 6 -153 -89 98 -59 2
3260 2 -26 -33 0 -199 18 -33 -228 -260 41 -18 -14 114 -39 127 -132 -155 67 143 -47 258 60 -31 -222 -93 103
3285A03lj38j8J6R3j72J42kL5k12K87J4j51l8k1r5J46p8j3J43J40p9r9R5N1k04
3311e8J76q8R3k22J75pj22r1J59j11P3n8R7j3J08j63L2J45M6k92J12K43k45j64
3335a75K53J0k1j19j23Q7k1J31N4k84K62L9k1k50J22o7K10j3Q9l8O2k18J72o2
3359G9j10J33k2k85J82k48L08j8j2P4KK30k51L5k54j3L81n09L39M8j86J16n6J34
3383I7j18N9J67l66J03j00M6P1K0o2m9K67N0q7J12l02K99j63pk4r2J3J77kj14
3408ek61J48J96n1R4J12l38k6L40j23r9j75j09L85j06K78k75lo3j7M0J69k10k
3432a01rn6R8M5K8MK0p7mR2k24K08J48k30J32l7R9k04j05K47p1j02J50q6M8k9
3458a6j80K35m35M65P7O4j31m9l0j48J87n4j01L9L98k79k98K09J17j64L1O2J87
$$ plain form
3285 103 100 -38 -56 -40 53 -119 23 21 56 -156 131 145 -6 -44 -65 -160 -14 -92 -105 38 178 99 0 95 146 -58
3311 -58 118 30 123 -99 76 69 -53 -144 15 -96 -23 -81 16 3 111 -52 -20 125 171 -121 -9 234 -11 -175
3335 -175 78 88 67 -52 -175 -88 -109 22 76 -208 54 93 72 -178 -56 -123 87 74 163 125 187 -31 141 79
3359 79 -31 102 80 -205 -23 -271 37 19 7 81 83 313 62 97 -157 -170 211 -298 41 89 -97 19 -37 97
3383 97 -21 38 205 -161 -58 -158 -112 -41 -21 -83 -132 135 185 98 210 -92 207 44 37 13 -79 -66 111 109 -5
3408 -5 -266 -118 78 27 121 233 -105 -131 209 86 -13 -188 -297 88 -18 260 -15 -18 -81 -98 -58 111 -99 -101
3432 -101 -110 -166 -68 -23 5 9 29 -48 -52 40 -184 24 172 -58 74 37 136 -68 -173 74 3 -99 51 -35 13 -16
3458 -16 -196 39 -396 69 146 210 79 30 0 -148 39 -15 -116 -77 321 42 -256 -47 70 -94 -63 -1 186
3481A86k18J39m46L53j14L66m51L49l32R8k3jl3J49N5L5n7J82j14o0J15k31j53
3504b06J73R8r3J39pj05j90L1J76R1k36J85Q5rk89K16j17J34jk90L30j06k70K40
3528b1m1N8J2j59M37m85J1J75M0j64J41j58J86l9L49o13L48k21Q6n4Q9K0l58M21
3552F0j52K92l56M01l22P4P7j13j50K7J02K14l09J86J85k36J71l74J22r9R7M8
3574e5J25Q7J22l27N6n0J23k02K77l58J09K11Kjj4Nj41j33J65O8J01j44k27J53
3598d8L0R0K46j47K9j53J29R5k14P7k88J22q6K31n1J04k73J75Rj58N0jK05k53
3622h0o3K60j23J09m87L41q1K37j45J66p6j61K76n36L63R3q7l6P7J00j78J4k3
3645d0k8O9Kj61M7K05j07n8N4m8o1J31K38m8M1L7j80Q0j20j20O3J33J08J8k74
$$ plain form
3481 186 -32 107 -339 14 -100 266 -185 164 -168 -70 -93 -94 -127 22 77 112 55 237 123 63 178 -53 -206
3504 -206 -33 65 -28 111 104 -1 -191 -160 16 107 -129 56 141 132 -157 59 -58 76 75 -215 115 9 -261 -21
3528 -21 -62 -4 8 -151 286 -199 -188 -13 27 -137 4 -154 32 -7 342 -271 77 -144 -58 -112 -23 -3 -361 60
3552 60 -92 200 -156 245 -77 -3 74 -39 -189 -162 -60 154 -155 31 216 -20 151 -223 -101 -200 -103 -55
3574 -55 70 157 279 -48 8 -42 81 -121 156 -202 -93 118 120 119 105 110 -31 -164 1 69 170 26 -201 -48
3598 -48 -18 72 318 171 200 47 176 271 57 134 -154 -32 -118 113 62 166 -107 68 77 -81 -31 -32 173 -80
3622 -80 -143 117 -6 103 -384 -43 -124 113 -32 134 58 -103 173 -363 0 93 6 -30 47 147 -31 -17 -40
3645 -40 -68 1 3 -158 -111 94 -13 -71 -17 -65 -126 5 243 195 236 273 93 173 53 -67 -4 129 237 255 -19
3670a9M9J84k82K15j97j0k12L99l8j39K1o3M7K1J93l9N7j09j83n3L24k37P1R4
3694I4j60O6j4l3k7j1P6K05k36j09K10k43K59j58R0j02K50k6l33J40mK25j04L2
3718H7j26n8j8J98o0j07K75j27k89J06j77L27l5P5k01P7J47l0j37J45k63N2J38
3741am7J03j30J29K07k73J4M19l76l6J37k83m8L06J5J94m42J88n5m8j53J54J14
3764H8m0L2k08K74o7L8roj65j5N5o7J38k05K18j89N5J73L4j77J95l2j46J40j90
3789g6J21n5j98K90j98K46l32J88L45m57o8L10J73m45J20j04J75J29l83J77K04
3810A62j64J17J9p1n0k68L03k3k8k6j7l2J68k70r5L51QOn7j61K11j10J9L6j13
3835h5J96k29J11R6P1j94j45J40O8r2J09l8K1R0o1O9J0RP3k22J2K92l65J11J20
$$ plain form
3670 -19 30 214 -68 147 -50 -60 -272 127 89 -50 -29 -92 -45 -24 169 130 187 78 -105 -158 166 -71 0 94
3694 94 -66 0 -14 -47 -74 -85 -9 196 -40 -149 61 -182 77 -81 9 -93 157 131 -202 -62 -66 159 55 87
3718 87 -39 -97 -115 83 23 -84 191 64 -225 -119 -296 31 -4 71 -130 -53 94 64 -73 72 -191 -139 -1
3741 -1 -48 55 -75 54 261 -12 2 421 45 9 146 -137 -185 121 136 330 -112 76 21 -27 -180 -26 88
3764 88 48 80 -128 146 79 117 108 102 -63 -78 -23 -90 48 -157 61 -128 -73 100 134 -43 152 120 -26 114 -76
3789 -76 45 -10 -208 82 -116 130 -202 -14 331 -126 -194 116 289 -156 -36 -140 35 164 -219 -42 162
3810 162 -2 115 134 63 13 -255 48 25 -3 -29 -46 -78 90 -180 -275 76 84 90 33 -128 83 -27 -8 28 -85
3835 -85 111 -118 -7 89 160 -34 -179 -39 29 -63 46 8 29 119 58 127 137 146 219 -3 9 301 -64 47 167
3860A67j96P1j44K13n3j78r7K18k95J37P6q2L65l17M80j83k88J88M4j03Q9l27
3882b15L17K07l45k2K51K1k23K61j32K7k92j34K87K34m95L12L4k09J70p8r0K02
3904H8j57K21j9k83K72j8l2j98k6J49k29L47o7j98l6JK66k53K67j44K31k68K47
3927A61q8R1k17J72n9n6j06j03M91l34J86j97K27k32J52j6k16J50j20K4M4M4r4
3950i6J77j71K9m2J94J39l62K40R4l31L43j74k9R5j69J8J8O4K36l49PL0J69l41
3974b11L3P3L4l1o2L08P2j93k2k17K6K61J3j10j30K18j56L4J05k9q8K48k27j39
3998a90R9K02j53P6j06L8o6K47j90k50J39K56j34J25j44k32L32O9j65P5m4r9k7
4021a42K53J25k39k90J18K61j95k7K65%j32j85M12p4l01N9L9K41k58K45j51j37
$$ plain form
3860 167 -29 42 -102 111 58 -120 -217 1 -294 -157 -81 -163 202 -115 365 182 -106 82 126 23 112 -215
3882 -215 102 309 -36 -58 193 214 -9 252 120 147 -145 -279 8 242 -253 59 93 -116 54 -24 -114 88
3904 88 -69 152 133 -150 122 104 72 -126 -152 -3 -232 115 48 -150 -186 -185 81 -172 95 -49 182 -86 161
3927 161 73 164 -53 119 60 4 -102 -205 286 -48 138 -59 168 -64 88 72 -144 6 -114 -90 -46 -2 -96
3950 -96 81 -90 -61 -103 91 230 -132 108 202 -129 214 40 11 106 -63 -45 -27 37 273 -76 -69 -39 130 -211
3974 -211 -178 -105 -71 -102 -164 144 216 23 1 -216 -190 71 84 -26 -156 62 -94 -60 45 16 -72 176 -51 -190
3998 -190 -91 111 -42 34 -72 -34 -100 147 -43 -293 -154 102 -32 93 -51 -283 49 118 -47 28 -16 -115 -142
4021 -142 111 236 -3 -293 -175 86 -109 -136 129 129 -3 -188 224 150 -151 -92 -53 188 -70 175 24 -113
4043a13L99m30J59k10K27L52l54k32NK41j1J01j14M0j00J6J6r2J60J5r4L04k85
4066@K23j81p4rrkK12j55O0J07k10K9K70k83J3n1K00km08M62m03L31P7k05k87
4091b95L08j75J68L8p1Q0j44K97j86J45j86o8m8J87l6j1KQj5r1R4Q9p3k4J4j4
4117gk2J30q2M3K0n6l4J59l11K12M1j84p8J0K61ok14j2K55j32R4m4j49J15Ln2
4143d0j33K94j9j59Q2j47O5K68k93O2r8j98J67P3L44k05j90J11k7Rk0m2J48O1
4167A13n2q5J36k17j65J32L82l39R7O2O1j58K25l54P5K12k18R0M5j49p5K67M3
4190A28j57P0K42m08J50n7l1j07K36L3k96L00k06R2OK2q6L14o6j85L1k3J22k18
4214i4K2m6L50k18k8j19J24O5j65O5j9J54r8J16q7j8O8r6k1O5J6j07q4J10P6r9
$$ plain form
4043 -113 286 -144 15 -195 32 384 30 -202 -197 44 33 134 20 60 -40 -24 -8 -100 60 75 -19 285 0
4066 0 223 42 -32 -41 -50 -52 160 5 65 172 -38 -9 261 -22 -9 -60 140 138 -270 192 -211 120 197 -8 -295
4091 -295 13 -162 6 44 -27 53 -91 206 20 165 -21 -89 -137 50 14 3 5 13 -2 -93 1 90 17 -7 7 -7
4117 -7 -29 101 19 62 82 26 -8 151 -160 52 93 -91 -169 -159 102 96 -118 -130 125 -7 87 43 -106 9 12 -40
4143 -40 -173 121 102 -57 25 -122 -57 211 -82 -20 -118 -316 -149 -76 268 63 -127 -16 -43 -34 -54 -96 52 113
4167 113 61 -24 112 -105 -270 -138 244 -95 2 64 125 -33 192 -162 -87 125 -93 -3 42 -107 -182 85 128
4190 128 -29 41 283 -125 25 -32 -63 -170 66 99 -197 103 -103 -11 -5 17 -69 245 179 -6 25 2 124 -94
4214 -94 -72 -118 232 14 -14 -133 -9 56 -109 -44 -63 91 -7 109 22 4 72 -24 -45 20 36 -71 -155 -45 31 -68
4240f8M0j06K44J9j4k43j01K59q9K01l26L56j78J16k29M4K83l76n8J70j55J80
4262c1p1J48K05m35J93J58k36J81j48j51n2L74j21k4L79m34j75L83j41k46Q9m1
4284a96K31p5j31K22j7J19k36k35K92k3Kj42J14Q2L9K8J0j39K09j89o0Q3J4O1
4308F3rR7j10k4o7K43m1l46L18j73J31k19J03k69J43K37j9l98O10k38j39m3r6
4331b46M50k59O2Rn3K49j91J88K08o58O0J50Oj75J40QK98k41q2r0o2K79J7J02
4355A69k43K33o6q4JK5k02J22P4J44k74Qo2M38m67K95k24J57k7o2J25l0m5N8P4
4380A37j85J90l16L71j81p6K71j56j11J63j29j6j56J85L8L1j0J70k03J63O0k87
4402d7J37O4j56P8J27j11k51J13L1k6r8K76l21J03P5p6J90k39K68j67K62k62R9
$$ plain form
4240 -68 -28 -134 110 129 115 -128 -229 30 -59 142 -184 172 -6 110 -119 -75 208 -168 -226 -56 -211 -31
4262 -31 -102 46 251 -184 9 167 -69 112 -36 -187 -239 135 14 -10 369 -65 -240 143 2 -244 -155 -196
4284 -196 35 -40 -171 51 34 153 -83 -318 -26 -49 -47 -189 -75 7 46 74 84 -55 154 -35 -95 -12 2 63
4308 63 54 151 41 17 -50 193 152 -194 124 -49 82 -137 -34 -303 -160 77 58 -340 270 32 -107 -150 -246
4331 -246 204 -55 7 16 -37 212 21 209 417 -241 -181 -31 -25 -200 -60 -52 246 5 -77 -167 -229 50 67 169
4355 169 -74 159 93 9 10 35 -167 -45 29 173 -101 -93 -155 283 -184 111 -113 44 17 -45 80 50 5 63 137
4380 137 -48 142 -174 197 16 -60 211 55 -56 107 -22 -38 -194 -9 29 60 50 220 17 180 240 -47
4402 -47 90 154 -2 76 203 92 -159 -46 -15 -41 -139 137 -184 -81 -6 -82 108 -131 137 -30 232 -30 69
4425F9j4m5P2j32J91J5j80J57j68k3N9K00k68p1L3L37k88o9P3L53l22K1Q9q8q
4450gJ36L0q3j57J09J34k83K06p9J0j67M9k7k3Q6J74j78k49O10k34rMm0J88m40
4475b40l1K55K2q0J27O2l14M11k75J75J2k77L34m4k35M3K01k68O8J58L8l20J55
4498b3J28q0j24P5M8nj50M53l84k51K79J00Q6j12j63J59J0J48k05M5o5J36l20
4521b15J45R0j40K41j19J49k50J78J81m78J13K66k47J53o5J85k41k28J63J98L5
4542A14k36M4J19L5l79K2L21p0K13k02q1P3K21l63K72j46J36j44O7P7j08rk6R4
4566D4q7R5j39Q9k4l9k7P2r6J76n8R5j63R0J06j12j14m7J67r9N3P8M1j01k45L54
4592A09J76k25r1M1p7k1l7K06Jj88L74l72K4L34j42l99K18L0J48j05k7J76k95
$$ plain form
4425 69 55 10 82 -50 141 156 -24 133 -35 -58 1 201 -67 -138 -105 232 -56 -125 -52 301 -21 0 89 1 -7
4450 -7 129 159 76 -81 28 162 -121 85 6 16 -151 -102 -129 -152 -66 108 -70 -319 291 57 48 52 12 200 -240
4475 -240 -271 -16 6 -74 53 115 -199 212 -63 112 124 -153 181 137 -98 -55 146 -122 -54 104 142 -178 -23
4498 -23 105 25 -99 -24 24 19 -131 322 -62 -313 -34 66 152 40 -123 36 46 194 -11 34 -31 105 -215
4521 -215 -70 20 -120 121 2 151 -99 79 260 -218 -105 161 -86 67 2 187 -54 -282 -119 79 114
4542 114 -122 -78 41 76 -303 -281 40 -30 183 -19 -100 -27 194 -169 103 -43 93 -51 16 93 -15 -24 -50 44
4566 44 -43 52 -87 2 -22 -61 -88 -16 -112 64 6 101 -62 28 134 22 -92 -139 28 -71 -18 60 101 0 -245 109
4592 109 285 60 -31 10 -67 -88 -125 81 82 -106 268 -104 -80 254 112 -287 -69 -39 109 4 -23 153 -142
4615a42m5K11J65j09L5j58J48k53L67m67K46r6P8J85j05p8J2p0J3K11j36k84J92
4638h0J29k38K02j82J96Jj01K5P4k36N52J06o37J53J68k31J11k7m0J03J42j74
4660A6J41j64J74k86K77m51K98M5l04L04j67J72k0K3q8J69j56R6m0j94J36j93
4682b12L39p0rkk05N8K10j17mp0J96qj72K4m6J02j20J61Mj30N1J0k2L4k63M28
4708A67k57K2o4k0J89Q6k05J16j37J23K1j36JJ83j41K03N8m51K20k2KK35k15o0
4732h2J23J44l41L07l4j79L19k32j11J18K4r7J17J8j70J7J74k26J32j57J07k0
4754d9J47m25M35%Q3l28R2R7K2k02J17K00K1Kk47K4l7L35k41J5k41J72J27k00
4778h1J71p3j24J51o5k0j16N67j90l33N4K71m2k12j32p2L75P1k00K5l5N8n4R7
$$ plain form
4615 -142 -187 24 189 80 115 -43 105 -148 219 -248 -2 -98 -20 165 60 -18 -6 -76 -63 148 12 -272 -80
4638 -80 49 -189 13 -169 27 28 -73 -48 26 -210 342 448 -189 -36 132 -99 12 -15 -55 48 190 16
4660 16 157 -7 167 -119 158 -293 5 50 -254 50 -117 55 35 58 -30 139 -17 79 39 -155 -19 -212
4682 -212 127 57 48 46 -159 -101 109 -8 -12 -82 114 106 -66 -42 -88 14 -106 55 59 -71 -20 -10 -32 2 -261 167
4708 167 -90 -68 -132 -152 37 123 -82 34 -103 20 41 -95 -94 89 -52 151 209 -242 -22 -44 -42 193 -22 -82
4732 -82 41 185 -156 151 117 -62 257 25 -86 32 56 -41 76 94 -76 -59 115 -111 21 -136 -29 -49
4754 -49 98 -327 108 108 191 -137 -45 52 74 -128 -11 189 210 212 -35 -11 -48 287 46 61 -180 -8 119 -81
4778 -81 90 17 -107 44 -21 -41 -157 410 220 -113 -59 212 170 -42 -174 -246 129 200 0 25 -10 48 -6 91
4802I1l2J6j31j23K10k11L39j34m1r3K12j59K19m6qk18J41J6K4K9O6k40J21J53
4826B01m2k10J02J22k36r9K19j9j0k7R7O8j85k1j78L31l06L58k35r8K6J29n2K5
4850d0J14K15l80j51J97nP5l01J34L1j07J99j83K05QJ96q2j08k5j09O2K77k11
4873A1J67j24jJ57l53P3r7J01J36J00k33J75k56m4M55k76J68j21l1K81m23L13
4895A78l02P2j72R5K20q2J90k19K12k42R2j75k4K17M1k52K50P4l31K13l27K79
4917Gp6k4J40k13K2L86o0j43P4o8Omr0r6K80j90N8O0j09q0J37p0k2J03J8k46Q
4944a92L28m11K48k43N08k29r0QL67k03J81k39O5k43J13lo1Q2K17j06j17j33L46
4967A93k06r8j05J67J06J78k22R9j5l49L04l13K30j66J06n3K40k67K24J82j44
$$ plain form
4802 91 59 75 -56 -179 31 -180 159 25 -16 -109 103 -56 163 117 109 -109 32 48 72 101 167 -73 48 201
4826 201 159 -51 51 173 -63 -162 57 38 28 1 98 166 -19 -40 -218 113 -193 165 -70 -168 -142 -13 -65 -40
4850 -40 74 289 -91 -242 -45 -50 25 -276 -142 -111 -218 -19 -202 3 11 207 125 17 -8 -117 -55 222 11
4873 11 178 54 53 210 -143 -70 -167 -66 70 170 -63 112 -144 -188 267 -9 159 38 7 288 -135 178
4895 178 -124 -52 -224 -129 91 9 199 -20 192 -50 42 -133 -157 60 101 -151 99 173 -158 55 -272 7
4917 7 -69 -93 47 -166 -144 242 182 39 113 45 51 47 -43 -139 141 -49 9 69 -40 -120 17 -53 -75 28 46 -200 -192
4944 -192 136 -275 -27 -270 238 9 -81 -73 294 91 272 33 98 -145 -32 -35 -96 -14 203 97 -20 -153 193
4967 193 -13 -111 -216 -49 57 235 13 112 97 -252 52 -261 -31 -197 -91 -144 96 -171 53 235 91
4988I1l5k66N01m89J02J84l08M20m5k66r4K07j75J38L27j10k67M5J7j26K25k51
5010a75O8Q7j68J95J37J59j52n7l0j40L16k33j60p4K78J18q6J2j59R0j26K91l43
5033a52J46R7j34k1M51l35K8R7k62J34q4k38L85j56m2j9n0o5o6M35m2k03J48k5
5057B7J92k33j6L9k98J44L6j17N98n69L23j31M2j17JnK27n7j93L73m14K28Q7l11
5081a44L40k07n5K43j08p7jM6p3L9k07J06j45L29j75R2j36J92R7j38m8J13k14
5104a31k00L79M6k66K34L2O1k08J32J21l19J32p0K23j56O7o3O2k6j76J55m8O9
5127E0j03J2JJ08q7j11K35Ql02K65p7J33O2l31o5K40q0j57K32l32J97K52k00J29
5151G9j31M3q4K93j05R7l54R6J00k86J92P7q0J04K1k06K63j33k07O1J64j60K13
$$ plain form
4988 91 56 -210 291 -198 -96 88 -220 200 155 -111 -205 2 -173 -35 292 182 -85 -40 -23 -149 76 -175
5010 -175 -107 -20 -188 7 144 303 151 94 64 -76 240 7 -153 -227 51 169 83 95 -64 26 -100 191 -152
5033 -152 -6 91 -43 -64 387 52 80 177 -85 49 -35 -273 112 -44 -86 -105 -155 -220 -286 149 107 -96 52 27
5057 27 219 -14 -30 9 -289 -145 -109 -226 372 -197 126 -5 37 -80 -79 -84 143 86 -107 266 -148 80 167 -144
5081 -144 196 -11 -66 177 69 -8 -9 37 -36 3 -204 -98 -243 86 -89 3 -133 59 156 18 -30 83 -131
5104 -131 -331 48 94 -172 62 94 155 -53 79 200 -119 13 -57 166 10 77 14 76 50 -126 29 -19 50
5127 50 -53 -41 -40 68 -19 -130 105 113 -189 76 -1 132 194 -137 -202 38 -42 -199 33 -299 -102 150 -50 79
5151 79 -52 -9 -93 200 95 192 -162 -66 34 -252 -60 17 -63 41 62 -144 119 -14 -221 -160 4 -156 57
5174E7N5P2J7k86%n9R2J64m6L68m29K85l21MJ05o2j8L9P8mj33O3j51K57j13o2
5200b8J24k37L40j96J53j43j65J13J05K6k00J10O8q8Lm7K08j58J43N2j48p7j79
5223b21K87R3k56K21l24K89J12k23O4K2k40J63r5M48m30j7L76k41p0K4J16L0j01
5246B7ko4MJ71j42k61J34J20J56q9j23L00k53J60j84k78l5M04J45l83K55O7j60
5269c1k21J72R6L4j3K50l50J30J13j65K41j56j72j33J04Q9k1J71l78M02j11R2
5291A43J8k21L7K1K41m20K26k31J51J36o8L6r4k7l7J74M1k8rM8k16K08k23q6K18
5316C8r0K05m51L28j78L15j57j24K82%q3l49R9N2N0j00J25o1N0p1N4O%oJ17O6
5342A17J19k73J37Mj45J50l2o2j07r4L97k64OJ29j63K11k57J5K76K08m75O8m5
$$ plain form
5174 57 112 184 201 -85 -85 -144 -52 112 66 434 5 290 -31 -27 78 16 -2 37 115 111 -22 41 -110 147 34 -28
5200 -28 96 -141 199 3 156 13 -152 -39 66 92 -108 2 70 -18 -15 -62 146 -12 131 183 35 -42 -221
5223 -221 66 159 -97 124 -200 89 201 -22 42 64 -176 -13 -108 340 -90 -107 269 28 -42 -18 98 128 27
5246 27 25 -39 -35 136 -6 -267 -133 -13 143 54 -69 231 -22 138 -46 -324 -359 45 190 -193 62 129 -31
5269 -31 -252 -80 16 50 37 287 -63 67 180 15 256 100 -72 -205 -101 -12 -33 138 -240 162 51 143
5291 143 161 -60 -23 -2 239 -181 45 -186 -35 101 33 69 -25 -52 -89 85 126 98 89 137 -79 129 -94 -180 38
5316 38 -52 153 -298 30 -148 167 10 -114 168 168 85 -264 -165 -113 -63 -163 -38 -99 -49 -120 -66 -60 -60 -66 51 117
5342 117 236 -37 100 104 -41 109 77 15 -92 -186 211 -53 -47 82 -81 130 -127 -112 164 372 -103 -35 -80
5365h0K58k6L3l80N4L5J90j98J20j13J57J72j30q8Q1m8Q0l99K76J47m78K63J27
5388E3j14P6j09J63L6m16R0K92j55K82j57j48L71k85N9j88O5K4M9j10N9n5K36
5411A18p8j49J37o4J00l13K27J40j36L5R2r6J19k45J52j60K07k25J09l3J99j87
5433e1j53M37j81j01J18Nj02K97j60j97R5J24O7l86J09J30R2l1k28l9J85L02o10
5456b78M19m6m4n6J5J42j41q5J47o8j8Q5PK4j41K54j19K6l16M15k05j11rK49m2
5481A04l15Q4L62q6j16k07K99k80J02ppJ15l27L80k04l5M32l03J1o5L9N7RK24
5505B66j10j69P9o4j92J96J98j06j25J32j80N2K49j91k25Q5K21o6j62J71j85L19
5527A93m50J77O8j35Q3k1K23l14M56k07J02k24j45J96j18j15M90o67M48p3l1J01
$$ plain form
5365 -80 178 152 185 -195 -141 -106 84 -114 6 -107 50 222 92 4 85 37 117 -282 -6 141 -337 -74 53
5388 53 -61 15 -94 69 105 -311 -221 71 -84 198 41 -107 264 -21 38 -150 -85 -61 -12 -122 -63 -118 118
5411 118 40 -109 28 -36 64 -249 -22 118 -18 17 109 13 132 -113 39 -121 86 -139 -30 -63 136 -51
5433 -51 -204 233 52 -49 69 74 -28 269 109 -88 7 131 198 -188 -79 51 143 112 -116 -155 30 332 -278
5456 -278 141 95 51 -5 10 152 11 -74 73 5 -13 72 79 103 -38 216 97 123 -193 222 17 -94 -103 146 104
5481 104 -211 -127 235 149 33 -174 125 -155 -53 -60 -67 48 -279 101 -103 -138 294 -9 2 -63 -24 33 42 266
5505 266 156 -13 66 2 -190 6 204 98 -27 105 -75 -23 226 35 -190 -105 116 50 -112 59 -126 193
5527 193 -257 -80 -12 -147 -64 -85 138 -176 280 73 175 -49 -194 2 -116 -231 259 -408 40 -33 -64 37
5549C7L8L0k1O1l48M58m45L29l70K04J57o1Mj25K37j79p6J70K5j36r0k8L08j69
5573A0J18l1N1K1l12j03K58J28l61L07J51l80L9j89L04K34l78K22k53J15j04L15
5595A62j14RL2j2J32l55K20M5j50K05M8k18j54K48j30k4K78k61o7K0O3pk41N26
5619B55m96M64j65k29k40N56p2j50K1J21O3l06J35P0J99l92K99K2j05Mj06K21
5641A69k50J91j37r5J08n1J44j48j42J02j66K31o4J49n2N5m5J86R1k95L7j54M7
5664h9J15J49p8k43J16K98l0l9l80n2L84p6j30k1J75o1j23M3M8Rj11O9K0L0J76
5689A99l09R1J36j06J05j81K9K7J67K1j16J9j65J47L0l09K46j27p3N86n97M22
5711B42n4j00l09qL26J84l9l19J93j19P9j64J26J67k11J41r3R0k03qM20r6m54
$$ plain form
5549 37 75 105 84 145 -203 255 -190 139 -231 -27 130 69 73 -52 185 6 -70 100 125 -11 -101 -129 179 10
5573 10 128 97 148 169 -143 -246 12 140 -221 86 237 -143 -104 -293 11 245 -133 89 -164 -49 -153 162
5595 162 48 57 89 77 209 -146 74 119 -31 174 222 4 -150 98 -32 -56 222 -39 -106 -86 -23 -30 -271 255
5619 255 -241 223 58 -171 -411 145 73 -77 -56 65 128 -178 -43 27 226 -166 133 155 50 54 -52 169
5641 169 -81 110 -27 -122 -14 -65 79 -69 -211 -109 -275 -44 -108 41 -11 44 -1 185 276 -19 18 -136 -89
5664 -89 26 175 97 -146 -30 268 238 199 -181 -233 151 75 -55 -76 99 38 -85 -42 6 15 -96 -27 -7 23 199
5689 199 -110 -19 117 11 116 -65 -36 -9 158 179 63 82 -83 64 94 -215 31 -96 -169 417 -180 242
5711 242 188 88 -221 -229 97 281 242 -77 116 -3 76 -88 38 205 -6 135 42 132 -71 -79 341 245 -209
5734b09L44j06k2J26k36K51k02K18k56q7K17N9k54J33j54K69r4J19J30k40n6L02
5756B52k16J36j39L1Q0M7k56j41J24K20j92K84k56j05K91k97J67J59Rk29J83j37
5778A5J21j03k20L28j28QL6j19K55j67o2Q1J33j38m5J20k03J69L1p3p7NK18j81
5802Dj61j28K75J54k44K21k10Q0k32J27J19j34J86n0N4J33j99q0M7P9K2k45Q2
5825a00r5M7J04K79k98L07j27ok47K5L67m39L06k04J05q6Q5j21k1r0J06K0P0o5
5849g8K00o2L5l4j32J04j3j10M12k38P2%m00K11k20M92l18M3J23j22J9K49k93
5872f0m00M78o1J02l6j0j11Q6q1J17P9j6l10l9o8K60l2J18j10k7K37r5j71K2n3
5897a81J46M8j72K00m1N1k19J94o4l5k25J92J56r1%J98k33r9K65j35j3q6m3L88
$$ plain form
5734 -209 135 29 7 133 -103 148 -54 164 -92 -179 38 97 -157 -24 -178 91 -3 116 246 6 -50 252
5756 252 36 172 33 64 144 191 -65 -206 -82 138 -54 230 -26 -131 160 -137 30 189 198 -31 152 15
5778 15 136 33 -187 141 13 21 57 -62 193 26 -36 45 178 40 -5 115 -88 81 112 39 -38 -33 185 4
5802 4 -157 -285 -10 144 -100 121 -89 -9 -241 -114 5 -129 57 7 61 194 -5 -85 -38 41 63 -182 -100
5825 -100 -195 -148 -44 235 -63 244 117 111 -136 -111 256 -183 123 -81 24 -62 23 -98 -119 -209 -103 -83 -13 -78
5849 -78 122 60 95 61 -71 33 20 -90 322 84 156 156 -244 -33 -253 239 -79 -36 87 -35 -16 233 -60
5872 -60 -460 18 -43 59 23 13 -98 -12 -93 24 103 87 -223 -262 -330 -70 -102 16 -94 -121 116 21 -150 -128 -181
5897 -181 -35 13 -159 41 0 51 -168 26 -38 -73 -298 -106 50 -41 -41 157 -76 -175 90 -45 -58 -144 -187 201
5921B01j85p6P8p5J4J55j08J0o7J50k43Q1l6K28k13k15L71k70P5J42j9O8l1j25
5945i0J54j02K2j37J90j96J59o3J97r3j62N7J1l0K35l35K6J00L55j77k02J74j60
5968f7L2K06l25J63J15l21J99L42m31J82j68n4K47R4j48O8l42R8n7R8P5M1j59
5991a12O5r6J90j43J52Q8j14M8k05J29P3l25M0J15nK63k11K0K36l09O6K41k77
6014g1J6j44K5K87j04Q3j8k02J08Q1j47K07m4l2j55K15k11J00Mj22r0J74Q9Q4
6038A33L6J66k68r9k10J50j87J48j03K98pJ48k05M7l10P1J58j56L18j58k2N8K19
6061B25p7l20J92j61R7O1q3K59l21J90j06Q7j26L35j31j23k03J25K29k03Q5r7
6083f6k03L57n6o8J10P9o6m4M8n1Qk4k1J01k79J58J13j15j01J14L70l99J24j96
$$ plain form
5921 201 16 -60 18 -57 -43 112 4 14 -53 97 -146 -65 -101 127 -86 -301 70 -200 -125 17 -2 66 35 -90
5945 -90 64 -38 -16 -153 37 -159 0 -63 134 41 -121 -64 -53 -83 152 -183 -157 -57 298 121 -81 93 -67
5968 -67 -35 171 -154 9 124 -197 2 344 -87 95 -73 -127 120 214 66 134 -208 -110 -167 -69 6 47 -112
5991 -112 -47 -143 47 -96 56 144 30 78 -127 2 75 -250 -210 -95 -100 163 -48 -28 208 -101 -35 206 -71
6014 -71 -55 -199 -174 113 9 92 74 -128 -20 61 -86 121 77 45 -110 105 -106 -6 -2 -124 -214 -40 49 133
6038 133 169 335 67 -32 -242 -92 -279 -131 -234 64 57 205 0 47 -263 -192 -34 -190 128 -30 -52 6 225
6061 225 148 -172 20 -141 -44 17 -66 193 -128 62 -44 43 -83 252 121 -2 -205 -80 149 -54 31 -66
6083 -66 -269 88 32 -36 74 153 87 43 91 40 48 24 3 104 -175 -17 96 -19 -120 -6 364 -35 89 -107
6107a07L03l27J6K77j24j77j9L05j88J98k06J85p1k1l09K2J22k34R4L74k1J35
6129B27k8k45K20k32K34l29J74q6J03j70J92J7n0J47l46J00j82Q2M05k94O0K15
6151B14k51J96j67P7k5j03q2K80n6j47L77k24K1k30M14k14Q3k08K20m87J93K12
6173I3k12J39j31L2K0J69k84K34j48J00m6m0J74K1O1j51p4J04L4r0k16P1L49j37
6197G2m50N9N13j74mp7p2K98k78K45k92K35j38k2J88J80Ol24M5P3l2L38m43j77
6221b31L72n1k26N7J44j81J76K6j55L4J91k61O6K32l04j3K48r9M5k18o9j8K33
6244bnm3K81k55M3K02l90J77j79L05k20J91p7J17m05J47J47N5j77J01N2Q0j4q4
6268D7k5O3k84J65O5l44M99k44J24j53m7O6K74l13Q5J61j88N9q8R9l9k0R6o1m
$$ plain form
6107 -107 196 -131 -115 162 38 -139 -158 147 -41 157 -49 136 65 44 -265 -243 -121 -355 -261 113 92 227
6129 227 199 -46 174 -58 176 -153 21 -65 38 -132 60 77 27 174 -172 -72 -254 -172 233 -61 -1 214
6151 214 -37 159 -8 69 44 -59 -141 139 83 -64 313 89 110 -120 294 80 163 -45 175 -312 -119 93
6173 93 -119 20 -111 -79 -59 110 -174 60 -88 12 -34 -74 100 121 182 31 -43 61 95 5 -211 -140 209 72
6197 72 -378 -319 194 20 16 -61 -133 165 -113 132 -160 75 -63 -85 103 283 289 -35 10 83 51 389 -54 -231
6221 -231 141 90 -136 -79 65 -116 60 86 -69 -35 156 -105 -39 193 -111 -124 124 25 70 -148 -217 -235 -2
6244 -2 -7 -50 231 -24 19 221 -169 8 -171 134 -86 105 28 145 -260 -113 34 89 -88 13 65 145 131 47
6268 47 22 85 -199 -34 31 -313 186 -58 66 -87 -134 -68 206 -107 -22 139 -49 10 -78 21 -18 -38 58 -3 -7
6293gk6J7P1M6q6m8K0j37L90k31q8J67j13O4j39q0K86j17R6r3jM8k02J21N5O1
6319G4K00k80P3J5r6j34K64O4l56J47O2l7j6j56M00k1r7k68K40j2k24K54L8l30
6343a96J99J9l6K7O0l1k8n5MJ28q5L06l2m0k70R1m9n7J88o6K43l24j70J00R4r1
6369g1l8l4O8J05L4p5L2p7k34L93P9j3j78j5R6j61K11Q3k44J3L0m1l0LK36k15
6395d3j6j7j19K19on9r5K8j40P9J13L9P7k51J45J73k49R8j01j5L70o7j76J00l0
6420E7p9j53L19k67J10J07lp2k39J89O7J18q4k14K99j32j28J37l17J93O9j44K23
6443E6q5L0J77K43m61K55j05Q4j83j78J49j18P4K07k48M03n38K87l6j88K24N7
6465A06p4j06K07q5rJ6j62J58jk93J38L80k51j84L14j21j41K05j83J91j03j65
$$ plain form
6293 -7 -33 -16 55 101 15 -33 -13 -150 240 9 -79 88 -25 39 -100 -180 106 -11 85 -8 -9 39 -163 -42 13 74
6319 74 274 -6 67 82 -14 -148 116 180 -176 -29 33 -4 -20 -176 224 203 106 -162 78 66 -158 96 134 -196
6343 -196 3 22 -14 13 73 42 14 -41 -37 91 6 312 280 240 -30 61 12 -45 143 77 320 -4 -174 -74 20 -71
6369 -71 -109 -143 -75 30 64 -11 21 -56 -290 103 182 169 -9 -24 72 -89 122 205 -39 -26 4 -37 -67 -64 172 -43
6395 -43 -59 -76 -195 24 18 -41 -136 -108 -248 -169 -56 -17 60 -191 -46 127 -122 -24 -125 -140 230 163 -13 87 57
6420 57 -22 -175 144 -123 -13 94 91 19 -220 -31 36 154 70 -144 155 23 -105 32 -285 -92 -23 -167 56
6443 56 -29 1 178 421 -40 215 110 194 11 -167 -18 -136 -62 145 -103 300 -238 49 13 -175 49 106
6465 106 32 -74 133 48 39 55 -107 51 50 -243 -105 275 24 -160 154 33 -108 97 -86 105 2 -163
6487a63J90J30r4J20l21N9J35n5J38j49M5q3j25J82o3o9R5pK25l54K46k46K52
6510H8P3l28J42p6K59k07L4j13J02N8j48j48K52P3j13l3m1K40L3l56K30j19J89
6533I1j62J32r9N6q6J62k09K6L56j2J39j86j21k45j14K98Jk15K01%M7j21K24j7
6557A46l25R1l4J93Q4l34J86j25J11LM5j06j06L03k38O6j20K51Q6q7Q1l57%L65
6581A79PP8k27o1m1J24k13R1L5K05j07j19P2MJ53j31p7L6J22m8l07Q9p0J02J1
6606i3J93j83P9M3l72K10l7P5J86k27J84L7o6q8l8m4J68K95n54K26j61J51k4P9
$$ plain form
6487 -163 27 157 63 183 -138 -79 56 1 139 -10 35 -48 -173 9 -54 -123 -28 -35 190 -164 82 -164 88
6510 88 161 -167 -25 -101 158 -49 -15 -128 -26 32 -116 -264 -12 61 -52 -85 -126 114 147 -209 21 -98 91
6533 91 -71 61 -38 18 -68 94 -115 -89 267 255 394 208 87 -158 -272 26 27 -188 13 13 60 -61 163 146
6557 146 -179 -88 -122 71 155 -179 7 -118 -7 -4 41 -65 -171 132 -106 -40 -160 91 177 90 171 -186 -186 179
6581 179 186 264 37 -24 -65 59 -154 -63 -28 177 70 -49 23 27 180 49 -28 8 130 82 -225 -136 -206 -104 -93
6606 -93 100 -83 -4 39 -333 -123 -160 -85 101 -126 58 95 29 -59 -97 -141 27 322 -232 -6 -167 -16 -40 39
$$ [...]
8191a28
##END NTUPLES=NMR FID
##END=
