##TITLE=1H_CA-8764-1
 CDCl3, 8 sc, 
 25.9.2020
##JCAMPDX= 6.0         $$ Bruker NMR JCAMP-DX V2.0
##DATA TYPE= NMR FID
##DATA CLASS= NTUPLES
##ORIGIN= UXNMR, Bruker Analytische Messtechnik GmbH
##OWNER= root
$$ XWIN-NMR		Version 3.5
$$ Fri Sep 25 09:28:27 2020 Russian Standard Time (UT+4h)  she@DPX200
##.OBSERVE FREQUENCY= 200.1315066352
##.OBSERVE NUCLEUS= ^1H
##.DELAY= (6, 6)
##.ACQUISITION MODE= SIMULTANEOUS
##.ACQUISITION SCHEME= undefined
##.AVERAGES= 8
##.DIGITISER RES= 18
##SPECTROMETER/DATA SYSTEM= spect
##.PULSE SEQUENCE= zg30
##.SOLVENT NAME= CDCl3
##.SHIFT REFERENCE= (INTERNAL, CDCl3, 0, 15.7039)
##AUDIT TRAIL= $$ (NUMBER, WHEN, WHO, WHERE, WHAT)
$$ ##TITLE= Audit trail, XWIN-NMR		Version 3.5
$$ ##JCAMPDX= 5.01
$$ ##ORIGIN= Bruker BioSpin GmbH
$$ ##OWNER= she
$$ F:/spectra/data/she/nmr/H-F/1/audita.txt
$$ ##AUDIT TRAIL=  $$ (NUMBER, WHEN, WHO, WHERE, WHAT)
(   1,<2020-09-25 09:27:17.89 +0400>,<she>,<DPX200>,
      <created by zg, POWCHK disabled, PULCHK disabled
       configuration hash MD5:
       00 E9 B6 7A A2 85 ED C7 34 08 36 98 17 FE 4E 26
       data hash MD5: 16K
       00 55 C0 DA 67 5C 3A 13 24 1F 8D 13 60 C2 44 E3>)
$$ ##END=
$$ 
$$ hash MD5
$$ 59 92 B8 9B 28 39 A1 5E D3 C2 4C AB E5 35 82 37
##$RELAX= 
##$RELAX= 
##$RELAX= 
##$RELAX= 
##$RELAX= 
##$RELAX= 
$$ Bruker specific parameters
$$ --------------------------
##$DU= <F:/spectra>
##$EXPNO= 1
##$NAME= <H-F>
##$PROCNO= 1
##$TYPE= <nmr>
##$USER= <she>
##$AMP= (0..31)
100 100 100 100 100 100 100 100 100 100 100 100 100 100 100 100 100 100 
100 100 100 100 100 100 100 100 100 100 100 100 100 100 
##$AQSEQ= 0
##$AQ_mod= 1
##$AUNM= <au_zg>
##$AUTOPOS= <>
##$BF1= 200.13
##$BF2= 200.13
##$BF3= 200.13
##$BF4= 200.13
##$BF5= 200.13
##$BF6= 200.13
##$BF7= 200.13
##$BF8= 200.13
##$BYTORDA= 1
##$CFDGTYP= 0
##$CFRGTYP= 5
##$CHEMSTR= <none>
##$CNST= (0..31)
1 1 145 1 1 1 1 1 1 1 1 1 1 1 1 1 1 1 1 1 1 1 1 1 1 1 1 1 1 1 1 1 
##$CPDPRG= <>
##$CPDPRG1= <>
##$CPDPRG2= <>
##$CPDPRG3= <>
##$CPDPRG4= <mlev>
##$CPDPRG5= <mlev>
##$CPDPRG6= <mlev>
##$CPDPRG7= <mlev>
##$CPDPRG8= <mlev>
##$CPDPRGB= <>
##$CPDPRGT= <>
##$D= (0..31)
0 1.2 0 0 0 0 0 0 0 0.06 0 0.03 0 0 0 0 0.0002 0 0 0 0 0 0 0 0 0 0 0 0 
0 0 0 
##$DATE= 1601011637
##$DBL= (0..7)
120 120 120 120 120 120 120 120 
##$DBP= (0..7)
150 150 150 150 150 150 150 150 
##$DBP07= 0
##$DBPNAM0= <>
##$DBPNAM1= <>
##$DBPNAM2= <>
##$DBPNAM3= <>
##$DBPNAM4= <>
##$DBPNAM5= <>
##$DBPNAM6= <>
##$DBPNAM7= <>
##$DBPOAL= (0..7)
0.5 0.5 0.5 0.5 0.5 0.5 0.5 0.5 
##$DBPOFFS= (0..7)
0 0 0 0 0 0 0 0 
##$DE= 6
##$DECBNUC= <off>
##$DECIM= 32
##$DECNUC= <off>
##$DECSTAT= 4
##$DIGMOD= 1
##$DIGTYP= 9
##$DL= (0..7)
0 120 120 120 120 120 120 120 
##$DP= (0..7)
150 150 150 150 150 150 150 150 
##$DP07= 0
##$DPNAME0= <>
##$DPNAME1= <>
##$DPNAME2= <>
##$DPNAME3= <>
##$DPNAME4= <>
##$DPNAME5= <>
##$DPNAME6= <>
##$DPNAME7= <>
##$DPOAL= (0..7)
0.5 0.5 0.5 0.5 0.5 0.5 0.5 0.5 
##$DPOFFS= (0..7)
0 0 0 0 0 0 0 0 
##$DQDMODE= 0
##$DR= 18
##$DS= 0
##$DSLIST= <SSSSSSSSSSSSSSS>
$$ [...]
##$SUBNAM2= <"">
##$SUBNAM3= <"">
##$SUBNAM4= <"">
##$SUBNAM5= <"">
##$SUBNAM6= <"">
##$SUBNAM7= <"">
##$SUBNAM8= <"">
##$SUBNAM9= <"">
##$SW= 16.880792210976
##$SWIBOX= (0..15)
0 0 2 0 0 0 0 0 0 0 0 0 0 0 0 0 
##$SW_h= 3378.37837837838
##$TD= 16384
##$TD0= 1
##$TE= 0
##$TE2= 300
##$TE3= 300
##$TEG= 300
##$TL= (0..7)
0 120 120 120 120 120 120 120 
##$TP= (0..7)
150 150 150 150 150 150 150 150 
##$TP07= 0
##$TPNAME0= <>
##$TPNAME1= <>
##$TPNAME2= <>
##$TPNAME3= <>
##$TPNAME4= <>
##$TPNAME5= <>
##$TPNAME6= <>
##$TPNAME7= <>
##$TPOAL= (0..7)
0.5 0.5 0.5 0.5 0.5 0.5 0.5 0.5 
##$TPOFFS= (0..7)
0 0 0 0 0 0 0 0 
##$TUNHIN= 0
##$TUNHOUT= 0
##$TUNXOUT= 0
##$USERA1= <user>
##$USERA2= <user>
##$USERA3= <user>
##$USERA4= <user>
##$USERA5= <user>
##$V9= 5
##$VALIST= <valist>
##$VCLIST= <CCCCCCCCCCCCCCC>
##$VD= 0
##$VDLIST= <DDDDDDDDDDDDDDD>
##$VPLIST= <PPPPPPPPPPPPPPP>
##$VTLIST= <TTTTTTTTTTTTTTT>
##$WBST= 1024
##$WBSW= 4
##$XGAIN= (0..3)
0 0 0 0 
##$XL= 0
##$YL= 0
##$YMAX_a= 526042
##$YMIN_a= -409710
##$ZGOPTNS= <>
##$ZL1= 120
##$ZL2= 120
##$ZL3= 120
##$ZL4= 120
##$ABSF1= 10
##$ABSF2= 0
##$ABSG= 5
##$ABSL= 3
##$ALPHA= 0
##$AQORDER= 0
##$ASSFAC= 0
##$ASSFACI= 0
##$ASSFACX= 0
##$ASSWID= 0
##$AUNMP= <proc_1d>
##$AZFE= 0.1
##$AZFW= 0.1
##$BCFW= 1
##$BC_mod= 2
##$BYTORDP= 1
##$COROFFS= 0
##$CY= 11.3945322036743
##$DATMOD= 1
##$DC= 2
##$DFILT= <>
##$DTYPP= 0
##$F1P= 16.9975609425685
##$F2P= -3.02152046262296
##$FCOR= 0.5
##$FTSIZE= 0
##$FT_mod= 4
##$GAMMA= 1
##$GB= 0.15
##$INTBC= 1
##$INTSCL= 1
##$ISEN= 128
##$LB= 0.24
##$LEV0= 0
##$LPBIN= 0
##$MAXI= 10000
##$MC2= 0
##$MEAN= 0
##$ME_mod= 0
##$MI= 1.114404
##$NCOEF= 0
##$NC_proc= 0
##$NLEV= 6
##$NOISF1= 3.799351
##$NOISF2= 2.8
##$NSP= 1
##$NTH_PI= 0
##$NZP= 0
##$OFFSET= 15.70392
##$PC= 1
##$PHC0= -9968.421
##$PHC1= 11.2009
##$PH_mod= 1
##$PKNL= yes
##$PPARMOD= 0
##$PSCAL= 0
##$PSIGN= 0
##$REVERSE= no
##$SF= 200.130013532006
##$SI= 16384
##$SIGF1= 3
##$SIGF2= 2
##$SINO= 400
##$SIOLD= 16384
##$SREGLST= <1H.CDCl3>
##$SSB= 0
##$STSI= 0
##$STSR= 0
##$SW_p= 3612.71676300578
##$SYMM= 0
##$S_DEV= 0
##$TDeff= 0
##$TDoff= 0
##$TI= <>
##$TILT= no
##$TM1= 0
##$TM2= 0
##$TOPLEV= 0
##$USERP1= <user>
##$USERP2= <user>
##$USERP3= <user>
##$USERP4= <user>
##$USERP5= <user>
##$WDW= 1
##$XDIM= 8192
##$YMAX_p= 0
##$YMIN_p= 0
$$ End of Bruker specific parameters
$$ ---------------------------------
##NTUPLES= NMR FID
##VAR_NAME=  TIME,          FID/REAL,        FID/IMAG
##SYMBOL=    X,             R,               I
##VAR_TYPE=  INDEPENDENT,   DEPENDENT,       DEPENDENT
##VAR_FORM=  AFFN,          ASDF,            ASDF
##VAR_DIM=   8192,          8192,            8192
##UNITS=     SECONDS,       ARBITRARY UNITS, ARBITRARY UNITS
##FACTOR=    0.000296,      1,               1
##FIRST=     0,             0,               0
##LAST=      2.424536,      0,               0
##MIN=       0,             -409710,         0
##MAX=       2.424536,      526042,          0
$$ Real data points
##PAGE= N=1
##DATA TABLE= (X++(R..R)), XYDATA
0 0 0 0 0 0 0 0 0 0 0 0 6 -8 8 -8 16 -16 24 -28 32 -40 48 -60 72 -84 100 -118 135 -159 183 -210 242 -275
32 -275 315 -358 406 -458 516 -579 646 -724 808 -898 999 -1106 1224 -1354 1495 -1650 1820
49 1820 -2007 2207 -2433 2681 -2953 3260 -3603 3991 -4429 4935 -5523 6218 -7054 8083
63 8083 -9380 11081 -13423 16873 -22529 34052 -116141 316171 43846 -409710 71217
74 71217 122485 -116321 -33168 227216 484 -154746 219117 236877 -171211 38037 101553
85 101553 -87506 -33238 3975 56095 33567 -76801 9698 60673 -35355 -30203 21819 85350
97 85350 21013 -83828 103749 16993 -98489 86277 25145 -96751 51891 103810 -12441
108 -12441 -56121 -8678 57668 -59714 -37104 76606 -12754 30620 13992 -28811 89704
119 89704 39422 -50868 79523 71692 4076 65737 23056 -34019 -49855 66335 34860 -115029
131 -115029 58199 89282 -113448 -21388 94774 -58257 -47793 49995 20086 -25269 9194
142 9194 52301 -72252 -9866 107967 -19437 -23207 99845 44800 -12854 36120 22880 23802
154 23802 8935 37830 36915 -4923 49892 13436 -24302 33920 57255 13809 -17079 -9971 69789
167 69789 48281 -71760 -9988 23052 -2307 10442 16290 -8292 -29248 44792 42815 -54065
179 -54065 -12912 74991 -32013 -27668 67273 -8834 -41194 2622 20665 -21568 1045 29185
191 29185 -29818 -11721 42268 -33817 -60128 44565 -12904 -49612 10478 -9020 -29694 1003
203 1003 17847 -54094 -33900 46560 -3922 -62453 19453 13924 -70499 -12198 10188 -13509
215 -13509 -27241 -12850 452 -8472 15557 2138 -31173 -11495 31324 9722 1776 -12399
227 -12399 -1067 38723 -15297 -11960 27565 17292 -11653 10597 34935 -3670 -18795 11891
239 11891 7275 -21860 41843 13012 -42424 26578 33843 -20187 -12097 41746 10207 -8394 23168
252 23168 5334 -26913 22340 28796 -49541 14880 46071 -27642 -25995 32223 16253 -26591
264 -26591 8058 7063 -19292 4527 27275 -35737 -24044 39772 -7265 -23992 903 9843 -8472
277 -8472 -3954 595 -7940 1333 -3040 -16170 -13930 20206 -11618 -19554 10318 -3375 -4298 -3227
291 -3227 -2657 -7573 7947 -4652 -17261 91 15136 -1486 -25549 3940 -1262 7932 12071
304 12071 -13733 -3897 22220 5756 -24559 14306 17169 -12729 -7650 27025 9601 -11414 22435
317 22435 -5482 -17556 24224 31124 -21063 -10838 29343 -4422 -23890 -1330 15236 -19045
329 -19045 -7946 11896 -5985 -6837 -5590 -12142 -17743 14824 9130 -7596 -5214 2130 3395 -8658
343 -8658 3296 2549 12643 7795 -3568 -6218 7067 7609 -22105 -10974 1830 10507 -6712 -13662
357 -13662 -1960 -6954 -9878 -3881 8142 -5390 7974 7431 -7114 -6219 11281 15972 -20765 3142
371 3142 31559 7648 -11606 14077 10229 -11944 5203 12599 14097 685 10678 1767 -9087
384 -9087 16960 11300 -4747 409 17945 10700 6064 -8748 -748 7483 -10007 1220 -882 7050
398 7050 -2093 -17802 -9951 -299 -1677 -4083 -7059 -11120 9948 -6471 -5945 -750 -12241 966
412 966 -260 1056 -1701 2794 2301 -11912 -16869 14900 879 -32323 8938 4356 -19841 -12652
426 -12652 1428 -10828 -28638 -448 3528 -21683 -2085 15711 -38036 -20089 19911 -9405
438 -9405 -15015 -4594 8493 -7107 -6888 4550 -14292 -10334 17095 -7044 -16760 24527 -4749
451 -4749 -17885 -2629 -353 736 -4492 13053 684 -12157 13296 10845 -22462 9361 19666
464 19666 -7513 6569 6906 12783 -5695 -8569 14902 -397 -3351 15049 3950 -4398 6999
477 6999 -6520 5406 -3346 -1034 22637 -10670 -18 20557 1437 -9537 -876 9232 12398
490 12398 -3672 5805 12317 -19307 8673 -934 -19271 14278 3229 -8905 -1102 -1638 -4953
503 -4953 -8875 -7734 8424 -12849 891 18863 -25815 1033 12705 -17481 -7201 11539 10770
516 10770 -6885 -9619 12600 -221 -22201 19837 -358 -17842 18910 2433 -7682 -3575
528 -3575 5501 3487 -13956 3229 26193 -8789 -9909 13755 -6658 8694 444 -5266 10461
541 10461 2196 9518 614 -10059 12404 8401 -12014 12619 3971 1931 15585 -4927 3725
554 3725 988 9353 14314 -9229 8971 22442 -9994 -829 18335 -5986 2568 3875 8572 2786
568 2786 -10018 18493 -585 -17641 12671 10007 -12598 4020 8097 276 -8346 -4505 20094
581 20094 -14317 -10859 17155 -4448 -6096 5016 -2397 -5722 -1057 325 3076 -9945 8969
594 8969 7311 -17611 6560 1773 -4399 4558 -332 -1130 4097 1571 660 -5694 -2302 12061 -14371
609 -14371 2829 19110 -10185 -5410 4853 2628 -3943 3197 10289 -3560 -9704 19324 4065
622 4065 -20871 12425 5039 -7981 854 9953 4460 -14019 -1215 9986 -4629 -2634 8990
635 8990 -11523 813 10754 -4932 -5368 -7335 8582 1569 -9807 1031 -448 -4171 3619 -8312
649 -8312 -13898 7925 -149 -2000 -7139 -5138 2089 -8932 2230 -42 -12916 -281 9136 -6581
663 -6581 -4220 -2135 -3376 53 -6002 10258 -2555 -10131 7650 2009 -5129 -350 4490 2724
677 2724 -1398 -2356 12872 -2579 -5172 10027 -3100 2046 4554 3801 471 -2022 6564 3552 -7167
692 -7167 6032 10564 -9096 5387 2733 -1365 6830 2093 -474 -4718 8327 6412 -7887 3689
706 3689 13045 -12826 -2310 16117 -9264 -3835 6054 1142 -10089 680 12877 -14505 -15257
719 -15257 14077 1689 -17087 7967 438 -10998 -1500 685 1454 -9167 2857 1397 -10428
732 -10428 2872 5923 -9993 -4316 241 -3876 8650 -5497 -6159 1225 -605 1151 -6136 1960
746 1960 2796 -4410 2746 5197 -9179 3292 5019 -7998 3794 -704 3019 2845 -3377 -1420 -1962
761 -1962 2532 4073 650 2538 2862 -6797 13751 7153 -12646 8300 8407 1172 3847 7525 -362
776 -362 -5847 4664 9367 -5988 -1149 12376 -9908 -406 7699 -5878 -3355 99 2244 -683
790 -683 -752 -636 -3452 -5065 5202 -5449 -7867 8666 -5252 -3257 -617 -4291 -2069 -2103 -853 -306
806 -306 -2106 -45 4680 -6024 626 905 -77 2881 -5456 6934 3872 -9154 -1238 7047 -5721
821 -5721 -4294 4110 -1850 -3846 -2107 5502 -10543 -6241 10904 -3204 -6935 4683 3323 -4513
835 -4513 3480 950 -43 1284 4206 4554 -665 6526 -1732 -288 7692 556 -2731 6507 3102 -5153
851 -5153 6549 3003 -3644 -2718 6678 1667 -6205 6457 2086 -5874 -2026 3383 -2752 -1987 -1769
866 -1769 -4076 1162 -4062 -3753 -4397 -2996 -6595 -1252 4041 -7867 -5358 4180 -732 -11339 5199
881 5199 5542 -8557 1100 7059 -3450 -7800 7773 -673 -6990 3888 3299 -5608 -1345 5221 -7744
896 -7744 -2284 4865 -1499 -3448 4356 -649 -6358 6900 453 -5429 1770 7206 -2605 -2453 8624
911 8624 -940 -3652 4501 5613 -3506 5376 5934 -2401 4068 2951 1941 414 4302 2111 2246 4980
927 4980 -450 -997 4212 3063 -5798 6305 3226 -5536 4129 3494 -4469 -4238 6486 -109 -3628
942 -3628 3018 1487 -7356 665 6555 -8291 901 3090 -3936 380 2943 -3712 -4693 5914 190
957 190 -5366 2203 7508 -8925 -2993 10035 -5870 -2359 6723 395 -6874 2754 5947 -4062
971 -4062 -3658 5393 2100 -6748 5873 1037 -3860 1263 -575 1953 -494 96 1488 914 -2485 1959
987 1959 2214 2160 41 -1695 7132 -1484 828 6093 -1644 -421 4182 3757 607 1087 -1260 3019
1003 3019 90 1542 539 -2069 4333 -4769 -736 3993 -4116 -4011 4126 -2185 -5816 2979 -142
1018 -142 -4712 -6368 5355 -678 -8449 4936 274 -7801 -677 3739 -3766 -2067 -37 1079 -2409
1033 -2409 -2963 4803 -4109 -994 596 -1579 1983 -1404 -2398 1673 -1368 -4615 3653 -479 -869 -2055
1049 -2055 -835 2979 -3900 2613 418 -3351 3497 2784 -2639 3560 1591 -3254 5238 571 824
1064 824 1536 4017 1118 -4677 7591 3194 -6586 4550 7238 -7973 2153 8280 -4155 -3374
1078 -3374 1939 5188 -6198 599 6975 -7652 -3221 6972 -2808 -5054 4111 -3099 -1168 683
1092 683 -655 -1728 -3957 4254 -3330 -3337 5367 -2406 -5238 5551 -1075 -4350 4347 -1559 -1071 -1721
1108 -1721 2599 784 -6712 2550 650 -5306 884 786 -3586 2362 -3197 -1673 2610 -5576 1442
1123 1442 1783 -214 -1343 -408 4924 -1550 -3647 7197 1229 -6261 9622 1713 -5210 3411 2619
1138 2619 1345 -1673 5230 2988 -3668 4234 4980 -5529 3465 5305 -4916 5995 2017 -3356
1152 -3356 233 1714 1941 -4109 1096 3034 -5801 -318 6355 -9823 -3225 5849 -4792 -1438 -1805
1167 -1805 490 -3023 -4156 3348 -1734 -5299 3089 -401 -3899 4098 -3589 118 28 -4921 5006
1182 5006 -279 -3515 -258 -274 410 -1199 -3060 2000 -2777 -2204 6681 -6547 -1625 3331 -3161 1642
1198 1642 689 -342 1788 964 953 1480 -1668 5891 -622 -1303 9549 -4105 -761 6921 -304 -1150
1214 -1150 2869 2439 711 -422 4755 3051 -7794 6786 5078 -4826 4350 856 -467 1778 -73
1229 -73 888 -398 -2555 3582 -1270 -3188 1804 -4748 2266 -1187 -4683 3989 -2059 -3899 2814 -1053
1245 -1053 -2160 1152 -3182 1722 -1227 -1680 1540 -5649 1085 -542 -3836 1284 -4077 -5105 4399
1260 4399 -2387 -6400 2293 -2175 -860 -1273 1735 391 -6976 4709 3518 -6275 2181 4971 -5835
1275 -5835 332 3360 -456 -933 -2198 4447 -1219 -172 4234 -2931 60 4737 -654 1561 4188
1290 4188 -2635 3992 3107 -760 1524 1386 4262 -2200 -116 5106 -1577 -1141 5403 -2048 -2166 4439
1306 4439 -1362 1321 -513 296 840 -1498 1785 -742 -1184 464 -1950 -1062 4644 -5015 -3785 3835
1322 3835 -3384 -942 1178 -28 -4868 -1378 4998 -1498 -5052 3018 1496 -5225 4181 354 -4301
1337 -4301 420 953 399 -1999 1340 8 -2097 466 1047 -2580 1305 1659 -3874 3256 1032 -2292
1353 -2292 595 2182 718 -1275 2392 2040 -523 540 3848 -1623 278 3918 129 1026 -58
1368 -58 1775 1352 29 276 1589 753 41 1399 546 1250 -2373 1103 920 -2274 1632 934 -1400
1385 -1400 -2541 1072 50 -1724 -1298 516 -769 -1707 1363 -2595 -1418 -478 -964 -622 -247 145 -1330
1402 -1330 143 -1590 -1080 -313 1153 -1261 -1322 2155 -1189 -1177 -158 603 -1682 76 1788 -466 -606
1419 -606 -364 848 -1589 -176 547 1320 313 -1110 1628 400 63 36 2318 9 509 3666 1204
1436 1204 -293 752 3236 418 2021 2881 1323 446 694 2297 -322 1078 -6 376 903 193
1452 193 -940 -1347 396 -2548 -478 267 -713 -2837 -694 751 -3782 -1454 420 -1200 -3463 940
1468 940 466 -2981 -1141 -627 -259 -2746 749 163 -1993 -346 70 -550 -1940 -404 -332 875 -1408
1485 -1408 185 783 -1861 -780 -431 1187 -1597 -242 1689 -615 -1652 687 546 -2100 882 613
1501 613 1321 -437 -23 1481 -527 1690 819 1671 2521 1615 898 3545 1508 -713 3269 2030 903
1518 903 177 3061 1165 -3073 1506 977 -3119 -263 3099 -3056 -2218 1015 -19 -1809 -1772 2171
1534 2171 -1869 -534 2694 -575 -1808 425 -309 121 1327 -1823 847 -627 -413 -790 -2056 576
1550 576 -2232 -677 1815 -1233 -2793 1013 -1230 -1757 633 -662 753 -1924 332 491 -2604 -131
1566 -131 -838 -705 1241 -119 -1225 1680 -2290 -169 2726 -1076 399 716 3094 159 -1310 3306
1582 3306 1155 -1600 4272 3025 -2156 3043 1342 8 656 770 2254 -1576 1496 1973 -1728 -200
1598 -200 1520 -2739 861 1133 -2692 1480 -516 -647 -1259 -789 1312 -1807 -579 2286 -1612 -1835
1614 -1835 3113 -2353 -857 620 -743 904 -2060 1062 247 -3582 -320 937 -2010 -267 -1431
1629 -1431 -1701 1038 -3143 1114 -543 -4083 1514 302 -671 -565 -1536 -87 147 -1368 2191 -1383
1645 -1383 -1985 3256 -1670 867 568 -2068 1638 1129 -232 1184 716 258 1019 -639 3871 -103
1661 -103 -965 4744 -1430 174 3299 450 1 722 757 2359 -1145 336 2237 -2718 1632 583
1677 583 -1161 1760 -1354 391 1183 -1813 313 1750 -1886 483 -109 254 907 -2731 1770 -908
1693 -908 -2321 2524 -860 -2702 830 -977 -994 1090 -2278 235 -1198 -33 1045 -2860 1338 -596
1709 -596 -2726 2373 -246 -3796 1866 407 -2191 325 -97 796 -3043 834 2595 -3805 704 2890
1725 2890 -2435 -371 2277 -951 1060 -40 974 978 -1313 2903 -369 -458 2561 -381 606 2160
1741 2160 -1753 1090 2412 -1696 771 359 1228 728 -1534 2474 -563 -835 2467 -612 -1923 1740
1757 1740 -488 8 491 -1663 1560 -882 -828 38 -758 1133 -901 -600 1534 -1514 -1419 3589 -1690
1774 -1690 -1822 2005 -373 -61 -971 1330 -489 -2120 1614 881 -2722 476 639 -2798 792 -655
1790 -655 -359 -339 -1347 783 -802 116 -99 -1602 334 1321 -2054 1313 1111 -2077 1402 271 -111
1807 -111 -569 481 1882 -937 57 1949 -580 -1154 2047 -504 772 549 -566 1455 -1419 183
1823 183 321 -73 89 265 238 -79 -1202 3 1779 -2413 560 1333 -1004 -411 -326 197 -800 175 603
1842 603 -363 -576 1297 -368 -1405 845 -1256 720 270 -582 103 235 -279 -882 24 466 -253 -1532
1860 -1532 1883 -691 -1087 990 -1399 -693 -73 1103 183 -861 -257 439 -465 -41 768 -438 1284
1877 1284 40 665 1006 -908 458 854 266 40 1312 581 24 -405 1115 88 -1564 1620 -326
1894 -326 -233 789 -404 -418 -115 185 -166 447 -303 778 -329 576 -500 -848 2011 -663 -937 381
1912 381 606 -1111 -62 535 -919 -682 676 1472 -1939 300 615 -1570 -110 395 293 -651 5
1929 5 -538 226 -180 -673 -589 -15 804 -1340 864 -61 -1681 606 474 -1178 -533 2041 -118 -880 208
1948 208 1264 -994 15 2092 -684 725 1287 519 -316 1036 45 136 1134 143 663 529 975 -1542
1966 -1542 435 1814 -1172 -289 1425 368 -1409 1345 320 -1715 -37 1664 -94 -1747 1320
1981 1320 -484 -1489 164 178 -785 -475 382 -957 44 -676 -587 -678 -3 -663 -520 1027 -1312 -1261 -121
2000 -121 92 -1602 -75 1051 -1301 -391 459 -44 -1590 432 -76 -655 7 -79 420 -702 -288 -455
2018 -455 514 357 -409 508 589 -351 -781 2088 -334 -423 1392 640 -185 120 1796 -580 -409 1245 855
2037 855 -721 438 1315 -363 666 -350 227 -21 270 453 188 288 -463 149 112 41 -1113 1029
2055 1029 190 -1453 675 -234 -525 -571 317 -160 -653 50 60 -318 -845 233 -1163 449 -705 -691 843
2074 843 -1096 -767 202 6 -1355 -174 346 -381 -1099 199 1004 -2231 493 810 -1263 7 659
2091 659 -109 -415 243 0 53 -389 1069 186 46 1418 -886 774 743 -650 483 1262 243 258 1173
2110 1173 180 188 -513 1914 -297 -457 1820 -361 -122 830 235 -10 777 -310 655 -173 -281 649 -809
2129 -809 612 -678 83 1302 -974 -144 1147 -830 -1049 1131 -636 -327 -260 362 -291 -1455 1098
2146 1098 -644 -1083 520 -149 -970 748 -620 -727 616 -963 -126 -621 492 -321 -1397 1298 -281
2163 -281 -1314 944 859 -1711 624 750 -584 -155 96 1269 -1064 323 1279 -524 -94 800 -300
2180 -300 -129 396 -420 1319 -293 86 1055 -370 449 -656 835 705 -465 563 1294 -701 313
2197 313 1094 -572 365 -633 461 31 -883 708 -682 -471 231 -145 -537 356 -1013 389 116 -1630
2215 -1630 274 -105 -11 -655 -57 567 -937 -640 900 -1222 -1556 1459 -645 -1018 -423 -306 297 -1432
2233 -1432 346 325 -798 379 497 -611 179 101 -329 917 -900 668 529 -518 474 -608 710
2250 710 275 -232 588 1068 -832 689 663 -265 625 -9 1201 -18 -330 1266 426 -460 701 564
2268 564 156 669 -333 995 -553 -281 1407 -452 -25 234 494 203 -425 -95 154 -1182 91 1029
2286 1029 -1299 100 -433 -556 -31 -979 -41 -153 -535 -9 -294 -600 48 -984 191 489 -1475 998
2304 998 -43 -451 -132 -254 76 -562 -26 736 -130 -764 1175 -633 -369 251 -634 742 -130 197 736
2323 736 -152 3 669 -5 240 652 -478 1289 -795 402 1115 -867 2 884 679 92 263 240 508
2342 508 -494 1000 594 -990 885 -518 71 377 -825 -455 333 -548 -35 -192 -357 164 -1164 644
2360 644 -535 -1601 753 -432 -1249 83 -97 -959 -479 -445 365 -907 -943 843 -1485 -260 -56 -1138
2378 -1138 269 -187 -491 413 -365 -655 606 -273 369 -445 101 1370 -899 418 519 -965 482
2395 482 1001 -223 283 288 125 871 -416 1219 48 -80 1463 50 387 312 -205 592 1177 -578 641
2414 641 593 -239 448 -153 1052 -496 -33 1385 -499 -398 936 59 -611 383 -256 296 -844 -131
2432 -131 332 -1313 -36 -331 -776 72 -410 -743 -42 -802 -567 256 -1147 -253 -431 -13 -343 -1082 162
2451 162 -417 -919 -112 263 -838 26 36 -413 14 -681 407 -129 155 349 89 176 -155 81 550 473
2471 473 -813 786 221 -372 559 270 426 -289 722 705 -227 -50 1371 288 175 1009 -212 251
2489 251 200 622 609 -233 335 446 494 -205 395 264 745 -81 417 795 -697 135 179 179 -322 -83 124 -273
2511 -273 -164 -162 -96 -1197 -43 -140 -230 -205 -656 -92 -440 -408 -428 145 -573 -301 127 -58 -672 -342 678 -620
2533 -620 -436 631 190 -621 -111 496 -324 52 52 75 -436 3 266 -235 325 -250 377 55 -5 -68 644
2554 644 578 -535 441 600 368 -221 912 290 -574 369 305 131 148 826 -17 -49 339 -13 129 185 392
2575 392 -267 258 -254 -30 244 -332 -386 -127 295 -938 -270 282 -416 -719 308 40 -1043 -22 161
2594 161 -326 -945 251 -327 -869 66 -357 -212 -123 -105 -543 -74 -104 -389 191 -164 -260 -315 498 -304 -755
2615 -755 365 266 -320 -329 620 -244 -297 531 348 -113 4 754 -230 300 488 283 106 114 280 616 401 -283
2637 -283 755 -230 375 24 262 539 -464 556 627 -131 -63 575 -237 -72 348 -88 244 -320 310 14
2657 14 -323 123 -135 -38 -45 -324 5 365 -735 -151 155 -392 43 -130 812 -764 -272 437 -559 -499 303
2678 303 44 -783 181 -373 23 -659 26 451 -730 68 128 2 7 10 -247 311 -194 -112 679 -186 261 -86
2700 -86 30 259 -259 553 382 -186 196 410 -402 464 126 274 568 -355 580 -24 -209 122 219 126 95
2721 95 -49 485 29 -772 949 -69 -569 694 208 33 -598 210 267 -698 176 787 -869 -50 416
2740 416 -936 265 -484 -91 102 -518 57 78 -86 -140 -366 -78 617 -1070 -10 560 -961 145 121
2759 121 -243 -445 -135 91 -283 -738 483 -106 -720 616 -803 443 130 -598 703 -11 -618 483
2777 483 178 -254 -273 -41 855 -332 -479 1167 -929 -123 723 -206 -21 -32 -17 238 -13 1 438 -905
2797 -905 639 220 -545 762 -866 83 518 -676 -243 359 -409 -11 -224 121 333 -1057 331 271
2815 271 -1138 697 13 -598 264 168 -83 -14 -477 628 -172 -339 799 -847 340 147 -715 440
2833 440 -89 -532 556 58 -647 639 -64 539 -224 40 1097 -1097 310 844 -426 273 382 -410
2851 -410 507 -32 -251 857 -185 501 117 276 811 -402 458 737 -563 539 999 -535 562 563
2869 563 242 217 -255 917 -193 -459 706 -201 -401 701 -378 -83 356 -845 463 -185 -518 299
2887 299 -637 167 -370 -589 165 -328 -599 653 -487 -537 666 -741 267 -439 -150 284 -606 29 257
2906 257 -404 -103 -101 -609 363 -481 128 730 -787 398 136 -126 -42 1 289 122 -297 530 254 -889
2926 -889 763 70 -233 381 -239 435 -27 138 419 386 132 437 -157 228 414 -351 850 -17 -69 686
2946 686 336 -40 80 431 98 -224 -73 385 -1000 76 249 -782 308 -376 -72 -122 -267 -307 -1
2965 -1 -442 8 72 -311 286 -706 310 -110 -921 232 101 -462 -90 310 -201 -119 90 393 -262 -334 777
2986 777 -94 -318 -96 -135 -216 -19 -143 39 296 -292 379 -171 211 -99 -136 871 -389 230 827 58
3006 58 -351 374 278 19 336 80 460 -502 367 217 -248 319 111 396 -72 221 -152 495 -253 148 137
3027 137 -82 184 -438 660 -414 -250 450 -71 -321 -75 252 -390 -175 98 73 -731 -123 272 -605 -116
3047 -116 -257 98 -225 -66 -138 -125 -31 -420 193 57 243 -107 124 -205 -306 361 1 218 -164 442 -379
3068 -379 149 65 167 43 -62 490 -24 -34 -129 145 363 154 112 163 405 12 376 312 43 281 150 228
3090 228 -284 309 175 35 -192 560 44 -214 272 -33 230 -51 98 104 -244 -171 -240 134 -505 -274 -455
3111 -455 199 -448 -323 -112 -253 -261 -236 203 -468 -341 -155 -430 -161 -407 -18 -639 -326 174 -30 -261 -265 -175
3133 -175 -215 -179 -222 111 -58 -260 13 120 -74 -336 372 -51 -28 96 288 -242 -24 765 -50 427 25
3154 25 469 195 241 439 62 171 -17 -51 207 294 -174 294 348 -531 339 138 199 -240 438 119 -283 -289 112
3177 112 176 -620 263 -300 -268 -117 -12 28 -190 87 -39 67 -183 -89 -59 -56 46 -427 204 -353 -283 -107 -166
3200 -166 -176 26 114 -191 -269 -107 492 -439 -112 122 -158 182 17 461 103 130 143 446 -38 68 1 -206
3222 -206 334 -218 515 299 -462 355 334 -314 -154 418 108 175 -40 597 170 -388 524 30 -96 233 -176
3243 -176 116 21 -114 425 101 -47 239 -702 65 -4 -231 641 -721 -215 229 -279 -336 174 -225 -324 -277
3264 -277 -96 380 -744 249 -20 -688 113 -50 -310 102 -119 -208 300 -652 322 90 -409 609 -80 156
3284 156 -173 -266 475 -70 -69 394 63 -203 170 -317 652 70 -193 690 -20 210 280 265 206 181 -273 737
3306 737 119 184 776 140 415 388 232 414 -23 369 356 -189 80 490 -79 259 -183 24 93 -480 292
3327 292 59 -437 24 269 -127 227 -441 -145 4 -730 373 -408 -476 -49 -62 53 -385 -321 142 -141 -369
3348 -369 265 -468 -228 158 -370 132 -611 -278 156 -342 -225 -84 -110 153 -168 -16 628 -414 151 315
3368 315 -259 181 -83 145 -38 -79 451 580 -347 531 273 -246 619 -154 164 221 -145 673 216 -268 99
3389 99 256 384 380 -221 522 17 -344 476 -224 8 -34 26 23 -110 68 -1 -239 -487 472 -350 120 157 -113
3412 -113 52 -425 -97 110 -215 -47 128 -163 56 -429 -269 212 -583 312 200 -245 175 -49 43 -131
3432 -131 -59 37 54 -452 353 96 -420 217 -261 83 -317 -42 370 254 -114 157 332 105 127 -194 428
3453 428 -147 -101 343 100 86 99 18 59 38 107 277 -218 149 579 -301 223 -78 -151 55 -251 198 100 -1
3476 -1 -69 386 -101 225 -59 -16 -247 -510 437 91 -456 166 -159 -298 266 -171 176 -236 -239 236 -164 -315
3498 -315 -92 -246 138 -282 58 -70 -233 -253 92 -163 -294 189 -103 367 -478 -64 99 -246 68 -111
3518 -111 142 -75 236 322 134 -307 156 420 -98 501 -152 210 91 50 223 20 -127 228 298 105 303
3539 303 -88 172 23 -255 394 -216 189 122 -13 -401 -73 45 94 33 -116 156 -443 -9 -151 -351 -243
3560 -243 -174 92 -102 -242 -210 270 -397 -27 -243 -399 126 -491 78 -174 -313 -142 -64 -267 -39 -51 -151
3581 -151 -69 -17 232 112 -154 76 7 142 181 404 237 210 -229 540 245 -229 639 219 304 -186 163 253
3603 253 -70 139 208 36 86 337 -77 130 94 -7 125 -51 453 -45 -42 -101 -73 -67 139 -385 -43 450 -175
3626 -175 119 1 -48 -98 -142 247 -431 160 -314 178 -126 -143 -41 -132 -44 -514 -146 -58 -36 -257 231 -266 -188
3649 -188 89 -55 -65 -157 389 63 -408 321 45 -3 -97 286 -440 135 117 7 -47 22 78 104 141 -143 157
3672 157 162 159 -67 120 260 -388 229 352 101 321 261 106 244 167 -23 -21 -322 454 213 -135 146 107 341
3695 341 202 -14 170 103 76 159 64 -182 -19 -30 39 -306 -42 246 -337 -284 114 -143 -463 -114 2 -181
3717 -181 25 -19 -92 -515 14 -89 49 52 -92 92 -125 -104 1 194 -204 98 -31 168 -43 -69 160 142
3739 142 -216 258 -36 -350 380 -89 109 187 -63 320 4 94 156 27 337 -47 365 448 263 -199 131
3760 131 115 -73 298 17 186 -113 -49 214 -196 -70 92 -272 -118 249 -155 177 -373 104 238 -285 -323
3781 -323 -60 146 -106 164 -81 -76 -536 -159 49 -727 299 -371 -143 -147 -97 -36 -264 -60 -53 106 -174 202
3803 202 -398 106 -55 -321 289 -70 -18 79 52 253 -54 -90 112 85 174 457 -211 179 318 13 -243 -176
3825 -176 280 -56 -74 272 261 -264 138 129 -106 224 -421 433 310 -71 -64 35 115 -71 -54 44 -133 -218 235 -145
3849 -145 -217 241 -198 -193 -101 -313 105 -265 -224 220 -213 -196 150 -188 333 -378 -237 276 -331 -259 -198 -255 -232
3872 -232 -296 -197 90 -353 -157 315 -549 254 -296 -271 -54 -109 171 71 17 85 171 -345 444 -75 79 274
3894 274 -203 241 48 -112 72 74 -70 286 62 141 242 -45 631 -222 -33 76 166 148 -138 52 -7 -74
3916 -74 172 514 -205 -22 92 -343 474 -206 -159 67 -201 177 101 -285 -238 -319 -208 356 -100 -82 -87 -260 344
3939 344 -141 4 58 -296 62 40 -431 319 -78 -253 328 -100 29 -55 -67 23 -16 -186 225 -148 -464 212
3961 212 -201 60 223 10 167 -263 366 331 101 113 -132 169 159 104 -16 242 -267 267 335 -249 -64 -189
3983 -189 281 -132 10 213 256 -316 179 181 -243 -29 -107 512 -94 -188 267 -412 -182 47 128 123 25 -363 225
4006 225 -228 -483 -83 -232 -51 -330 197 -184 -304 -454 258 -289 -126 341 -370 46 -240 -119 34 -398
4026 -398 29 106 63 98 9 -263 233 -18 113 430 -370 199 116 -99 31 28 309 -36 -73 191 318 -296 316
4049 316 215 55 492 -158 42 151 132 339 -198 51 45 87 -14 131 -118 352 -241 -57 327 -324 -33
4070 -33 125 303 217 -126 69 15 -145 -172 174 -316 91 -175 -21 -169 -52 2 -12 55 -421 4 -246 -110
4092 -110 -316 80 -75 -288 262 -49 -273 -100 -28 -176 112 -94 -135 -114 -386 370 -71 -99 -106 85 320 147
4114 147 -18 -181 195 -25 213 225 -56 77 36 340 2 -127 263 69 -58 34 139 21 78 243 277 -100
4136 -100 83 147 -67 97 -8 241 -146 -146 333 247 -149 -243 218 -160 71 -112 -137 -106 -320 54 -297 32
4158 32 -243 44 -291 -283 -221 -120 -62 -384 230 -271 -181 -249 208 -85 -124 92 42 -158 -216 315 -178 184 132 202
4182 202 19 -118 36 121 5 -186 19 -90 -111 204 85 129 -39 33 156 -149 -108 125 -36 -167 260 118
4204 118 339 -64 366 326 99 69 -109 351 35 192 194 256 -224 -61 40 -14 -39 -216 75 -257 -134 -101 37
4227 37 -181 -56 136 -244 -131 87 -41 -93 -253 125 14 -162 -3 406 -395 -96 44 -305 62 -397 249
4248 249 -191 113 81 -254 4 35 167 -29 398 -290 113 185 -198 -35 -118 109 -76 86 136 -59 -298 45
4270 45 79 -324 278 -6 154 -131 218 -52 -33 216 7 61 -302 227 -100 248 -54 108 288 -87 9 -62
4292 -62 -150 119 -192 222 -253 -64 81 98 -164 138 131 -36 -21 -117 140 -88 -326 -121 -32 -187 96 78 -70
4315 -70 -52 -156 186 -407 87 174 -169 312 19 -51 148 -157 -88 230 -240 -161 240 -92 401 55 326 116
4337 116 -82 14 152 -54 299 319 4 448 -264 36 61 -132 157 -13 -49 -24 -117 21 242 101 242 198
4359 198 -301 238 -120 -57 82 -152 153 -289 -30 315 49 -129 394 63 -129 -111 -164 263 -258 102 50
4380 50 -351 44 -15 -78 -103 -239 -39 135 -354 66 -62 -473 -79 -259 -110 -47 -54 -15 212 -413 121 222 -272
4403 -272 438 -298 -64 179 -174 313 43 -105 69 21 -58 386 86 244 17 -177 368 -231 101 93 89 197
4425 197 75 33 531 -41 -166 491 -320 204 92 51 184 -82 115 205 -290 67 177 -147 -34 -30 66 485
4447 485 -378 -68 11 -353 -16 -71 -152 -306 -125 12 95 -436 143 -249 -375 -109 -454 50 -211 -300 14 204
4469 204 63 308 14 -231 66 -212 156 -259 -408 157 -314 -132 146 123 194 121 -84 243 -21 240 257
4490 257 -396 227 -5 214 231 -65 185 155 6 38 199 -380 267 185 61 287 -127 468 130 34 94 280
4512 280 201 -15 -15 97 -36 -451 449 -19 25 85 -283 119 -133 -164 -88 -13 -189 87 -179 -58 -126 -58 -13 -254
4536 -254 -68 -31 -199 -276 -30 90 -61 156 -194 96 -146 -95 206 -78 64 -150 24 -222 31 -124 4
4557 4 -83 -48 138 -226 163 -294 -125 -179 -46 194 131 -40 -1 367 -89 173 -258 120 -104 15 195 -34
4579 -34 42 -69 -124 313 104 75 158 -151 -188 184 210 -177 218 43 89 -202 285 -83 -281 12 -35 -9 -269
4602 -269 91 13 109 -399 61 -27 -191 -127 35 -225 -285 -81 119 74 -348 55 -137 -105 -67 -6 -48 -291 30
4625 30 296 -80 -211 241 141 -96 -123 -299 400 -27 -20 -86 -258 58 146 -142 296 -3 -136 -90 -92 81 374
4648 374 -249 -84 48 183 -146 144 229 87 48 197 168 -245 228 -63 81 84 -27 219 -133 8 96 -222
4670 -222 151 -116 173 21 357 -269 143 -20 -177 -107 -196 -312 -186 9 -172 -41 -117 192 55 -119 -155
4691 -155 -41 80 -226 -236 54 -337 -199 95 13 -86 222 -141 146 -108 69 216 6 -12 -69 42 -210 104
4713 104 -41 231 83 -149 67 99 173 -33 -39 -199 -114 221 207 169 90 245 -164 159 -207 168 -160 49 266
4736 266 4 -50 72 86 45 -59 117 -65 -98 -2 169 218 -248 -53 -172 51 34 132 -175 -19 -254 -44 104
4759 104 8 -29 58 -65 54 -107 -240 -4 -37 -203 92 56 76 -5 -168 -266 -113 244 -221 -164 -78 -56 -233 270
4783 270 -40 -150 372 -130 -99 134 37 49 -25 -106 129 120 48 82 80 213 143 283 -29 182 146 107 29 218 283
4808 283 -35 163 72 85 81 -405 99 -16 236 128 -214 -100 15 110 -16 -103 -114 93 75 -92 -242 254 166
4831 166 -510 -69 -209 -60 -114 68 -223 -118 -72 -458 208 -139 -5 -64 106 152 -171 2 43 -91 -96 148
4853 148 -154 185 -205 29 144 -295 222 211 -95 67 130 29 45 164 105 113 74 259 -45 -64 95 94 262
4876 262 -260 141 202 94 -5 305 213 -227 183 -173 13 -96 -30 149 -69 -95 -8 49 106 192 -123 -8 -147
4899 -147 -229 237 -425 0 -306 -39 106 -196 -112 -159 -203 -281 135 -332 44 -231 49 33 -14 219 -64 -340
4921 -340 -135 1 -341 -68 -254 49 -50 72 285 -97 -38 -61 55 -119 244 14 -52 -125 -224 157 -323 13
4943 13 47 -49 43 -33 58 -13 161 170 23 52 -20 209 -68 161 155 73 105 -174 50 118 -44 -13 177 -93 -59 42
4969 42 -237 30 -157 88 -78 109 -23 -176 448 -130 1 -175 -115 -137 60 -127 25 25 -277 -215 -271 -298 2
4992 2 -343 -201 -425 -149 -116 -166 -191 303 -195 -226 -42 -224 286 -180 -96 5 -309 172 142 -143 276 -141 -119
5015 -119 365 -8 401 -105 245 269 28 75 -80 118 145 48 79 -59 141 158 14 138 129 -40 -57 25 32 43
5039 43 -46 -45 -145 204 -406 92 -51 -25 405 -3 54 -116 -202 -210 22 -255 184 -173 0 64 -299 95 -199
5062 -199 323 -142 -304 -175 -83 77 -47 43 -309 165 37 -274 -3 -111 156 -142 -73 15 80 -110 197 24
5084 24 89 66 -181 364 69 173 313 174 -39 -194 -43 20 185 50 205 -77 56 9 -202 170 -160 73
5106 73 240 -86 178 7 272 212 -76 93 17 -117 -126 237 -160 199 61 78 -69 -72 169 -145 48 49 -252
5129 -252 -281 17 -399 -166 -17 43 181 -147 -60 -31 -87 -223 109 -153 87 -53 -197 290 -137 44 129 -67
5151 -67 -172 -193 28 -59 -241 151 275 -217 22 160 -78 197 46 -59 310 62 153 110 -11 207 312 -253
5173 -253 -6 8 380 175 180 256 18 -38 164 181 1 73 327 199 -40 -101 -125 -21 -69 37 -154 -315 -71
5196 -71 29 -47 -313 -251 83 -26 -2 -243 -206 -144 -24 -145 -45 -275 -78 37 70 326 -28 -115 238 -290 71
5219 71 119 -256 -160 -138 -276 -184 -66 -126 116 91 -25 5 -61 196 65 -12 -325 -37 197 -215 -56 164 211 54
5243 54 277 73 250 83 -4 -141 -267 213 -93 160 82 52 44 -26 -99 16 49 -95 -84 -108 138 -13 -143 80
5267 80 -195 -216 -185 225 -130 -85 -19 -136 1 -13 -188 -225 -45 -96 -51 -34 9 -50 1 64 -24 99 -382 -133 -26
5292 -26 -215 -81 127 41 0 163 -352 96 -215 29 257 75 419 35 -54 -25 160 -288 -69 -161 -156 84 -75
5315 -75 6 -138 333 138 -118 47 -175 83 -266 247 30 -99 216 -75 348 46 -28 -184 223 -37 79
5336 79 109 -296 66 -133 50 -46 27 -108 -160 131 -46 41 -188 -176 -252 -236 -309 12 98 210 -39 -165 122 6
5360 6 -323 -42 -229 -108 -127 28 -158 -27 -165 -152 203 100 111 -66 -165 -11 -116 34 -145 -6 -45 96
5382 96 -157 -31 -11 57 -88 -70 -25 -72 104 -272 78 -73 188 92 217 0 97 134 -38 125 131 104 5 51 14
5407 14 394 129 -142 -65 -120 -20 -189 37 59 36 43 -167 -186 -109 12 -381 -25 56 5 -62 -231 19 -224 -202
5431 -202 47 -130 -355 -163 133 -223 -169 -33 -100 -31 293 304 166 307 -199 -162 -49 5 15 103 130 -159 41
5454 41 -75 -3 150 47 83 -44 -57 -80 1 207 408 -71 -74 212 181 77 -179 -28 101 46 -14 71 246 110
5478 110 101 88 410 -373 258 -98 -59 106 -306 197 -335 112 38 86 -359 45 20 72 233 -116 59 -40 -51
5501 -51 -17 -501 74 43 202 -38 44 -133 73 48 87 -24 -102 158 -60 -30 -92 26 77 143 12 273 -66 5
5525 5 130 -408 -39 30 245 45 -45 -68 60 -11 90 33 -155 120 54 -158 76 -173 123 134 61 187 50
5548 50 240 131 147 -253 226 187 274 121 62 143 18 -69 65 112 -9 203 -76 113 191 -103 140 -188 60
5571 60 186 -239 36 143 -39 69 -41 281 -7 -241 -7 -47 -415 258 -208 195 -241 -12 -157 -21 -243
5592 -243 49 -69 -169 -89 -272 7 8 -162 168 48 40 86 41 -101 40 76 -69 6 1 248 -113 -52 -149 -54 33
5617 33 124 170 122 70 -51 349 -47 78 -57 53 137 -108 39 53 -17 205 74 332 -297 46 -20 -81 -262
5640 -262 -294 -64 54 71 38 21 -182 160 23 149 -349 72 129 37 37 -227 247 -201 -110 199 -155 52 -78
5663 -78 -174 -277 -89 -191 -44 -23 95 114 -88 167 -88 170 146 -68 -42 -40 30 237 131 -151 330 45 -123
5686 -123 84 28 87 -38 57 78 26 -17 -151 177 -56 -19 -82 237 -175 161 -48 0 125 -22 -159 -56 151
5709 151 69 -26 -109 27 1 89 167 -185 6 118 -58 -51 150 -47 -68 266 -121 -104 -99 -90 -31 -147 -99 -46 6 -254
5735 -254 -179 -166 -20 61 209 89 -55 -13 3 -39 -51 -221 -165 -130 103 -264 11 -146 79 -251 10 80 38 24
5759 24 -118 100 -132 269 89 -5 122 -79 -64 -23 36 -106 295 172 81 105 60 141 -138 -131 97 227 -18 104
5783 104 -6 33 151 -81 -47 79 -1 -5 -5 -71 -108 140 183 231 -25 36 41 -246 -248 -305 -175 -181 -258 10 149 -160 -25
5810 -25 104 -73 -21 34 -96 -131 68 126 -165 -9 5 192 43 -64 -234 -132 -199 50 2 28 -106 -168 247
5833 247 -46 -216 85 -102 -36 -69 52 29 127 -274 -69 -23 -289 103 -156 115 91 162 18 66 69 -95 129
5856 129 -139 234 -56 -6 11 38 131 -59 188 -119 128 -132 73 11 -97 -67 223 -120 -60 8 -39 112 39
5879 39 37 16 -259 86 -41 -37 -182 176 -201 -110 112 38 229 83 91 -170 -156 141 22 -18 88 16 -94 162
5903 162 -32 106 92 -110 91 64 194 -175 231 382 148 177 21 -52 -39 -226 8 53 -1 102 164 -26 -60
5926 -60 -98 31 -32 -1 73 109 66 -92 218 -155 91 -81 64 147 -93 124 -29 -64 -53 79 -73 -39 44 -5
5950 -5 -59 1 141 -106 28 17 66 12 46 0 -56 -10 -349 63 -188 -102 123 114 172 -133 131 -171 30 114 5
5975 5 -142 70 -150 -162 181 -32 212 -49 172 158 53 28 -53 188 -85 93 -103 125 -48 -260 326 30
5997 30 -28 138 -15 67 93 57 84 108 -95 -58 132 -73 -80 -89 153 -115 85 189 243 -8 -74 -289 21 -223 -105
6022 -105 56 -143 352 92 -186 -55 -295 -7 48 -23 87 -18 -33 -122 -224 -129 -101 -286 -59 195 250 -90
6044 -90 227 -132 -123 -119 -181 89 -272 33 89 209 107 -19 45 128 -70 115 -96 -130 -21 70 -140 76 70 140 16
6069 16 86 66 -142 -167 54 141 68 235 -20 84 47 -205 -48 -18 124 -13 107 56 -20 53 26 -248 -6 105
6093 105 -92 99 44 28 71 -37 65 208 -44 20 -31 -138 -93 132 34 70 -245 -12 -132 92 236 43 148
6116 148 -11 7 117 -164 -169 -137 -276 24 43 -120 44 73 -131 190 97 28 117 -221 -161 299 -291 14 -172
6139 -172 -7 -200 -13 90 -92 67 -81 173 -163 57 -85 127 -174 -137 382 -104 -39 -82 -78 -192 104 -234
6161 -234 141 67 -281 -86 19 62 -142 72 -87 -75 255 35 -165 -243 41 -7 -50 126 -196 259 5 180
6183 180 331 -94 55 -6 202 -18 -330 -228 -65 -19 45 44 -31 35 -183 -8 188 -292 87 130 89 -70 75
6206 75 33 28 -10 144 -73 -202 225 17 193 104 138 26 78 -37 86 -71 149 208 46 28 -152 -63 156 35
6230 35 -43 61 -53 -248 179 13 27 -87 230 55 -21 104 -91 -4 39 10 -176 -113 -98 284 92 -398 -69
6253 -69 -73 -122 -48 -343 -90 155 -66 -125 -137 -27 51 -8 21 -335 -123 54 -235 12 -78 -89 84 21 227 34
6277 34 196 90 -105 -38 51 -4 -5 116 -217 -138 17 112 70 25 31 69 -96 43 74 -75 -179 94 95 371 -144
6302 -144 124 26 -23 189 119 -213 -102 -52 136 66 -239 30 -139 -111 118 -110 27 -96 385 -173 58 -186
6324 -186 46 -152 -443 -54 33 52 -144 76 132 -50 60 77 36 -194 -36 -106 3 -46 -486 50 -89 185
6346 185 79 88 97 41 19 214 -212 45 -184 160 48 -1 -47 132 29 -11 -114 224 53 232 70 64 30 57
6370 57 -195 336 -88 45 16 75 155 26 177 25 -53 184 -311 106 -151 -234 -245 25 -73 -76 125 265 6
6393 6 212 155 216 -148 -44 -27 -403 -60 -45 -70 -95 102 116 56 -22 11 29 -211 -155 -113 67 142 -141 232 234 -396
6419 -396 26 6 5 -181 -89 -199 -143 -155 -104 90 -82 58 -204 32 193 23 205 23 63 161 -68 -16 57 55
6443 55 -283 -61 3 26 100 -108 186 93 228 -116 -89 93 400 -3 0 -17 112 146 60 -95 -156 16 -42 -39 -55
6468 -55 53 -53 -37 -17 -153 36 151 -52 -107 -241 52 -223 75 140 18 19 139 -161 -227 87 -34 -293 -193
6491 -193 28 179 -94 118 142 131 -139 98 -189 21 -159 126 -39 95 232 -81 7 -199 -96 -81 226
6512 226 180 155 -151 -105 100 7 122 138 -121 142 -7 -1 144 35 184 54 -8 -185 48 150 100 -181 62
6535 62 50 -28 -150 -216 58 177 -130 173 -307 -29 -14 -146 -128 -367 -289 44 -34 -222 99 132 -73 22 -91
6558 -91 -113 67 -99 59 -199 -87 -39 -8 -16 -31 -25 129 11 -46 77 196 -173 287 94 75 -64 193 -120 -373
6582 -373 103 56 -60 -39 200 -120 149 71 58 65 -247 1 27 39 79 -51 -103 4 205 -222 242 -234 134
6605 134 54 -166 213 -132 -160 8 -142 83 139 -71 10 -114 -50 10 -81 3 30 -3 -14 -12 -9 51 88 -118 -234 140
6631 140 -56 60 -22 -27 62 -40 -203 67 -95 -292 8 -162 -120 -77 162 -175 250 135 114 -128 -114 45 -11
6654 -11 166 46 -35 -188 -54 0 98 -27 55 209 111 94 112 81 130 -190 -119 81 -34 179 -15 218 127 -116
6678 -116 -327 109 -42 91 -59 -27 -151 269 76 -111 -144 -279 -62 -57 -92 -100 -109 165 9 -3 -32 44 332 -46
6702 -46 -181 73 16 -188 23 17 -30 -96 133 -118 -330 -245 -40 110 -114 -123 -180 122 -228 -137 42 -89 184 -165
6726 -165 -21 -121 -46 78 -17 84 29 247 -39 215 162 100 116 -16 -11 -196 226 45 369 -36 261 -66 7
6749 7 52 -104 187 -83 -21 81 100 17 -170 -66 -153 51 -142 -5 114 12 -11 -318 25 60 92 -123 69
6772 69 74 -43 -138 52 1 -63 119 -98 68 -14 -189 132 250 -93 -135 5 -174 -3 -13 -19 257 -209 -134 -17
6796 -17 -13 70 -209 169 -60 -61 5 -40 18 126 272 -73 68 -156 345 185 -253 -8 137 179 88 34 244 69
6820 69 7 20 7 -271 125 187 25 -115 57 -60 -16 -261 234 -199 -146 89 -214 1 -185 47 141 -117 -74
6843 -74 -96 -36 -266 -98 58 115 -131 140 99 -81 -207 116 -38 -344 -204 -77 76 -2 -130 23 -19 63 -53
6866 -53 -91 37 -181 91 -72 53 -186 50 -160 -23 229 188 132 -235 104 224 -21 32 90 111 41 248 -99
6889 -99 -64 -40 215 203 -149 33 -330 210 144 -107 37 211 -167 -96 -154 -93 -2 -25 267 19 213 -29 -239
6912 -239 -161 -244 55 4 30 -314 171 18 94 -212 7 -48 50 -27 -265 5 -162 -75 -92 -54 186 -118 19 -59
6936 -59 -265 -58 -103 99 -204 -41 81 162 29 81 -50 242 -77 -94 100 -27 115 25 23 -110 -6 78 260
6959 260 141 -42 278 140 -129 -53 -47 -8 125 63 -82 126 -162 -50 -23 52 -155 -247 -17 -28 -130 95 -184
6982 -184 225 99 16 25 177 -59 -4 94 120 313 145 324 16 17 -147 -114 -170 81 -116 -259 -72 17 43 -240
7006 -240 -80 -113 -90 -61 -21 -16 42 -265 -4 245 -68 -39 -175 42 -44 -37 -26 -87 -225 54 -147 -96 225 40 223
7031 223 6 23 99 183 59 151 149 197 -44 71 129 146 85 -36 -112 136 -52 -152 -4 -147 -33 -1 -106 66
7055 66 -43 197 -85 147 -197 35 68 -287 450 68 15 -130 -4 77 3 73 -241 -189 -65 263 -225 -96
7077 -96 18 -70 -39 -115 90 -81 83 -186 -95 112 -341 27 -169 61 -61 -232 23 -9 226 173 143 185 -19
7100 -19 253 112 -253 204 -123 148 101 -145 44 -112 92 282 106 -341 -63 254 45 -63 -72 -69 181 46
7122 46 -211 49 181 -166 -78 -46 -34 -120 56 -38 -46 -109 -325 -17 225 -59 226 119 -155 -157 -90 97 121 -57
7146 -57 -13 55 -156 -123 -80 -39 -166 -271 -17 62 -152 -115 183 -186 29 141 49 221 75 225 34 259 18
7169 18 260 32 371 -34 114 175 9 193 -133 -136 -52 17 -250 75 -39 58 146 -103 -27 -165 -65 82 -104
7192 -104 151 76 59 -262 -222 13 -94 -93 -67 -214 182 51 -104 85 181 -101 -87 -263 50 64 -246 60 -130
7215 -130 -221 59 76 -80 93 -133 -11 -217 32 -100 74 40 242 131 -27 160 73 -29 -209 4 56 -223
7237 -223 2 -171 -143 -350 -22 124 223 125 5 127 -170 35 -25 93 179 -2 2 128 -281 28 47 -95 65
7260 65 -209 229 163 53 100 123 154 -183 145 29 24 -25 37 -54 -195 52 -153 132 -119 -20 -128 -42 128 -35
7284 -35 -110 -207 -268 -116 59 49 -109 137 -200 -47 -38 -147 140 45 -62 -69 183 21 219 12 184 59 -31 58
7308 58 240 104 -100 224 -255 221 -48 16 -115 -99 -206 -329 100 -76 -269 231 109 148 233 143 46 141 -7
7331 -7 114 96 70 -3 -40 -124 -123 92 73 -252 78 -54 99 -95 -17 94 132 -84 -154 31 -233 159 65 117 29
7356 29 -12 -189 260 -103 -145 -114 -42 -22 26 -197 69 52 -158 126 -69 27 184 -101 -100 -359 -195 -208 -76 48
7380 48 247 -38 -114 -106 168 -21 135 -103 232 174 120 -86 -174 61 -159 140 205 -25 -121 126 -324 143 62
7403 62 38 180 -10 -43 25 -17 -111 25 173 -68 48 83 -140 -103 -56 -91 76 -256 -10 94 -14 83 -97 36
7427 36 26 -40 -21 -116 147 -262 -42 -130 -74 169 -173 -57 -114 -175 7 -7 61 -43 47 -218 -41 27 -207 32
7451 32 -19 59 120 279 -115 143 64 -93 67 -64 -300 -103 26 -77 87 -17 15 216 73 48 -25 135 228
7474 228 -145 137 -18 -44 2 -20 -161 -102 -269 -107 177 49 -102 -89 -116 47 -162 63 162 -97 166 -149
7496 -149 13 57 -111 215 -65 38 -217 105 101 145 -124 28 31 170 2 21 187 5 41 -36 -56 -63 209 7
7520 7 -35 -43 134 -2 58 44 -32 -7 -20 83 107 80 -206 -66 -160 -68 -147 -180 108 178 168 -108 80 -162 -100 -92 5
7547 5 -85 117 -61 -64 -128 -25 -37 -227 15 -151 -91 126 -28 -260 -56 -271 -77 -72 -26 -139 -162 -128 92 118 -236
7572 -236 21 -5 -7 198 75 45 81 -86 137 154 78 -17 66 140 -112 44 14 -91 280 125 -142 62 -1 -180
7596 -180 54 -285 -229 -33 -19 138 -164 293 -1 129 95 -77 -168 -206 -87 60 100 3 63 -238 -154 9 44
7619 44 102 -138 -216 -288 4 110 54 87 156 20 -70 79 -2 25 -196 210 -31 47 33 96 -115 -142 -145 -3 -87 -73
7645 -73 67 -134 -28 -38 39 41 9 -3 214 77 -68 -65 -171 -309 115 -31 -52 73 -15 -164 97 -61 88 91
7669 91 -90 324 -59 -158 -248 39 130 -20 129 89 174 155 -23 -113 -119 -130 -20 208 -49 -246 -119 -78 -2 155
7693 155 -9 -17 55 -389 -154 -38 7 -127 105 -14 -146 61 -62 -43 98 -106 -23 107 -14 -300 88 166
7715 166 172 436 -130 -28 -133 -125 64 211 118 0 73 142 60 103 107 27 91 28 -134 81 75 25 14 60 -166 199
7741 199 -168 222 133 -42 16 -223 -78 -205 83 -24 8 -118 -203 -197 54 -130 -228 202 106 -46 122 -28 -120
7764 -120 -219 -237 -198 -239 -150 -85 -32 -96 64 180 217 -90 25 51 -41 206 53 155 10 52 84 34 -44 -56 -24 -47
7790 -47 -20 -13 -73 137 -170 36 111 -68 35 66 94 -230 -12 110 130 20 -154 -59 103 -93 25 -158 117
7813 117 -56 -150 -147 -92 68 -98 -186 -275 -147 131 -219 121 -178 -21 121 37 107 -110 -5 -269 13 -109 177
7836 177 -53 -126 -77 25 -30 86 -208 74 136 -34 78 117 -48 12 -200 82 -131 159 173 30 33 -30 21 -92
7860 -92 -154 22 -11 -262 73 -33 -181 347 -105 -54 1 49 -111 -71 26 -31 62 115 -128 -93 -68 69 -396 -106
7884 -106 -13 13 -54 -171 -188 123 192 -7 212 -66 53 70 -114 -63 10 -160 -31 -235 -77 61 161 42 42
7907 42 274 69 -147 0 -1 -159 -164 -140 -192 29 42 -57 -42 118 70 -23 140 -10 -63 -75 123 -56 169 -23 126
7932 126 121 -96 -15 141 68 -170 -82 -78 49 -65 77 281 -44 75 39 -79 108 -49 26 125 24 -94 -199
7955 -199 -43 37 179 77 -226 4 156 -258 -148 63 -270 -59 203 280 118 -225 -135 36 -16 245 -302
7976 -302 -150 -24 -93 134 23 -3 -5 -105 40 4 -74 -127 -115 -8 -12 17 116 -94 151 -19 -47 184 103 198 82
8001 82 93 -52 -94 94 223 48 78 -271 78 111 117 -42 -80 -153 -185 -209 -9 37 108 227 -80 86 119 -105 -19
8026 -19 -234 136 135 95 45 -128 -92 -56 6 -110 34 -186 67 -213 -27 105 -126 -16 -168 -41 -61 151 -122
8049 -122 -188 -42 152 30 -108 147 -96 -73 48 31 -421 2 -31 -165 4 -108 2 77 157 -135 -29 -90
8071 -90 -230 -23 -15 172 -20 -156 199 70 -130 -15 189 101 90 -96 41 -307 5 26 13 53 207 141 -43
8094 -43 192 -25 -4 -74 74 -3 86 39 -306 -358 14 119 145 -98 60 135 -3 183 -174 76 108 -155 61
8117 61 112 -61 -17 56 49 75 117 -53 -162 12 -193 -107 168 47 -86 17 -162 -30 -71 25 82 -283 135 -64
8141 -64 12 111 201 233 -89 72 -272 62 26 -18 119 71 70 144 235 -321 149 73 -74 -116 12 245 -45 77 86
8166 86 77 7 -57 -133 76 -338 -62 -22 88 -128 135 -94 -130 53 47 -118 -152 -34 -100 145 52 -85 61 100 -25
8191b5
$$ Imaginary data points
##PAGE= N=2
##DATA TABLE= (X++(I..I)), XYDATA
0 0 0 0 0 0 0 0 -8 1 -8 8 -8 16 -16 24 -24 32 -40 51 -64 74 -88 109 -128 152 -176 208 -240 276 -318 365 -419
31 -419 475 -539 610 -688 776 -870 974 -1087 1212 -1347 1497 -1660 1838 -2031 2242 -2473
47 -2473 2726 -3005 3307 -3645 4013 -4425 4885 -5400 5979 -6643 7403 -8293 9343 -10610
61 -10610 12170 -14145 16740 -20306 25532 -33945 49684 -89114 393608 526042 -265022
72 -265022 233336 379220 76595 65606 330388 131965 -82008 180449 297032 -153940
82 -153940 -35074 195064 -51335 -41340 51187 20097 11834 -93472 -28461 56782 -34265 -49380
94 -49380 38833 48811 15979 -105376 20798 32814 -156132 -203 17939 -150887 -33444
105 -33444 49628 -90005 -117056 -33993 32395 -34896 -79362 58406 -25122 -59666 -9249 -76845
117 -76845 3439 -1013 -120345 -18034 34076 -78141 -22632 -23656 -82591 -62840 7701 23442
129 23442 -130087 -19804 86007 -112828 -69399 109998 -16707 -57609 87847 57742 4073
140 4073 25957 77112 -4097 -8809 129338 18963 -39605 97240 69618 -25095 37496 47088
152 47088 22882 27273 28889 48173 -5875 21920 17598 -41931 11631 39011 -8650 -28734 540
165 540 47770 42000 -75428 -30366 52906 -326 -92 3194 -13059 -31084 18558 32763 -53645
178 -53645 -32010 69806 -3047 -55508 57686 -2416 -66981 -7072 11797 -25646 -28998 14788
190 14788 -32870 -38948 19489 -24195 -69941 32992 17999 -64253 5742 -413 -39053 -16328
202 -16328 4554 -42938 -41636 43650 8079 -62414 2968 37698 -55377 -12709 41234 -6012
214 -6012 -15082 -4047 16312 342 9835 9840 -15098 6893 48649 25228 -7893 -879 -4147 33673
228 33673 -2355 -22798 27353 11239 -20711 -8019 25017 -4939 -20176 12878 19929 -17362
240 -17362 13693 20536 -50148 10353 37423 -26274 -26515 27578 10172 -28017 10059 7350 -24007
253 -24007 3316 28385 -44292 -14504 47206 -31186 -39249 24133 18568 -34763 -4666 17118
265 17118 -14706 -1569 21744 -19804 -32252 40986 2760 -37682 645 10570 -4842 -7297
277 -7297 9748 -1516 3433 1447 -7499 -5874 20220 6128 -22480 15772 4270 -7442 1014
290 1014 3869 3678 11332 9917 -9320 9684 17905 5057 -18886 8218 18745 4336 15107
303 15107 -8911 -2074 21863 13290 -17599 12191 29169 -9270 -5774 20944 12956 -22449 8174
316 8174 4425 -19991 18421 23820 -22974 -26173 25876 -606 -27626 -1072 15433 -13172 -19263
329 -19263 13936 -5599 -10605 -2703 -2984 -6672 13924 16059 -13658 -5715 330 2346 -11428 -4199
343 -4199 360 -2701 -2924 -18083 -13480 -5696 950 -24035 -15858 6497 3058 -8624 -21162 -1472
357 -1472 -2108 -4881 -45 10702 707 759 11421 -6535 -1049 9407 14923 -15472 -5952 29439
371 29439 2153 -20243 1930 12389 -15841 669 13401 7407 -2647 -2245 3916 -12349 9307
384 9307 9172 -11335 -4633 13337 6101 -5911 -8171 -7464 10657 -6072 574 8160 4544 3960 -12659
399 -12659 -1044 10535 9347 3032 6069 2751 16560 9347 -6834 9195 -2639 6477 9397
412 9397 1867 167 -3437 -2688 -13277 -14299 6750 7479 -32720 -2161 11191 -26119 -15314 -898
426 -898 -6112 -24031 -1445 10772 -16365 -9910 13972 -23561 -25183 30436 191 -17702 415
439 415 7568 -3855 -14226 3159 -7149 -9934 14275 1971 -22139 14936 2654 -27180 3423
452 3423 5472 4015 -3027 5149 3259 -14536 6436 13644 -16624 588 27640 -9291 -1643 9073
466 9073 3012 -1627 -11102 15801 7939 -4629 13496 9520 -5971 9658 5816 6606 15054 2245
480 2245 25777 3182 -4284 26911 7370 -6476 6920 16314 13405 1485 -1271 15864 -10443
493 -10443 45 15840 -16310 13137 13564 -10199 1489 4883 96 -75 738 12663 3868 -3376
507 -3376 24232 -11872 -6935 26166 -9030 -3810 18889 12705 -5510 -7271 11624 10169 -16461
520 -16461 13401 17034 -20763 16342 11213 -12021 695 5684 5506 -8002 1082 22841 -3400
533 -3400 -20381 15046 -1190 -3915 5953 -10962 8194 2551 -1291 -979 -12891 3965 10306 -13717
547 -13717 3028 11273 -8375 8872 -6722 -6798 4380 -65 9013 -10618 -4185 16064 -11449
560 -11449 -16187 13916 -7752 -10128 4972 -2780 -229 -15881 3532 1222 -24802 4388 10969
573 10969 -16655 -6471 6542 -8978 -10307 -9079 11671 -7354 -22611 15896 -2351 -14822
585 -14822 2283 -1592 -7922 415 908 2126 -4888 446 11708 -16736 459 11069 -7207 4126
599 4126 2138 -2298 2808 2111 -1994 -1594 -2682 11342 -4235 -6148 20756 -8976 -11363 8434
613 8434 3837 -2895 -115 7007 -3462 -10722 10066 8753 -23944 4211 12255 -13247 -684 5848
627 5848 1545 -14162 -4962 11222 -2262 -8231 6736 -5786 -7121 12168 -7378 -8390 -2989
640 -2989 4582 4449 -12247 -827 2753 -4168 -4 -2322 -12032 8892 6150 -6725 -1978 -4625
654 -4625 6497 -3275 -398 5537 -7678 1268 12979 -2111 -6957 4147 -800 4851 -212 6885
668 6885 5316 -10845 8397 6906 -4397 1464 7258 3421 87 -1118 8669 3298 -10008 10173
682 10173 939 -2764 5756 584 -30 -3119 3689 2819 -6743 -53 10936 -8935 -2224 7190 -6456
697 -6456 2982 -900 -3957 -3834 3066 5446 -9879 -3911 8610 -10252 -11869 15363 -7565 -12463
711 -12463 5845 -1442 -8811 -4091 10202 -9760 -16318 13152 8750 -17548 3367 8894 -11786
724 -11786 1655 4634 3244 -4050 490 7650 -7226 2221 9517 -5772 -5156 8227 322 6785
738 6785 1310 -7615 7330 2579 3159 -1052 1923 7194 -1806 1534 6931 -4902 -1440 10412 -7013
753 -7013 1427 5047 -715 4338 -4127 -1096 1108 3093 4619 660 -214 3028 -4503 4871 9625
768 9625 -15923 1996 10279 -4766 -2687 346 -4201 -9712 218 4896 -6774 -9755 7694 -7626
782 -7626 -10507 8185 -7821 -7046 558 685 -2186 -3827 -2433 -3570 -4130 2121 276 -9505 8193
797 8193 215 -7538 3105 -1818 413 1978 2414 2183 1762 1035 5348 -2029 -1041 6752 -362 4439
813 4439 -1776 3283 6341 -8359 -1730 9023 -1209 -5308 7251 879 -2327 211 5376 -2165
827 -2165 -5965 14426 2631 -6770 6281 6782 -3565 2456 4809 -1193 2680 1969 3405 -3313 957
842 957 -742 -5380 4889 -1515 -6379 1033 2246 -8497 213 1677 -7698 -3567 2093 1576 -9561
857 -9561 937 1642 -9396 -4442 2416 -2270 -6052 -472 -4457 113 -1980 -3912 -796 -712 -305 124
873 124 6676 -3016 -3435 6952 4299 -5992 4184 11369 -6420 453 9243 -453 -6977 7072
887 7072 5664 -6902 4968 6183 -2495 -1212 7985 -1901 -1935 9612 2378 -1158 4677 4781 -3812
902 -3812 6712 5904 -4449 3797 7887 751 -3932 8325 1812 -4875 3869 5589 -2731 59 6523
917 6523 -5090 -369 2333 -1239 -1975 -85 617 -2839 876 -3467 -4372 -18 888 -7129 -215 4042
933 4042 -9159 -196 2178 -5777 -5720 4453 1296 -6662 831 578 -5609 -2419 7657 -5914 -3411
948 -3411 6576 -3711 -672 2618 -1879 -4463 5739 2947 -5112 1476 6427 -4563 -6234 11410
962 11410 -1907 -5339 7547 1629 -5700 1468 7874 -3042 -3517 5043 4652 -5605 2940 5486
976 5486 -5393 2395 1769 1801 1390 33 2229 1350 -1000 1144 4411 -116 1062 -2151 4818 952
992 952 -3946 4868 -2395 -3553 2132 1497 -3409 -2531 -3032 -699 -773 -3864 -787 -4799 558 -3700 -5350
1009 -5350 3336 -4085 -5474 2165 -302 -7176 1998 1180 -4726 -4319 3310 4083 -8505 3368 3856
1024 3856 -7001 -497 5593 -1287 -2825 2116 1029 159 -2977 4557 -950 -3319 4069 -1169 1928
1039 1928 23 -2175 1376 1412 -3381 3570 2835 -2420 1215 -592 4260 -1411 410 3999 -2839 3136
1055 3136 4252 -2161 992 3843 -3920 3243 2307 -2262 1736 423 702 -5496 2731 3906 -8284
1070 -8284 -349 6587 -7412 -4100 8043 -5660 -6272 1622 3198 -4466 -4521 6456 -6002 -6522 6573
1085 6573 -497 -7973 3653 -215 -3921 2458 -1325 -393 -2899 2991 736 -4794 5373 208 -5758
1100 -5758 4228 2723 -5942 3836 693 -2344 633 613 2719 -5827 1281 3980 -4187 542 3877
1115 3877 -2223 1675 1799 -2540 5748 -1468 1048 5546 -67 1037 479 4506 791 -3080 5392
1130 5392 4587 -6484 5613 5384 -8281 3054 3388 102 -1235 1486 3160 -4903 549 4296 -5431
1145 -5431 -2104 6314 -6068 209 3108 -6937 -810 -8 -109 -4304 -1931 2972 -4834 -3417 5432
1160 5432 -5997 -6987 8957 -2748 -3584 1440 -182 3 -3222 3514 1272 -4120 2855 3182 -4260
1175 -4260 3150 56 -3235 3465 -3934 3139 2409 -5097 3 687 -11 -533 -2073 1266 1512 -2812
1191 -2812 6362 -1836 -4063 7232 -934 1102 3556 -149 2259 1896 149 1773 -581 2693 2461
1206 2461 -4397 6705 -1428 -5870 6718 -608 -3875 1490 1571 -1221 -1427 835 2162 -7373 1060
1221 1060 7452 -8288 -70 1772 -3656 168 -1024 -2024 -1334 -2662 835 782 -5510 2193 -1915
1236 -1915 -383 3085 -5237 3615 1182 -4125 3104 1774 -2862 1992 -756 -40 1598 -3138 2641
1251 2641 -3326 -573 3459 -3641 1416 -261 -3341 4684 2492 -5741 4069 2708 -972 1907 947
1266 947 2983 -4255 2993 6833 -5771 -350 6804 -3721 -1858 5819 -1055 -731 -1329 3222 1577
1281 1577 -2842 4576 -1448 -1856 4638 -81 -2197 3319 -2654 -499 3372 -4020 -396 -776 618
1296 618 -2487 -3612 3115 -2077 -4575 2559 -1169 -5596 3238 -1251 -2698 34 -2337 737 -2267
1311 -2267 -90 -417 -2328 128 -785 -1408 3463 -1688 -5197 5823 -200 -1844 3528 517 -1652
1326 -1652 -196 6515 961 -4179 3041 4771 -3838 2668 4205 -4403 1483 2890 1302 -868 902
1341 902 2031 -1424 1348 2520 -505 490 3916 -2076 1936 3546 -2423 1394 2489 1400 -1409
1356 -1409 1712 2199 -1113 -444 2533 -964 -2156 3810 -970 -1618 -447 -299 459 -2078 -1055 -671
1372 -671 -667 -2142 -545 -1176 -1289 -2755 -2062 743 -4039 -555 163 -3176 -3229 -245 -144 -2922 -1038 -558
1390 -558 -292 -2349 693 -1187 -2149 1196 -500 338 -149 388 -823 173 141 -744 885 1215 435 -1507
1408 -1507 2239 -28 -1422 992 920 125 -205 2604 -49 -140 576 1192 303 173 2309 1116 926 -986
1426 -986 1961 1482 298 1210 2094 1589 -282 3099 713 -1133 97 2431 466 -707 2045 -1011
1442 -1011 -1271 -1138 603 -1630 -1537 -192 -1848 -138 -1630 -1824 -2347 -65 -1726 -1287 587 -1428 -1512
1459 -1512 -1118 1303 -2276 -1525 2212 -45 -1916 675 2270 -2336 -726 968 900 -935 449 2111
1475 2111 -1937 258 854 221 -936 445 1086 1202 -76 -547 1514 -1340 89 797 1215 -74 -718
1492 -718 2212 -67 -1106 441 1823 -840 948 2288 792 516 -460 2096 -411 1216 1704 496
1508 496 1478 580 -651 530 792 -2765 860 585 -1661 -1802 -498 -269 -5082 -870 782 -3448 -1623
1525 -1623 2301 -2111 -3636 1767 251 -1063 -1511 2408 116 -1442 2437 -451 -2256 107 902
1540 902 -520 699 -1572 -799 301 -1746 -161 -1852 797 -353 -1071 2434 -507 -2578 1103 1127
1556 1127 -1578 2045 513 440 -187 -572 1963 -1862 408 1341 215 1661 1173 -874 1411 575 -673
1573 -673 4231 -20 287 2380 2141 821 -1977 2388 1925 -1939 1818 3409 -3694 228 2112 -2098
1589 -2098 -50 -893 856 -1892 -1151 1420 -2781 -2047 963 -1914 -1059 2237 -3196 241 672 -1936
1605 -1936 1 -957 1417 -564 -1130 2305 -738 -2540 2632 -493 -2767 2200 -835 139 -1447 -774
1621 -774 1207 -3108 -447 2145 -1261 -956 387 -1465 1497 -924 -652 1969 -3112 1897 2384 -1139
1637 -1139 -11 -392 429 1544 -314 825 888 -2363 3343 242 -948 2190 -1646 1097 2556 -231
1653 -231 708 916 -320 1100 -282 1511 1282 -3091 3595 -288 -2562 2515 -503 -1757 72 10
1669 10 334 -768 -2049 2115 -2316 -1037 2361 -2449 789 -514 -1242 1351 -1536 -806 1918 -1965
1685 -1965 -1058 1442 -1021 1184 -2287 122 1189 -3024 2228 621 -2793 1132 1009 -1127 1558
1700 1558 -887 -352 1095 -653 2290 -1642 508 1365 -2294 2301 1930 -2823 1373 2605 -2495 1100
1716 1100 1011 567 -591 -179 4097 -2402 -559 4144 -1275 -1411 3076 -369 -201 1007 -172 1549
1732 1549 -1619 1146 651 -1894 1947 -288 -1045 1153 -1330 -1076 2466 -1964 -1222 781 -685 490
1748 490 -2401 373 -439 -2938 922 -464 -3073 352 295 -2254 451 -1971 291 256 -2446 667
1764 667 -773 436 -56 -1244 778 -363 -2160 2794 -34 -2938 2764 252 -803 -128 477 589
1780 589 -2050 1104 1917 -1953 -9 2322 -1833 643 1397 -701 1631 -278 1100 653 176 1096
1796 1096 -45 876 2329 -219 301 2546 -1825 1152 1579 -295 644 109 1961 -632 -728 1517 59
1813 59 -1677 1651 558 -801 694 -1197 510 -957 -1143 540 -699 -357 -302 -244 -1003 -1312 -808 1267
1831 1267 -2154 -1277 1622 -1976 -858 -755 -280 -698 -590 511 -401 -1178 385 156 -1945 899 -645
1848 -645 -269 932 -1321 -28 260 -81 -783 727 747 281 -722 1148 538 -1464 1641 27 -217
1865 -217 1268 1601 842 -550 876 1213 846 129 1688 522 1273 1250 -157 1779 -787 448 1647
1882 1647 313 -129 778 442 -376 -444 342 848 -1457 723 292 -1068 592 -200 -549 -363 173 -424
1900 -424 125 -537 -282 -423 -689 -410 -1750 1256 -54 -2108 234 241 -1522 -1112 559 -1331 -1023 -253
1918 -253 784 -1638 -1254 1447 -2023 -497 556 -146 -718 -84 -297 -58 61 -519 70 241 1079 -143
1936 -143 437 1149 -1660 643 1538 -311 -457 2333 866 -872 849 1200 87 -434 2564 -222 -205
1953 -205 1217 78 -371 206 661 -499 814 -214 -256 -20 33 -1092 -702 1747 -1226 -940 1264 258
1971 258 -1824 229 972 -1795 -218 1118 234 -2187 255 -5 -2181 -8 156 -484 -1032 486 -627
1988 -627 -562 -8 -650 -47 -155 428 -265 734 -710 -1409 818 307 -594 -90 1664 -665 -472 720 301
2007 301 -408 483 1409 -625 997 455 650 179 25 562 577 1036 -544 627 741 11 -788 1216 492
2026 492 -1297 1239 895 -687 -556 1063 -311 -1143 1111 558 -796 -605 1080 -810 -289 103 -453
2043 -453 18 -718 388 -509 -59 -650 -444 341 -249 -697 -56 761 -1819 86 318 -942 -55 -153 339
2062 339 -793 -187 -78 -103 -436 267 -12 -50 617 -855 1028 -177 -546 681 453 -463 383 1281 -50
2081 -50 -170 331 1529 -988 453 2547 -892 565 1293 364 -227 646 386 163 83 604 426 -578
2099 -578 1430 -798 -297 1336 -718 31 1127 -446 -876 957 -83 -139 -837 779 238 -1873 1136
2116 1136 -585 -1252 252 -194 -679 52 -589 -160 1 -1238 432 -832 -82 -105 -738 1021 -860 -1104
2134 -1104 801 -557 -1494 574 -5 -1019 141 -41 -1 -1320 656 535 -1372 961 421 -915 616
2151 616 451 -422 1344 -318 21 720 213 640 -1084 1197 963 -1065 857 1422 -1142 372 1695
2168 1695 -734 77 260 1028 -544 -388 1578 -818 -668 607 -203 -444 207 -617 -8 32 -1080 888
2186 888 -793 -34 -456 -230 855 -836 -209 653 -820 -952 1053 -992 -354 -140 -477 131 -1327 312
2204 312 -37 -963 332 -29 -711 224 -420 -709 681 -1485 146 477 -442 105 -371 914 -227 -428
2222 -428 1031 228 -1297 1795 695 -1275 828 388 1182 -221 313 1192 -539 486 941 -67 -5
2239 -5 1010 5 1183 -162 -59 1196 -602 345 142 341 490 -113 51 785 -775 -151 1006 -1028
2257 -1028 413 3 238 246 -1404 614 -74 -885 -76 267 -377 -26 -239 -56 -304 -1395 1294 -363
2275 -363 -1024 -13 -233 -219 -911 -241 -278 -636 -471 1203 -1323 -563 359 -780 29 -474 150 300 -368
2294 -368 -4 193 -345 391 316 -281 1282 -743 341 1007 -889 494 325 533 39 72 706 561 -905
2313 -905 1318 612 -980 910 -254 449 421 -163 614 -114 -415 462 524 -210 205 -890 478 -435 -623
2332 -623 1341 -1153 -400 742 286 -581 -202 -426 100 -625 -128 595 -1629 186 256 -962 667 -703
2350 -703 -396 50 -540 -563 105 -874 -254 -813 -112 619 -1652 683 -10 -1587 184 481 -781 -234 334
2369 334 87 -130 -985 1134 -200 -420 1114 -373 391 685 -406 320 296 -27 955 515 -19 686 -40
2388 -40 1328 -419 241 1327 -682 245 1142 129 -261 397 -406 347 -320 -138 522 -680 1007 -116
2406 -116 -429 418 -230 127 637 -794 -570 794 -596 153 -120 170 -20 -1110 1115 -245 -1064 703
2424 703 -1 -845 146 -169 -238 -69 -720 769 -679 -327 357 -503 206 -31 -347 -44 -220 -718 790
2443 790 55 -302 352 98 381 -425 558 792 -587 472 1020 -104 -3 1196 -54 406 -227 526
2461 526 812 -182 807 69 360 236 404 519 655 -552 409 771 -848 726 204 100 -111 337 693
2480 693 -447 -235 526 209 -857 499 -251 20 130 -195 413 -471 -167 30 -191 -550 -219 -418 -226
2499 -226 -163 -377 326 -967 -189 40 -153 -391 -420 317 -572 -421 -243 -73 -859 -27 198 -500 -24 -718
2519 -718 99 62 -478 -159 456 -55 -606 664 -61 60 -36 941 179 -437 947 483 -232 6 1157 -139
2539 -139 -144 642 115 62 -94 437 -124 174 401 108 324 135 431 -71 469 -524 271 754 -233 -343 247
2560 247 326 -800 115 -40 -279 -386 181 -102 -528 103 -147 16 -361 -32 -387 -191 -597 -985 65 -537
2580 -537 -585 -611 -89 -441 -525 472 -627 -903 -120 196 -942 -279 333 -30 -325 -89 352 -686 445 364
2600 364 -47 193 40 -10 14 738 -140 353 256 113 381 266 230 -376 434 562 -54 -180 783 178 -200
2621 -200 669 130 236 -309 914 175 59 532 -129 -62 -72 311 125 179 -271 207 111 -316 65 -472 258
2642 258 -542 -273 508 -679 -579 114 -47 -451 -99 -327 -18 -534 -161 81 -536 281 -265 -44 -19 -265
2662 -265 2 389 -525 -280 610 -419 59 -26 586 -129 -498 899 151 -420 529 746 -647 318 310 -153
2682 -153 43 -342 940 -193 168 365 -220 110 229 241 401 65 -360 814 -214 -427 118 -43 325
2701 325 -10 346 173 -541 71 274 -507 103 169 -528 197 -725 -22 72 -749 -247 -87 -72 -379 -243 -81
2722 -81 110 -963 184 241 -1043 489 -341 -204 -719 -315 202 -588 -221 381 -497 -758 301 -866 -38
2741 -38 22 -466 282 -253 -67 244 -14 84 212 50 548 -151 -300 1097 -816 186 593 -141 270 163
2761 163 588 285 -95 531 805 -282 772 134 -251 878 -445 433 282 -654 500 403 -164 221 81
2780 81 142 292 -864 1116 -330 -642 1331 -305 -359 67 -158 -46 -237 -616 346 -558 -74 642 -1175
2799 -1175 315 -231 -777 510 -476 -598 366 -430 -567 23 -19 57 -804 -40 888 -1094 288 508 -873
2818 -873 290 365 -209 120 -353 277 470 -724 676 -91 131 945 -429 489 313 -293 721 761 -607
2837 -607 720 262 20 230 -498 929 -335 -203 1124 -402 97 825 -206 11 398 -379 445 -22
2855 -22 105 499 -546 586 -330 -276 569 -674 -317 792 -280 -518 669 -588 38 -434 170 82 -1061
2874 -1061 745 -61 -515 213 -242 -573 327 -592 -123 411 -966 213 -64 40 -116 -448 462 278 -360
2893 -360 582 276 -941 572 -190 -85 111 -503 479 -238 172 510 -401 -72 618 -177 261 52 -276
2912 -276 762 -366 -116 609 -70 117 -136 40 29 -178 187 675 -926 312 507 -745 582 -107
2930 -107 15 -306 -262 72 12 -291 3 -76 -181 231 -598 177 -329 -875 538 -308 -525 -230 51 -397 -305
2951 -305 -90 287 -439 -619 660 -896 -214 219 -152 -2 -109 46 346 -203 -177 312 102 153 -76 -6
2971 -6 517 -615 275 637 -87 139 421 133 133 18 168 596 -487 772 304 -46 715 119 134 409 567
2992 567 30 354 12 478 392 111 304 -305 474 -326 -254 493 37 -191 85 109 -586 -34 21 126 -456
3013 -456 -25 117 -781 90 -142 -278 -422 -264 -275 -202 -336 -593 63 -248 63 -383 18 63 -351 528 -161
3034 -161 -385 -195 237 -381 -383 -61 -32 -51 -435 386 -182 -82 173 90 -5 31 -116 -181 28 -174 505 -24 -143
3057 -143 139 -39 376 -420 204 123 -101 -242 305 234 -283 458 162 318 -245 388 204 -199 -4 112 218
3078 218 -42 240 -32 166 -308 26 169 -176 -136 -131 -10 -366 -23 123 -360 75 57 221 -628 42 -1 -11
3100 -11 -196 -174 0 -298 -96 -301 74 -230 -191 26 -114 -112 -272 370 -268 -132 -82 276 -135 -333 165 -114
3122 -114 25 -186 13 1 -178 381 26 36 -164 340 127 139 -112 388 305 -330 191 117 272 -134 409 278
3144 278 -173 20 282 -34 -142 773 -114 50 -15 -102 107 8 132 -154 0 -210 131 -45 168 -156 -317
3165 -317 449 -356 -111 180 -304 -207 -267 177 -383 -298 -95 221 -574 -109 327 -509 153 -83 159 -364 -124
3186 -124 274 84 -224 25 295 -96 277 -41 564 -61 -447 516 36 215 174 332 -48 -5 -35 678 153
3207 153 -74 982 -302 223 417 388 223 -163 379 368 13 -9 566 -105 470 -109 335 650 -496 370
3227 370 163 -299 112 348 -129 44 -90 -11 157 -735 514 -29 -433 329 -268 -61 -114 -224 60 -95
3247 -95 -593 185 -157 -181 55 -506 267 -105 -474 482 -153 -294 197 -174 -341 -197 -435 499 -219 -99 374
3268 374 -394 75 199 -126 282 120 -355 318 -292 -141 364 -463 305 139 -80 296 -70 435 194 -31
3288 -31 53 393 -70 482 -9 134 223 -263 593 77 -19 375 77 -204 93 6 205 241 -539 388 -216 -62
3310 -62 157 -307 238 -445 -178 170 -76 -167 241 -277 -294 56 -592 341 -356 -242 306 -539 -103 27 -176
3331 -176 -166 -99 -405 303 -467 -85 447 -797 327 -132 0 100 -187 293 25 -275 34 23 -302 400
3351 400 -220 293 23 -307 692 -206 12 72 192 -87 329 -219 23 95 -407 440 -272 260 102 -117 217
3372 217 -218 226 210 -240 -2 454 -290 207 43 -227 370 -296 237 155 -163 18 231 -372 -136 -132 -40 68
3394 68 -580 323 -9 -428 120 -120 304 -321 -45 -47 49 -429 256 187 -556 299 -327 144 -207 75 306 -406
3416 -406 -43 243 29 105 35 -259 397 -179 98 268 -351 17 198 15 -38 -27 262 467 -186 86 646
3437 646 -166 389 -54 150 359 -22 450 40 61 346 165 -65 122 -236 119 74 -395 383 -139 -155 233
3458 233 -206 -163 -261 33 -252 -268 -254 309 -395 -197 59 -545 -15 -367 -72 -63 -229 -199 -28 -214 -265 -62 -443
3481 -443 -64 -810 361 95 -636 -241 -44 -55 -44 96 -4 121 -45 178 152 -384 208 -231 -36 105 97
3502 97 222 -139 106 319 -7 -280 363 5 272 81 31 795 -154 125 327 -42 -28 98 -3 54 -146
3523 -146 -191 326 -395 121 27 -174 273 -69 -32 63 -281 -128 -3 -298 151 -51 -95 -185 -427 141 -370 -488
3545 -488 301 -100 -188 113 -174 -295 -53 -303 37 35 -190 283 -47 -158 -56 -185 -67 -308 -353 307 5
3566 5 -342 113 -228 -56 -137 302 173 -240 346 359 82 81 292 -175 263 -135 168 477 -42 318 68 240
3588 240 -37 375 135 156 313 15 215 -397 453 410 31 42 87 167 -335 104 227 94 -124 -27 -97 -90 222
3611 222 -85 282 -385 -266 165 -179 103 -388 -78 -102 -357 -369 358 -337 -266 -23 -187 -149 116 99 129 -289
3633 -289 -43 -110 5 -92 132 -206 -75 -63 282 -120 -58 -30 257 172 -295 517 35 -120 181 388 347 -217
3655 -217 240 58 60 -179 124 375 24 232 -15 225 208 352 -5 -45 -20 -13 136 68 103 -9 84 -109 -10 127
3679 127 83 -186 54 -111 -176 119 9 -200 -174 -139 117 -216 -70 32 -186 2 -56 -180 -181 39 -185 139
3701 139 -499 -67 -131 8 -250 -236 278 -285 1 -9 73 -249 -66 151 129 -82 -271 253 -32 -40 202 -169
3723 -169 -41 -383 275 220 159 59 448 21 -111 150 -82 384 -52 335 -60 -253 334 107 -125 3 242
3744 242 155 199 -235 117 185 -221 322 5 -30 -173 -263 27 96 -169 63 66 -513 -16 -232 -139 -238 -21 21 -224
3768 -224 -130 -130 -94 -429 214 -256 58 -61 -378 39 -447 -54 -173 -205 -192 -421 -133 -124 -299 -112 189 -190 -33
3791 -33 36 -73 67 -23 534 225 -114 66 134 -107 131 319 142 141 -231 67 99 -2 -10 175 209 -114 105
3814 105 130 74 79 392 -77 -162 374 -74 334 51 25 -27 -245 11 143 -18 44 -48 -390 113 -222 -80 209
3837 209 -443 67 -325 -79 -17 -373 22 92 -405 55 178 -566 202 -198 -212 -91 -129 35 -86 -130 188 -51
3859 -51 -357 35 -93 -54 462 -54 270 -86 178 344 207 39 173 -9 203 244 -166 509 -81 -209 441
3880 441 -214 244 152 -68 310 -79 109 108 -303 269 190 3 275 -220 374 296 -157 220 -6 8 -89 141
3902 141 155 245 -556 86 152 -559 72 -119 -106 235 -65 5 -147 -345 280 7 -303 -126 -301 -39 -59 -288
3924 -288 176 -369 1 -1 -382 -467 -189 -147 -4 -359 -249 445 -477 83 213 -238 47 -159 23 -37 -301 -194
3946 -194 472 -321 450 37 -170 92 -169 225 162 -354 239 93 -220 355 58 19 265 129 470 85 -288
3967 -288 400 -146 -17 97 -111 175 -387 -228 323 -249 -320 260 -1 57 -59 -199 94 -308 82 227 -411
3988 -411 -49 306 -248 -52 -292 -178 -56 -341 6 -102 -335 -101 54 -220 -13 -498 -109 143 -367 262
4008 262 -38 -188 -157 -228 74 -126 -156 237 6 -218 352 -58 -176 348 -50 147 -51 66 239 -105 3
4029 3 254 -97 -124 419 -228 362 -108 -60 515 -443 202 23 128 -8 -159 -14 -12 -144 -143 90 -322 310 -53
4052 -53 269 163 -179 235 96 -331 9 51 -206 115 -10 68 169 -472 261 -346 -334 -115 -291 105 -142
4073 -142 -76 41 -95 -492 301 -297 -31 24 -321 71 -101 -84 152 -114 -95 382 -203 -37 -18 -293 200 -180
4095 -180 138 293 -84 339 212 334 -108 192 39 168 -45 210 305 -46 191 -218 297 -37 -170 -212 27
4116 27 161 275 292 81 178 100 38 -129 80 218 -308 12 42 -167 -131 106 69 96 -148 -263 190 -72 70
4139 70 28 46 -76 -79 199 -198 140 -431 218 -174 108 156 -128 -218 -165 206 -449 -382 -90 36 46 -343 -50
4162 -50 -109 -25 -74 31 134 135 115 17 111 -93 137 -14 166 -149 160 -4 -123 230 254 75 30 259 -20 -79
4186 -79 31 262 364 -174 92 243 347 -209 215 199 19 -39 17 185 -291 -32 208 -145 31 -110 370
4207 370 -278 160 -186 292 150 -61 110 -242 381 -138 228 -190 -53 76 -183 -25 55 114 -67 -172 -189
4228 -189 90 -20 -198 107 63 85 -304 176 -99 -448 60 245 -141 -260 108 -209 158 -45 -4 116 -44
4249 -44 36 69 -17 -77 159 265 -56 -207 -14 78 14 268 152 34 88 49 239 80 61 181 -3 -254 141
4272 141 -152 -97 185 14 188 -35 0 433 51 -263 -59 -62 12 12 -122 -67 -201 -67 184 54 -217 -80 53
4295 53 -165 -47 -208 161 -276 -153 -48 7 163 25 81 -83 -196 156 -187 -138 11 227 -66 206 -69
4316 -69 -156 -2 -320 61 -188 -15 80 147 -15 51 20 -39 -32 -56 568 -58 -39 166 190 177 -145 377 65 -13 -70
4341 -70 186 154 -114 -8 -440 258 -271 66 184 -54 74 42 16 -28 74 -49 -73 -506 7 -70 -274 -207 -142
4364 -142 -31 -36 -121 127 -220 -122 94 -173 -428 -47 -405 48 -121 -295 -238 -180 -139 62 -157 -167 -274 -83 -153
4387 -153 -234 -66 348 -182 111 189 -120 -94 -134 9 -49 -42 -66 190 -280 129 -68 192 366 -377 239 -46 -69
4410 -69 299 119 -193 133 -104 -34 347 -260 223 81 -244 192 -107 12 29 88 163 -71 -450 418 -16 -46
4432 -46 162 -62 212 -294 34 -50 22 -253 262 -128 -100 -75 -246 4 -104 -222 340 -300 -60 -117 -71 16 -2
4455 -2 -38 4 -283 -90 307 -436 -32 16 25 118 -192 27 -17 50 -10 267 -367 141 147 162 329 -36 233 -313 -244
4480 -244 259 -146 -21 32 16 307 160 78 345 -123 49 89 -153 330 -154 32 -24 -132 -78 340 -232 -179
4502 -179 35 -239 97 -366 0 -58 -302 0 79 60 43 311 -67 78 -392 50 3 -495 177 -211 170 -16
4524 -16 -161 -22 -120 -374 163 105 -260 115 -20 -28 -53 192 219 -142 -37 273 122 -61 132 -59 333 151
4546 151 150 83 -269 18 152 203 195 -34 -21 203 -49 -194 238 -19 169 70 -147 -62 -205 374 40 96 94 82
4570 82 99 -15 -117 -138 80 -300 60 -265 -74 -114 -278 90 -60 60 -235 48 -140 -66 -47 -299 -57 41
4592 41 153 70 -25 109 -26 -247 -65 0 -26 -146 -177 -160 -181 -12 74 -83 -223 15 -121 -108 289 36 75 -18
4616 -18 -236 170 117 187 81 -38 190 -159 -30 -99 -126 5 15 43 266 -80 65 140 47 376 113 92 49 204
4640 204 347 64 -147 227 134 -472 55 -4 26 129 74 -37 -210 317 -81 -228 -34 111 -171 -173 143 -31
4662 -31 69 -296 349 -189 -341 -199 -56 -323 -117 23 -23 -222 -114 45 -8 -156 99 -198 -279 -256 177 -232
4684 -232 -43 -148 19 55 -303 130 -103 116 -73 156 25 75 281 51 335 160 62 134 46 310 186 326
4706 326 19 127 -171 -31 134 -200 199 -238 -51 62 164 -166 125 44 -209 22 -165 103 -207 -228 -165
4727 -165 107 -151 -152 56 -101 108 -24 2 -187 39 26 46 161 -254 355 59 -225 134 -93 -237 -287 -139
4749 -139 -119 44 -305 -100 145 -227 -173 -57 343 -157 3 -38 -74 175 50 192 -158 346 -2 367 29
4770 29 150 242 154 181 -57 350 -271 259 -189 -140 -134 261 147 -105 20 71 184 83 92 105 70 68 -98 156 151
4795 151 234 41 186 181 2 89 -133 257 -84 -81 -106 -63 -105 -38 -131 -83 9 -228 -51 -16 -192 -364 -71 -277 -318
4820 -318 -4 -168 98 -29 -70 -14 -345 -3 -176 -101 66 -12 -213 -6 101 -50 -77 -98 -159 -21 260 230 -99
4843 -99 -94 -149 34 -260 148 33 -66 183 121 192 -119 224 -221 297 -90 59 261 -247 188 75 237 97
4865 97 -90 10 115 -56 -114 332 -141 258 -17 -38 -119 72 76 -243 -179 192 291 -172 -123 2 197 52 -93
4888 -93 94 -390 -165 164 -309 161 -122 -103 -120 -283 -412 109 27 -117 -125 -74 -135 41 67 -1 -25 -252 286 -38
4912 -38 -33 65 -279 152 223 67 -29 3 214 -19 -22 -33 288 -48 244 56 -30 40 -253 193 -22 -158 109 146
4936 146 41 73 -158 246 -27 -350 137 -71 239 17 213 79 -151 -172 187 110 103 386 -309 97 -154 238
4958 238 228 -37 -20 -97 -345 -140 -175 -128 -18 -267 -266 104 -95 -215 29 -108 -58 -273 216 -82 -216 -96 296
4981 296 -97 -24 -19 121 128 -184 322 -23 -16 103 -39 65 -10 185 84 104 -170 345 241 31 285 -27 308
5004 308 141 -5 -110 -45 155 268 134 -125 113 -115 283 40 37 142 -243 162 39 144 152 -78 28 337
5026 337 -124 -76 132 -19 77 -41 -86 80 -244 214 -5 6 -207 -279 -115 152 -139 -113 4 -179 -27 -150
5048 -150 -66 123 -169 -6 99 -257 -42 91 -252 95 -262 -32 94 -129 -271 -28 -62 -7 311 188 121
5069 121 -15 -211 65 -95 140 36 81 -59 -15 72 -77 162 145 99 -17 60 -24 42 -60 117 159 90 -68
5092 -68 -192 62 84 -65 -99 246 141 -330 156 41 -34 -205 -83 187 -208 -93 104 4 -135 30 -242
5113 -242 -60 27 -131 205 -280 -192 -72 -84 -59 50 87 -298 4 145 46 -154 -123 -137 -153 -18 -241 161 37
5136 37 -37 -226 79 -109 -10 33 -155 11 -68 268 59 19 157 -152 166 235 100 -297 445 -120 58 180
5158 180 -121 487 -116 138 28 216 49 -202 -1 -121 -111 206 -38 -254 -7 -66 -150 82 -380 215 27
5179 27 -43 23 -101 54 164 -171 172 249 -392 74 -142 -100 13 -206 -107 25 -47 155 -231 -190 -73 -220 12
5202 12 250 -276 -59 -295 -180 146 -71 -83 213 -41 -183 -145 39 142 -164 -43 32 77 222 -215 63 -239
5224 -239 106 136 336 -83 128 500 -67 124 -157 152 141 63 67 95 -87 -88 76 -72 278 -186 14 -162 -222
5247 -222 -56 -140 29 -20 136 -97 141 -78 -10 -50 -200 85 -346 -67 -157 -13 -109 -305 -128 -214 58 -176
5269 -176 -134 -201 -119 -81 70 19 -365 22 -206 -56 81 -162 129 -78 106 23 112 -137 167 23 -129 -66 -72
5292 -72 -88 -98 188 -6 283 -6 -111 127 -72 224 67 0 -33 178 264 302 -28 -119 241 27 181 270 -157
5315 -157 222 -17 -119 64 199 145 -13 29 -158 4 -10 -127 -257 -118 -104 18 -61 -134 16 -89 -78 -146 -164
5338 -164 -37 74 -241 -101 105 44 89 -142 -160 -296 -20 -104 -233 -134 -146 113 -28 288 -89 -92 163 -133 -74
5361 -74 113 94 -275 100 133 -86 117 -124 103 -109 30 142 18 -9 172 83 128 -62 162 145 -212 109
5383 109 -152 144 122 71 -34 -180 -74 -37 -11 -107 -7 31 -304 -77 -113 195 -116 -147 -292 -101 66 -48 -17
5406 -17 -244 -201 48 1 -193 -135 -5 -48 160 -189 155 -24 -106 -34 19 -184 -141 43 -273 -50 -122 -4 -110
5429 -110 -237 74 -103 35 -162 273 -15 82 140 -133 86 -169 90 67 50 109 86 -70 89 211 154 104 102
5452 102 169 171 314 283 149 332 96 109 70 94 137 104 -271 -150 -81 102 61 101 -69 33 -203 36 -110 26
5476 26 271 -201 190 189 47 51 160 -217 133 -185 116 -162 -251 186 -207 -153 84 28 -179 120 33 141 106
5499 106 -185 49 174 -46 64 -16 -46 -62 -93 -258 -172 -81 227 -53 8 -25 -2 214 107 -9 311 123 1
5522 1 251 3 283 81 180 61 -144 287 64 77 94 -71 123 192 95 -219 -22 26 -3 -258 -148 19 -33
5545 -33 171 -175 166 231 10 -18 22 -109 -332 -101 -220 -155 27 -125 -1 -243 -189 -96 -138 -148 52 -239 -19
5568 -19 -86 -136 45 -196 -122 -68 71 -56 -282 -121 -59 -224 -267 145 -28 0 51 -40 171 -308 -62 7 4 -54 118
5593 118 -102 238 292 -46 -57 10 394 162 -9 46 43 14 19 -25 58 203 71 112 -133 -83 49 102 87 -135 -62
5618 -62 -7 -257 89 124 -204 -53 163 -137 199 -365 47 187 -200 234 47 -197 -22 -20 -114 59 -183 69
5640 69 -28 -324 -63 -8 191 87 182 -61 -78 1 -93 404 -16 -462 83 -23 -92 -187 209 -90 96 257 -48
5663 -48 192 11 154 63 18 64 211 13 84 -15 -79 92 -114 137 -311 31 264 217 53 33 350 42 239
5686 239 -12 12 -25 -82 -114 147 43 10 290 50 -100 -15 47 26 34 79 125 -142 49 -154 -50 -61 13 -79 -9
5711 -9 -162 0 -187 -209 -248 -171 67 -172 -25 19 141 84 -172 -69 19 -235 -9 292 -82 73 -66 85 185
5734 185 190 -82 -256 -70 20 191 -174 -25 -96 -332 -92 80 278 7 220 -165 126 1 159 125 -32 -84
5756 -84 -152 -52 -31 162 20 66 -118 -163 -95 -218 43 -6 -45 65 -152 72 -28 -8 -84 -115 -39 250 -16 -40
5780 -40 101 -164 17 -166 -82 -249 -85 18 -304 -124 7 -78 -76 348 -4 40 -337 -208 86 -136 164 31
5802 31 -31 -36 -197 -53 33 309 16 55 183 -88 -66 97 234 -112 266 -57 37 -65 46 30 14 143 56 170
5826 170 -48 286 -60 95 -30 97 148 -38 24 -152 62 237 -29 -91 22 197 -31 183 -102 118 -82
5847 -82 54 35 -23 31 -55 14 -75 -92 -200 147 37 -144 264 -267 193 -109 140 152 -89 -62 -190 -133 -59 138
5871 138 -177 -145 -144 -35 -208 -20 38 13 -50 -85 -20 48 -22 191 -78 61 -141 142 129 75 143 -97 50 122 99
5896 99 164 323 161 18 348 36 322 -125 195 206 -63 153 -35 -13 91 280 114 -190 44 234 259 24
5918 24 -193 113 -15 -285 0 -212 210 39 9 -138 -117 58 -19 -93 -39 144 -41 35 -230 -75 88 48 -83
5941 -83 -38 -81 64 -134 3 111 180 226 182 -270 -101 86 -25 145 126 276 -32 103 53 102 14 141 144 -232
5965 -232 -30 -79 213 110 24 166 -208 17 -150 -5 90 289 -129 74 -67 -56 215 -281 -58 7 168 -111
5987 -111 35 -158 -126 -30 126 309 -290 266 -69 -80 56 18 -240 -52 192 -48 151 -230 -14 53 -228 86
6009 86 -239 -83 -148 35 130 -60 154 -142 -24 150 -3 -306 124 -25 -295 169 -289 -258 79 -37 100
6030 100 199 0 -6 -91 87 -58 30 249 -35 115 18 -118 137 79 0 -5 -113 -80 28 -95 -30 -16 -164 214
6054 214 -59 225 18 362 236 -147 40 -240 219 -153 186 232 -41 -110 -56 106 -12 122 -114 -99 -57 4
6076 4 -109 -182 75 -60 81 -300 43 193 63 77 -127 -117 -115 -93 -92 338 -267 -139 117 -274 -61 -171 28
6099 28 -32 -197 63 71 -102 6 66 -225 84 -15 160 77 32 198 102 -70 85 -15 144 -14 -86 257 228 -186
6123 -186 -186 -48 100 -116 -103 204 -139 61 -169 116 85 218 -153 54 94 -144 15 72 74 -134 -105 -209 -96
6146 -96 204 -86 -167 147 29 -170 -7 -51 144 -182 -112 39 -191 -166 35 -25 -83 174 82 -61 113 -421 -143
6169 -143 -138 -129 -85 39 20 79 -18 -200 109 136 -73 -259 31 216 -431 -55 -137 250 237 -43 47 76 -162 -134 64
6194 64 -295 79 -14 145 155 126 -130 117 175 -74 -117 -92 93 39 196 207 -125 94 114 -54 282 40 154
6217 154 -26 -82 -121 -178 -82 -21 74 -52 -77 -101 130 -54 124 -133 26 27 13 117 49 -87 -102 8 -129 128
6241 128 112 -28 134 72 25 24 44 -22 7 22 -157 -48 -172 224 89 -155 -30 27 371 316 -164 -215 281 3
6265 3 448 26 6 27 -217 173 106 116 -101 221 -12 93 -158 15 -48 203 -66 44 227 -19 -155 140
6287 140 -137 39 207 -28 17 -110 12 35 -88 67 275 -92 -172 185 -110 121 -42 -285 -59 -20 -53 -52
6309 -52 34 209 -145 198 -85 210 227 138 108 65 -2 -8 -58 -54 -113 -142 -21 162 94 223 105 -168 -40 126 40
6334 40 -94 0 -88 85 -45 -177 350 -3 171 171 48 116 136 26 295 279 41 61 16 -30 -57 68 245 -234
6358 -234 174 -100 85 99 -9 -1 112 -30 53 285 -41 -216 3 40 -43 -244 -65 -40 82 16 -163 168 -221
6381 -221 -77 -52 51 -14 -4 -182 398 133 -280 181 25 -285 -115 -262 -121 -87 -199 -80 -138 -211 2 -256
6403 -256 338 -366 -61 51 21 64 -224 -54 94 80 45 -12 -224 239 321 -21 246 31 98 72 172 -159 44
6426 44 122 179 173 138 143 115 -41 -31 113 38 -182 -90 -119 4 3 65 -10 -89 -89 36 107 -28 96 -71 -91 -83 20 -169
6454 -169 -120 -166 -5 -85 -96 125 14 172 -29 -119 49 -74 51 46 -51 7 -49 -201 164 -54 110 359 194
6477 194 -64 30 -134 106 40 -54 -204 -19 -57 -134 -26 -328 28 -33 337 -105 -137 36 1 113 235 332 -10
6500 -10 79 135 104 32 -5 -31 168 140 -61 233 21 179 9 -121 34 -34 74 -6 -11 -263 208 -39 -31 63 71 -202
6526 -202 132 8 -254 80 -106 1 -11 -414 -175 8 3 -230 22 -30 134 -11 50 -93 -41 -229 -167 -188 14
6549 14 -282 145 31 -163 -45 23 93 286 -55 34 25 77 -10 77 -204 293 -295 -45 74 200 -7 104 54
6572 54 -32 107 165 -107 -34 -77 -273 51 59 144 -108 -153 30 201 -28 152 6 138 278 -152 -175 197 -104
6595 -104 70 -291 -223 207 102 -45 110 -46 91 229 -105 -3 75 99 151 -52 -57 -106 -119 -180 195 -8 132
6618 132 3 -114 32 -86 -28 103 -142 -160 75 33 131 213 20 52 -34 -107 35 -2 11 5 42 -43 96 -92 212
6643 212 83 212 -248 210 -183 -115 105 -96 -221 -87 -115 133 -117 48 -63 159 27 21 -108 -136 205 -237
6665 -237 297 47 69 36 -228 26 -176 150 -72 46 15 10 -315 -168 6 -148 66 -174 -196 36 6 -95
6687 -95 -128 -185 -66 19 63 173 -151 -104 66 32 -81 3 130 -170 -69 39 64 -130 45 32 -14 109 -27 147
6711 147 -149 -25 70 15 3 203 109 -147 -60 -98 69 -44 -30 48 6 177 59 304 19 185 -220 136 5
6734 5 199 84 133 106 -135 -213 134 35 74 -65 -128 52 -168 -75 33 28 41 -113 -32 16 45 84 -202 42 -38 85
6760 85 -185 -8 -40 -333 26 196 65 51 -58 161 230 -196 -59 -216 -137 80 7 68 25 5 136 -146 -1
6783 -1 -69 -149 200 -66 194 91 14 -133 -27 37 42 27 8 82 49 197 24 27 3 -94 151 -49 159 -218 -122 -112
6809 -112 95 -5 43 -35 -172 -91 -43 -51 105 150 -208 12 -63 -112 -14 -195 -339 -227 37 -35 88 -35 70 196
6833 196 -248 46 -99 -116 93 128 40 -64 55 190 201 -44 91 107 -83 60 161 109 -43 133 152 245 47
6856 47 59 325 3 -150 112 4 -67 85 309 -8 -52 -86 -19 134 -92 -70 297 15 48 5 -21 174 115 87
6880 87 219 58 155 -54 -18 190 -167 -70 -41 -76 3 103 -94 -15 -131 -220 -113 8 46 13 65 -120 14 -122
6904 -122 199 -9 -36 -11 -164 -85 -435 35 -151 -181 -32 -56 223 -111 -232 -108 -172 -14 16 -195 205 180 -7
6927 -7 220 -145 102 -16 -226 -108 89 47 41 97 1 203 89 -27 39 45 -28 -80 88 -125 191 91 -142 -58
6951 -58 -86 -213 10 -105 -136 -117 -124 300 -104 119 -11 -103 246 25 65 -36 25 101 44 -8 -240 170 -240 -4
6975 -4 -56 -112 -213 86 72 -132 177 64 55 -187 53 -43 -4 25 -100 -28 -216 170 -8 200 87 81 83 -85 202
7000 202 149 115 -78 -81 214 72 -16 -227 -229 98 18 62 206 77 168 142 46 59 283 105 84 91 178 -74 -97 -4
7026 -4 132 -8 -5 113 392 127 -15 41 13 -25 25 -4 -182 -188 -11 -35 -68 38 190 -204 -236 13 -191 -199 -88
7051 -88 -27 -124 39 -3 35 -68 -40 -70 -286 -26 -102 -56 -286 144 59 112 -67 -22 47 225 297 50 -98 176 139
7076 139 103 266 143 169 -85 98 -180 20 16 -206 33 -73 -58 106 -58 60 -230 -51 -81 110 65 10 156
7099 156 -14 3 -32 -80 42 -132 -102 86 -160 35 251 -163 -1 -90 -192 58 -90 271 -26 -55 121 -194
7121 -194 116 -55 61 24 166 -48 -174 171 126 -77 10 -100 -192 -28 -18 -184 150 -38 208 -57 -32 62
7143 62 -178 -47 62 248 -97 160 92 -164 -107 87 -47 138 -204 178 -90 383 171 -179 -11 -11 120 19
7165 19 65 47 139 -53 -184 121 -37 -466 -122 27 103 -105 -123 157 -173 -10 -159 86 -135 -72 69 -238
7187 -238 182 -189 114 -252 -78 -219 -143 121 -41 -250 -157 -203 -28 -90 44 164 -96 -76 -37 300 108 -13
7209 -13 -50 59 -146 -181 31 -50 -172 -49 43 -14 -325 -125 -101 -235 -13 58 -232 -341 121 105 -81 97 -9
7232 -9 145 -107 191 53 -121 34 50 -129 -373 -20 -53 -73 -157 -45 7 24 28 57 -40 -31 221 39 198 225 -316
7257 -316 86 266 227 -150 157 68 -51 -32 -153 128 -58 -148 89 68 184 -153 50 112 190 -21 172 -290
7279 -290 -195 88 -50 21 51 184 120 70 65 5 -91 121 -94 -176 54 -123 -31 -168 82 11 40 -485 239 126
7303 126 -141 123 83 24 -230 320 193 -209 49 268 -97 133 112 -99 255 -253 -37 -2 186 123 -264 -59
7325 -59 202 50 -91 -43 -175 -119 -18 -62 147 157 28 17 127 10 -30 -233 -178 135 -2 -58 -166 -32 270
7348 270 -156 56 58 -231 -59 -96 11 152 -184 -105 -7 -29 -244 -14 163 -156 -60 21 114 148 37 -67 25 -127
7372 -127 -431 73 51 -190 -80 -261 -94 -221 -26 48 -34 45 96 147 -8 -61 75 51 154 -126 78 139 -2
7395 -2 -28 -380 113 78 -54 202 73 -226 -68 61 -191 58 35 31 -160 133 213 50 226 169 -130 57 -145
7418 -145 -97 278 -40 271 -126 38 95 -153 155 -116 157 -101 13 -33 61 -21 -167 -77 -130 163 -271 -134
7440 -134 37 40 -14 277 38 -169 -69 154 -19 -41 150 -96 -23 209 90 31 121 102 -268 159 -259 -2 168
7463 168 -125 -129 -68 94 55 139 -147 -209 -175 145 -23 86 -214 -75 227 -166 -54 -67 106 301 -60 -80 117
7486 117 -23 58 -118 -80 83 -73 -235 18 -5 -131 138 -117 -181 74 61 33 -15 -64 -92 -285 69 -215 -101
7509 -101 -69 -31 17 79 207 -67 -66 -10 -7 -14 -163 -68 -100 144 2 163 -45 1 -16 -104 191 103 91 63 -410 204
7535 204 -12 61 -82 -130 22 8 -171 25 46 119 204 -167 -37 47 16 -207 -33 -167 -10 98 -21 220 261
7558 261 2 282 71 133 -191 105 15 179 231 -110 -154 -118 53 6 -157 -100 -8 122 -213 -77 -206 130 7
7581 7 28 -114 104 -65 -66 194 -149 -49 145 261 -67 211 42 129 146 -179 -126 198 130 -64 -186 32 118
7604 118 -235 -107 -21 164 27 17 -86 106 -144 -254 -181 -27 -81 87 48 -43 124 -78 157 -14 132 -54
7626 -54 -54 -159 -223 72 144 89 57 191 -31 -61 -127 207 73 -39 307 -94 -41 32 -136 166 -166 -133 73 -150
7650 -150 64 -50 -2 160 -136 -248 29 68 -219 23 261 -89 94 40 87 261 120 68 22 245 266 -27
7672 -27 48 31 -34 51 58 144 38 -9 -87 30 89 194 -95 13 148 79 23 46 90 -116 -164 86 206 -42 34 -112
7698 -112 6 -131 -42 -72 -214 27 -30 103 39 73 254 58 68 -155 123 -255 -138 130 10 -78 -178 -45
7720 -45 -19 186 171 63 -31 -79 170 193 108 -170 -132 -166 -37 -111 -60 43 85 13 0 -89 88 4 -9 -70 -63 107 61
7747 61 357 153 -12 -27 -69 202 139 -3 161 -201 -251 167 -90 189 45 65 -123 3 43 148 66 -58 12
7770 12 -67 72 130 -35 -61 -115 -56 43 -71 -129 -134 188 -19 -60 35 -345 -241 -117 70 17 -98 -68 151 -174 14
7795 14 21 -6 30 116 -195 102 177 -4 81 -12 -237 20 -29 14 6 -44 -86 141 -51 88 -72 -86 -18 74 182 131
7821 131 250 -141 -127 112 -138 45 -46 192 110 57 214 120 -191 -5 379 46 234 -10 189 -76 155 -16
7843 -16 78 115 48 143 -46 27 55 -265 -78 62 -26 16 119 -21 2 38 -113 -150 -68 102 13 231 -14 -31 162
7868 162 33 -40 189 51 105 60 15 -58 -137 -64 -159 69 -122 103 -178 -184 195 120 -118 30 2 -137 -99 92
7892 92 -40 -57 70 119 112 78 -15 -60 16 -68 143 327 -202 9 70 173 -202 12 0 -62 286 187 -49 125 59
7917 59 55 -184 -195 74 -38 -29 89 62 49 -36 -220 93 65 -48 -134 90 -161 304 -71 -252 143 95 0 -136
7941 -136 -60 20 0 -108 -108 -5 49 -133 -13 -28 -17 82 -143 126 -158 -41 -83 -201 10 -150 164 12 -52 262
7965 262 -124 129 -53 21 152 -87 86 223 73 -129 33 66 -55 119 92 296 42 -44 -164 201 95
7986 95 -235 28 23 -217 122 164 52 -138 108 -83 -226 70 124 61 256 50 -162 -171 -121 -152 -231 -9 -49 -108
8010 -108 28 -11 66 -183 124 -27 63 186 5 51 -26 -321 33 94 6 16 130 -184 79 16 -55 116 -156
8033 -156 -57 -272 206 -20 -103 81 191 -55 342 205 8 154 -16 34 112 98 -199 -151 -34 54 32 -265 -69
8056 -69 -151 -22 316 -133 91 15 -179 101 -134 58 4 109 -136 10 -117 15 30 197 -38 -127 163 -30
8078 -30 -88 176 -313 85 192 -13 -316 -123 -168 -28 7 115 445 -267 -96 32 -149 -40 123 -175 -4
8099 -4 -174 -176 -198 0 13 -48 -145 24 -58 -29 31 227 -7 229 -19 111 -58 -66 62 -78 -159 21 106 -253 23
8124 23 180 -223 -58 253 98 -86 60 93 24 136 -72 61 -83 -1 -53 139 133 -67 248 -129 18 -217
8146 -217 -104 220 -171 -11 99 -317 -18 198 29 106 -104 166 -1 2 -303 159 -15 -159 -197 59 138 -101
8168 -101 27 175 -455 -77 -87 36 -29 32 -98 115 236 -50 -130 -111 -75 -12 62 -119 101 -42 -203 -117 -47
8191d7
##END NTUPLES=NMR FID
##END=
