##TITLE=1H_CA-8763x
 DMSO, 8 sc, 
 21.9.2020
##JCAMPDX= 6.0         $$ Bruker NMR JCAMP-DX V2.0
##DATA TYPE= NMR FID
##DATA CLASS= NTUPLES
##ORIGIN= UXNMR, Bruker Analytische Messtechnik GmbH
##OWNER= root
$$ XWIN-NMR		Version 3.5
$$ Mon Sep 21 10:16:12 2020 Russian Standard Time (UT+4h)  she@DPX200
##.OBSERVE FREQUENCY= 200.1315066352
##.OBSERVE NUCLEUS= ^1H
##.DELAY= (6, 6)
##.ACQUISITION MODE= SIMULTANEOUS
##.ACQUISITION SCHEME= undefined
##.AVERAGES= 8
##.DIGITISER RES= 18
##SPECTROMETER/DATA SYSTEM= spect
##.PULSE SEQUENCE= zg30
##.SOLVENT NAME= DMSO
##.SHIFT REFERENCE= (INTERNAL, DMSO, 0, 15.7039)
##AUDIT TRAIL= $$ (NUMBER, WHEN, WHO, WHERE, WHAT)
$$ ##TITLE= Audit trail, XWIN-NMR		Version 3.5
$$ ##JCAMPDX= 5.01
$$ ##ORIGIN= Bruker BioSpin GmbH
$$ ##OWNER= she
$$ F:/spectra/data/she/nmr/H-F/1/audita.txt
$$ ##AUDIT TRAIL=  $$ (NUMBER, WHEN, WHO, WHERE, WHAT)
(   1,<2020-09-21 10:13:59.59 +0400>,<she>,<DPX200>,
      <created by zg, POWCHK disabled, PULCHK disabled
       configuration hash MD5:
       00 E9 B6 7A A2 85 ED C7 34 08 36 98 17 FE 4E 26
       data hash MD5: 16K
       ED 74 68 81 B9 02 04 7B 35 DC B3 50 6C DC 7F 34>)
$$ ##END=
$$ 
$$ hash MD5
$$ F4 7C C0 33 D5 F6 E6 8D 32 B0 D4 33 4C EE 7E 4C
##$RELAX= 
##$RELAX= 
##$RELAX= 
##$RELAX= 
##$RELAX= 
##$RELAX= 
$$ Bruker specific parameters
$$ --------------------------
##$DU= <F:/spectra>
##$EXPNO= 1
##$NAME= <H-F>
##$PROCNO= 1
##$TYPE= <nmr>
##$USER= <she>
##$AMP= (0..31)
100 100 100 100 100 100 100 100 100 100 100 100 100 100 100 100 100 100 
100 100 100 100 100 100 100 100 100 100 100 100 100 100 
##$AQSEQ= 0
##$AQ_mod= 1
##$AUNM= <au_zg>
##$AUTOPOS= <>
##$BF1= 200.13
##$BF2= 200.13
##$BF3= 200.13
##$BF4= 200.13
##$BF5= 200.13
##$BF6= 200.13
##$BF7= 200.13
##$BF8= 200.13
##$BYTORDA= 1
##$CFDGTYP= 0
##$CFRGTYP= 5
##$CHEMSTR= <none>
##$CNST= (0..31)
1 1 145 1 1 1 1 1 1 1 1 1 1 1 1 1 1 1 1 1 1 1 1 1 1 1 1 1 1 1 1 1 
##$CPDPRG= <>
##$CPDPRG1= <>
##$CPDPRG2= <>
##$CPDPRG3= <>
##$CPDPRG4= <mlev>
##$CPDPRG5= <mlev>
##$CPDPRG6= <mlev>
##$CPDPRG7= <mlev>
##$CPDPRG8= <mlev>
##$CPDPRGB= <>
##$CPDPRGT= <>
##$D= (0..31)
0 1.2 0 0 0 0 0 0 0 0.06 0 0.03 0 0 0 0 0.0002 0 0 0 0 0 0 0 0 0 0 0 0 
0 0 0 
##$DATE= 1600668839
##$DBL= (0..7)
120 120 120 120 120 120 120 120 
##$DBP= (0..7)
150 150 150 150 150 150 150 150 
##$DBP07= 0
##$DBPNAM0= <>
##$DBPNAM1= <>
##$DBPNAM2= <>
##$DBPNAM3= <>
##$DBPNAM4= <>
##$DBPNAM5= <>
##$DBPNAM6= <>
##$DBPNAM7= <>
##$DBPOAL= (0..7)
0.5 0.5 0.5 0.5 0.5 0.5 0.5 0.5 
##$DBPOFFS= (0..7)
0 0 0 0 0 0 0 0 
##$DE= 6
##$DECBNUC= <off>
##$DECIM= 32
##$DECNUC= <off>
##$DECSTAT= 4
##$DIGMOD= 1
##$DIGTYP= 9
##$DL= (0..7)
0 120 120 120 120 120 120 120 
##$DP= (0..7)
150 150 150 150 150 150 150 150 
##$DP07= 0
##$DPNAME0= <>
##$DPNAME1= <>
##$DPNAME2= <>
##$DPNAME3= <>
##$DPNAME4= <>
##$DPNAME5= <>
##$DPNAME6= <>
##$DPNAME7= <>
##$DPOAL= (0..7)
0.5 0.5 0.5 0.5 0.5 0.5 0.5 0.5 
##$DPOFFS= (0..7)
0 0 0 0 0 0 0 0 
##$DQDMODE= 0
##$DR= 18
##$DS= 0
##$DSLIST= <SSSSSSSSSSSSSSS>
$$ [...]
##$SUBNAM2= <"">
##$SUBNAM3= <"">
##$SUBNAM4= <"">
##$SUBNAM5= <"">
##$SUBNAM6= <"">
##$SUBNAM7= <"">
##$SUBNAM8= <"">
##$SUBNAM9= <"">
##$SW= 16.880792210976
##$SWIBOX= (0..15)
0 0 2 0 0 0 0 0 0 0 0 0 0 0 0 0 
##$SW_h= 3378.37837837838
##$TD= 16384
##$TD0= 1
##$TE= 0
##$TE2= 300
##$TE3= 300
##$TEG= 300
##$TL= (0..7)
0 120 120 120 120 120 120 120 
##$TP= (0..7)
150 150 150 150 150 150 150 150 
##$TP07= 0
##$TPNAME0= <>
##$TPNAME1= <>
##$TPNAME2= <>
##$TPNAME3= <>
##$TPNAME4= <>
##$TPNAME5= <>
##$TPNAME6= <>
##$TPNAME7= <>
##$TPOAL= (0..7)
0.5 0.5 0.5 0.5 0.5 0.5 0.5 0.5 
##$TPOFFS= (0..7)
0 0 0 0 0 0 0 0 
##$TUNHIN= 0
##$TUNHOUT= 0
##$TUNXOUT= 0
##$USERA1= <user>
##$USERA2= <user>
##$USERA3= <user>
##$USERA4= <user>
##$USERA5= <user>
##$V9= 5
##$VALIST= <valist>
##$VCLIST= <CCCCCCCCCCCCCCC>
##$VD= 0
##$VDLIST= <DDDDDDDDDDDDDDD>
##$VPLIST= <PPPPPPPPPPPPPPP>
##$VTLIST= <TTTTTTTTTTTTTTT>
##$WBST= 1024
##$WBSW= 4
##$XGAIN= (0..3)
0 0 0 0 
##$XL= 0
##$YL= 0
##$YMAX_a= 520408
##$YMIN_a= -574348
##$ZGOPTNS= <>
##$ZL1= 120
##$ZL2= 120
##$ZL3= 120
##$ZL4= 120
##$ABSF1= 10
##$ABSF2= 0
##$ABSG= 5
##$ABSL= 3
##$ALPHA= 0
##$AQORDER= 0
##$ASSFAC= 0
##$ASSFACI= 0
##$ASSFACX= 0
##$ASSWID= 0
##$AUNMP= <proc_1d>
##$AZFE= 0.1
##$AZFW= 0.1
##$BCFW= 1
##$BC_mod= 2
##$BYTORDP= 1
##$COROFFS= 0
##$CY= 11.3945322036743
##$DATMOD= 1
##$DC= 2
##$DFILT= <>
##$DTYPP= 0
##$F1P= 16.9975609425685
##$F2P= -3.02152046262296
##$FCOR= 0.5
##$FTSIZE= 0
##$FT_mod= 4
##$GAMMA= 1
##$GB= 0.15
##$INTBC= 1
##$INTSCL= 1
##$ISEN= 128
##$LB= 0.24
##$LEV0= 0
##$LPBIN= 0
##$MAXI= 10000
##$MC2= 0
##$MEAN= 0
##$ME_mod= 0
##$MI= 1.114404
##$NCOEF= 0
##$NC_proc= 0
##$NLEV= 6
##$NOISF1= 3.799351
##$NOISF2= 2.8
##$NSP= 1
##$NTH_PI= 0
##$NZP= 0
##$OFFSET= 15.70392
##$PC= 1
##$PHC0= -9964.064
##$PHC1= 4.4009
##$PH_mod= 1
##$PKNL= yes
##$PPARMOD= 0
##$PSCAL= 0
##$PSIGN= 0
##$REVERSE= no
##$SF= 200.130013532006
##$SI= 16384
##$SIGF1= 3
##$SIGF2= 2
##$SINO= 400
##$SIOLD= 16384
##$SREGLST= <1H.CDCl3>
##$SSB= 0
##$STSI= 0
##$STSR= 0
##$SW_p= 3612.71676300578
##$SYMM= 0
##$S_DEV= 0
##$TDeff= 0
##$TDoff= 0
##$TI= <>
##$TILT= no
##$TM1= 0
##$TM2= 0
##$TOPLEV= 0
##$USERP1= <user>
##$USERP2= <user>
##$USERP3= <user>
##$USERP4= <user>
##$USERP5= <user>
##$WDW= 1
##$XDIM= 8192
##$YMAX_p= 0
##$YMIN_p= 0
$$ End of Bruker specific parameters
$$ ---------------------------------
##NTUPLES= NMR FID
##VAR_NAME=  TIME,          FID/REAL,        FID/IMAG
##SYMBOL=    X,             R,               I
##VAR_TYPE=  INDEPENDENT,   DEPENDENT,       DEPENDENT
##VAR_FORM=  AFFN,          ASDF,            ASDF
##VAR_DIM=   8192,          8192,            8192
##UNITS=     SECONDS,       ARBITRARY UNITS, ARBITRARY UNITS
##FACTOR=    0.000296,      1,               1
##FIRST=     0,             0,               0
##LAST=      2.424536,      0,               0
##MIN=       0,             -574348,         0
##MAX=       2.424536,      520408,          0
$$ Real data points
##PAGE= N=1
##DATA TABLE= (X++(R..R)), XYDATA
$$ [...]
1917B29r91J575L1j719J631L29j819J028L84j414O32Q30j700M94J357j614J11
1934f26J336p87k70J247p44j11J209j047r35J527o78r24R63j25j062J191j7j263
1952a116J353K99j635J166J029j519L30J377j559q0J430j406l01J418j238m23
1968h75J416q10q99J202j92q32J173K30q10J129J10j184J088L18j633L88N61j128
1986g48L46Q59j580M81J180j436R5J659j177j64J462m66r06J715r42j277J882
2003I83l97j803J212M21j491P30N81j140N58R82j468Q33R07j080J37J245j252
2020d2m7Q51o77n36J126j064o54J669j012p31J419r7j257J219N51j390J115M63
2038I06j195N58P79j373p9J416j501l7J071j174n7J279j047n52J707m94o09J020
$$ plain form
1917 229 -762 813 844 -875 756 1085 -734 294 678 -736 -104 726 -974 -480 877 -737 -626
1934 -626 710 -77 -347 900 156 45 1254 207 -728 799 121 -803 160 35 -1027 164 147 -1116
1952 -1116 237 536 -1099 67 1096 -423 -93 1284 -275 -355 1075 -331 -632 786 -452 -875
1968 -875 541 -269 -1168 34 -158 -990 183 413 -397 732 842 -342 746 1064 -569 -181 380 -748
1986 -748 -402 457 -1123 -642 538 -898 -803 856 -321 -485 977 511 -395 1320 378 -899 983
2003 983 586 -1217 -5 416 -1075 -345 236 -904 -346 636 -832 1 908 -172 -35 1210 -42
2020 -42 -89 762 85 -451 675 -389 -1043 626 -386 -1117 302 205 -1052 167 718 -672 443 906
2038 906 -289 269 1048 -325 -404 1012 -489 -526 545 -629 -686 593 -454 -1006 701 207 -402 618
2056F18P3j160J222j33r77R26j53j215Q15J87j283R06N30j195N94O64j156P08
2074b9J020j293p4J724j148p37J470o59q18Q31j43j042J402l96j223J002M65j284
2092i32R08P25j017N45O21j092M44R65j505j0J177j232k27Q16p00m01J299n64
2110a80n93J457o38p72J225L96j250P81M71j457P09N27j313M28J133j576K10R07
2128D65j003l21J370m61n14J321q75l99J322m07q51J131l65q30P76k10j112Q98
2146f5K1o89P08L15j101P32O89j006N82P67r93j6R23j104l91J476q88r28J471
2165E03n81o10O93L3r23J231j93o50Q32M50j025M85O42r73L13K96r60L05L92r49
2185f89n1J030p93k89J328o80l42J136m35o93J246k08q93J151m28j047P37M78
$$ plain form
2056 618 691 -469 753 620 -357 569 416 -799 16 203 -1080 -174 356 -839 -245 419 -737 -29
2074 -29 991 -302 -376 1348 200 -537 933 274 -544 287 144 -898 504 108 -1115 -113 352 -932
2092 -932 -24 701 -316 229 850 -242 202 1167 -338 -348 829 -403 -630 186 -514 -915 384 -180
2110 -180 -773 684 46 -726 499 895 -355 426 897 -560 149 676 -637 -209 924 -652 -442 465
2128 465 -538 -859 511 50 -464 857 -18 -417 905 498 -353 778 413 -417 359 149 -963 -65
2146 -65 -44 -733 -25 290 -811 -79 610 -396 186 953 -40 -56 867 -237 -628 848 -40 -968 503
2165 503 -78 -688 5 38 -885 346 153 -497 335 785 -240 245 887 -86 227 523 -437 -132 260 -689
2185 -689 -740 290 -503 -792 536 -144 -486 650 215 -478 768 560 -333 818 390 -657 80 558
2203E58j164L25N10j000P67O34j036l2J184p82j36J045p64k22Q15p05j59Q53n78
2222A13r04J034m53p59R24K21r82J134j30q62P45N83r40L95P95j334J67J160j090
2241a83m48J146r31m29J402p40o79J273n97k21R87Q4r70Q09P8j088J132q6j008
2260d69M32L42p96K02R15j240O74O13q78k6Q64p15j27P88k44q59J354l75j112
2279f57J275n60r79J052J7j053P24N71j054M97P48o94j72Q88q12K17P11q92J8
2298a55O58n51k92Q02o50m32R08l20q85J115j27p52Q80L91p40L38K85r42P25N41
2318G97j133K33Q01r59k61J015j020L6Q37p66L0J007n92l16Q48N8r68P33K31q64
2338b53O50k87n66N02J10p52M49N33r52J51J122q52m9R24q09O7N16m33m77J049
$$ plain form
2203 558 -606 -281 229 -771 -4 630 -406 -438 746 -36 -172 873 109 -113 702 -3 -162 691 113
2222 113 -791 243 -210 -969 -45 176 -806 328 198 -664 81 664 -276 119 914 -420 -253 907 -183
2241 -183 -631 515 -416 -845 557 -183 -862 411 -186 -407 580 664 -306 503 581 -507 625 539 -469
2260 -469 -37 305 -491 -289 626 -614 60 673 -205 -231 633 -82 -209 579 335 -524 830 455 -657
2279 -657 618 58 -921 131 148 -905 -181 390 -664 -167 581 -113 -285 603 -209 8 719 -173 -155
2298 -155 503 -48 -340 462 -188 -620 288 -32 -917 198 71 -681 199 590 -150 188 473 -469 256 797
2318 797 -336 -103 698 -261 -522 493 -527 -491 346 -420 -390 617 25 -291 557 615 -353 380 611 -253
2338 -253 397 110 -456 46 156 -596 -147 386 -566 -415 707 -145 -194 730 -79 -12 504 71 -406 643
2358F43k93r59R78l83m85Q46l23m88N54J46o05L01N26o06L08O90q28N1M88j094
2378e33L15O40o49m97R52m18l96O85l41k59P95j94o45J009J95q50N41K03p58L83
2398A78k2o10L86J73m53J73O99q73j91J014o53j54R50o32j46N49j99n97J010m48
2418A54j089J009M3p77O64J05o24M07J82n18M01M74n11r6R58j014J09N65o87J19
2438a26K96m29k39R00l49m71N44j01n95P09Q1q22Q97N2n32L98L62r70M30K21m31
2459a75j66N93n66J3M82k71k52Q12n24l41Q37j58o56P25p6o24P18q5n75M28K70
2480D09j194O21L67p73M08O36p81J69O31o49j7O34m43j27M85l79p6K96j88n60
2500e31Q45k87o08P07j9m96O36K6o28O53J83m27J37L36n76%M61p12q2R01p48k16
$$ plain form
2358 643 350 -609 369 -14 -499 347 24 -464 90 236 -369 -68 458 -148 160 850 22 73 561 -533
2378 -533 -218 422 -227 -724 228 -190 -586 99 -242 -501 294 100 -545 464 659 -191 350 553 -205 178
2398 178 156 -454 -68 105 -348 -175 524 -349 -540 474 -179 -333 617 -15 -161 388 189 -408 602 154
2418 154 -935 74 117 -660 4 109 -515 -108 74 -444 -43 431 -80 -176 782 -232 -123 442 -245 -126
2438 -126 170 -259 -498 402 53 -418 126 25 -570 139 220 -602 295 347 -185 213 575 -395 35 256 -175
2459 -175 -341 252 -314 -301 181 -90 -342 470 -54 -395 442 284 -372 353 277 -347 371 286 -289 139 409
2480 409 -785 -164 203 -570 -162 474 -307 -138 493 -156 -173 461 18 -109 376 -3 -79 217 29 -531
2500 -531 314 27 -581 126 107 -389 247 273 -355 298 481 54 191 527 -49 -49 412 -300 -382 519 -229 -445
2522d45Q66n76k48O51l31k92P38j78m74O27j65j93J83K02p36K59L15q95M06M80
2542A94n65K69K28l77j03J233r72j12P53m53n31J016k28p01O32j73m07M54J14
2561B71j010N99K66n07N39J93n00R5N14m66m4M99m03j05M06m30j14L23j48o17
2581f39Q28k05k08M84k74j61J89N16q08L47K64n25K27J06n38L43K40m47O1N26
2601C26o17j26P86n51r7N92j39n22O85P0n07J17m2l23L58L8p18L47N75n05L4M75
2623B56n02N8M40k32k39O66n11J5M41l38j40L74m40l98P98m25n9L50k29j55L06
2644C6K2o93R27M4l68K07K59n13n0L00j42k84O18n22k94N10l05J20M80k89l80
2665c17L95qk52P98m36m75M59O5q22P59J82o71K53L41q76N34L25o20L39L26l07
$$ plain form
2522 -445 421 -155 -403 248 -83 -375 363 185 -289 338 173 -20 163 365 -371 -112 203 -692 -286 194
2542 194 -371 -102 126 -251 -354 879 -93 -205 548 95 -436 580 352 -349 283 110 -297 157 271
2561 271 -739 -140 126 -381 158 351 -149 -54 460 -6 -50 449 46 -59 347 -83 -197 126 -22 -639
2581 -639 189 -16 -224 260 -14 -175 14 530 -278 69 333 -192 35 141 -397 -54 186 -261 -200 326
2601 326 -291 -417 369 -182 -279 313 174 -348 337 407 -100 17 -25 -348 10 48 -670 -323 252 -253 -219 256
2623 256 -246 -188 252 20 -219 447 -64 -49 392 54 -86 288 -152 -550 248 -177 -236 114 -115 -270 36
2644 36 58 -635 292 336 -32 175 434 -79 -129 171 29 -255 363 -159 -453 57 -248 -128 352 63 -317
2665 -317 78 70 -182 616 180 -295 164 229 -593 166 348 -323 -70 271 -605 -71 254 -366 -27 299 -8
2686hj24L29m3m77R44n25j66K72nm94J06J96l22K45K34n71J33N10n05K88K29k86
2708d0m2M78n53J34M31m86k97N40l53J03K64k97n29P80k35k81O00q7k01K64K73
2729D66n50N07J20n81K02J16p92L19L03m35oO16l50k82N24k20l12L73K29o34O85
2750B98q3j32K1J61m12M08L6q55L02N00n84pN59k39J09M76p42N0M37k62j02N70
2772E09n33k52O31n3o07L49q8n63O76p0k53L36R7m60M70L72o15J24J64l37M3L39
2794B79l83l42N17q9n22P18k49l0L06n1m15P10m74k32M95J8m73J27N94o14q7M59
2816B62m39k8L98l85J16J53k6o0M01l08j62K40P2l48L48N2l54K83Ol80Q0J44k88
2839b23M4K73l42K66M35p61K74N66n07L9K52l10l20M94m99m4L14K0j37K01m9m10
$$ plain form
2686 -8 -132 197 154 -323 621 96 -70 202 197 -297 -191 5 -317 -72 162 -409 -276 234 -271 17 246 -40
2708 -40 -82 396 -157 -23 408 -78 -375 165 -188 -85 179 -118 -647 133 -102 -383 217 130 -71 193 466
2729 466 -84 423 543 -38 164 280 -512 -193 110 -325 -331 285 -65 -347 177 -43 -355 18 247 -387 298
2750 298 215 83 104 265 -147 261 297 -558 -256 244 -340 -347 212 -27 82 558 -184 -134 303 41 -61 509
2772 509 -24 -276 355 302 -305 44 -44 -607 69 -1 -254 82 179 -281 189 561 -54 70 234 -103 -60 279
2794 279 -104 -446 71 -18 -540 178 -71 -101 205 154 -261 449 -25 -257 238 256 -217 -90 504 -110 -197 262
2816 262 -177 -205 193 -192 -76 77 51 -9 392 84 -78 162 234 -114 234 286 -68 215 221 -159 -79 65 -223
2839 -223 -179 94 -248 18 453 -308 -34 532 25 64 316 6 -314 180 -319 -363 -49 -29 -166 35 -14 -424
2861d24O71R9n14M76J4n71M24J25n18q1P07o45n9K72Mm23M43k65M8L97k19k94
2883c33Q19j78o09P07k30l32J32M63q28N45o5l01L74J43q24M84J5K4p6M72n61
2904a59l9P51p12n9M61l13LK70l89j77N64j86k38Q0L56m90K66L02k26J28J00l84
2926i1n4O47n24Q2J18k54j12L71m51K23P2l76J18L62j7k82L94O1o47N63K11n30
2948a16J06Rk43K17J79o50L73J23n29K43O50k54m66O64j98k40L07J22n89N78k84
2969Bk37M45k87j68L65p0l13K07J05k73lM96m81K02L42l59j89L38j18J6L71m79
2991h8j40L60Mm82N86q1l68K47nm17N91o5j33K30j03l91L79K00m79j49L87k95
3013b12J02J55j05P9P2m11K27O5K76k79J70J69n35M75o8m25O08l10m97M17j7k76
$$ plain form
2861 -424 247 346 -168 308 322 -249 175 300 -218 -299 408 -237 -296 -24 -20 -443 0 -265 -217 180 -39 -333
2883 -333 486 308 -301 406 176 -156 -24 439 -389 156 91 -210 164 307 -517 -33 -18 6 -70 402 -159
2904 -159 -198 553 -159 -218 243 -70 -67 203 -186 -363 201 15 -223 -143 213 -277 -11 291 65 193 293 -91
2926 -91 -145 502 -22 60 178 -76 -188 183 -268 -45 27 -349 -231 131 114 -168 226 287 -360 203 414 -116
2948 -116 -10 -1 -244 -27 152 -498 -125 -2 -531 -288 362 108 -358 306 108 -132 175 297 -292 286 2
2969 2 -235 210 -77 -245 120 50 -263 -56 49 -224 -227 269 -212 -10 332 -27 -216 122 4 20 391 -88
2991 -88 -228 132 136 -346 240 159 -209 38 33 -384 207 142 9 239 136 -255 124 324 -155 -304 83 -212
3013 -212 -110 45 -60 19 91 -320 -93 -28 248 -31 139 308 -227 248 180 -245 363 53 -444 -27 -44 -320
3035c20J65M89n52L13K15l84O5M93m31k64M68k23j40M72j74m13O11l80m30M16
3055dJ70l34J1K90j62L57j87j07r4L81k05k06J7j69K82J34l07P0P5K6l05J87J38
3078E8j94K64K03l26L87n6n16K89k3l12L02O5k26m2J89k66J70R7l14JM05k13j97
3101b55O69l81m2K96k29k46L94j46l59n2M14m87K76L08n57J80M67j92J16q0j93
3122i9K66L45l03j86q1j65L38l2l80r2N66l01MJ77J32m91N21j26j87L79j13k28
3144e6J78l3l51J76K24k55k53M48L1k97M11m64J2K58J18k49K38J38m72L67j08
3165F1l22M63l5m07K12N8m11O47j93l13o5L99l97K15J77l10K78K29k99j87M63
3186B63q8m84M48k95o9J91J61k30K13k41q0J14J30k32L64J32n74L74j72K03m36
$$ plain form
3035 -320 -155 334 -218 95 310 -74 -9 484 53 -211 257 34 -106 366 192 -221 390 10 -420 -4
3055 -4 166 -168 -157 133 -29 328 141 34 -60 321 116 -90 -73 -242 40 174 -133 -63 12 38 -267 -80 58
3078 58 -136 128 331 5 392 336 -180 109 86 -226 76 141 -85 -127 62 -204 -34 63 -251 -250 155 -58 -255
3101 -255 414 33 -9 287 58 -188 206 60 -299 -351 63 -424 -148 160 -397 -217 250 58 174 94 -99
3122 -99 167 512 209 23 -58 -223 115 83 -297 -389 177 -124 -120 57 189 -302 219 93 -94 285 172 -56
3144 -56 122 89 -262 -86 138 -117 -370 78 109 -188 223 -241 -229 29 147 -102 136 274 -198 169 61
3165 61 -261 202 167 -240 -28 30 -381 266 73 -240 -305 94 -303 -88 89 -221 57 286 -13 -200 263
3186 263 175 -309 139 -156 -225 -34 127 -103 110 -131 -211 -97 33 -199 165 297 -277 97 -75 128 -308
3207c08L90n8l31N43k13k96N83m64n7K90M3l93K61J58j00O1M0m39M67j3n35L22
3229d9O6k44J50K13l60k8M26k24q7M64l20k12M73k63N6J16K2j39l07J50k04L05
3251DQl20L57K19n50K68L01m07J96J76k25J02j4k27R4J79l70j6M18l72j91M76
3273A06q3k08K99r9j23L83l0l73J06L12n00K13J63k24j78L85l60n2L54j63k11
3294b83M48l32K79J53j6m45L31q2r3J78J46m18K09M3k84K05J07j76J32O4l15j52
3316c01N26j47j49N51o39N6M53j47m62M31j92j63K17ok29K76M3k72J85K58l43
3337e4J72K32m64L4L17k52R7Rlk20K22j25J6K1n7l9R7j32k8R5K08l71K26Q8r9
3362a0K11q3k31K34N8n20J05K93J13k66J22j83J69L54l79N0m7O3m47N09k39k22
$$ plain form
3207 -308 82 24 -307 236 23 -273 310 -154 -211 79 122 -271 -10 148 48 109 149 -290 177 164 -371 -49
3229 -49 17 -227 -77 136 -224 -252 174 -50 -137 327 7 -205 268 5 61 177 199 60 -247 -97 -301 4
3251 4 12 -308 49 268 -282 -14 287 -120 76 252 27 129 115 -112 -18 161 -209 -225 193 -179 -370 106
3273 106 23 -185 114 15 -108 275 245 -128 -22 290 -210 3 166 -58 -236 149 -211 -263 91 -72 -283
3294 -283 165 -167 112 265 249 -196 135 53 -40 138 284 -134 75 118 -166 39 146 -30 102 166 -149 -301
3316 -301 225 78 -71 480 -159 -103 350 203 -259 172 -20 -183 34 28 -201 75 118 -154 31 289 -54
3337 -54 118 350 -114 -80 237 -15 82 91 88 -132 90 -35 -19 2 -55 -94 3 -129 -157 -62 146 -225 1 89 -10
3362 -10 201 118 -113 121 179 -341 -236 57 170 -96 26 -157 12 366 -13 37 -10 53 -394 115 -124 -346
3384c46N65j8m61J98mp23Q52J49m59K03M96n79J68M85q09K63K52j6j54L39j72
3405B29k83K65m54k35L65K53m91N54o4k92P7J28j26J40J67m52M30q3m5j05L4l02
3427b90K72K65k18r6R0o3k6K89j73l52M42j47k90L62J65k40N5m4j63J69J22q1
3449D8q8N0j43J63J62k23N8L24k52j58L35k80L0J76k71k35L12j41j25K64k8l75
3471c97M38J8k87J33K72l51J61J41k08P2J81k43l6L86l55L6K08o1k96L12j21P1
3493G4P7j89j6K21Kl5l0jj17L3J74l6k07N7n3j71M05l14L9L39l50J10J2K5k44
3518a95N27l74l23M93m5P5k24J48j86J94k18j40L24m2j93J21L09k15J11Ql19K34
3540G0r4l6j48K58J38l85Q1K57p9Ml16K26J87j62o1L08k84r5K09P2o8n1J56n39
$$ plain form
3384 -346 219 201 -260 -62 -66 -789 63 212 -247 -44 452 -127 41 526 -283 -20 232 216 62 401 229
3405 229 -54 211 -243 -478 -113 140 -351 203 139 -153 -76 52 -74 66 233 -219 211 128 83 -22 12 -290
3427 -290 -18 247 29 -67 23 -40 -66 223 50 -302 140 -7 -297 65 230 -10 45 1 -162 7 129 48
3449 48 -40 10 -133 30 192 -31 27 351 99 -59 276 -4 26 202 -69 -304 8 -133 -258 6 -22 -397
3471 -397 41 59 -228 -95 177 -174 -13 128 -80 -8 173 -70 -106 280 -75 -39 169 108 -188 124 3 74
3493 74 151 -38 -54 167 169 134 104 103 -14 19 193 157 -50 7 -46 -217 188 -126 -87 252 -98 12 24 49 -195
3518 -195 332 -42 -365 128 83 158 -66 82 -104 90 -128 -268 56 14 -179 -58 251 36 147 155 -164 70
3540 70 -24 -60 -208 50 188 -197 -116 141 62 66 -250 -24 163 1 -60 248 -36 -131 78 150 82 31 187 -352
3564c52j00M66j54J23K48m04j10N36k55j75K86O3n7Q2n3k58J35R4j64q7K73Nj99
3587e7J44p1j17J71l78L61J99l84K35K6m9j03n7M2o5K18j03l70N84m11PK77J25
3610B24m38L67M6k11K04r7K07l39M05l78p5J48p5n4K48j17l04N9K27o4N4J37m75
3633c01M69j12o3K57j86p8j85J87J70j84j2kk18J93q0l4L10j63O2L16j24j59Q8
3656A51j24o1l1K6J26J12m68j3L18j01m9P0N60o06MK69m57o2N76l17J06K69m61
3679a63K66J9j04j68J87M9k30O8Q0j10J53P9k30O0M7o3J46J83l70K80Nl77J64
3702b9j69J96j78J14K17l31L14k24R9P7l7l0l9Q2k42J78Qm1qO5m8k24L85k75J17
3727b3K28l86J33J25j37K61j9k90J27J90j57m1M21l90j32L23o8m25L78k59K74
$$ plain form
3564 -352 -452 14 -140 -17 231 -173 -283 253 -2 -177 109 172 115 197 144 -114 21 115 -49 -136 137 142 -57
3587 -57 87 16 -101 70 -308 53 252 -132 103 129 80 -23 -80 -38 -103 115 12 -358 226 -185 -178 99 224
3610 224 -214 153 199 -12 192 95 302 -37 368 -10 -85 63 -12 -66 182 65 -239 -180 47 -17 37 174 -301
3633 -301 168 56 -7 250 64 -14 -199 -12 158 -26 -38 -40 -258 -65 -145 -179 131 -32 30 346 222 63 151
3656 151 27 -34 -65 -39 87 199 -269 -282 36 -65 -114 -44 516 -90 -86 183 -274 -336 240 -77 29 298 -163
3679 -163 103 122 18 -150 37 86 -144 -76 4 -106 47 126 -104 -44 3 -60 86 269 -101 179 184 -193 -29
3702 -29 -198 -2 -180 -66 151 -180 134 -90 9 86 49 19 -20 62 -180 -2 6 -35 -43 22 -26 -250 135 -140 -23
3727 -23 205 -181 -48 77 -60 201 182 -108 19 209 52 11 432 42 -90 233 165 -260 118 -141 133
3748A33K9j10j80j9O4m6P7J52l5l18L11j32n8no4M0L21J09n18M02j60j11J67j09
3772f0k31J68K93m06K20L3p3N8J70j7k56K35k30j14J41Q2o2K42j36r7L6Jj53K41
3796H5O2j16j62J44l24K49j4K60J2M7m17K05Q8k04k5L62o4k05J63l07P9J66L0
3819A14J36l30K30k55Q9o8j42K05L37l30L0J42k97L12l37l42N58J91n76p2N17
3840A12j84J53K58o56L13P2r8j64L62o4l59M91J05l00J41N6k15J84P8l38mJ46
3862H9k07j80K09K25k64M15l11N3L81m51n6J85J26j51R3Mo25M76k62J28l9K33
3884G1q6q7J79j79j1L32m12J53Q2k3o8J74Q9l37K55l89j9L43l6j45Q4P1m13K66
3908a06J58l31M81P9k55j68K5j42M06O3m66K54q5o8J3nNJ0K27j56l42O16M6l89
$$ plain form
3748 133 162 52 -128 -147 -83 -129 -52 100 65 -253 58 -74 -132 -137 -201 -161 160 269 -249 153 -7 -118 49 -60
3772 -60 -291 -123 170 -236 -16 17 -56 2 172 155 -101 134 -96 -210 -69 13 -49 193 57 -40 -4 -3 -156 85
3796 85 147 31 -131 13 -311 -62 -76 184 196 243 -174 31 119 -85 -110 252 188 -17 146 -161 -82 84 114
3819 114 250 -80 150 -105 -16 -84 -226 -21 316 -14 16 158 -139 173 -164 -506 52 243 -333 -405 112
3840 112 -72 81 339 -317 -4 68 -30 -194 168 104 -255 236 341 41 182 238 23 207 285 -53 -57 89
3862 89 -118 -298 -89 136 -128 287 -24 29 410 -41 -97 88 214 63 156 160 -465 11 -251 -123 -162 71
3884 71 -15 -102 77 -102 -113 219 -193 -40 42 19 -49 125 214 -123 132 -257 -276 67 31 -114 -30 41 -372 -106
3908 -106 52 -279 202 281 26 -142 -117 -259 147 210 -256 -2 -87 -155 -142 -147 -142 -132 95 -61 -403 213 259 -130
3932a30K01j3j50j28N30m40j98M06l25J32P5j09K12N7k07j21M02j73J11O9k74
3953g3J10Q9j82m38M86j33J94J49k48o7J96j5j67lN07n84M5L55l51K28%r5k75
3976b72K67k4k32M24n7k71L84l62J04Q2J41l8j24r5j51L13j37j02o7K96k46L67
3998B00l41m0J40j48J70O8K0j63j31M75m91J60M00j72qR8q5k89K17P3k53P6K18
4021A94l45K58n7j37J21O8lJ55K94p57K33j08O1k9J86k20j22M90m29L4J72j2j41
4044i4J52K63o38L26J38k01L76j64l58M2L53m02P3M10k94p3L42j99r0J76j01j1
4066B6K83n0m13L46j38m1J06J21m56N17k18j63Q8J22m29rO23n38M19m9k59LK33
4089A24l32K84J74m15J69R2p5l36O85l72J5J16j53JQ2n0k58L29M7l38L15M98o42
$$ plain form
3932 -130 71 58 -92 -220 310 -130 -328 78 -247 -115 -40 -149 63 120 -87 -208 194 21 132 201 -73
3953 -73 37 126 -56 -494 -8 -141 53 202 -46 -113 83 68 -99 -102 405 -179 -134 221 -130 98 98 3 -272
3976 -272 -5 -29 -261 163 106 -165 219 -143 -39 43 184 146 22 -73 -224 89 -48 -150 -217 79 -167 200
3998 200 -141 -181 -41 -189 -19 49 69 -94 -225 250 -241 -81 319 147 139 237 152 -137 80 153 -100 -24 194
4021 194 -151 107 50 -87 34 102 99 254 548 -209 24 -84 -23 -52 134 -86 -208 282 -147 -113 59 47 -94
4044 -94 58 321 -317 9 147 -54 322 158 -200 -158 195 -207 -134 276 -18 -91 251 52 -38 138 37 26
4066 26 309 259 -154 192 54 13 119 240 -216 301 83 -80 8 130 -299 -308 315 -223 196 147 -112 -109 124
4089 124 -208 76 250 -165 4 96 21 -315 370 -2 13 129 -24 -23 59 9 -249 80 127 -211 104 602 -40
4112d0ML56m69K00mk79J79K42j36l49K63Jj63L66j87p3J22J67m25L01J54m02J92
4135B0ok15K66O6k86J40k1J19k23K00j46k09M73k10K5L0k48P6M38n14K94j38J87
4158A18m06K04l0n0K42j9J33k33K77l52J03J71J19k92K82m48J5Q3o5j5J49J94
4180A80m44L98p4k38K11l9r9K88n1j22J46K2m36J23K32l50K22L7k4j76L24j15
4202A5n1K48P8l82K60k43Q3L31k11l09K17K84n41L57J66m29K68o4k64Q9K35k87
4224a50P7K93l70J98o9RR3J02k72l6K91k77J25M6J19l44L9K00k93J58J64k73K47
4247G7J88m13J57n5l18L89N8j13Q7N9k47q3K27J68j28O1m6j81M87n64J79J56j41
4270Dm52N21L4l76M00J8j54K8J02j56j2J83k69J16k77K97P7M0j40j95L60n0l14
$$ plain form
4112 -40 -36 320 -149 51 47 -232 -53 189 53 -296 -33 -32 -195 171 -16 -89 33 200 -225 76 230 -172 20
4135 20 14 -201 65 131 -155 -15 -36 83 -140 60 -86 -295 178 -32 -7 23 -225 -149 289 -225 69 -69 118
4158 118 -288 -84 -114 -164 78 59 192 -41 236 -116 -13 158 277 -15 267 -181 -166 -83 -148 -163 -14 180
4180 180 -264 134 60 -178 33 -6 -105 183 132 10 156 178 -258 -135 97 -253 -31 6 -18 -194 130 15
4202 15 -36 212 290 -92 168 -75 8 339 128 -181 36 320 -221 136 302 -127 141 77 -187 -98 137 -150
4224 -150 -73 220 -150 48 -21 -12 81 183 -89 -125 166 -111 14 60 179 -165 -126 74 -219 -61 103 -170 77
4247 77 265 -148 9 -46 -364 25 83 -30 57 116 -131 -214 13 181 53 114 68 -113 374 -190 -11 145 4
4270 4 -448 73 107 -269 131 149 -5 23 125 -31 -43 140 -129 -13 -290 7 84 124 -16 -211 149 99 -215
4293b15L63n1k62n8M16j98K83m98K76j99K55L3j16J33j04l5r1j01J4L54j76k28
4315b05J54n2l53N12k32J51MJ49j67J79R4k70J23k6k28J1M26m51K18J65n45Q5
4337b58K20j31J39J21p9l2J09l7k00K16o7j6o4K62l47M35j36m99J18L47j21PM
4360ij42l2J66L62l92J86k19K5J75l84J93L98l74m8J50l10M4N3K93k46M66k52
4382A03l80K47j6m3J93J80m03rL64n90L81K4j83p4N72k80K09l72r5Q8J51m1j67
4405a41j1K68l59K05J38N8k11K44k42K0N3j46Q0K04j77O6q8j89P8L89k84q9J84
4428E0Kr3J55m6l13K87N7n1lO0j26K89j47l67M22k4j19rN8j08O0N2k47N8J62k50
4454a91j87L77J2p1p4n7J22K73J22n02J65m5K0P4J85m14J75K18n75K14J53L4r5
$$ plain form
4293 -215 148 97 -165 -223 193 -5 278 -220 56 -143 112 145 29 162 58 23 -68 -169 -155 199 23 -205
4315 -205 -51 -103 -456 56 -176 -25 -21 128 -39 140 234 -36 87 61 -167 -156 270 -181 37 202 -343 -258
4337 -258 -38 -169 -30 91 12 -20 89 52 -148 68 1 -15 -79 183 -164 271 135 -364 -246 101 -20 -13 -9
4360 -9 -151 -183 -17 345 -47 139 -80 -55 120 -264 -71 327 -47 -95 55 -255 -211 -158 135 -111 355 103
4382 103 -277 -30 -46 -89 104 284 -119 -128 236 -354 27 51 -132 -206 366 86 295 -77 -172 -84 67 26 -141
4405 -141 -152 116 -243 -38 100 158 -53 191 -51 -31 22 -124 -44 160 -17 49 -39 -228 -150 239 -45 -134 50
4428 50 52 -41 114 68 -245 42 99 48 45 105 -21 268 121 -246 176 152 33 24 82 -26 34 86 -161 -103 59 -191
4454 -191 -378 -1 11 -60 -134 -191 -69 204 326 -176 -11 -56 -36 38 223 -191 -16 202 -373 -159 -6 28 -67
4477f7K45l83K90L49l95j45K53l13L20m3q7k08L50l84l4K32L10m02j09K70k21
4498a72L13m7j07J06J74k81n5L39n31R1o5P6j17O4K7j57K62qK12mj99O6J67K11
4522C65k49N0P1k84k1M36o98K95J56k07p7L61j40n0J42k22m7K64p8n1J02J02q2
4545A38J21L4n08K42K02j92n8J16n2q1K31k12K43Nk57j24N14m91O4J81j62p6J92
4568G0j49m9K92l71j3NP8j37K15Q7k61K60K34k03j22m0K98k13K09k46j41J81r2
4591a08J57k4R7k66K28J8j36J27J43m38L85O9l50K92o7l59K34J47k92R4Q9J87
4613B27l85L02j10k70L08J51l25K78k98J07K97k03j60K55j83j75L18j28k03L19
4633A22K4k06K60j11jkJ60m10J74K91j60l35L59j32L1M9l6k42L62l99j8N46l99
$$ plain form
4477 -67 178 -205 85 434 39 -106 147 -166 154 111 24 -184 166 -218 -252 -20 290 -112 -221 49 -172
4498 -172 141 94 -13 93 267 -14 -69 270 -261 -170 -235 -159 -276 -212 -185 -342 -80 -88 124 120 -79 -13 154 365
4522 365 116 166 237 -47 -68 368 -330 -35 121 -86 -163 198 58 8 150 -72 -119 145 67 16 118 220 138
4545 138 259 293 -215 27 229 37 -21 95 43 -38 193 -19 224 229 -28 -152 362 -129 -65 116 -46 -122 70
4568 70 -79 -128 164 -207 -220 -215 -137 -274 -59 28 -233 27 261 58 -64 -104 194 -19 190 -56 -197 -16 -108
4591 -108 49 25 122 -144 84 102 -34 93 236 -202 183 252 -98 194 127 -232 2 149 -143 -49 40 227
4613 227 -158 144 34 -236 72 223 -102 176 -122 -15 282 79 -81 174 -9 -184 134 6 -197 122
4633 122 146 -60 200 89 88 86 246 -164 10 301 141 -194 165 33 64 113 77 -165 197 -202 -220 326 -73
4656g3k00K11J30m03M95N2l77J38J20j44L9J23k23j97N64k36l00O14k82l02M26
4677A75j6l3J08j83j85M05k37j25K17k66m0J26r1J2L79l69K9l6P1O8K18J91m17
4700Ao4L68m10L3n9r5J41K66r8j57k09L44o8J40K7m22N20K5j84K1n4j63j07K69
4724F5j10J18n3j06R3J4M8k16J92j38q9L58k95j96L95J81l22J09J43l83L15Q3
4746B06k88J26K31k11o7K03k64l2R4q7m9K93j59j86K06j0j44R7K07p9j11q7P9
4769c2O7n8l06K98J09J0j15K04j73R9K8l13K11K42m07K6K01j31j11L04m54J30
4791a71L22j02k07n9L17k29K60J2j80j1K60o02L27J05k20K71k3j01l3o0R3J50
4813A19Rk76j4J25M8j2j18J71J3K98k82m26L75r4o5j63J89N9OJ28J84k99L24j86
$$ plain form
4656 -73 -273 -62 68 -335 160 212 -165 -27 93 -51 -12 111 -112 -309 255 19 -281 333 51 -251 175
4677 175 159 126 234 51 -134 271 34 -91 126 -140 -180 -54 -145 -133 246 -123 -94 -130 -59 9 227 418 1
4700 1 -63 305 -105 -72 -131 -226 -85 181 83 -74 -283 61 -7 133 160 -262 258 283 99 120 66 -97 -204 65
4724 65 -45 73 20 -86 7 21 69 -147 45 -93 -182 176 -119 -315 80 261 -61 48 191 -192 123 206
4746 206 -82 44 275 64 -3 200 -64 -96 -2 -89 -138 155 -4 -190 16 6 -138 -41 166 87 -24 -111 -32
4769 -32 35 -23 -329 -31 78 88 -27 177 4 103 131 -182 29 271 -136 -110 91 -40 -151 153 -301 -171
4791 -171 151 49 -158 -217 100 -129 131 143 -37 -48 212 -390 -63 42 -178 93 70 -31 -64 -124 -31 119
4813 119 128 -148 -162 -37 11 -1 -119 52 65 363 81 -345 30 -64 -129 -292 -103 -44 -38 90 274 -25 299 113
4837A13j28N4k00K3rJ58J68j13qJ02k10J6M1K67j54k0j01j06m3R4J91k80J47K78
4861B80n27J90J69k93J06j25oR6J70J53l48M4K7j57L80k52qK60j4k48K11OL4l65
4885b17K25j47J3J95r7j18L18k26Q5J47l58L41k27p7J3J48j8l25L96K3m3o4K2
4908Ik97J92L00k16lJ17r6j10J77j23P9rn1lL62l78Q2j1k82K76n8L0k46J24K20
4933H5k14K51J47m13J05K0o4J17k16n2N9K30q2j52L36j89jL80l19k40Q7J51j55
4956a29J60q0j91M08k2k62J71J01k07k68L67k17L47k42o1k4j3J57J80J08l27n8
4978a02J19P5k52K13j69j29L63o1j22n8n2K06n4K09l53J78K70n20J52L06j49j26
5000e6N62m96j08O4l1Q5J38k32O7J72k10j55KJ99j72J30R2q9j9j5mQ4J53j76J50
$$ plain form
4837 113 -15 39 -161 -138 -147 11 179 66 58 160 -50 -34 7 274 120 100 -1 -107 -150 -56 135 -145 2 280
4861 280 -247 -57 112 -181 -75 -200 -206 -110 60 213 -135 -91 -64 -221 159 -93 -101 159 145 -103 108 114 148 -217
4885 -217 8 -139 -126 69 -28 -146 172 -54 31 178 -180 161 -66 -143 -130 18 0 -325 71 94 51 -13 9
4908 9 -288 -96 204 -12 -15 102 6 -104 73 -50 29 20 -31 -34 328 -50 32 21 -261 15 -43 -13 -259 -135 85
4933 85 -129 122 269 -144 -39 -19 -83 34 -182 -234 -175 55 -27 -179 157 -32 -33 347 28 -212 -125 26 -129
4956 -129 31 -49 -240 168 146 -116 55 156 -51 -319 48 -169 178 -64 -125 -149 -162 -5 175 283 -44 -102
4978 -102 17 92 -160 53 -116 -245 118 57 -65 -123 -175 31 -23 186 -167 11 281 -239 -87 219 70 -56
5000 -56 506 10 -98 -34 -65 20 158 -74 -7 165 -45 -200 -198 1 -171 -41 51 -38 -57 -72 -76 8 161 -15 135
5025A35n8k05l8K19m13N33k06j6M2J61l2j86J92r7j89M8J06k99M21j71j97N5M91
5048B96l25J3l0k20N32r6l25R6K57k68p5K85l01K6J17L2k37L10J7k63R6P4J16
5071A27k33M14n45O0K2Q1L2Q7j09Q3K45l85J40J94l26j24K80r9m9J9K49n05M37
5094I5j13j89K87p0l38M15k41Q0J08q7n4J56Mj00L3J70m2k03K93j80k8p4l16M74
5118H0j71M4r0K57r7j13K22j74n2K44m5n04J57K82L2j36J23Qk18K80l5l48L88
5141A34n12K0M32m64K88J51j7k87L34j91O1l3l5L36j51M4l48L35j24j49K17j75
5163a34K52j84J66j97L28j95k17L99k61M8J38N0n8j75R6j20j48K67j22J26k86
5184b27M54k73K8j14K50j20R2l49K17%J84n5K4R2m21K36k54K77r5J03q1J53k48
$$ plain form
5025 135 77 -128 -166 53 -360 173 -33 -49 -7 154 122 -64 128 31 -158 -110 -4 -303 118 -53 -250 -195 296
5048 296 -29 -16 -46 -266 266 170 -155 -59 198 -70 -145 140 -161 -135 -18 14 -223 87 104 -159 -63 11 127
5071 127 -106 308 -237 -177 -155 -74 -42 45 -64 19 264 -121 19 213 -113 -237 43 -56 -105 -86 163 -342 95
5094 95 -18 -207 80 10 -328 87 -154 -74 34 -53 -107 49 53 -47 -14 156 114 -89 204 24 -4 -78 -394 80
5118 80 -91 -47 -137 120 23 -90 132 -42 -94 150 105 -399 -242 40 72 -64 59 67 -151 129 94 -254 134
5141 134 -378 -358 74 -390 -102 49 32 -255 79 -112 -51 -84 -119 217 66 110 -238 97 -27 -176 41 -134
5163 -134 118 -66 100 -97 231 36 -181 218 -43 5 143 193 135 -40 56 -64 -212 55 -67 59 -227
5184 -227 227 -46 -18 -132 118 -2 90 -259 -42 -42 142 87 111 203 -218 18 -236 41 -54 49 -32 121 -127
5207a27J84J84k81j05K03J07l0k97L22O9l54K16j45qR1j60K8m7J09p5J78J2m2
5230C2nN3j11j41L09j76N15l96l71L46p8k02L33o2k10K56N6JJ85j63k12J4J37
5253A10k5k51L81j10l91L30L0j27M11j35j74pJ40l61K66J29l11J25P3k56J15J
5275c7p0R8J63oj31P6j00q6Q2J33M1k5l79J17J86L9n8Nn6mJ67k86M6R4k91K73
5301iJ9j76N7L42j32j59K13k98LQ9K51l35Q6J07L4r0K08l30R0k8j18J01J53J02
5325A80l13K19J36j83K7J99k82m9r4L32k6p4Q8Rn7k7l08K67j94OK91j70J5o6J62
5350H8J3j67P1n7k6L9%n9K32j29J30l2k87L34K26m22N8L01l97m9J7K23j59K40
5374A88k21K1L5J04k07J49l3m0j80J62j25K3K37k99K54p4Q7j28Q9r2M2j39J17
$$ plain form
5207 -127 57 241 -40 -145 58 165 135 -162 160 229 -125 91 -54 -62 29 -131 -103 -150 -41 -116 62 74 32
5230 32 27 80 -31 -172 137 -39 476 80 -291 55 -23 -225 108 46 -164 92 148 149 334 171 -41 -27 110
5253 110 85 -166 215 105 -286 44 74 -53 358 223 49 42 182 -179 87 216 -95 30 103 -153 -38 -37
5275 -37 -107 -9 154 148 17 93 -7 -93 -11 122 163 138 -241 -124 62 101 43 48 -8 -12 155 -131 -85 9 -282 -9
5301 -9 10 -166 -109 233 101 -58 155 -143 -140 -51 200 -135 -49 58 92 2 210 -120 -30 -58 -176 -75 78 180
5325 180 -133 86 222 39 66 265 -17 -66 -160 172 146 72 160 169 112 85 -223 44 -150 -144 147 -23 -8 -74 88
5350 88 101 -66 5 -52 -78 -39 -39 -98 134 5 135 103 -184 150 376 -46 12 313 -84 -133 -116 107 -52 188
5374 188 -33 -12 23 127 -80 69 36 -4 -184 -22 -147 -124 113 -186 68 -6 81 -47 42 -50 -8 -147 -30
5397c0K07r7k20J77J75k82j70N51k71oo9k0M6p3J47K12k91R0K0r1M9q8L7j08q7
5422a92k11M47k1j27J43O6n2j07J1j1K71k35l8p0M4o7K02K11m03M61k75l45K45
5445e3P4o4Q7r4L8R4o2j23L23j55j18j39P9J4R9J70j65m6J58kk97L35q2K1l24
5470b32R6P8K23j52l9J06m1j81L35j41j04r8j35J57J47J76j10P6Q3k44j82J70
5492a2J10p8M4j05k07K17r9P1J27Nk09PK17k02R9J88j91O6N0k2K51l71r4j82K39
5517h1N4k61M53k55k0r3L62m0m0l4K7k4Lk33K20j51k1J29R6j80P0M9Q4o6k4J34
5543A58n7K7l8p8r9m9OP4K03m6r0R6K2J03r9l13K11n5o9J34lP7K2m2J01j11j45
5570f0J56k99M28j57j37K69k44K84k52r0J3M9O7j61K63r6J31l50p5R0R6K72m81
$$ plain form
5397 -30 177 80 -140 37 212 -70 -240 311 40 34 -35 -55 -9 -82 65 277 -14 76 96 5 54 -34 3 -105 -192
5422 -192 -403 44 23 -104 39 105 53 -54 -43 -54 217 -18 -56 -126 -82 -149 53 264 -139 322 47 -298 -53
5445 -53 21 -43 44 -50 -12 82 20 -103 220 65 -53 -192 -113 -99 0 170 5 -41 117 115 -182 153 71 92 -232
5470 -232 -136 -58 165 13 -26 80 39 -142 193 52 -52 -150 -285 -128 19 195 85 161 244 0 -182 -12
5492 -12 98 20 64 -41 -248 -31 -130 -59 68 73 -136 -129 88 -114 -15 173 -18 48 98 76 327 -44 -138 -320 -81
5517 -81 -27 -288 165 -90 -110 -203 159 119 79 45 72 48 51 -182 38 -113 -134 -5 91 -89 -19 30 114 48 24 158
5543 158 101 128 90 12 -87 -136 -130 -56 147 101 11 107 129 232 133 -180 31 -24 -93 41 38 115 137 95 196 85 -60
5570 -60 96 -203 225 68 -69 200 -44 240 -12 -102 -89 -40 27 -134 129 33 164 -186 -261 -171 -75 197 -284
5593b84K88P1K6k11J39m5j52J60O5q1O3K08o00L94j60J66oL28l94j41L72k27j26
5616a47J70p5m3J57l17M13j99k13O79k87j44l36L96j4j49m0j6J20J09j45K0J42
5638H1nOj7J43k60R4J16Q4k89K00k51K14M1j7l53K78r7J12J2k43K42K37k25k26
5662a23J5J23J03NK7p4J37l61k4K78j02j68k57O27l69j21M08j55K9L5k1j49L37
5685B00l51K81k58J18J15j93K4J98j27j16m2J23o8k3j17J94M7j00J59j82m0J49
5707ik6l20N46j34p3L7Pj73K23k32J70j40j90K77r6K54k53K5P7j13J4K17J3m2
5731E9k18JO6K45k31l4O9K03j83m9k7L30l93L79l80K36j65R9j73K91n0j6M3k24
5755a22L80j78Q6m67L10j65L69k72J57J6Q0k79J73K2j01l59K18K13l4L5j42J31
$$ plain form
5593 -284 4 75 101 -110 29 -16 -168 -8 57 -24 39 247 -353 41 -119 47 41 369 -25 -166 206 -21 -147
5616 -147 23 -52 -95 62 -255 158 -41 -254 425 138 -6 -342 54 40 -109 -149 -165 -45 64 -81 -61 81
5638 81 76 82 65 208 -52 42 158 242 -47 153 -98 116 157 140 -213 65 -32 80 92 -151 91 328 103 -123
5662 -123 -108 15 118 123 150 76 213 -148 -172 106 4 -164 -421 206 -163 -284 124 -31 -2 33 12 -137 200
5685 200 -151 130 -128 -10 105 -88 -64 134 7 -109 -151 -28 -96 -119 -236 -42 5 -95 64 -118 -158 -9
5707 -9 -35 -355 191 57 -16 21 28 -145 78 -154 16 -124 -314 -37 -133 121 -132 -107 -30 -143 -129 88 101 59
5731 59 -159 -158 -92 153 -78 -112 -43 160 -23 -72 -99 231 -162 217 -163 73 -92 7 -166 125 75 59 102 -122
5755 -122 258 80 166 -301 9 -156 213 -59 98 114 194 -85 88 110 9 -350 -132 81 47 82 -60 71
5777G1j8o4Q8k25N7qJ21j39J32J58J54o8k94m4J38m61L58K02lk31M7J51oR1k56
5802d9OK59k00r6K34m05K04R0PL7N5J26l84K67j80j95J58N5QM0k15L64l42P3K51
5827A68j93L1j53k0L85l38k4R0P8O6j05J20j81J51q9n2K67q6j13J82k97O6J60
5850A13k13L75l46n6j45K36j9M3j53NL00j66J29j37J56k54P9M6J12j04q8Q9j84
5873a82l8K65p0j66L06l35J01O7Q2k9q6K05O2K9P6l34Q5n6j76n8q9K83O0k6j80
5898b04L41j01m4m8M5J30m2j15K96j81r1m7p9J22J66K61l45O4k38K60j55k83K12
5921g6J52l50J47M27l05O4q0j03J2N02l34k08J46j75J57Q9l07M16k84P0k2Q3J73
5944A94m36L55j78m7J27j07P4m2j7N7j91J28j10K67p5Q7J37j35q2l22N02L4l00
$$ plain form
5777 71 53 -11 77 -148 -91 -99 22 -117 15 173 327 259 -35 -79 59 -402 -44 158 155 -76 -29 122 116 207 -49
5802 -49 -43 216 16 -80 154 -251 -47 43 50 87 142 268 -116 151 -29 -224 -66 -11 -3 37 -178 186 -156 -83 168
5827 168 -25 6 -147 -167 218 -120 -144 -54 24 90 -15 105 -76 75 -14 -66 201 115 2 184 -113 -47 113
5850 113 -100 275 -71 -127 -272 -36 -55 -12 -165 -160 140 -26 103 -34 122 -132 -53 -7 105 1 -87 2 -182
5873 -182 -220 45 -25 -191 115 -220 -119 -52 30 1 -85 120 182 211 287 -47 38 -18 -194 -252 -341 -58 2 -24 -204
5898 -204 137 36 -8 -56 -11 119 77 -38 258 77 -14 -61 -140 -18 148 409 64 128 -110 150 -5 -288 -76
5921 -76 76 -274 -127 300 -5 59 -21 -124 -112 390 56 -152 -6 -181 -24 65 -242 174 -110 -40 -62 21 194
5944 194 -242 113 -65 -112 15 -92 -18 -60 -77 -20 -211 -83 -193 74 -1 86 223 88 6 -316 186 220 -80
5967h0N8QqN2J15r0j12J55k20L3J87k40Q4pM3K34k87K1P7ML7N1j39O4j23P8p7
5994h2J35k94K21J40J61j88k28L49k06l7j57L38j63r3J34K5j36K24j74l32M41
6015G8o6j2j18J59M0P6j44J17q4Mk67K87L4q8n1K9K17k19n1rj9m1R2qJ17j40L0
6042c7O4j46M05n11L33l81K49n7j42K11J26k51J73J91j77r1M6j1J76j39N4J43
6064B28l33O0Q2p8n4j50L19j25j49J92J83j97N1P7p0m6O7mm5J63j72J07k41L8
6088i7L8J79k06L5j05O9Q3J01Rk23K37l24M93l16J38k81N1L50k43R0l87M20m23
6111c12L29j80J50J67j23k78K83Q9j00O1j4q3J09j46K02nk02j0n1K11K29n35L19
6134A10j51k82J18J08Q6kj32J65p9j29K57J82k64M1K32l8k10l49K62j4J78j35
$$ plain form
5967 -80 -22 -14 -22 30 145 55 -57 98 -122 -89 98 -142 -58 -65 -22 212 -75 -54 23 27 64 115 -24 40 -83 -5 -82
5994 -82 53 -241 -20 120 281 93 -135 214 8 -29 -186 152 -11 -104 30 55 -81 143 -31 -363 78
6015 78 12 0 -118 41 81 157 13 130 46 50 -217 70 104 16 -35 -6 211 -8 -59 -68 -87 -128 -36 -44 73 -67 -37
6042 -37 27 -119 286 -225 108 -273 -24 -81 -223 -12 114 -137 36 227 50 -41 5 -6 170 31 85 228
6064 228 -105 -45 37 -41 -95 -245 74 -51 -200 -8 175 -22 29 106 36 -10 57 53 8 171 -1 106 -135 -97
6088 -97 -59 120 -86 -51 -156 -87 -4 97 106 -117 120 -204 289 -27 111 -170 -119 231 -12 78 -309 111 -312
6111 -312 17 -163 -13 154 31 -247 36 125 25 86 72 -11 98 -48 154 149 -53 -63 -114 97 326 -209 110
6134 110 -41 -323 -205 -97 -11 -13 -145 20 -59 -188 69 251 -13 28 260 222 12 -337 -75 -89 89 -46
6156d6Q6mn7r1M3j12J09j77K64j64L59j78l15K04nL8O8j41L9Q4J1J3J19K2l76
6181b07J49J82k89J18Q9j15j5p9L79l31J38L3k30N09l05R2j15j4KJ69j57Nl5K04
6205A77j23L9j45J13J86m74K08r3m0L24l30J27J15k23K38J2k30J43p4Q4J25k44
6227h5K26l45L38j08l7J6R0l8K5j88K7R3J1j40O1Q3k22J41J32k03J19O2RJ4k65
6252a84N9K1j94K51K05l46J48L09n3k80L6K94m87K52pk27K21J6O2l46J70q8k60
6275d28L10K33k98K55J20p7p2j47j61M62k61K1J57j9j12J93j49q2J08o5J4o8q5
6298a51K20l10M75m01j7K84l9ok52M9q6N44l77J48j9O8j05j78K55j10Pj16KJ77
6322F2P9l07N7LJ57k9M9J4m6R5m2k21J55K8J6j53K60Nm29J23J00M4o5L1K82j15
$$ plain form
6156 -46 40 36 -21 -112 -69 -181 -72 -249 15 -149 210 32 -283 -79 -84 -46 22 -119 -80 4 15 28 147 169 -207
6181 -207 -58 124 -165 -47 42 -73 -88 -167 212 -119 19 52 -178 331 26 118 3 -11 -9 160 3 8 -27 177
6205 177 54 93 -52 61 247 -227 -19 -112 -152 172 -158 -31 84 -139 99 111 -119 24 -50 34 159 -85
6227 -85 141 -204 134 26 -11 5 95 57 82 -106 -79 14 25 -115 -54 29 -193 -52 80 -123 -4 58 67 81 -184
6252 -184 -125 -104 -298 -47 158 -188 -40 269 216 -64 -28 266 -221 31 24 -203 18 34 96 -250 -80 -168 -428
6275 -428 -118 115 -183 72 192 115 43 -104 -265 197 -64 -43 114 95 -17 176 27 -55 53 -12 2 -66 -151
6298 -151 69 -241 234 -167 -184 100 61 55 -197 -148 -234 310 -67 81 62 130 25 -153 102 -8 -1 -117 -115 62
6322 62 141 -166 -109 -106 51 22 71 85 39 134 92 -129 26 54 70 -83 177 182 -247 -124 -24 20 -45 -14 268 153
6348A53l28K67P0k00J02K5k39J39j39O9O2lP3K8p2P5M1j57K3M2N8j16j30J26J29
6373I8j34m5K94o3j55k21J38j27R4J42j80J13m3p0M2K8j8J13MJ12j91K28k35j18
6397a94nP3K27o2Qj46M3J17j80K0J53j41O0N4QN1l02qL15J25m30J54J73l65J61
6422i1J41j71J00J86k83J78k72J39J06m2j12R0l2M8j06L0Q3K2j1J74k89J62j1
6445C9nk80J28q9J87K00j58K6n8Q7j6r3M9k1q1J67J35k04l0L8j50j10K48n6J00
6470E3o9R0k55J21p7K06k94J29J52J90m47J10K39nj18K2j54K1K04m74L18L6j30
6493a32L50k62j1K83p2j1q0j18n1Q5R5k19j76J34K42k60L66k20J29R1l20J8o9
6516b08J91K21j83L8j43J0K08l91L09Q7j81n7J73L3j24J07j79N8O8r7J13j51l0
$$ plain form
6348 153 -175 92 162 -38 64 89 -150 -11 -150 -81 -19 -22 51 79 7 82 123 -34 -11 31 89 -27 -157 -31 98
6373 98 -36 -81 213 150 -5 -226 -88 -215 -121 21 -159 -46 -89 -159 -117 -89 -107 6 10 122 -69 159 -76 -194
6397 -194 -199 -126 101 39 47 -99 -56 61 -119 -99 54 -87 -27 27 35 86 -216 -224 91 216 -214 -60 113 -252 -91
6422 -91 50 -121 -21 165 -118 60 -212 -73 33 -9 -121 -31 -63 -15 -121 -91 -8 14 3 177 -112 50 39
6445 39 34 -246 -118 -207 -20 180 22 48 -10 77 61 -32 17 -4 -85 82 217 13 -17 21 -129 -239 9 -47 53
6470 53 -16 74 -181 -60 -137 69 -225 -96 56 246 -201 -91 148 143 25 47 -107 -86 118 -356 -38 -2 -132
6493 -132 218 -44 -55 228 156 145 65 -53 -104 -19 76 -143 -319 -185 57 -203 163 -57 72 163 -157 -139 -208
6516 -208 -17 204 21 59 -84 -74 134 -257 52 139 -42 -99 74 107 -17 90 -89 -31 37 -60 53 -98 -128
6539a28K9m0L00Qk67J95l96L65k07j26K58J2o6K03J95l73K36j11j25J18j41J03
6561D2j3R4o6r8K77n06K61m6L4l4j1qP9J2M0j63P3k03L08j63J37l7K46k17j68
6586a30J31j12J08l6N3j66J10j08K11n2Q8j37r4J90m5N5j68q7O76m87k13N2J55
6609fj13p2J63K13j64K27l14J38mj89R7k47K72K15j54Rq7j41K02r5r2J51R7q4
6633B2r5j92Q7K02R4q2o9K8p2J16k38L29j96R9k06o7M09j60R3J41o2k01J14j23
6657b9P1k11K57n5q7%M4J00j64j36L54k03L43k15l05J69J25P7j32j45r7J15J25
6680Aj12J63K28m23N3qj29M46m40L77l14Q4J95k21K21L5N2k35Q9j41n2K23j42
6703e0k19L04j01M1o3O7J05k22j73K77Nj62K64k4r3j51O7p7J0L1P2J54j34K26
$$ plain form
6539 -128 -99 -139 161 169 -98 97 -299 66 -141 -267 -9 3 -63 140 335 -38 198 87 -38 80 -61 42
6561 42 29 123 57 -41 236 -270 -9 -55 -21 -55 -66 -74 5 17 57 -106 -33 -236 72 -91 46 9 255 38 -130
6586 -130 1 -111 -3 -39 14 -152 -42 -150 61 9 97 -40 -134 56 11 66 -102 -189 487 0 -213 -161 -6
6609 -6 -119 -191 -28 185 21 248 -66 72 68 -121 -24 -271 1 216 62 71 -16 -157 45 -50 -142 9 106 22
6633 22 -73 -265 -178 24 118 36 -33 -5 -77 39 -199 130 -66 33 -173 -240 169 9 102 243 181 -20 94 -29
6657 -29 42 -169 88 33 -54 -54 -10 90 -74 -210 144 -59 284 69 -236 -67 58 135 3 -142 -239 -124 1
6680 1 -111 52 280 -143 -90 -98 -227 219 -221 156 -158 -74 121 -100 121 156 208 -27 62 -79 -131 92 -50
6703 -50 -269 35 -66 -25 -88 -21 84 -138 -311 -34 -29 -191 73 49 -44 -195 -128 -205 -195 -164 -92 62 -72 154
6727A54k19RO2lM42k19j63k80K80k0n6K52l31l26N24J3j22nq0Q7j54Nn6K64q6
6752b8K22l69K95j11J0J2j73J10l8j05Q5K07j44J57j32L50l80K01j87q8J28rk
6775A1n9R8P8j1j78K22l13J1K03k21K77Lj41J41n8j09r9J77j54J85q7P4k9r6j05
6800a80K49K0q4P9j52K21l08K55j55L8Q0K8j92K65j04l7k77N79m62J02P1ql7k22
6824b31J64m8J40l8p1K55k73J82J97l33j38J13k8J84m5KL2j69N0r3J34N1R6j95
6848f2N6k7q5M9J44PJ16k66K36p2j66L47m57J31k8J57q6j5M6j16J88k97K46j36
6872i0j27K14p0Q1n8N8Nn8J92l56m4K62M5j8k09J65J94k01K61n31K71J17j26J00
6896G7j58J91j66L2l9K64p4j95L19j07k52J67r1O5K61m30L11p4l9j27J70n3j1
$$ plain form
6727 154 -65 -56 6 3 445 226 63 -217 63 43 -13 239 -92 -418 106 119 -3 -8 -88 -1 -155 -150 -206 58 -28
6752 -28 194 -175 120 9 19 31 -142 -32 -70 -175 -90 117 -27 130 -2 348 -32 169 -18 -106 22 13 11
6775 11 -48 50 128 117 -61 161 -152 -141 62 -159 118 121 -20 121 63 -46 -145 32 -122 63 -24 50 21 -75 -180
6800 -180 69 89 5 84 -68 153 -155 100 -55 -17 63 91 -101 164 60 23 -254 325 -137 -35 36 28 -9 -231
6824 -231 -67 -115 25 -13 -84 171 -102 80 277 -56 -194 -81 -109 75 30 32 64 -105 -55 -148 -14 37 133 -62
6848 -62 -6 -33 -118 -69 75 82 198 -68 168 96 -70 277 -180 -49 -77 80 -6 -21 25 -91 97 -200 46 -90
6872 -90 -217 -3 -73 8 -50 8 13 -45 147 -209 -253 9 54 36 -173 -8 186 -15 246 -285 -14 103 -23 77
6896 77 -81 110 -56 -24 -63 201 127 -68 251 144 -108 59 -32 33 294 -136 175 101 62 -65 105 52 41
6919D1q5K60l24J4J00Nn6O2k47M05j32N1k21J59q0j00K80J98m75J56q7K18k39
6942i7k27L56n6J7j31K14J42j79k15Q9j6Q0m0J36m4j44J24J0j05l2J7K5j19O9
6966a26J18%M4Q7k13Q4kl8J89j04j68q2P1PR6K1j0rJ32rk26J86m2p4J8J94j98
6993e4J5R7j13j73K39K01j74j89J50j31m8J47j38Q8K2o9N5PJ39Nq0N7j03P0k67
7018b47L15j71P7J30k9J1o8q0M7P2K9j48o3K34k17o7L26j55j07K17M6q4M4k23
7042a11K85k36J04J31j94pO3mr3J47n2q6j40L6J54NL01k54k2k39L83j35j41K9
7066g6j18J73J68j65oP4K05l14R7J02J78l66M3Q4o0J26r4N6L6l37J60K9j10K25
7090A10k09J52k14n5K91M0l29Q8R2PJ92j94R6k49K87k0Q0j19j57k24J75M31l27
$$ plain form
6919 41 -44 216 -108 -94 6 11 -45 17 -230 175 43 94 -127 32 -48 -148 132 330 -145 11 -76 142 -97
6942 -97 -324 32 -24 -7 -138 76 218 39 -176 -87 -103 -23 -63 73 29 -115 9 19 -86 -118 -101 -76 -195 -126
6966 -126 -8 -8 36 123 -90 -6 -8 -46 143 39 -129 -211 -140 -133 -37 -16 -26 -35 97 88 -138 48 6 -68 -50 144 -54
6993 -54 -39 58 -55 -228 11 212 38 -151 -1 -132 -180 -33 -171 -83 -61 -130 -75 -68 71 76 -4 53 -50 20 -247
7018 -247 68 -103 -26 104 75 86 18 -62 -15 57 86 -62 -125 109 -108 -175 151 -4 -111 106 152 68 112 -111
7042 -111 174 -62 42 173 -21 -28 35 31 -62 85 33 -53 -193 -157 -3 2 303 49 27 -212 171 36 -105 -76
7066 -76 -194 -21 147 -18 -24 50 255 -59 38 140 318 -48 -5 79 19 145 51 107 143 -194 -34 -5 -115 110
7090 110 -99 53 -161 -216 75 115 -214 -126 -34 -27 165 -29 67 -182 105 85 165 46 -111 -335 -160 271 -56
7113e6J11j09J46r8O5O9k96l8K39k0r7J46p5J33j21j19j43L62m28J73K90j83o2
7136a11K95l65L11m7k40Q5K26k75K57j04k1k3k89M24j57J17l74J91J75p4l5J10
7158G6j61j9J13l2P6j19K28j22r4k2J9O8J6j52J60j03O6k83Q0M56l09J49n1j64
7182a24JK00n2n6J88j94K08j81mn1P1J14r8J61k51M8l23L28j20K42j28J56k59
7205a24J07J27j22j0O3K2l8J6j08J32r2K81P5m16q9J33m7j90K58R0Q4j22R5k08
7229h3K01k76L16j64J87l87K93oR2j87m1L38m05L31l22k6O0j85P1J47P2r2pp4
7253a47J87j03L1K12o3j88L42l90J06q2J98j1LJ8l48M16k71j32K12P5k41J49n
7276c2j13K47j81J71k0J05k65O8k04M69k33J37k8O9p2O5k72P5j90K7J47j13K41
$$ plain form
7113 -56 55 -54 92 -6 59 128 -168 -206 33 13 -84 62 -13 120 -1 -120 -263 99 -329 -156 134 -49 -111
7136 -111 184 -181 130 83 -157 -72 154 -121 136 32 11 -12 -301 123 -34 83 -291 -100 75 1 -34 76
7158 76 -85 -104 9 -23 53 -66 162 40 -54 -76 -57 11 27 -125 35 -68 -2 -285 -205 251 -58 91 40 -124
7182 -124 -123 77 25 -31 157 -37 171 -10 -14 -65 6 120 22 183 -68 -20 -343 -15 -135 107 -21 135 -124
7205 -124 -17 110 -12 -22 41 63 25 41 -67 65 -27 254 329 -87 -176 -43 -90 -280 -22 68 152 30 125 -83
7229 -83 118 -158 158 -6 181 -206 87 81 173 -14 -55 283 -122 209 -113 -139 -79 -264 -193 -46 26 -66 -73 -147
7253 -147 40 -63 -32 180 117 -71 271 -119 -13 -95 103 92 95 113 -235 181 -90 -222 -10 65 -176 -27 -32
7276 -32 -145 102 -79 92 72 177 -88 -20 -224 245 12 149 121 190 118 183 -89 -14 -204 -177 -30 -143 98
7299I8j04P2m6j03M62o38N4K19p8J97R9l87N05m52j17K93J15q7j93K37n78M71
7321C9n2j46K04m3J34l29L71l48J29O9k15J69j1K82j08n1j94K31N1k28L3j06J36
7344A7N2k4j53K98q9l14L97j84L5O7j90o7K41j27p7J80k50K34k37o1R0L33l71
7367b00K67m9N8j21J38l87M57q7q5%K00l42l7K00j68J59j22L15j40j36J05m2j21
7390a38j6K65k90P6L7L7L8q9K4%K2n6J36Q4j13o8j02N3j3J93k8j58j5q0j8L77
7416A58k61J60k71J72L0k58M55j64j44n0J08Q8L90l49r9K54r5l48N20k55qj54
7438a21J67O6j09j43J38K22O6l92J34L3J13Jl86l5J93m5M7K07j73k29K45K7j16
7461i0j02M21j81O7j21k32L27l12J88R6L7j04K31j80k64J73k0o8L31l32K75j57
$$ plain form
7299 98 -6 66 20 -83 379 -259 -205 14 -64 133 232 -155 350 -102 -219 74 189 102 -91 146 -432 39
7321 39 -13 -159 45 2 136 -193 178 -170 -41 28 -187 -18 -29 253 145 94 -100 131 182 -46 -13 -119 17
7344 17 69 45 -108 190 101 -213 184 0 35 102 -88 -155 86 -41 -118 62 -188 46 -191 -252 -162 171 -200
7367 -200 67 18 76 -45 93 -294 163 76 -9 -9 191 -151 -188 12 -156 3 -119 196 56 -80 25 -17 -138
7390 -138 -154 111 -179 -103 -66 -29 9 -80 -56 -56 -34 -90 46 130 17 -51 -153 -100 -113 80 52 -106 -121 -201 -219 158
7416 158 -103 57 -214 -42 -12 -270 185 21 -123 -173 -65 23 413 64 -35 219 124 -224 296 41 33 -121
7438 -121 46 112 3 -140 -2 220 286 -106 28 61 174 175 -211 -246 -53 -98 -51 156 -17 -246 -1 26 -90
7461 -90 -192 229 48 115 -6 -238 89 -223 -35 61 98 -6 225 45 -219 -46 -66 -134 197 -135 140 -17
7483a7J02Q6k16r6MJ5n3J81N9k03K63j33k68R0J00J72l8l54L16m8J02l3J10j86
7507d5m7k9Q0qR1p3k00j9J15L08o9J3r1n2O3r1O3P7j96N3n8J07oK2q5L26j48j66
7535f5k6q4l2J44O3%n1JK20k41j55J44J39J59k60j84J19k2J72M4l8j56L18j48
7559F1Q1j26J6k02QK33J07Q0l19J35j36J68m74L39l2K3K03k25J51j8O8l19K79
7582A01j54p4L72j81l86M74j67n4o2K18p3m0R3o8O7j15K2K14k02M1M5j63q4J98
7606B2j01l9J90J5J25p6r2O5k27M7n4M5r7J94l8pJ45l16K76k10QJ98J3j1m7k26
7632a98L21p1N8j01k48J67J7O1P7j63J2OOQ0J98k1k70K20j09L5k2k94K18L1j48
7657a38M1PJ52k55K06k05M00%k73k4l7r0K70j19K44k26J33jO4j46n2K88m05P7
$$ plain form
7483 -17 85 171 -45 -141 -137 -122 -175 6 65 -138 125 -8 -276 -186 -86 86 48 -306 10 -38 64 31 141 -45
7507 -45 -92 -121 -41 -49 42 -31 -231 -250 -135 173 104 117 26 -26 37 -54 9 86 -110 -57 -115 -8 -14 8 -77 249 101 -65
7535 -65 -91 -175 -207 -63 0 0 -51 -50 170 -71 -226 -82 57 216 -44 -228 -109 -131 41 85 47 -109 209 61
7559 61 142 16 32 -170 -162 71 178 258 -61 74 -62 106 -368 -29 -61 -38 165 -60 91 73 141 -178 101
7582 101 -53 -127 245 64 -322 152 -15 -69 -131 87 14 -26 67 -1 66 -49 -27 187 -15 26 71 -92 -176 22
7606 22 -79 -118 72 87 212 136 44 109 -118 -71 -125 -80 -177 17 -21 -28 117 -199 77 -133 -125 73 86 75 28 -198
7632 -198 123 52 110 9 -239 -72 -55 6 83 -80 -68 -62 -56 24 222 201 -69 151 42 77 55 -239 -21 10 -138
7657 -138 -97 -90 62 -193 13 -192 208 208 -65 -89 -126 -216 54 -65 179 -47 86 85 149 3 -49 239 -166 -89
7681h9Q7pP6k7J99K4k62j16L3N8J37j08P0k64k1J28J66j10J12j03j75K24k41m
7705b13M33j25k36K98q0J55J4k87L3j36K7j02O9K46j61K31j84q2J35k09M35m57
7727a96P4J92k58K22J7o2j11J27j41K27r4K75l84J31K9NM5o7k54K58K74m10j9
7750a20J0K14m20L13K10p6j21r2L21l42N0L40j57j74K10j39j56K86k37J68j02
7771a4n1M5j12J61O8j01Mq0p1K82k08J34j73J97j12P6k05N1L86k30j77k4m8K35
7795C3m0J44kj63Q2r3K52l17K30j74k7L33j73l3P7M1l8j82J37k35J38J60KJ2j7
7820A47r2l8l3J24j08J15k23NJ25K30l65K02j16p0Q4K2J43k27j7j29K77o3k05
7843b12K53RL2M9j60j3j16J36J32l78J14l5J64j07l9J46l3J3j05K12l4J62k89
$$ plain form
7681 -89 -2 -9 67 40 239 263 1 -115 -82 -24 113 5 75 -189 -210 -82 84 -26 86 -17 -192 32 -209 -213
7705 -213 220 95 -141 157 77 232 246 -41 -8 -144 -117 -219 -150 96 -65 166 -18 -100 35 -174 261 -196
7727 -196 -122 70 -188 34 51 -11 -122 5 -136 91 -3 272 -112 19 48 53 98 31 -223 35 309 -101 -120
7750 -120 -110 104 -316 -3 207 131 10 -82 239 -103 -53 287 130 -44 166 27 -129 157 -80 88 -14
7771 -14 -65 -20 -132 29 97 -4 0 -80 -151 131 -77 57 -116 81 -31 45 -160 -109 277 47 -130 -154 -202 33
7795 33 -7 137 135 -28 54 -39 213 -104 126 -48 -75 258 85 52 129 170 132 -50 87 -148 -10 150 152 164 147
7820 147 55 17 -16 108 0 115 -108 -103 22 252 -113 89 -27 -97 -13 9 152 -75 -92 -221 56 -7 -212
7843 -212 41 50 82 131 -29 -42 -158 -22 110 -268 -154 -189 -25 -132 -171 -25 -58 -45 -150 62 28 190 -99
7866i9K13k08K45j16J01j36K7P1j25o0k45L85M6k74J61K51l15P1j79J17J51l06
7888b24J51J73J42j80P3l7j4j64n1J33j2o2l9j1j88L68P8q5j63J95k65K70k2j00
7912c4J49q8J2m6j39L22k02j84K96J1nR8r0n9j03J12r2r9J38K11K1k42J67m9k13
7937a08R7q0NJ17J1k06L2J68j15L21k60K84j68l33L46k75R8Q5PM2K01k31j68K05
7961G5j72M30m25M6O7J58r1l24K30M1j02J89k63J9O8P6K3o5J51k75J04j81R0K19
7985H8j08j31L40l64K17J47m56L19j00J53q8n2J83r2j70J13P2O8j89r0K88k44
8007i6J53j34K36l18o6L6J84J19o7K9L1k35J54l8m8q4pJ46j6j77J74P8k76J79
8031d3j38K77M3P1k43P1k37R3K38m4k46K40m0k50J26K28k41K18l70K16K31j82
$$ plain form
7866 -99 114 -94 151 35 136 0 27 98 -27 -87 -332 53 99 -175 -14 237 -78 -7 -186 -69 82 -224
7888 -224 -73 100 242 62 135 98 84 -80 -131 2 -10 -72 -111 -122 -310 58 136 51 -112 83 -182 88 66 -34
7912 -34 115 27 39 -7 -146 176 -26 -210 86 97 92 190 100 41 -62 50 -42 -141 -3 208 229 -13 154 105 -108
7937 -108 -11 -91 -86 31 42 -164 -132 36 -79 242 -18 266 98 -235 111 -164 -66 19 26 68 269 38 -130 75
7961 75 -97 333 -92 -46 21 179 88 -236 -6 35 -67 122 -141 -122 -54 22 45 -20 131 -144 -40 -221 -131 88
7985 88 -20 -151 189 -175 42 189 -267 52 -48 105 17 -35 148 56 -114 -1 71 139 -50 -140 148 -96
8007 -96 57 -77 159 -159 -225 -189 -5 114 47 76 107 -128 26 -12 -60 -144 -151 -5 -21 -198 -24 54 -222 -43
8031 -43 -181 96 139 210 -33 38 -199 -106 132 88 -158 82 42 -208 -82 146 -95 123 -247 -31 200 18
8053A8r0q1K09L9k41R6N0j75K44j15L1n4Q0j66L61J49l04j46p2J09R8m8l0L4J00
8078I6j83J88kk24j10J85M77l26m3m05L07J7j49O4m4K46J52N6k52j32K61j81j70
8101a72K50j07k3J65j19J9l9o2o6J69J01l31J14J55o5RJ12j35q6K47p5J22j33
8124E0o6r8J91K4Q7j44j87K78k69L77k42N0Pr1L29k12j44j25R5J12j84K86k33
8147a09j5J10L2j87J48L9j09p8J39Q8j54N5o6n2J82L8l6m9j0K8K7j23K40j97N2
8172gJ69k79J44k12L42l92J79q7J33J56j1km11K81p2K6j51J81j94
$$ plain form
8053 18 -72 -153 56 95 -146 -50 0 -175 69 -46 -15 -69 11 -155 206 355 51 -95 -167 -58 40 -8 -38 -4 96
8078 96 -87 101 99 -125 -235 -50 427 101 58 -347 -40 -23 -172 -108 -152 94 246 302 50 -82 179 -2 -172
8101 -172 78 -29 -52 113 -6 13 -26 -88 -154 15 116 -215 -101 54 -11 -2 110 -25 -111 136 61 183 50
8124 50 -16 -114 77 101 188 44 -143 135 -134 243 1 51 58 -33 296 84 -60 -185 -90 22 -162 124 -109
8147 -109 -124 -14 18 -169 -21 18 -91 -169 -30 58 -96 -41 -107 -159 23 61 25 -24 -34 -6 21 -102 138 -59 -7
8172 -7 162 -117 27 -185 157 -235 -56 -143 -10 146 135 133 -278 3 -69 -43 -194 -13 -207
8191b07
$$ Imaginary data points
##PAGE= N=2
##DATA TABLE= (X++(I..I)), XYDATA
0@%%%%%%qJ6j6J6j6K4l2M0n6O7p7R8j20J44j76K10k50K96l47M06m74N47o30P25
30C87q30R47j075J217j376J550j740J950k180K432k707L009l340L699m090M520
46B373m991N503o065O682p358Q106q935R857j0888J2048j3367J4878j6629J8690
60I904k1155K4161k7924L2792l9362M8748o3314Q9072j47544N03905Q187r91818
72e74348O96301J51435l27490J47654j21881q4360M00758l56732k16243M70730
82A85824P690l18532M8952M4074J12292M3947k08656j8569K04996l8846j61960
93i8788J2366J84877j5471j79738k5936J27018J37903p7577k91242K05422L19112
104B97946m05932j02666M50883j64021k22308J73269r8756Q9352J66571l98360
$$ plain form
0 0 0 0 0 0 0 0 -8 8 -8 8 -8 16 -16 24 -32 35 -42 56 -64 80 -96 114 -136 160 -187 219 -255 292 -338 387
30 387 -443 504 -571 646 -730 820 -920 1030 -1150 1282 -1425 1584 -1756 1943 -2147 2373
46 2373 -2618 2885 -3180 3502 -3856 4250 -4685 5172 -5716 6332 -7035 7843 -8786 9904
60 9904 -11251 12910 -15014 17778 -21584 27164 -36150 52922 -94622 409283 417470 -574348
72 -574348 121953 273388 -54102 93552 -28329 -112689 288069 -68663 -284906 185824
82 185824 193514 -125018 -76066 -31992 80300 124247 -84409 -102978 102018 63172 -98788
93 -98788 -86422 98455 82984 -96754 -122690 4328 142231 64654 -226588 -21166 297946
104 297946 -107986 -210652 240231 76210 -146098 27171 -71585 17767 184338 -214022
114b14022K5694L81839k29939j28468J73171o0120Q4498n035k28768K39916J59334
125A98100k91898J2715J58222j0850o252j38140L9461K54133k09137k10255K65845
136F1944Q2806j56764n3756o357J17877O5875j79988j8331J57049j6084j13895
147e9624j3730J10160L7354j19767n0520N6555P1502L9598j68264n6072K73460
158A20652n3775k45441J84567J29222j48920j9357Q28Q1942J17336k15618n2529
169a01093K36050q8752j02516R8504o5865M5335N2739k16703J05936K11432k23725
180d8658o4585J68445n1509J3779L7301j33353Q2357J25513j65302o2822J83580
191H4746K7070j83346k9801J74645R061j46550K6014O6456j3670L415n5917O192
$$ plain form
114 -214022 -188328 193511 -36428 -164896 8275 -51845 32653 27618 -201150 38766 198100
125 198100 -93798 -81083 77139 66289 60037 -78103 -38642 215491 6354 -203901 61944
136 61944 144750 -12014 -65770 -72127 45750 111625 -68363 -86694 70355 54271 -59624
147 -59624 -73354 36806 74160 -45607 -96127 -39572 31930 71528 -96736 -152808 120652
158 120652 66877 -178564 6003 135225 -13695 -33052 -32224 49718 167054 -48564 -101093
169 -101093 134957 46205 -56311 42193 -23672 21663 74402 -142301 -36365 175067 -48658
180 -48658 -113243 55202 3693 17472 54773 -78580 3777 129290 -36012 -98834 84746
191 84746 111816 -71530 -101331 73314 82375 -64175 -38161 28295 14625 18040 -37877 -31685
203c1685J21918o4859j19675Q8121O1273l4810n1050m6096Q7802L6764j28868
214h1165K0212R0897m4492j2632l1842q52J53435n7697j69299J33881J07555j16560
226h559k7617N1061M0116j9055j00739N5058J05248q9517n2340L6892n0O7845
238E8343l0350j22580J14613P3790j46099J5880R7897l9532j4880k6674k9251
249d8843J08966L411j43767K3994J19788m5562r0849N2174O8465m5059m4724K1134
261b0872L2285M7953m5810r4810R8528P3891j26899o79P8841n3720J0947k208
273b553o8529J05435K4245j59298N5931J12323p6388j5571J2445l023P9510o1393
285C134q8761J41717K8139j46491L4740P1168l6661K527j9842k3695O8715J135
$$ plain form
203 -31685 90233 25374 -94301 -6180 55093 20283 -30767 -76863 10939 47703 -81165
214 -81165 -60953 29944 -14548 -27180 -59022 -59874 93561 35864 -133435 446 108001 -8559
226 -8559 -36176 14885 55001 35946 -64793 -9735 95513 5996 -46344 -9452 -9502 58343
238 58343 27993 -94587 20026 93816 -52283 -36403 61494 21962 7082 -19592 -48843
249 -48843 60123 63534 -80233 -56239 63549 17987 -72862 -20688 47777 2718 -42006 -20872
261 -20872 11413 59366 13556 -81254 17274 91165 -35734 -36413 42428 -11292 -345 -2553
273 -2553 -71082 34353 58598 -100700 -44769 67554 -8834 -24405 -11960 -14983 64527 3134
285 3134 -85627 56090 84229 -62262 -27522 43646 6985 9512 -10330 -34025 34690 35825
297C5825q9605L5469R0731m9862p5887N5769N1508l9935j0563p527j2414N8103
309D1612j9004r2652O8518O9606j09164l2717Q6731K0058m2475m0252K5247O4706
321D0214l0997m5959M3471J5661j1245j4061l1211N7392M0142j01641j5014R2255
333C9007j7501l9335O299m03L2881n221n3395L8088N0512m3530l5185J3590M7292
346C3099J5359q0179j3993Q8500k0043p4519M0285L5343l1557j1285k743J2458
358i275M1787j8229o2562L8979O8896n3411m7329O2667J2473m9001R969l114J862
371f288M3143n7071n1182R8488Q953r5234L7275M4318l1790M906j1913j289O1856
384D4172l4918o7167O7835L4078n6128n966J6022P264J3408l1793j3777N8230
$$ plain form
297 35825 -53780 -18311 72420 22558 -53329 2440 53948 14013 3450 -4077 -16491 41612
309 41612 22608 -70044 -1526 68080 -41084 -73801 12930 32988 -9487 -49739 -24492 40214
321 40214 9217 -36742 6729 22390 11145 -2916 -34127 23265 63407 -38234 -53248 39007
333 39007 21506 -17829 -11530 -11933 20948 15727 -37668 420 50932 7402 -27783 -14193 33099
346 33099 48458 -31721 -45714 42786 22743 -51776 -11491 23852 -7705 -18990 -21733 -9275
358 -9275 32512 14283 -48279 -9300 59596 6185 -41144 21523 33996 -15005 -5036 -8150 -6288
371 -6288 36855 -20216 -71398 27090 36043 -59191 -21916 22402 -9388 -4482 -16395 -17684 44172
384 44172 9254 -57913 9922 44000 -12128 -18094 -2072 5192 18600 -13193 -26970 31260
396C1260j738n5987J4591M5537l934k4847j0022J3731K8909j6763m5397K6647
408A987M6834n2792m1628N6811J3882l8377l260j9J1491L1218l7518k6243O4865
421B7251L350o1826J8702M6571j7210k6785k324J2853J7718j1707k7992M184L3556
434A6341o575m3982J6892N0978k9574m2668L5156K4171j5689j1359j1349J4853
446b805K5697l2542k4151M1368R097l6677q465K5791J9853j5462k8825J8977L6625
459B8481k0106k3694K2799J6031j2930j2153m231J6332J9815l6231l1269M7375
471A0219J9177n6659Q5M2845j8720j3412J3483j0058J9863J6968n2621O521O5664
484D3355l3568m3281M1352J0596k5730O488n287K065K6471k5975k6613M3079J7740
$$ plain form
396 31260 29522 -26465 -11874 33663 29729 4882 -5140 8591 37500 20737 -24660 1987
408 1987 48821 -3971 -45599 11212 25094 -13283 -16543 -16562 -5071 26147 -11371 -37614 27251
421 27251 30601 -31225 -12523 34048 16838 -9947 -12271 582 18300 6593 -21399 -17215 16341
434 16341 9766 -34216 -17324 33654 4080 -38588 -3432 20739 5050 -6309 -17658 -2805
446 -2805 22892 -9650 -33801 7567 16664 -20013 -28478 -2687 17166 1704 -27121 -8144 28481
459 28481 8375 -15319 7480 23511 10581 -1572 -5803 10529 30344 -5887 -37156 10219
471 10219 29396 -27263 -27178 15667 -3053 -16465 -2982 -13040 6823 23791 -28830 -22309 43355
484 43355 9787 -33494 7858 18454 -7276 -788 -6075 -4010 22461 -3514 -30127 12952 30692
497C0692l9050l518K4847L377p142j1564K075K1816p863l4055J3328L0883j8188
510E638k6036P883J6665M938j4421j5747K5810J8455l3812n022L6776j869k3663
523d405K546N025R198L170k7635l044L3191j0169l5905J8993K4823j9721j5098
536a9031R865R148O783n975k0681J3741K8127k4429k5250L4031J2058l6736m02
549a8751K2604k521m872n375p848K1833J1527l0702J851L3420p893k3772J1357
562H58J3566j329r194j3357R253J8394j6679k1251J9051J2421j8144p476R818
575d069J2530J76k1559k04L4078n300l0840J4450J7904j5271l216K730n847J4943
589A0505m229l0404K0502K7759l1974j3718L1658k587j1900Q032o262M503J7025
$$ plain form
497 30692 -8358 -11876 12971 16348 9206 -2358 -283 21533 13670 -20385 -7057 23826 5638
510 5638 -20398 -12515 4150 9088 -5333 -21080 4730 23185 -10627 -15649 21127 19258 -4405
523 -4405 -1859 3166 12364 15534 -12101 -15145 18046 7877 -28028 -9035 15788 -3933 -19031
536 -19031 -9166 -18 6765 790 -19891 -6150 21977 -2452 -27702 6329 18387 -18349 -18751
549 -18751 3853 1332 -3540 -8915 -16763 5070 16597 -14105 -12254 21166 13273 -10499 858
562 858 14424 13095 3901 -9456 -203 18191 1512 -19739 -688 11733 -6411 -13887 -4069
575 -4069 8461 8637 -12922 -13126 20952 15652 -15188 -738 17166 1895 -1321 1409 -4438 10505
589 10505 6276 -24128 -3626 24133 -7841 -21559 10099 7512 -4388 3644 -2618 1885 18910
602A8910k3667j4228L7491j010l8694J0153K3729j4062q074M320p74J0750k633
615B211j7642J4634K0500j8936j2521J8626O442o886o706l768J0596N339k0304
628h415l305K1264m106j8119K484J1696M506n591j2909Q400K0976j5019j8031
641a6169K1817J0368k2697k695J2267j924M07n706j1034J4199J2824k3281m227
654a5851K6952m405j8251J0602R336l892K397r133m278K1475l530k7492J2048
667d022K0643k0308j1292J6483L357p016k052l009Q459J1805j5535p358J9433
680I588J806j5488K212P685j082k493r703R65J5790n995j8150R853J2954r354
694a412m378L336M568O563r181j0791K0149P662k6753O15K0706r339j0250P329
$$ plain form
602 18910 -4757 -18985 18506 17496 -21198 -11045 12684 -1378 -9452 -5132 -5906 4844 2211
615 2211 -15431 -797 19703 767 -11754 6872 13314 6428 -278 -4046 6550 11889 -8415
628 -8415 -11720 9544 5438 -12681 -10197 1499 6005 414 -12495 -4095 16881 1862 -16169
641 -16169 5648 16016 -6681 -9376 2891 967 1374 -4332 -15366 -1167 11657 -11624 -15851
654 -15851 11101 6696 -11555 -953 8383 4491 6888 -2245 -6523 14952 11422 -16070 -4022
667 -4022 16621 -3687 -14979 1504 4861 -2155 -4207 -7216 1243 13048 -2487 -9845 9588
680 9588 11394 -4094 -1882 5803 4721 2228 -7475 -6510 9280 3285 -14865 -5012 7942 -1412
694 -1412 -5790 -2454 2114 8677 -504 -11295 8854 16516 -10237 -9622 11084 1745 -8505 -1176
708a176m061J881P958j6060k76K3963r294j9585J8600R975j3410K996J778m173
722h84J0630l550j7921J5021J2912k4237m676K0863k568j1935L414J887M695K831
736F482j1335K156J5133o892j2924R576N523n705l681l518L421Q031r326r501
750a2560J3695M788j2911Q12Q618J263l01n279k682J4401J98j9258O020J6197
764A3001j3342j0124J1800K41n437J820n295J173J3113p799j2402J5961O995j5029
778e324J020J1083m409j803N61o657P660O652j6588l107J9231n213j4493R371
792b016P413n611o86q04K278Q855o972r824J1250N245j1787j294N508j921L63
807cm055m529J0529K515j3980L109J3478n355m711M880l81L930J196j1290M730
$$ plain form
708 -1176 -5237 -3356 4602 -11458 -11734 12229 2935 -16650 1950 11925 -1485 1511 3289 -884
722 -884 9746 6196 -11725 3296 16208 -8029 -12705 8158 5590 -6345 -2931 -1044 3651 6482
736 6482 -4853 -2697 12436 5544 -7380 2196 7719 2014 -1667 -5185 -1764 6267 -3059 -12560
750 -12560 1135 5923 -6988 -6176 2442 3705 3404 -1875 -4557 9844 10042 -9216 -3196 13001
764 13001 -341 -10465 1335 1576 -3861 -2041 -7336 -6163 6950 -849 -13251 2710 9705 -5324
778 -5324 -4304 6779 2370 567 1128 -5529 2131 8783 -7805 -10912 8319 3106 -11387 -2016
792 -2016 5397 -214 -900 -1704 574 9429 2457 -7367 3883 9128 -2659 -3953 1555 -366 -3
807 -3 -4058 -8587 1942 4457 -9523 -6414 7064 1709 -3002 1878 1497 5427 6623 -4667 63
822F3J4195j5036j0112J7843n59j3315N569K298n058Q567l689r097J4059L908
836I636j7096N587J3154r408l920M798l771K762K955j1561J330J3390r371r369
850a0884J1780M931q692L03K919J884L630o079l485R873j52j1584L759N751n118
865a164j802j136q75O252j463r639O361Q550q044k830P752K12j467K04l758M314
881A467O229j0590n222J3153o19j3192N661P016o760M55K605l221O137K952j1329
896e258M050J1949q974o842R655j036n569L116l587n11P907o746p570J1755L483
911E822j1484K783P566k576q27L96j736N575j37r862M360P813q316m250O080j547
927c40p08J661n976M115P807r709k701J2719k996o906N253p39j061M584o776m102
$$ plain form
822 63 14258 -778 -10890 6953 6394 -6921 -1352 946 -4112 4455 766 -8331 5728 9636
836 9636 -7460 -1873 11281 1873 -2047 2751 -1020 1742 4697 -6864 -5534 7856 -1515 -10884
850 -10884 896 5827 -2865 -2562 357 2241 5871 -208 -3693 6180 6028 -5556 -1797 3954 -1164
865 -1164 -2966 -4102 -4977 1275 -188 -9827 -3466 5084 -2960 -5790 1962 2174 707 911 -2847 1467
881 1467 7696 -2894 -8116 5037 4418 -8774 -3113 3903 -2857 -2402 203 -3018 3119 6071 -5258
896 -5258 -1208 10741 1767 -5075 4580 3544 -2025 1091 -2496 -3007 4900 -1846 -9416 2339 5822
911 5822 -5662 -2879 4687 2111 1284 1680 -56 5519 5382 -4480 -120 7693 -623 -4873 1207 -340
927 -340 -1048 613 -5363 -1248 6559 -3150 -5851 6868 3872 -3034 2219 1480 419 5003 -1773 -5875
943e875J1843l493j2511Q888O545r985J90O078l340K545K492p507M384Q264r702
958a184l719J1089k535p931M168k00j978L488m377l763Q922l91q632N013O382
973D352m718j502K426N68K753k837m638N019L441p367j537O105k297k744J316
988a660n40K099K674n309j030R750k542p072N686L073n197J220J53l563N353j390
1004A705r143O831O444j0309q05R291l907k300M024j935N10N632o560k906R973
1019F545k495r045N389L458o396J446Q08l593N194%p514N481O941q384q00P059
1035D094k461r86J347l630K863L322q463L7P662m589m510M912j17j534L142l295
1051b206KP310l506n932P791K016p600K279K492l489K213l75o102M821M503r760
$$ plain form
943 -5875 5968 2475 -10036 -1148 5397 -4588 -4398 1680 -1660 885 3377 -4130 254 8518 -1184
958 -1184 -4903 6186 3651 -4280 -112 -312 -2290 1198 -3179 -6942 1980 1589 -7043 -2030 4352
973 4352 -366 -1868 558 1126 3879 1042 -3596 1423 4864 -2503 -4040 2065 -232 -2976 -1660
988 -1660 -2200 -101 2573 -2736 -3766 5984 3442 -3630 2056 5129 -68 1152 1305 -2258 3095 1705
1004 1705 -7438 -607 5837 -4472 -5277 4014 107 -2193 1831 -104 406 6038 -522 -3428 6545
1019 6545 4050 -4995 394 3852 -2544 -1098 -290 -3883 1311 1311 -6203 -722 6219 -2165 -2965 4094
1035 4094 1633 647 1994 -1636 1227 4549 -3914 -3877 3785 -804 -5314 -402 -519 -2053 1089 -2206
1051 -2206 -2204 5106 1600 -4332 3459 5475 -2125 154 2646 -843 1370 995 -5107 -286 4217 -5543
1067e543Q11R147m788m111O482q09j502L925m066j236P078l181o873O034K438
1082C806o681M10L020k047Q14J09l082L731L430n443j31O046j403l745K913k38
1098A509n41J024m151l9N466m150n054O041J124m569K680L74j142L913j496m380
1114c391O836J740q290K505N104n015j164L169l919J341L463o510J69Q126m358
1129a94n324P871P94n458L689O61l089M452j220o416O352J977q642K253M899m537
1145a932l45K644l199K853K696n460J652O358m246k926M917q04j905J333k252
1160f16j20L584m310l203O170k77n356L247K348k854K487m7l121M905J188o899
1176b874K944M976o413p50L966k796p83K287l400P5N340l688l294O599K92n212
$$ plain form
1067 -5543 -4732 4415 -373 -4484 1998 1189 -313 3612 -454 -1690 5388 2207 -4666 1368 3806
1082 3806 -2875 -2465 555 -1492 -678 -569 -3651 80 3510 -1933 -2064 3982 2579 -1166 1747 1509
1098 1509 968 1992 -2159 -2198 3268 -882 -5936 105 1229 -3340 -660 -286 -1428 2485 989 -3391
1114 -3391 3445 5185 -3105 -600 4504 -511 -1675 1494 -2425 -1084 2379 -4131 -3962 4164 -194
1129 -194 -5518 2353 3147 -2311 1378 2039 -1050 3402 2182 -4234 2118 4095 -4547 -2294 2605 -1932
1145 -1932 -2277 367 -2832 21 2717 -2743 -1091 5267 1021 -1905 3012 2208 303 1636 -616
1160 -616 -736 2848 -1462 -4665 1505 1228 -4128 -881 1467 -1387 1100 1053 -2068 2837 4025 -2874
1176 -2874 70 5046 -1367 -2117 1849 -947 -1730 557 -2843 -2768 2572 -1116 -4410 2189 2481 -2731
1192b731L009K555l388J853J00l372L427R23n854P94N294m365k170M410j258p09
1208a482K297k182N31M521l601k190M976k96m059J992N49j827J798k156k040M292
1224A123J57n613L357L906m115M27K971k495J484K059m957J795M745n601k140
1239b897N778k122m091L916j308j938M475k343l200O209M98o445M240L602m777
1254d03J199J790l078J369J484m932J652L848m885j498M588q69k386K671q64j62
1270d76K857k294j781M694r51m492L197J027l016J161l96k169L103j61m503L645
1286e55K847m321L25M080k304j28K334k930R26K836l858j933M988j850m359L697
1302b05N59l046K197K17k520L802P32m817L362L715m636l65M105k609q11J883
$$ plain form
1192 -2731 278 2833 -555 1298 1398 -1974 1453 2376 -3478 -2684 2610 -1755 -3925 485 -773 -1482
1208 -1482 815 -1367 -836 3685 84 -2106 2870 2574 -1485 507 1056 -771 1027 -1129 -3169 1123
1224 1123 1280 -4333 -976 2930 -1185 -758 2213 -282 1202 3261 -1696 99 4844 -757 -2897
1239 -2897 2881 759 -3332 584 -724 -2662 1813 -530 -3730 2479 2977 -3468 772 4374 -403
1254 -403 796 2586 -492 877 2361 -2571 -919 2929 -1956 -3454 1134 265 -2121 550 -314 -476
1270 -476 2381 87 -1694 3000 2049 -2443 754 1781 -1235 -74 -470 -2639 464 303 -4200 -555
1286 -555 2292 -2029 -1704 2376 72 -56 2278 -652 274 3110 -748 -2681 2307 457 -3902 -205
1302 -205 354 -2692 -495 -278 -2798 1004 1736 -3081 281 3996 -640 -1005 3100 491 -320 1563
1318A563l191Q20L152l908j755M820j008l563L364Q85j815J776k26j602L491o34
1334B169m015K952J707m213M44K128k652P25J025l215K536K816m383J77M830k512
1350E19j565L397j291j227K806k650j886M414j922m115L774J394m249J646J658
1365G03k672K311J071l185K052K797m269Q4M260k749j692K556j335j360K464k488
1381a452j319M149j683k851L057J440k914J663R05j426K574q48k722K523J266
1396B362m236P00K415k386l61J672k157P89K498k933j08M153j839j940L219k56
1412A592k437K604j053j837L104j180l715L292J416m596J385K764k455M59J890
1427A233k307J012K796l472j39M014k492k524L202n63k458K027r01j459K769n38
$$ plain form
1318 1563 -1628 -808 2344 -1564 -3319 1501 493 -3070 294 1179 -636 1140 914 -688 2803 2169
1334 2169 -1846 1106 2813 -1400 -956 1172 -1480 -755 270 -2945 -409 2407 -1976 -1799 3031 519
1350 519 -1046 2351 1060 -167 2639 -11 -1897 2517 595 -3520 254 1648 -2601 -955 703
1365 703 -1969 342 1413 -1772 280 3077 -1192 -1108 3152 403 -1289 1267 -68 -1428 1036 -1452
1381 -1452 -2771 1378 -305 -3156 -99 1341 -1573 90 995 -431 2143 1295 -1427 1096 2362
1396 2362 -1874 -1174 1241 -1145 -1506 166 -1991 -1202 1296 -1637 -1745 2408 569 -1371 1848 1592
1412 1592 -845 1759 706 -1131 1973 793 -2922 370 1786 -2810 -1425 1339 -1116 -657 1233
1427 1233 -1074 -62 2734 -738 -877 3137 645 -1879 1323 760 -1698 329 -572 -2031 738 200
1443B00l240L139J771l989J938K130j952N54J055k031J460J145l762O74K667k738
1459i79j228K889j569q11K446j833m64L515j612k362L998n1l156K389M13k364
1475g79J542j03l123K629J440m334Q54L582k904n37L392j898m16K684j811j009
1491g91L344j645k630L187l84k574J320M32j789J357r4k212K673J028k905J384
1507b99K178k313M44J585j704P07J079k546J50K645k706j542L208j029j867K263
1523B53m14j174K368m10k276L168N76l222J342J604k383O65Q21k370J276R55k852
1540b073L22L329k614r64L279j275j278K752r27j368K925j350k267L049j08l589
1556b157K049J039k292N42J380k300J307J950l018Q74K980k613k79K289j179o36
$$ plain form
1443 200 -3040 99 1870 -2119 -181 1949 -3 551 1606 -425 1035 2180 -1582 -908 1759 -979
1459 -979 -2207 682 -887 -1698 748 -1085 -1549 1966 354 -2008 1990 1939 -1217 1172 1585 -779
1475 -779 763 660 -2463 166 1606 -2728 -1874 1708 -1196 -1733 1659 -239 -655 2029 218 -791
1491 -791 2553 908 -1722 1465 1081 -1493 -173 259 -1530 -173 -267 -2479 194 1222 -1683 -299
1507 -299 1879 -434 10 1595 -109 598 1677 -869 -719 1926 -780 -2322 886 -143 -2010 253
1523 253 -161 -1335 1033 623 -1653 1515 2091 -1131 211 1815 -568 97 918 -1452 -176 779 -2073
1540 -2073 -1751 1578 -1036 -2000 1279 4 -1274 1478 551 -817 2108 758 -1509 1540 1432 -2157
1556 -2157 -108 931 -1361 -819 561 -1739 -432 1518 -1500 -626 2354 -259 -538 1751 572 -64
1572f4J263r85r44J948j950j031K537r94j734K014J68j545K028r9j884K639N40
1589A907l065J731J814l268L41K196k459j73J886k038l95K910k548p76L164o89
1605E38k160K640J42j828J670j41j925J962M42k690O19J880k518K16J503j350
1621a000L59J298j954P26K408j968n15K380r91j638K001j021j188K118j589j495
1637b069K562l54k767K370J040k388J200J429j709P86J765k678R92J924k231o84
1653h12K353j457j246J877j212o48J744j051j139K473j92j901K188K57j738J259
1669G55M84j994J668N50k919J150J572k568j23K329j806l06K006j288j62K023
1685A371j258j028K544o67j883K261k72j758Q10q5j431J425J02k173J650J038
$$ plain form
1572 -64 1199 214 -730 1218 -732 -1763 774 -220 -1954 60 228 -1317 711 612 -1272 1367 1907
1589 1907 -1158 573 2387 -881 -540 1656 -803 -976 910 -1128 -1523 1387 -1161 -1937 1227 538
1605 538 -1622 1018 1160 -668 1002 861 -1064 898 1340 -1350 -731 1149 -1369 -1153 350 -1000
1621 -1000 -641 657 -1297 -571 1837 -131 -646 1734 743 -895 1106 85 -1103 1015 -574 -2069
1637 -2069 493 139 -2628 -258 782 -1606 -406 1023 -686 100 1865 -813 179 2103 -128 -812
1653 -812 1541 84 -1162 715 -497 -1145 599 -452 -1591 882 690 -1211 977 1234 -504 755
1669 755 1239 -755 913 1463 -1456 -306 1266 -1302 -1425 904 -902 -1208 798 -490 -652 1371
1685 1371 113 -915 1629 962 -921 1340 1068 -690 120 35 -1396 29 131 -2042 -392 646
1701F46k043J051J515j670M26J428j675M60J593k046n55K475j870j365K137q41
1717c34j307K043l25j882K552m1k107J710J429k218K27J812j601l07J265j557
1733f41k5J557j969k78J822p70r26J466n29n36J951q35q59K187r01j701J990L20
1751A323k587J365O35j946J207O12k262Q71J846k167K56K397j543o70J834m62
1767G09j124J623j066q41J956r13j823J474M26j627R97M61j370J297L15j585J418
1784C27Q71j690M72J511j757j2J489k058L76J358j753m82K018j080j487K295J87
1801E85j847J758J65j346J379M27j793J062R83k075L73J070j610K30P76j030K33
1818f60J244j555K40J797j284k52J647p82q24J485q32r26J626m83j788J664J69
$$ plain form
1701 646 -1397 -346 1169 -501 -75 1353 -322 138 1731 -315 -870 1605 -265 -1630 507 -334
1717 -334 -1641 402 77 -1805 747 706 -1401 309 1738 -480 -253 1559 -42 -349 916 -641
1733 -641 -666 891 -1078 -1356 466 -304 -1230 236 -293 -829 1122 287 -572 1615 714 -987 1003 1323
1751 1323 -1264 101 736 -1210 -3 609 -1653 -782 1064 -1103 -847 1550 7 -663 1171 709
1767 709 -415 1208 142 -699 1257 344 -1479 -5 421 -1206 -209 252 -1118 179 494 -1091 327
1784 327 1198 -492 -20 1491 -266 -278 1211 -847 -471 887 -866 -1348 670 -410 -1897 398 585
1801 585 -1262 496 661 -685 694 1121 -672 390 1373 -702 -329 741 -869 -639 137 -893 -660
1818 -660 584 -971 -731 1066 -218 -470 1177 395 -429 1056 224 -702 924 441 -1347 317 486
1835D86k204J075J249j833R96J058j780O93J614j773L77J438j057r24J465p49
1851A31q54J123p31r97J353j11j285J703J36j476J338M81j253J163J6j138R78
1868E77K99j687M21J477j973kJ662j447j93J453j008m71J809o99j426K128J2j686
1886g54J078O19j583R46K81j737J010P48j776N26J161j005j23J176r25K34J325
1903A201j126k49J386j034q37J556m55j329J423o16j168J318j48j440J785L89
1919F56j654J176R94j427L21J154j339m0J377j496j8J296j345q00J664o29j049
1936a159J274j22r27J348j98r69J481L4j247J304l7j370J123J2j543P85Q85j814
1954a140K29J448j300j79J892j047l81J474o19q25J684p60j424J590J43j744Q03
$$ plain form
1835 486 -1718 -643 606 -1227 -231 827 -953 -260 1354 -419 -42 1396 339 -585 880 131
1851 131 -723 400 -331 -1328 25 -86 -1371 332 468 -1008 330 811 -442 721 737 -401 577
1868 577 876 -811 -390 1087 -886 -888 774 -673 -866 587 -421 -892 917 218 -1208 920 932 -754
1886 -754 324 943 -640 306 587 -1150 -140 608 -1168 -642 519 -486 -609 567 -358 -124 1201
1903 1201 75 -174 1212 178 -659 897 442 -887 536 -80 -1248 70 -78 -1518 267 656
1919 656 -998 178 1172 -255 66 1220 -119 -159 1218 -278 -296 1000 -345 -1145 519 -110 -1159
1936 -1159 115 -7 -934 414 216 -753 728 762 -485 819 782 -588 535 547 -996 -211 674 -1140
1954 -1140 -911 537 -763 -942 950 -97 -478 996 377 -448 1236 476 -948 642 785 -959 -156
1971a56O97j719R22J63r88P77N87r76M98J277j341L50P18p72j1J053j184k55J232
1990H72j077j000J832j067o75J696n09r38J408K3j097R84P62j845Q17J491j791
2007a14j7J215j460N0Q33j152k8J278r94k84J349n24p33J075k52n86J348q44p63
2026f03J300j14j480J093K48j575Q77N89j300N38R82j539O95J430j339k93J981
2043A490j141q47J307o17o29R74n08r74J146n9j566J447L28j236Q69N83r21O59
2061C05N97j304O32R66j447k02J287j204j45J038j219k41J312o49q02J542j69
2078B97j149J559j83r57J054L2j338J071K41j544P79P92j200j42J290j089q3R75
2096D05o12k60J079o42l92J343o76n77J020k37q85Q16m22q38R81J09j196Q88L36
$$ plain form
1971 -156 541 -1178 -256 -93 -1081 -304 283 -693 -195 1082 -259 91 809 37 26 1079 -105 -360 872
1990 872 -205 -1205 627 -440 -1115 581 72 -866 542 565 -532 452 1214 -631 186 1677 -114
2007 -114 -131 1084 -376 -326 507 -645 -673 605 -389 -673 676 152 -581 494 242 -344 1004 160 -603
2026 -603 697 583 -897 196 444 -1131 -254 335 -965 -427 555 -984 -289 1141 -198 -491 1490
2043 1490 349 -498 809 192 -437 537 29 -945 201 142 -1424 23 351 -885 -16 567 -354 305
2061 305 902 -402 230 1196 -251 -453 834 -370 -515 523 -696 -937 375 -274 -1076 466 297
2078 297 -852 707 524 -433 621 653 -685 386 627 -917 -138 654 -546 -688 602 -487 -570 405
2096 405 -207 -467 612 -30 -422 921 245 -332 688 451 -434 382 -40 -878 103 212 -984 -96 240
2115B40j119O28R75j006J08J281j426L08R44j011m30J467r70o29J038m17r84J010
2133Gj5r12J339N2j296J013O42j077P14Q0p78N79L57j152L63O04r60j18R84j076
2153f50J9Q44l16o21J466n83o61J221l36q52J147N4j430J182K6j416Q57Q7p37
2172f99L36Q17j186L72J078q53j01R79r03L3J031r82k95J122o86q51J078k25p88
2191g23R94L1j183R77K50r91R18M85j024N27N79j129J81Q35j055n0O02p70j97
2210g43Q70m38m63R50m20m20J260j7r54Q60J73p28N66Q4j028N17M51j084L30N20
2230B86j229L81R75r31N7J135q49j30R48l87m93Q66k03p68Q57j06j020P68J24
2249B81j167Q61L77q19M26M15j040O30P25r08R3P57p56R0N17p42k8O66p12m80
$$ plain form
2115 240 -879 -251 724 -282 -174 1107 -319 -11 933 -78 -508 959 -11 -640 398 -19 -1003 7
2133 7 -8 -920 419 471 -825 188 830 -247 467 547 -231 348 705 -447 -84 520 -440 -558 426 -650
2153 -650 -631 213 -103 -724 742 159 -502 719 383 -469 678 732 -698 484 510 -906 -49 38 -699
2172 -699 -363 454 -732 -360 718 -135 -236 743 -160 -127 904 -78 -373 749 63 -788 290 65 -723
2191 -723 271 302 -881 96 346 -645 273 758 -266 261 840 -289 -108 727 -328 -378 224 -546 -743
2210 -743 127 -311 -774 176 -244 -664 596 579 -375 485 658 -70 496 580 -448 69 520 -564 -234 286
2230 286 -943 -562 413 -518 -461 674 -175 -305 643 256 -237 629 426 -342 515 409 -611 157 281
2249 281 -886 -25 352 -467 -41 374 -666 -36 689 -219 -126 631 -125 -35 482 -260 -288 378 -334 -814
2269h14R59l70p23J213j84o65Q90J55j115R32L37j170J060K17j277N33M53q36
2287d05q1P41p52l8R10p39j11Q44l28n77Q62k2n98Q35q9r89Q60j4r72R43P8j069
2309g11N55O40j249M88R29j165K74R56j032J83P20m39m63R59n45o67R00k51n98
2328e16Q10k21q27P70L39j095P91O49j094L42O82r41L15P16q56k39Q14n43m51
2347e55Q76o77l46R35l63n72J020j63m19N86K19r19P05J76r82N15J65n41L98L56
2367D14j117L72O79q79J49Q01n44k68R52m17k70N56n03l93O94k9q73J007l07m51
2387d27N71j77o72M88M70q49M45O75q67K17Q25o32j71R54q84K6P00q89l60P43
2407A86m55n49Q63j03l91N25J8m36Q66J3q11O10J43q96M99K97p18K76L87q40L40
$$ plain form
2269 -814 145 -225 -948 265 81 -584 306 461 -654 278 615 -555 505 722 -555 -22 431 -405
2287 -405 -486 255 -497 -535 375 -364 -475 369 41 -536 326 304 -294 541 452 -537 323 309 -663 280 358 -711
2309 -711 -156 484 -765 -277 652 -513 -239 717 -315 -132 588 149 -314 645 100 -567 333 82 -516
2328 -516 294 73 -754 16 355 -740 51 700 -394 -52 630 -311 4 720 -136 -375 439 -104 -555
2347 -555 321 -356 -702 233 -130 -702 318 155 -264 322 541 -378 327 503 -479 36 201 -340 58 414
2367 414 -703 -331 348 -531 -382 419 -125 -393 559 142 -128 428 -75 -468 226 197 -676 331 24 -427
2387 -427 144 -33 -705 -217 253 -596 -151 524 -343 -126 699 67 -104 850 -34 -8 692 -197 -557 186
2407 186 -269 -818 45 -58 -449 76 94 -342 524 537 -274 336 479 -417 82 379 -339 -63 324 -516 -176
2428a76N05n68j78R02l86l60P21l12m77R85m86m25N51N7p44M31K03p24L35J51
2448El48N4O18r26L20N28k42m80J223o67L6L27j47m31L94k59o43R11l10o06P39
2469I6J41o33O66J19p83P73J29o68J02O52o94j1N94o49j27N00o09O5M81l43j86
2490c85M51k54j79O38p5l07N15j5n51M87j34p13N39M18q49K1L75l90J80N45m61
2511a44k60P00m90KP51l55l82O48m19j00J90O6o10J82L21p68N24L47n74J61P58
2532E48r29M65L61n55K20L72n15j99O71n76k36O31l13l88O76k66o29Q72k45k91
2552c26N83j16n58N43K65m24K11L06p58K07L14n81k14Q69o87l7O04l19k05P80
2572D57j99j91M57m75l10P09l40m35N59N6m65J69O5n91K89N40q81O29J39m46K32
$$ plain form
2428 -176 329 -239 -417 485 99 -261 460 148 -329 656 170 -255 296 353 -391 40 243 -481 -146 5
2448 5 -343 -289 329 -597 -277 251 9 -471 752 85 121 448 301 -130 264 5 -638 273 -37 -643 96
2469 96 237 -396 270 389 -394 379 508 -160 -58 594 -100 -111 483 -166 -293 207 -402 -337 144 -199 -385
2490 -385 66 -188 -367 271 196 -111 404 389 -162 325 191 -522 17 435 -414 -393 -18 -408 -228 317 -144
2511 -144 -404 296 -194 -192 559 204 -178 470 51 -49 141 207 -403 -221 100 -668 -144 203 -371 -210 548
2532 548 -381 84 445 -110 110 482 -33 -232 439 -137 -373 258 -55 -443 233 -33 -662 210 -35 -326
2552 -326 257 141 -417 126 391 -33 178 484 -274 -67 247 -334 -548 321 -366 -403 201 -118 -323 457
2572 457 258 67 524 49 -261 448 108 -327 232 288 -177 -8 57 -534 -245 295 -586 43 182 -264 -32
2593c2N79n58j5N79n71k90O85j26o78N94l71j65M88k09m20N60J63n53N62J83n81
2614a76K93O45r00L66K95o32j78N42k13l92O23l67m99O86j84k61N88J32l61K76
2634B83J22n82J62N83q51K07L63p73M89K70o61J94K35n54L86L59l17M5O01m32
2654A29j85M68k72k16N20l79n07L97Q5l63L08J83o52K83L68l60J24M74m50m1N90
2675E04l65k47M77m75J16K87l86l14O79m41m72N46J41m65M71J41n80O34K17o03
2695a35K09N79q94K26L50p32N59K10o49q3N26k85j12K92j11l07J107k91l93L09
2715C75J31p07J18L94o60L89Lk77M9M32n08K54N30n05j70M25l95K72L40n53k96
2736c59N96j42l73L34K0m25M17j99k15N03n5n33M41O13q03K54M88o15L68l7l88
$$ plain form
2593 -32 547 -11 -26 553 -18 -308 377 251 -427 167 -204 -369 119 -90 -510 50 213 -340 222 405 -176
2614 -176 117 762 -138 228 523 -109 -287 255 42 -350 273 -94 -593 93 -91 -352 236 368 7 283
2634 283 405 -177 -15 568 -283 -76 287 -486 3 273 -388 -194 41 -513 -127 232 -85 -40 561 129
2654 129 -56 412 140 -76 444 65 -442 -45 40 -323 -15 168 -484 -201 167 -193 -69 405 -45 -86 504
2675 504 139 -108 369 -106 10 297 -89 -403 276 -165 -637 -91 50 -415 56 197 -383 251 468 -135
2695 -135 74 653 -241 -15 335 -397 162 372 -277 -360 166 -119 -231 61 -50 -357 750 459 66 375
2715 375 506 -201 -83 311 -349 40 43 -234 -185 247 -261 -7 523 18 -152 273 -122 150 490 -63 -359
2736 -359 237 95 -278 56 76 -349 68 -131 -346 157 102 -431 10 623 -180 74 562 -53 315 278 -110
2757a10mK77n25J35M64l60l52N40K73o75N09j7k36J97O1m12L02J64k37m1K37m69
2779b79L97j61k84J87K28l24P8L51l55n5N53k17m59N55J91o23N21k67m12N32K0
2800A77l29k4K20m53M40J9m52J17Q59p66K68P6k93K36J55j98k57Q00p82m12Q52
2821B53k43m33O66l59J0K29K91o22K58m0j76N87k58j17p4L27n38L8L60n87K87
2842a41J00j52J27N27k83k35J31J31n61P29j92k67K04k2l85M42M9l54L7K03m13
2863c25L19J73l94J13M78m80l27R14m70%M93m86l96O35q1n86M49j09m28N72k24
2884a60k28L11M85o19K14M69n25KO08o08j65O50n37j61M46m23j96O61m66k1N55
2905B92j92rM79j98n50L03J32k00K80j46l84K72J05n50K66L25m57J89J72m19O1
$$ plain form
2757 -110 -114 163 -362 -227 237 -123 -475 65 338 -337 172 155 -81 116 177 -235 67 231 -6 -47 190 -279
2779 -279 118 -43 -327 -140 88 -236 -158 193 -162 -217 336 119 -340 215 406 -217 304 37 -375 157 177
2800 177 -152 -176 44 -409 31 50 -402 -285 574 -192 76 152 -141 95 250 52 -205 595 -187 -599 253
2821 253 10 -423 243 -116 -106 123 414 -208 50 10 -166 421 163 46 -28 299 -239 -201 159 -428 -141
2842 -141 -41 -193 -66 461 178 -57 74 205 -356 373 181 -86 118 96 -289 153 202 -152 -115 88 -325
2863 -325 -6 167 -227 -114 364 -116 -443 471 1 1 494 8 -388 247 166 -420 29 -80 -508 64 -160
2884 -160 -388 -77 408 -211 3 472 -53 -51 557 -51 -216 434 -103 -264 182 -241 -437 224 -242 -263 292
2905 292 100 91 570 372 -178 125 257 57 337 191 -193 79 184 -366 -100 225 -232 -43 129 -290 -229
2926b29P30k71k98N14k76n80P60k9q36O94l29k00L77O6n17N21J68m84J82K67m08
2947a78M17M8l46J61J09l67O9N07l28j98J08J94m30K43K7l29M51Qm56L23m5Q6
2969G4O6J55k69j17M09m34j41N60m24k75M57j29l28L93R1l59M82j63l30N05K2
2990B45l94K63o1j25L47j27m53J95J17l43J1M62l58K92K60o98K02N16l78q9M49
3011C33l80k29L01m2j99L29j33j27K53m3k80J78K36o25P92j62k98K63J04l52P0
3032a1M69q01L80j4j26k56N06l73p9N11m14Q8N07k73l23L96J61l46J69K1k37j14
3054a59K22m05M64K18o76j10O02l08o8L48m46M44J19j79j65N02k65l27M97j73
3074A35k53J18k2k22K44j76j74L18K02j96K87j19k45J06L65p01L12L24k79j23
$$ plain form
2926 -229 501 230 -68 446 170 -410 350 321 -515 179 -150 -350 27 93 -424 97 265 -219 -37 230 -178
2947 -178 239 287 -59 102 211 -156 -87 420 92 -106 2 196 -234 9 36 -293 158 166 -290 33 -12 74
2969 74 140 295 26 -91 318 -116 -257 303 -121 -396 61 -68 -396 -3 88 -271 211 48 -282 223 245
2990 245 -149 114 53 -72 275 148 -305 -110 7 -336 -325 137 -221 71 331 -367 -165 351 -27 -116 333
3011 333 -47 -276 25 -17 -216 113 -20 -147 106 63 -217 -39 197 -428 364 202 -96 167 271 -81 -11
3032 -11 458 -343 37 23 -103 -359 147 -226 -305 206 -208 -120 387 114 -209 187 348 2 171 192 -45 -159
3054 -159 63 -342 122 340 -336 -446 156 -152 -220 128 -318 126 245 66 -99 403 138 -189 308 135
3074 135 -118 0 -22 -244 0 -176 -350 -32 170 -26 261 142 -103 3 368 -333 -21 303 24 -99
3094i9K78l28r8O43n53o6M15j56k15L83L1l76N19j08n57P11k3n89K77J11l05J17
3116A2O9n37L48K28j15j87L61j17l53L91j08j97O74k97l76L17j69j74K38J75l80
3137a97J50K26o56N19L0r7k00M03Om93O83n12J41Q3k08M5M20m76j68P2L54m97
3159c72M47J44m53M92j95k35J62M24n57L34n2j59j2O6k50j9O10m60l8kk1J57%
3182A1J56m66P01k03n06N13K10n41K65p7m51O27m5m88O7O35n82k7K88j47k34N75
3204B81k68o1L46j15j96K8J44k57K49k60k49L60K20n64J68N45m76k70N63k42O6
3225A2M41o90L20K35m39R2K47k14j75J68q6k82L39L8j90K07M4k47L76Jp8j49K85
3248B55j39j31rN2%J20k69P1K8j94J77lk16M7L86jm29M74k59k51K84J52m33K14
$$ plain form
3094 -99 179 -149 -247 396 -157 -223 192 36 -179 204 235 -141 378 270 -287 424 401 -188 89 200 -105 12
3116 12 81 -456 -108 120 5 -182 179 62 -291 100 -8 -205 469 172 -204 113 -56 -230 8 183 -197
3137 -197 -47 179 -477 42 72 -25 -225 178 184 -309 374 -138 3 86 -122 -77 343 -133 -301 -229 125 -372
3159 -372 75 219 -234 258 63 -172 -10 414 -143 191 139 -20 -32 34 -216 -235 375 -85 -123 -125 -146 11 11
3182 11 167 -299 402 199 -307 206 416 -125 140 63 -388 239 194 -294 -227 408 -174 -201 87 -60 -294 281
3204 281 13 -48 298 183 -13 15 159 -98 151 -109 -358 2 222 -342 -174 371 -105 -375 188 -54 12
3225 12 453 -237 83 318 -121 -29 218 4 -171 -3 -89 -371 -32 6 -184 23 67 -180 196 197 119 -30 255
3248 255 116 -15 -24 28 28 148 -121 -50 -22 -216 -39 -42 -258 -211 175 174 -255 219 -40 -291 -7 145 -288 -74
3272g4M70q21M46l3k22J92J29k34O3M21l03k3K51j75k37J79j64L06p3O7m60M46
3294A51j13l47M03j83k38K65M05m24K87J52m43J81j5l16M38n6k19j00M16l88n
3315a49K13l49M9N66k52l68M92P5p6j07J01m98M15j70k92L0N49m34L54J77n53
3336b27j05M98l00o6L26k41J56J0J30l45M98j45n23N18p1l21L30l06J19j02K07
3357D0l32J24L14m51M62J29m06j01N60k06k23J86J48l84K21m0l08K89k36Q0K07
3378G3j06j57O8J60m05L60K49k52k5M93l16k17J86j67N1j42J47n8J57k12k36M65
3400A16j59L5J22O8m62K25K17o2j60J02k36K41K5j82l3K76o47M59J75j69l7M72
3422C86l14j13K46j29j08K13j91o2L09m00j61J19K95k36R9n0R1J89j23j37J46
$$ plain form
3272 -74 396 -425 21 -12 -234 -42 87 -147 -84 337 34 11 262 87 -150 29 -135 171 98 165 -295 151
3294 151 38 -309 94 -89 -327 -62 343 -81 206 358 -85 96 81 -235 203 147 -72 -172 244 -144 -149
3315 -149 64 -285 -236 330 78 -290 202 277 201 94 195 -303 112 -58 -350 -320 229 -205 149 326 -227
3336 -227 -332 166 -134 -200 126 -115 41 51 181 -164 334 189 -334 184 113 -208 122 -184 -65 -167 40
3357 40 -292 -168 146 -305 157 286 -120 -221 339 133 -90 96 244 -140 81 41 -267 22 -214 -134 73
3378 73 -33 -190 -122 38 -367 -7 242 -10 -35 458 142 -75 111 -56 -5 -147 0 -58 99 -113 -349 116
3400 116 -43 -8 114 182 -280 -55 162 100 -60 42 -194 47 72 -110 -143 133 -514 -55 120 -49 -86 386
3422 386 72 -41 205 76 -32 181 -10 -72 237 -163 -324 -205 90 -146 -47 -97 -6 183 60 -77 69
3443F9R5q0P1J67m40J6L27l17m0L25l39p5o8N16l97L03J21n79M01K0l03L29p8
3466D4rJ48J49n51R3J24j76N9K39qj44M20m88r5L55j74j02K74o7J5k8p5j29K31
3490A05k54j30J46J90l44K07k0l2L9J15N1o0m4P1n4P0j34k6K77k15k89L45P2j35
3514d9m3m3k16N57k41N0J7Q0rj6J19l81L33j78q6k10L12j39O3L15l94J38%n4k0
3539i5J46m7J6Q0j31p1K79N4n03K95Pl13J20L73m15J23J34j59O3J47k2j3j10J1
3563c1j4M15l07k47M11j43l31L34Q1n47L94j08m0j19M01l45K78K84m66J00n0n0
3585a00J15j80K75k02K18j46j77L10P3l46k1N4M2J40J19j47q0K04j92J69k1k41
3607a34J75k5m02M08J23k70J2lR8L6j45J49j95L51q4m02L81J84j47K9l80j9J42
$$ plain form
3443 69 164 84 155 322 -118 -102 225 -92 -132 193 -146 -221 -289 227 -170 133 254 -325 76 96 -207 122 44
3466 44 35 183 332 -219 -126 -2 -178 -119 120 112 -32 388 -100 -195 160 -14 -116 158 91 106 78 3 -126 105
3490 105 -149 -279 -133 57 -287 -80 -100 -132 -93 22 73 13 -31 40 -14 56 -78 -104 173 -42 -331 14 86 -49
3514 -49 -92 -135 -351 206 -35 15 32 112 103 87 206 -175 158 -20 -106 -316 -4 -143 -80 235 -159 -21 -21 -75 -95
3539 -95 51 4 20 100 -31 -102 177 231 -272 23 30 -283 -163 210 -205 -82 52 -107 -44 103 81 68 -42 -31
3563 -31 -45 370 63 -184 227 84 -247 87 168 -379 15 -93 -133 -252 149 -196 82 366 -100 0 -50 -100
3585 -100 15 -165 110 -92 126 -20 -197 113 186 -160 -181 -127 -85 55 174 27 -53 151 -41 128 107 -134
3607 -134 41 16 -386 22 145 -125 -113 -116 -18 18 -127 22 -173 178 94 -308 73 257 110 139 -241 -260 -118
3630a18P1m15L13K01k33K89P7p4k96M61k51J90j34k00j02K64j89L8M5P5l34M50
3652A28j11j59M18k96o1J70J25k90R9L12k23O9k6j63j08R9m7l21Q2K56q1L68m32
3675a92J74K12j83J50j94J88m91M10k40jJ09R6j94N6M12k95l37N66k80k26J93
3696f7j25J62K67j85L1R1l37o1N23j29m73L54j17k62J35K77o7n5L5j06K33j58
3718c4P4P5J7k70L3K33l7q3j3R9l77L75j67o8K70o1n7RQ7j83Q0o3j3K42j13j90
3744a35j65L67k05J83p7k96K94J74J8k35K11j44j58K45Qo2J27k0l80L92j26l28
3766c12L33J53k96J10J54m30K08L41m35J79J83k12q9K96j10Nk54J56q6Q5k8k38
3788b87J51J80J3l35L99j75N6K92l86J22K27l52K6M3J39l41M72k71k36J57K1J33
$$ plain form
3630 -118 -47 -462 -149 52 -181 108 185 111 -185 276 25 215 81 -119 -221 43 -146 -108 -63 12 -322 128
3652 128 17 -142 276 -20 -81 89 214 -76 23 335 112 181 155 -8 -116 -17 -64 -385 -303 -47 -128 240 -192
3675 -192 -18 194 11 161 -33 155 -336 74 -166 -167 -58 38 -156 -100 312 17 -320 246 -34 -260 -67
3696 -67 -192 -30 237 52 83 174 -163 -224 299 170 -303 51 -66 -328 -193 84 17 -38 -3 -109 124 -34
3718 -34 40 115 132 -138 -105 128 91 8 -5 94 -283 92 -75 -143 127 66 9 18 105 -78 2 -61 -74 168 55 -135
3744 -135 -300 67 -138 45 -32 -328 -34 140 158 -77 134 -10 -168 77 85 23 150 130 -250 142 16 -312
3766 -312 21 174 -122 -12 142 -288 -80 261 -174 5 188 -24 -113 183 73 78 -176 -20 -106 -21 -49 -287
3788 -287 -136 44 57 -278 121 -54 2 294 -92 30 257 -95 -69 -26 113 -228 244 -27 -263 -106 -85 48
3810D8j38Jj8J20J39l49L81j07l11N04J2l79K11J09m14o0K14k76M04R3k40lN7
3833bL6k55L76j67O2j06J47l98L28j25N6j22K02k51MK87k10pK76l17J88K13l04
3856h9K13L32p53J64J50J06j75J11j85k02L22p8L5j11L8K47j66J14l91K02N42
3877D26o93M88j42j76j7K92j24l28L01Qo6j3M2l65N86k64n1L01j91j84J05n7K79
3900A57kJ5l21J62Ro3J55j0k29Q3K32j90k5J41M0o8J32m67J96L5J37j79L67j52
3924A55m03K73kr5J24j49J09L9R0k94J97J21M0j20K7lk46J28N9j55K09L6k17q5
3948a62P7J51L5Qk21K39k13N2O3K05m74M00q9l49K84J99l07O6L26m63Q7L58o32
3971c60L15K29k21mL53k05l34M38k19j10J31K12l76p3M39m90J15J75m0L13m2l85
$$ plain form
3810 48 -90 -89 -107 13 152 -197 184 77 -234 270 282 -97 114 223 -191 -251 -37 -313 91 184 -56 -59 -2
3833 -2 34 -221 155 -12 50 -56 91 -307 21 -104 -48 -170 32 -219 -215 72 -138 -145 131 -186 2 215 -89
3856 -89 124 456 -297 -133 17 123 -52 59 -126 -328 -6 -84 -49 -160 -122 125 -41 73 -318 -116 426
3877 426 -267 221 79 -97 -114 178 54 -274 27 35 -31 -44 -2 -367 219 -45 -96 205 14 -170 -65 -122 157
3900 157 155 170 -151 11 20 -43 112 102 -127 -44 188 -2 -27 114 154 86 218 -249 -53 -18 119 -60 307 155
3924 155 -248 25 23 -72 52 -97 12 51 141 -153 44 165 205 85 112 109 -137 -9 50 -105 104 140 -77 -162
3948 -162 -85 66 101 109 -112 127 -86 -34 29 234 -240 160 71 -278 6 205 -102 -36 290 -173 -86 272 -360
3971 -360 -45 184 -37 -41 312 107 -227 211 -8 -118 13 225 -151 -224 215 -275 -160 15 -25 288 246 -139
3993a39k9L16o2j41K68n12Q2N25m76O2p0K90k33QK06j74L19m0l51J87J60j09q5
4016BJ38k46j1l2K7j04M60k96j0l0J90j9K32j89j49L11k17j2J33j11N2l2K12n06
4040b07J89K26k54KL6j8j01L32j82q8L32l76L1K42ok37J50mn5J56l5j57P8j03
4064d9k46K58J42m19L36r9j8K81r2k87K77J9k03R8J14K3j12j95j18J34N8M6O8
4087A6J46l68J24L19r1l09J27J07P3J05Q7o55M44MM6k33J54o9j95K63p7q0M25
4110C63l45j5J00k31O8L16l43P5K54j15l83K58r4k63K86J38j56j2K78k81J21K30
4132B49m54J54J37J31l66J69n1j52L96l90M0J39m1n7M3M9K9L4K48l38R2K69p13
4155c83L25L54l78n5J85k85L28J5k27j32M35k72R4P8r8r4L34j64n0M30n08K25
$$ plain form
3993 -139 -168 148 86 -55 213 -299 -217 308 -168 -106 -176 114 -119 -111 95 -79 240 200 -151 36 196 87 2
4016 2 140 -106 -117 -149 -122 -226 234 -62 -72 -102 88 69 301 112 -37 274 57 45 178 67 119 87 299 -207
4040 -207 -18 208 -46 -44 -8 -26 -127 205 23 -65 267 -109 -78 164 158 -79 71 67 12 168 133 -24 54 -49
4064 -49 -295 -37 105 -314 22 -77 -95 186 94 -193 84 103 -100 -2 112 135 23 -172 -290 -156 -98 -52 16
4087 16 162 -206 -82 237 146 -163 -36 71 144 249 336 -319 125 129 175 -58 96 27 -168 95 18 -62 363
4110 363 18 3 103 -128 -60 256 -87 -12 242 127 -256 2 -92 -355 -69 69 -87 -99 179 -102 19 249
4132 249 -205 -51 86 217 -149 20 -31 -183 213 -177 -137 2 -39 -96 -53 -4 25 59 307 -31 61 330 -383
4155 -383 -58 296 -82 -137 48 -237 91 106 -121 -253 182 -90 4 82 -16 -110 224 60 10 440 -68 157
4177A57q5j65l07N66k69l05M67J09l15M5J39j67K77K4j41j14J55q6J1Q4j67k12
4199b99M08j87N3j10L37k40o4J28j91J41J33o7Q6R3m84K48N4j65K17j42j23k16
4221c90L47J3N6P1n5j45M55k56O9j58J08pJ01j61l41L14J11p9k91J23L2J8K30
4244A65l96J04K09k39J85M8J89l21K80j61l2J09r0j79R8P8k91P2L54m34L25L39
4266D12m35q2L62l68K03J18l35L06Nk77K4L26k55J7J67k01k2J19j04j88M06j13
4288H5j46J78o6r7J49R8p6j52J43j26j92M08m89M46p2m8k79L40j56J46R4j66j15
4311i3K82k15k30L12j8n9j73K61k33J60K23k63RK05j75j51M38k88l5R4k8j81Q8
4334g0M6k00L07j85p7J44j77J31J12j11l4L64O8k45qN4l79N21K4l25K2J46r9j35
$$ plain form
4177 157 72 -93 -400 166 -103 -408 59 168 -147 -102 37 -130 147 171 30 -84 71 -15 -4 80 -87 -299
4199 -299 109 -78 -25 -135 202 -38 -102 26 -165 -24 109 42 128 221 -263 -15 39 -126 91 -51 -174 -390
4221 -390 -43 -30 26 97 42 -103 352 96 165 7 115 108 209 48 -293 21 132 53 -238 -115 -83 -65 165
4244 165 -231 -127 82 -157 28 76 265 -56 224 63 31 140 50 -129 -31 47 -244 -172 182 -252 73 412
4266 412 -23 -105 257 -111 92 210 -125 181 186 -91 -67 259 4 21 188 -13 -35 84 -20 -208 198 85
4288 85 -61 117 51 -46 103 201 125 -27 116 -10 -202 206 -283 163 91 43 -236 104 -52 94 188 22 -93
4311 -93 189 -26 -256 56 38 -21 -194 67 -166 -6 217 -46 -37 168 -7 -158 280 -8 -43 51 23 -158 -70
4334 -70 -24 -224 83 -102 -179 -35 -212 -81 31 -80 -114 250 318 73 65 119 -260 261 285 -40 -18 128 29 -106
4358a06J70p0m53N22k65J09j1J57o2K11k65J69r7J60l41K82J09k93K84k72o6j04
4380b32J8L05nQ3J17k78jj24P5K23l43l4M42m09J34j33R8r5J82J68m89M34L8m86
4404c12M88l08L5J55L8j48L20O6l99N1K07k04j66J21j01N5k4J04o5j58L06r3P5
4427D3K48k88L40k46j23K86j48m09K41J51k28lM25l23J6K47k95r9L56j75l49M63
4449A30O3k15P7j5l21L09K21l28l54M41K40J1j83l42M63j60p7k7K78j68K9n2o2
4472d2k22M98m07j47J94J15k52K49O5k22m2M43n71N65r2m76L28R9j51M1K68l18
4494g7k80M92j88j21L11j60j25J01l5q7M54j74j60P0n5J94j24P3j17K9lqL1j12
4518g1J34k16K23l00L14j71J89j19J29Q4n18N39j77m5K49j55l80L46N0m34M87
$$ plain form
4358 -106 64 -6 -459 63 -202 -93 -104 53 -9 202 -63 106 9 169 -172 110 219 -74 210 -62 -128 -232
4380 -232 -214 91 86 169 286 8 7 -117 -42 181 -162 -196 246 -163 -29 -162 -64 -159 23 191 -298 136 174 -312
4404 -312 176 -132 -97 58 96 -52 268 334 -65 -14 193 -11 -177 -56 -157 -102 -126 -22 -87 -245 61 -32 43
4427 43 291 3 343 97 -26 260 112 -297 -56 95 -133 -136 289 -34 -18 229 -66 -165 191 16 -333 130
4449 130 193 -22 55 40 -281 28 249 -79 -433 8 248 259 76 -266 197 37 -40 -67 211 43 72 20 -42
4472 -42 -264 234 -173 -320 -126 -11 -263 -14 51 -171 -213 230 -341 224 132 -344 -16 83 -68 -27 241 -77
4494 -77 -357 135 -53 -174 137 -23 -148 -47 -82 -169 285 111 -49 21 -34 160 36 109 -8 21 18 10 41 -71
4518 -71 63 -153 70 -230 84 -87 102 -17 112 196 -322 217 40 -5 244 89 -291 55 105 -329 158
4539A58j48j01L71j85k96L84q4j62L48k02j45j9K84k13K3J73k20l61L33J65k19
4560a16J11j12q2K63J46l61J85J7j01M03k71k07J81J63k69K09m3Rj71K19j13j56
4582i6L05l34j99M74j94L15m7j90j18L20k28l21M37P1j45j28m8k95N39M0l4l14
4604a90N93m24l8J56j18M5l6O1q0P1j15l84O53l75k72M34K03n26M01J42o29M42
4626A4N3k57L42J75m41M2M3k42K6PK11m5L6j24L02Kj68K7Q0Ll31L98Q7l02J28
4651F6J60k86N4J61o7k23L7J02J7J76k86j8M96k27n13O45l13n9K31k65J03K20
4673B11n4m46M38j04l11L26j15j03M47k15l21M21J39l54K13r4k52N3K75m01J14
4694a33M34j64k25K65j12q1J68m7k33L22j6o4q3r9p2K61M2k83J03k38j1L14Q5
$$ plain form
4539 158 10 -91 280 95 -201 183 99 -63 285 83 -62 -81 203 -10 13 186 -34 -395 -62 103 -116
4560 -116 -5 -117 -199 64 210 -151 34 51 -50 353 82 -125 56 219 -50 159 116 125 -46 173 60 -96
4582 -96 209 -125 -324 150 -44 271 224 34 -84 236 8 -313 124 195 50 -78 -126 -421 118 158 124 -190
4604 -190 403 -21 -59 97 -21 24 -12 49 -31 40 -75 -459 194 -181 -453 -19 184 -342 59 201 -428 14
4626 14 67 -190 152 327 -114 -72 -29 -271 -245 -238 -27 -72 -36 -160 142 144 -24 3 83 86 -245 153 240 -62 66
4651 66 226 -60 -6 155 88 -135 -98 4 21 197 -89 -107 389 162 -351 294 -19 -78 153 -112 -9 211
4673 211 157 -289 149 45 -266 60 -55 -158 289 74 -247 174 313 -41 172 78 -174 -121 154 -247 -133
4694 -133 301 137 -88 177 65 -16 152 105 -128 194 178 114 31 -68 -140 121 163 -120 -17 -255 -266 48 133
4717A33k47J61J56k98K84qk17j39J29J35k99M67j71j47p6J49q9J56J49l71nL80
4739B32m45J99m0Q3Q0J88l26O8J6M4k53L01j05Ml7j53R0L65j45k60J46m2j06K29
4763A33j77N7J86K2k80R8K34l73J81j58k31M02J6k51J22o1m2J47J16k31O8K69
4785B47j34j20Q0o5N4lq4j61J92k7l48M21j44J1Q6K34k43q9J23n7n2J86k29K99
4809A77j6k54p0J16N1p2J71J09q9j08L51m20K61l3m46K90J28k52P0J54r4k51J59
4832f8K02l78M76r7k36K21j10%j32O7J42j02O8j74L20J21n19J43k9j2R9k8j30
4855a56K84m0p3M7J03k63m7K91Mk59J02Q0p9j54J1J22J86o9m86L39Kj84K45K34
4879B40k61O7K14l84J13J89J8k18J43q5l10J9J89n2q5k7l1L66J1k76L75l64KK92
$$ plain form
4717 133 -114 47 203 -95 189 181 -36 -175 -46 89 -210 257 86 -61 -137 12 -77 79 228 -143 -148 232
4739 232 -213 -14 -54 29 109 297 -29 39 55 99 -154 147 42 46 9 -144 -54 311 166 -94 52 10 -96 133
4763 133 -44 13 199 221 -59 39 273 -100 81 -77 -308 94 110 -141 -19 -80 -122 25 141 -90 -22 247
4785 247 113 -7 73 8 62 59 -25 -186 6 -21 -369 52 -92 -81 5 239 -4 -93 30 -27 -79 107 -122 177
4809 177 161 -93 -163 -47 4 -68 103 212 123 15 366 -54 207 174 -272 18 146 -106 -36 118 24 -227 -68
4832 -68 134 -244 232 135 -101 120 10 10 -122 -55 87 -15 53 -121 199 320 -199 -56 -85 -97 2 -26 -156
4855 -156 128 88 15 62 165 -98 -145 146 150 -109 -7 73 -6 -160 -149 -27 159 90 -396 -57 -55 -239 6 240
4879 240 -21 46 260 -124 -11 178 196 -22 121 36 -274 -255 -66 -118 -203 -230 -261 105 116 -160 215 -149 -147 145
4903A45J78l25J99k28j11p6M06n02J52M61k53m5K81l86J49R1k63J60J44j40m74
4924d37N16k73K79k20L15l70J61M2l17J10J25j52J95J69l75K55P5j52J17R7k36
4945g6L71J1l44O8QL6j32J54j78K7O6O6m9Jn2J53k19R8pk6K71l43l1L33n33J90
4971a37K85j42l89L20J12k41L74k98K73o7j95m5J09p3p8K49K0k84L31j73k75L06
4993a8P3j16J63K12j38k87J71k62K90J36j79l49M25pk61J97K16n84L0L21Q9J42
5015B64k28q5l2K09l87K29Q1m7n3K42m36K52R2j49p7j9L34l46K85m9j12l1j60
5038b23L9P0K95l28K93J23l08P8o1K33k95J14j9r8R6l0j27L95j30J06j34J56m06
5061a61J0J45j47K49O9l13j32K96J10j80J78k93N8R8k30K01K46l69J18M35l88
$$ plain form
4903 145 323 -2 197 -31 -142 -218 188 -314 -162 299 46 1 282 -104 45 136 -127 33 177 37 -437
4924 -437 79 -194 85 -135 180 -190 -29 13 -304 -194 -69 -221 -26 143 -232 23 98 -54 63 160 -76
4945 -76 295 306 -38 30 38 74 -58 96 -82 -55 11 77 28 29 -23 130 -89 9 2 -24 247 -96 -127 206 -327 -137
4971 -137 148 6 -383 -63 49 -192 182 -116 157 90 -105 -150 -41 -114 -192 57 77 -207 124 -49 -324 -18
4993 -18 55 -61 102 314 176 -111 60 -202 88 224 45 -304 121 114 -147 50 266 -318 -288 33 122 264
5015 264 36 -49 -81 128 -259 -30 51 4 -49 193 -243 9 101 -48 -125 -144 190 -156 129 80 -32 -63 -223
5038 -223 -184 -114 181 -147 146 269 -39 39 -22 211 -84 30 11 -87 9 -21 -148 247 117 223 89 245 -161
5061 -161 -151 -6 -153 96 165 -148 -280 16 126 -54 124 -169 -111 -13 -243 -42 204 -165 -47 388 0
5082@J95L6l15Q2j51K34N1k38p1Q7J69j4%o8Pj37K60q9o6q7j7J05P2J29k14N5
5108A5R3k97l8K3J10K24j10j9k9L09j76l1K45o5m73O9J63J4q3J1Q1q8r5L3L7M3
5134c4m5j02L55l98J65K46j98K52l1j2j99M0l5r4n0j7K31L9j15KO9l0J81J3l0
5159B03l95J46K74l75J00o9J03j63J12K7k7J99k99K31K79k97L20l16k25K53J07
5180A88j54k0P1N1k4K2P1l26l7J05J48l28L45m23K86J36n7J11q7j4l44N51j49
5203A22k13K21K7l29L20l34n7L02q6k0J25ok05M6K4j12K70n2j74J76R6l30l4K1
5227b02J83j74K52j06j34L81p5J22k51m1P9O4K42m34K43p3M9P4j89j27J30O2q1
5250fq6K14j33r0K44l79R1L10k68K20j73K00k50PJ80k07J54l3k7M1j2l9P0L84
$$ plain form
5082 0 195 231 -84 -2 -153 81 132 -106 -177 -90 79 65 65 -3 4 -133 127 38 -28 -115 -132 -27 45 174 -40 15
5108 15 108 -189 -227 -204 -94 130 20 1 -28 281 105 74 319 254 -219 -150 13 27 -56 -45 36 -52 -147 -114 -77 -34
5134 -34 -79 -181 174 -224 -59 187 -11 241 210 198 -1 39 4 -90 -140 -157 74 113 -2 0 69 39 220 233 203
5159 203 -192 -46 228 -147 -47 -116 -13 -176 -64 -37 -64 135 -164 67 346 49 369 53 -172 81 188
5180 188 34 14 85 136 112 134 205 -121 -158 -53 95 -233 112 -311 -25 111 54 165 78 64 -280 271 122
5203 122 -91 130 157 -172 148 -186 -243 59 -27 -47 78 72 -133 -87 -63 -175 95 43 -131 45 141 -189 -223 -202
5227 -202 -19 -193 59 -47 -181 200 125 247 -4 -45 34 98 340 -94 149 76 125 199 10 -117 13 75 -6
5250 -6 -92 122 -11 -101 143 -236 -145 165 -103 117 -56 144 -106 -99 81 -126 28 -5 -32 9 -3 -42 28 412
5274D12k45p2l3R3n1k8p7l3L8J5N5Q0j56j11n7o0K9J75J41l77L78K72l19o6O9
5299G2k48K77qq1J35r9q6J17j39m8J94j86j15J04l2J27k02L64m3k75K66k01K0
5322h7M02j55l34Q2J96j5j58J95o6Qj90K11n0K1j7J1k43P2K41j48L4j9k8j46K14
5347C1j04J47k21qJ08J45k46QJ06K62k01k03r3M89l22K37J46n61J54K9M47l60
$$ plain form
5274 412 167 95 62 155 104 76 -1 -34 4 19 74 154 -2 -113 -170 -230 -201 -26 115 -262 116 388 69 3 72
5299 72 -176 101 93 12 147 48 -38 79 -60 -108 86 -100 -215 -111 -143 -16 -218 146 103 -172 94 -107 -87
5322 -87 315 160 -174 -92 104 89 -69 126 60 68 -122 89 39 60 43 54 -189 -117 124 -24 10 -9 -37 -183 31
5347 31 -73 74 -147 -155 -47 98 -148 -140 -34 228 27 -176 -269 220 -102 135 281 -280 -126 -97 350 -10
$$ [...]
8191D1
##END NTUPLES=NMR FID
##END=
