##TITLE=1H_CA-8763
 CDCl3, 8 sc, 
 21.9.2020
##JCAMPDX= 6.0         $$ Bruker NMR JCAMP-DX V2.0
##DATA TYPE= NMR FID
##DATA CLASS= NTUPLES
##ORIGIN= UXNMR, Bruker Analytische Messtechnik GmbH
##OWNER= root
$$ XWIN-NMR		Version 3.5
$$ Mon Sep 21 10:37:02 2020 Russian Standard Time (UT+4h)  she@DPX200
##.OBSERVE FREQUENCY= 200.1315066352
##.OBSERVE NUCLEUS= ^1H
##.DELAY= (6, 6)
##.ACQUISITION MODE= SIMULTANEOUS
##.ACQUISITION SCHEME= undefined
##.AVERAGES= 8
##.DIGITISER RES= 18
##SPECTROMETER/DATA SYSTEM= spect
##.PULSE SEQUENCE= zg30
##.SOLVENT NAME= CDCl3
##.SHIFT REFERENCE= (INTERNAL, CDCl3, 0, 15.7039)
##AUDIT TRAIL= $$ (NUMBER, WHEN, WHO, WHERE, WHAT)
$$ ##TITLE= Audit trail, XWIN-NMR		Version 3.5
$$ ##JCAMPDX= 5.01
$$ ##ORIGIN= Bruker BioSpin GmbH
$$ ##OWNER= she
$$ F:/spectra/data/she/nmr/H-F/1/audita.txt
$$ ##AUDIT TRAIL=  $$ (NUMBER, WHEN, WHO, WHERE, WHAT)
(   1,<2020-09-21 10:35:49.20 +0400>,<she>,<DPX200>,
      <created by zg, POWCHK disabled, PULCHK disabled
       configuration hash MD5:
       00 E9 B6 7A A2 85 ED C7 34 08 36 98 17 FE 4E 26
       data hash MD5: 16K
       EA 42 77 FC 89 EC 59 FB 54 F9 C9 D3 A4 5B 6A C0>)
$$ ##END=
$$ 
$$ hash MD5
$$ C4 8F 54 97 40 D7 48 FA 1F 4B 1E 5D 11 66 E2 77
##$RELAX= 
##$RELAX= 
##$RELAX= 
##$RELAX= 
##$RELAX= 
##$RELAX= 
$$ Bruker specific parameters
$$ --------------------------
##$DU= <F:/spectra>
##$EXPNO= 1
##$NAME= <H-F>
##$PROCNO= 1
##$TYPE= <nmr>
##$USER= <she>
##$AMP= (0..31)
100 100 100 100 100 100 100 100 100 100 100 100 100 100 100 100 100 100 
100 100 100 100 100 100 100 100 100 100 100 100 100 100 
##$AQSEQ= 0
##$AQ_mod= 1
##$AUNM= <au_zg>
##$AUTOPOS= <>
##$BF1= 200.13
##$BF2= 200.13
##$BF3= 200.13
##$BF4= 200.13
##$BF5= 200.13
##$BF6= 200.13
##$BF7= 200.13
##$BF8= 200.13
##$BYTORDA= 1
##$CFDGTYP= 0
##$CFRGTYP= 5
##$CHEMSTR= <none>
##$CNST= (0..31)
1 1 145 1 1 1 1 1 1 1 1 1 1 1 1 1 1 1 1 1 1 1 1 1 1 1 1 1 1 1 1 1 
##$CPDPRG= <>
##$CPDPRG1= <>
##$CPDPRG2= <>
##$CPDPRG3= <>
##$CPDPRG4= <mlev>
##$CPDPRG5= <mlev>
##$CPDPRG6= <mlev>
##$CPDPRG7= <mlev>
##$CPDPRG8= <mlev>
##$CPDPRGB= <>
##$CPDPRGT= <>
##$D= (0..31)
0 1.2 0 0 0 0 0 0 0 0.06 0 0.03 0 0 0 0 0.0002 0 0 0 0 0 0 0 0 0 0 0 0 
0 0 0 
##$DATE= 1600670148
##$DBL= (0..7)
120 120 120 120 120 120 120 120 
##$DBP= (0..7)
150 150 150 150 150 150 150 150 
##$DBP07= 0
##$DBPNAM0= <>
##$DBPNAM1= <>
##$DBPNAM2= <>
##$DBPNAM3= <>
##$DBPNAM4= <>
##$DBPNAM5= <>
##$DBPNAM6= <>
##$DBPNAM7= <>
##$DBPOAL= (0..7)
0.5 0.5 0.5 0.5 0.5 0.5 0.5 0.5 
##$DBPOFFS= (0..7)
0 0 0 0 0 0 0 0 
##$DE= 6
##$DECBNUC= <off>
##$DECIM= 32
##$DECNUC= <off>
##$DECSTAT= 4
##$DIGMOD= 1
##$DIGTYP= 9
##$DL= (0..7)
0 120 120 120 120 120 120 120 
##$DP= (0..7)
150 150 150 150 150 150 150 150 
##$DP07= 0
##$DPNAME0= <>
##$DPNAME1= <>
##$DPNAME2= <>
##$DPNAME3= <>
##$DPNAME4= <>
##$DPNAME5= <>
##$DPNAME6= <>
##$DPNAME7= <>
##$DPOAL= (0..7)
0.5 0.5 0.5 0.5 0.5 0.5 0.5 0.5 
##$DPOFFS= (0..7)
0 0 0 0 0 0 0 0 
##$DQDMODE= 0
##$DR= 18
##$DS= 0
##$DSLIST= <SSSSSSSSSSSSSSS>
$$ [...]
##$SUBNAM2= <"">
##$SUBNAM3= <"">
##$SUBNAM4= <"">
##$SUBNAM5= <"">
##$SUBNAM6= <"">
##$SUBNAM7= <"">
##$SUBNAM8= <"">
##$SUBNAM9= <"">
##$SW= 16.880792210976
##$SWIBOX= (0..15)
0 0 2 0 0 0 0 0 0 0 0 0 0 0 0 0 
##$SW_h= 3378.37837837838
##$TD= 16384
##$TD0= 1
##$TE= 0
##$TE2= 300
##$TE3= 300
##$TEG= 300
##$TL= (0..7)
0 120 120 120 120 120 120 120 
##$TP= (0..7)
150 150 150 150 150 150 150 150 
##$TP07= 0
##$TPNAME0= <>
##$TPNAME1= <>
##$TPNAME2= <>
##$TPNAME3= <>
##$TPNAME4= <>
##$TPNAME5= <>
##$TPNAME6= <>
##$TPNAME7= <>
##$TPOAL= (0..7)
0.5 0.5 0.5 0.5 0.5 0.5 0.5 0.5 
##$TPOFFS= (0..7)
0 0 0 0 0 0 0 0 
##$TUNHIN= 0
##$TUNHOUT= 0
##$TUNXOUT= 0
##$USERA1= <user>
##$USERA2= <user>
##$USERA3= <user>
##$USERA4= <user>
##$USERA5= <user>
##$V9= 5
##$VALIST= <valist>
##$VCLIST= <CCCCCCCCCCCCCCC>
##$VD= 0
##$VDLIST= <DDDDDDDDDDDDDDD>
##$VPLIST= <PPPPPPPPPPPPPPP>
##$VTLIST= <TTTTTTTTTTTTTTT>
##$WBST= 1024
##$WBSW= 4
##$XGAIN= (0..3)
0 0 0 0 
##$XL= 0
##$YL= 0
##$YMAX_a= 178465
##$YMIN_a= -170947
##$ZGOPTNS= <>
##$ZL1= 120
##$ZL2= 120
##$ZL3= 120
##$ZL4= 120
##$ABSF1= 10
##$ABSF2= 0
##$ABSG= 5
##$ABSL= 3
##$ALPHA= 0
##$AQORDER= 0
##$ASSFAC= 0
##$ASSFACI= 0
##$ASSFACX= 0
##$ASSWID= 0
##$AUNMP= <proc_1d>
##$AZFE= 0.1
##$AZFW= 0.1
##$BCFW= 1
##$BC_mod= 2
##$BYTORDP= 1
##$COROFFS= 0
##$CY= 11.3945322036743
##$DATMOD= 1
##$DC= 2
##$DFILT= <>
##$DTYPP= 0
##$F1P= 16.9975609425685
##$F2P= -3.02152046262296
##$FCOR= 0.5
##$FTSIZE= 0
##$FT_mod= 4
##$GAMMA= 1
##$GB= 0.15
##$INTBC= 1
##$INTSCL= 1
##$ISEN= 128
##$LB= 0.24
##$LEV0= 0
##$LPBIN= 0
##$MAXI= 10000
##$MC2= 0
##$MEAN= 0
##$ME_mod= 0
##$MI= 1.114404
##$NCOEF= 0
##$NC_proc= 0
##$NLEV= 6
##$NOISF1= 3.799351
##$NOISF2= 2.8
##$NSP= 1
##$NTH_PI= 0
##$NZP= 0
##$OFFSET= 15.70392
##$PC= 1
##$PHC0= -9974.979
##$PHC1= 20.8009
##$PH_mod= 1
##$PKNL= yes
##$PPARMOD= 0
##$PSCAL= 0
##$PSIGN= 0
##$REVERSE= no
##$SF= 200.130013532006
##$SI= 16384
##$SIGF1= 3
##$SIGF2= 2
##$SINO= 400
##$SIOLD= 16384
##$SREGLST= <1H.CDCl3>
##$SSB= 0
##$STSI= 0
##$STSR= 0
##$SW_p= 3612.71676300578
##$SYMM= 0
##$S_DEV= 0
##$TDeff= 0
##$TDoff= 0
##$TI= <>
##$TILT= no
##$TM1= 0
##$TM2= 0
##$TOPLEV= 0
##$USERP1= <user>
##$USERP2= <user>
##$USERP3= <user>
##$USERP4= <user>
##$USERP5= <user>
##$WDW= 1
##$XDIM= 8192
##$YMAX_p= 0
##$YMIN_p= 0
$$ End of Bruker specific parameters
$$ ---------------------------------
##NTUPLES= NMR FID
##VAR_NAME=  TIME,          FID/REAL,        FID/IMAG
##SYMBOL=    X,             R,               I
##VAR_TYPE=  INDEPENDENT,   DEPENDENT,       DEPENDENT
##VAR_FORM=  AFFN,          ASDF,            ASDF
##VAR_DIM=   8192,          8192,            8192
##UNITS=     SECONDS,       ARBITRARY UNITS, ARBITRARY UNITS
##FACTOR=    0.000296,      1,               1
##FIRST=     0,             0,               0
##LAST=      2.424536,      0,               0
##MIN=       0,             -170947,         0
##MAX=       2.424536,      178465,          0
$$ Real data points
##PAGE= N=1
##DATA TABLE= (X++(R..R)), XYDATA
0@%%%%%%%%%%%%%%Qj6J6j6J8k6L2m0M8n6O8p7R0j06J25j47J68j92K20k50K83l21
36a71L65m11M61n17N78o43P15p95Q79r72J077j191J315j450J595j755J935k132
54a117K350k594K865l171L520l921M388m937N594o401P418q745J0557j3184J7403
69A0025l8229K06669j94671j13868K44491j27206p0133J69844p3301m6638J04967
80G1950j05799O0786J5731p0509O6411K2191j18065Q1451O2970j26560M7915R964
92A8436k6106L5469r265l6375J2271J3496k4219L5296k6487J5486k7552o542M6605
105B0513l4134O836K8625m2145l5971J05547l5908n8734N6844o684q253l329J4895
118H102j1374L583j1796K9149j2685k8492M9194m2241J048K9063J220j9882r078
$$ plain form
0 0 0 0 0 0 0 0 0 0 0 0 0 0 0 0 8 -8 8 -8 10 -16 16 -24 24 -32 36 -41 49 -57 68 -79 89 -103 117 -133 150 -171
36 -171 194 -217 244 -273 305 -338 377 -418 461 -511 566 -625 690 -760 835 -920 1015 -1117
54 -1117 1233 -1361 1504 -1667 1853 -2068 2320 -2617 2977 -3424 3994 -4751 5806 -7378 10025
69 10025 -28204 178465 -16206 -130074 114417 -12789 -82922 86922 13621 -33017 71950
80 71950 -33849 26937 42668 -27841 38570 60761 -57304 24147 87117 -39443 8472 18436
92 18436 -7670 27799 18534 -17841 -5570 7926 -16293 19003 -7484 8002 -19550 -26092 20513
105 20513 -13621 -6785 21840 -20305 -56276 49271 13363 -45371 11473 4789 -3464 -6793 8102
118 8102 -3272 311 -11485 17664 4979 -23513 25681 -16560 -15512 13551 14771 -5111 -14189
131a4189j3152L9522J9094p6851N9030o216m7552N1727L504m5683M3492O04n9089
144d5759P7199l4849j6286N5486o0918J139Q5528o4928n2129J12727o2986j6339
156b2115P5724o1637j7073N5609k5832j9598N3736n1049J4788Q851l9181N5143
168B7366k517n1523K1291L0583n4577M4873L060n4613M0930J1932k7703p317L8300
181B0085k8722o675J8879N082j3357j0923K6727l1826K0417K0458k0693k5380
193b5928J9299K1304j7759L095q779K2413l1825Q882L3935l5276j121L0883k3515
206d392k8042P0881l4367l2723L9952o017j820J617p192o627K1519k0683K7205
219A9311j3651l4119N6378k7470k6586N3659l409o7568N7037J947m2814N6107
$$ plain form
131 -14189 -27341 12181 31275 -45576 13454 7238 -40314 11413 14917 -30766 12726 13330 -45759
144 -45759 31440 -3409 -19695 35791 -25127 -23988 61540 -3388 -55517 57210 -5776 -22115
156 -22115 53609 -8028 -25101 30508 4676 -14922 38814 -12235 2553 11404 -27777 27366
168 27366 24849 -26674 -5383 25200 -29377 15496 18556 -36057 4873 16805 -10898 -18215 20085
181 20085 -8637 -15312 3567 8649 -4708 -15631 11096 -20730 -313 20145 -548 -25928
193 -25928 -6629 14675 -3084 11 -8768 13645 -18180 -9298 24637 -10639 -11760 19123 -4392
206 -4392 -32434 38447 4080 -28643 11309 5292 3472 5089 -2103 -8730 12789 -7894 19311
219 19311 5660 -28459 27919 449 -26137 27522 24113 -43455 13582 15529 -27285 28822
231B8822k7056k6471L0917L456k1974K6544k7393J747M0467n6276K4285K7582
243B4650m3497J015M4391l7789J573L5889n4196K1527K5296j7238o872R436j5972
256a1787J1506J9236l1349J8447l935m817j414Q501K842p894K393j0667J6101
269G163n262P262j7475J505J5894p654N215j4510N305K236P772j2695J1788n035
283A509j6567K6426j8810P371J4565j7762k0551L6281l167k3099K7245k3665L664
296f560J1597k584o051M014p679Q938P012l1057M0782j4129l2554L5742J1830
309A9301l7030J6785J5192m3938M0864N753k8195N442Q116l351K204J846o925
322c936J8973l1858J3904K3287k8743P826J6092k4100n433M7130l4952j4179K7238
$$ plain form
231 28822 1766 -24705 6212 9668 -12306 14238 -13155 -11408 29059 -27217 -2932 24650
243 24650 -18847 -17832 26559 -11230 -9657 26232 -27964 -6437 18859 1621 -5251 4185 -11787
256 -11787 -281 18955 -12394 6053 2118 -2699 -4113 4388 7230 -664 1729 -8938 7163
269 7163 1901 9163 -8312 -6807 9087 1433 6648 -7862 -2557 -321 7451 -5244 6544 1509
283 1509 -15058 11368 -7442 -71 14494 -3268 -23819 12462 9295 -13804 13441 -10224 -6560
296 -6560 5037 2453 -3598 416 -7263 1675 8687 -22370 18412 4283 -28271 7471 19301
309 19301 -17729 -944 14248 -29690 11174 16927 -11268 -5826 2290 -1061 1143 2989 -3936
322 -3936 15037 -16821 -2917 20370 -8373 -547 15545 -8555 -13988 33142 -1810 -15989 11249
335A1249l819q460L718Q423j9482J0482R89N888j0179p26J0545j9894Q461J1352
349H547K089k7458J2468R679j2359P708J096p309j2019K9739j5026j1350J8834
362D639m497j3271Q237J6518k2008J0908o676J992J0521o380K348n820k338N775
376e2K0231l1275P291J9202k5272R345J3525j1298q992J9430k2291J0504J4340
389A4688k1672O828r45j386N579P482k4508J3874P769j4141J3288q189q98J789
403d42M076p585J4117p085j1002J5475j1373J0504L255q454j1361J8636j414j1370
417d023J2744j0712J463j240Q170q976J053K958o906K622k008J2559j7537j407
431a1240P906N637p986k332R839j7359J2276Q105p004j2303J8473j952j8205K4184
$$ plain form
335 11249 7430 -1030 2688 11111 -8371 2111 3100 8988 -1191 -1917 8628 -11266 -2805 8547
349 8547 10636 -16822 -4354 5325 -7034 674 1770 -5539 -17558 12181 -2845 -14195 4639
362 4639 142 -13129 -4892 11626 -10382 526 -6150 -4158 6363 -17 2331 -3489 -5827 -52
376 -52 20179 -11096 -3805 15397 -9875 -530 12995 1697 -7295 12135 -10156 348 14688
389 14688 -6984 -156 -1101 -2487 3092 10574 -13934 -60 7709 -6432 6856 -1333 -2231 -442
403 -442 3634 -3951 10166 3081 -7921 7554 -3819 6685 9940 1486 -9875 8761 7347 -4023
417 -4023 8721 -1991 -528 -1768 6402 -2574 -1521 1437 -5469 -2847 -4855 7704 -9833 -11240
431 -11240 -3334 2303 -5683 -8015 1824 -15535 -3259 4846 -2158 -14461 4012 2060 -16145 8039
445H039r99j1182k597J5316r458L094Q203j1777J679o23J6224j2368p595Q371
459D327P165j4330K586J9484k8165N433J3437q000q043J6226q368j7233K1047
472E566j498k284r262O746K80l445M605J540l257j0337K0086j0467m542J2645
486F376m360j2385R130J4706k0599P602M09l313J198P136k804j2118J0263q46
500C95K988q696Q315j382r756O775M081Q36j1499J0207p491K389P465l423n865
515d661j512J2194r369O113m565j90K475j57J028j538N719j2049Q648n33J994
530C597m17m428L12r79R511p545L757p555M382L461m874M251k886J79o086J2360
546G040p851J14M631q480J795O373L623j5931Q440N51j014R36O86K22r249J0411
$$ plain form
445 8039 7040 -4142 -6739 8577 -881 2213 10416 -1361 318 -305 15919 3551 -4044 4327
459 4327 11492 -2838 -252 19232 -8933 -3500 9937 1937 -6106 10120 1752 -15481 5566
472 5566 4068 1784 -7478 -732 -452 -3897 708 2248 -1009 -11346 8740 -1727 -6269 6376
486 6376 2016 -10369 -1239 13467 -7132 470 879 -2434 -1236 5900 3096 -9022 1241 395
500 395 3383 -5313 3002 1620 -8136 -1361 2720 3556 -7943 2264 -5227 -2838 4627 1204 -4661
515 -4661 -6173 6021 -3348 2765 -1800 -1990 485 328 1356 -182 5537 -6512 2136 1603 3597
530 3597 3180 -1248 -936 -1915 7596 51 3808 -3747 635 4096 -778 3473 587 766 -5320 7040
546 7040 -811 -697 3934 -4546 -2751 3622 7245 -8686 -246 305 -709 227 913 1135 -8114 2297
562B297j404j83n345Q255m854q811J5956j988o774m719J2958q806J834P887r908
577c605j548M879Q525j4603O609L204n259j631O665M527j5017Q479N06j779k212
592b260J0593o930j2361J6211J06o088l951J1744j0463k132J1816m462m986j153
606d316R814j0895N179M513m757o000M597R577j1981M397n29k15k950Q015q24
621C625r665R124l392L41p97Q446r258k814Q094k198J247l071M352r365O934L594
637E197m468k890L43O785q967N911j038o35m685M117L437o024N263n849K339k275
653c439O945k831l923J525j722P065n180K582l918L474k574J310M947o571J896
668d14k480O379n516M257j102m862K582J929M773j0895O234q38m88j014L973k09
$$ plain form
562 2297 893 710 -4635 3620 -1234 -10045 5911 3923 -2851 -7570 5388 -3418 -1584 6303 -3605
577 -3605 -5153 -274 8251 -6352 257 3461 -1798 -3429 3236 7763 -7254 1225 1731 -48 -2260
592 -2260 8333 1403 -10958 5253 5359 -729 -4680 7064 -3399 -5531 6285 1823 -3163 -4316
606 -4316 5498 -5397 -218 4295 -462 -6462 -1865 7712 -4269 128 -401 -616 -3566 4449 3625
621 3625 -6040 3084 -308 33 -764 7682 -1576 -4390 3704 1506 2753 -318 4034 -5331 1603 5197
637 5197 729 -2161 -1818 4967 -4000 1911 873 238 -4447 -330 3107 -2917 2346 -3503 -1164 -3439
653 -3439 3506 675 -3248 -1723 -3445 3620 -1560 1022 -2896 578 -1996 -686 4261 -2310 -414
668 -414 -2894 3485 -2031 2226 1124 -3738 -1156 773 5546 -5349 885 47 -441 -1455 2518 2309
684B309r182R138k372Q95j803M513o469j353R892m559o09l051N981n456L905K654
700D433n614N64P29M878q447P794j443n288N33O733n99r480R967n816j745L682
716H81O122j0498l079J1762o151j231J281N291j1191K870Q126m877k750O25O192
731C373j0995P473M044n859m595O671M167j0085Q161k336j957j120O482j839l950
746b365M957n180L636j011N056o407p46L876j244J407j938L643r408P716J880
761C872n073J84K808q30o567J0832m243j818j744L540K59k201M425m800J477l324
777c203Q173l140l918K795o67J564k768N977o162J750j014J508K132l567J287
792G47l259M784m751M910j961l902K076J477J631o339O289m965J054Q03K121j119
$$ plain form
684 2309 -6873 2265 -107 788 -1015 3498 -2971 -4324 5568 1009 400 -2651 3330 -2126 1779 4433
700 4433 -1181 -617 112 4990 -3457 4337 2894 -2394 -1861 4872 4273 -5207 4760 -1056 -2801 881
716 881 7003 -3495 -6574 5188 -963 -2194 -913 4378 -6813 -3943 4183 -694 -3444 -2819 3373
731 3373 -7622 -149 3895 -1964 -6559 112 4279 -5806 2355 19 -1938 -3058 3424 1585 -2365
746 -2365 2592 -2588 1048 37 5093 -1314 -2060 1816 572 1979 41 3684 -5724 1992 3872
761 3872 -1201 -1017 1791 961 -5606 5226 983 -835 -2579 961 1220 -981 3444 -1356 121 -3203
777 -3203 4970 1830 -2088 707 40 1604 -1164 4813 -1349 401 -613 895 3027 -540 747
792 747 -2512 2272 -2479 2431 470 -3432 -1356 121 1752 -4587 1702 -3263 -2209 -1406 715 -404
808d04m383M608k788M070l190L580m370q98O803l250K3j003M172p469P391R13
824C805n930L149L46K97l110P901o436j069J173K353N29n177N630m157m05J398
840B97N839q901q35Q680p725J318L606J160j0267P473K164m653K161p40J532o201
856e092P786m71l000k286M590On493Q495m403k092n5O236m719j225N255o316J552
873a232J533M031p897L118J821l635L284n98P77n709O027j671j56k98O11J31n293
890e156Q195j835k218k416N655l777m99O690p188J162M32L677l687K024j108o87
906g36K435l683O625n157k17R19K213k111R43J586o104O189l224K258p27j314
922a05j239K663Q11m488O286o343J334J681P66j641p40J278l236N458l752K284
$$ plain form
808 -404 -4787 -179 -2967 1103 -2087 1493 -2877 -3775 3028 -222 -199 -1202 2970 -4499 2892 3805
824 3805 -2125 1024 1370 1667 -1443 6458 22 -1047 126 2479 3008 -2169 3461 -696 -1101 297
840 297 6136 -2765 -3600 5080 -2645 -1327 2279 3439 -6828 645 2809 -1844 317 -423 1109 -5092
856 -5092 2694 2223 -777 -3063 1527 1533 -3960 4535 132 -1960 -2015 4221 -498 -1723 3532 -2784 -1232
873 -1232 301 4332 -3565 -447 1374 -2261 1023 425 1202 -4507 1520 -151 -307 -605 6 137 -5156
890 -5156 3039 1204 -1014 -3430 2225 -1552 -2051 4639 -2549 -1387 -955 2722 -965 1059 -49 -736
906 -736 1699 -1984 4641 -516 -733 186 2399 288 1231 2817 -3287 2902 -322 1936 1209 -105
922 -105 -1344 1319 2130 -2358 3928 -2415 -1081 600 1366 -275 -1015 263 -2973 2485 -1267 1017
938A017l011L96K131j518J853k278K189n012N918j226j699J167n83K81k057P051
954D619n885m68J059K431k479J41M544p532K917J572J329m000J879J268l480K705
970F20r3K420p516M666J959l841J648K104k466m535R601n106r88K038j75j973
986a637J140M399n406J789k103M798l091o99M368m949J23K986K747q706O528l42
1002A945m682M488L12j465k892M751l747K327n18o1l59l413N757k827P1j677L374
1019A384l802J587L909n910J659N4K334l947M036j212k496J793L75K125m569L975
1035A295k667Q74M59P62J80l118L062j543L061l755K444r06j725L261j293Q57
1051A248k915K575k473L701j754j827L278m094K880N61M79m005L747j398j574
$$ plain form
938 1017 -1994 -1598 533 -985 868 -1410 779 -4233 1685 459 -1240 -73 -656 -375 -2432 4619
954 4619 -1266 -1734 -675 1756 -723 -582 3962 -3570 -653 919 2248 -1752 127 1395 -2085 620
970 620 527 2947 -4569 97 2056 -1785 -137 1967 -499 -5034 4567 -539 -1527 511 336 -1637
986 -1637 -497 3902 -1504 285 -1818 2980 -111 -810 3558 -1391 -1268 1718 4465 -4241 2287 1945
1002 1945 -2737 1751 2063 598 -2294 2457 -1290 1037 519 458 99 -3314 2443 -384 -313 -1990 1384
1019 1384 -2418 -831 3078 -2832 -1173 -1119 1215 -2732 1304 92 -2404 -611 -236 1889 -2680 1295
1035 1295 -1372 -498 -39 723 903 -2215 847 -696 2365 -1390 1054 148 -1577 1684 391 1248
1051 1248 -1667 908 -1565 2136 382 -1445 1833 -2261 619 1180 1659 -2346 1401 3 -1571
1066a571M324l475J440k083K544j322K055j988n82J667k902N425l957k99J060
1081C36R43l028L128J389o747M949n61l8j450K549k085j901L141q55J790n267
1097c707M549j120j406K377J64k254k132O618m698R73N99K6k136J368L770n096
1113b105K035l50J378k982L472M09m623L267k77J171l030L573k321q00J463J197
1129A477j68m296N637l259K03J474Q69m224J416M157n114L572j690k26j067J952
1145G13N73j871R10j378L418m346L710j82l542J287J989m22k433M836n516J943
1161c11J278l01m56j351J855j953K962l293K965k357n64K520j367P94j913K184
1177F92l026L358j070p09Q85k198K401j199K007l010K139j413N80J653j552P67
$$ plain form
1066 -1571 2753 -722 718 -1365 1179 -143 1912 -76 -658 1009 -1893 3532 -425 -724 336
1081 336 1279 -1749 1379 2768 -3979 970 409 371 -1079 1470 -615 -2516 625 -230 1560 -3707
1097 -3707 842 -278 -1684 693 857 -1397 -3529 3089 -1609 -636 -37 -11 -2147 -779 2991 -2105
1113 -2105 -70 -420 958 -2024 1448 1857 -2766 501 224 1395 -1635 1938 -383 -1183 280 1477
1129 1477 1309 -2987 2650 -609 -406 1068 1937 -2287 -871 3286 -1828 1744 54 -172 -1239 713
1145 713 1286 -585 325 -1053 2365 -1981 1729 1547 -1995 -708 1281 859 -1574 3262 -2254 -311
1161 -311 967 666 210 -1141 714 -1239 1723 -1570 1395 -962 -1526 994 -373 421 -1492 692
1177 692 -2334 1024 -46 -755 130 -2068 333 -866 1141 -1869 270 -1143 -563 1090 -462 305
1193C05k481L751k344J705m72j007N20j0K445l428L050k572P09O4Q84N26k876
1210a231K277j426J937k719L425k461k108M013q49r06j040L152m500K560J400
1225A524k208n1n69K843k504J585j097J455k991J452L115m493K256k20j63j750
1241a816M293k533j818L148j902R47p46K390l410M67J212N07m64j783L317l872
1257b063J652J403n70k579J499K219l970L230j143K30k233L142j4k116J596j029
1273g46R23j752L722j980o20K86N33P59j625K512l051J596k59J256j480j14J771
1290A731l220K913p53M33k084J610m59m77J892k461J443j818J816m21j93p17J09
1307f56R50k090L484k374M70q55J238J8l82Q00k475K755k391K197n55p88M8L18
$$ plain form
1193 305 -2176 1575 -769 936 464 -543 -23 -33 2412 -1016 2034 -538 171 235 1119 1645 -1231
1210 -1231 1046 -380 1557 -1162 2263 -198 -2306 1707 858 -48 -1088 2064 -2436 124 1524
1225 1524 -684 -735 -1304 1539 -965 620 -477 978 -2013 -561 2554 -1939 317 97 -66 -1816
1241 -1816 2477 -56 -1874 1274 -628 319 -427 1963 -1447 -980 232 739 275 -1508 1809 -2063
1257 -2063 -411 992 422 -2157 -658 1561 -2409 821 -322 -92 -2325 817 803 -1313 283 -746
1273 -746 177 -1575 2147 167 -453 -167 366 1125 -500 2012 -1039 557 298 1554 74 -40 1731
1290 1731 -1489 1424 671 1104 -980 630 171 -306 1586 -875 568 -1250 566 145 -48 -765 -656
1307 -656 294 -1796 1688 -686 -216 -1071 167 185 -197 603 -1872 883 -1508 689 134 -654 -606 -288
1325b88J211k262K881k700R87j71J207k21j610J479j540J738j531K461k506k50
1341a115J813r03O11j101J595k854K478M84q65n30R7J037k141K518q44l42q88
1358i50J656o9j244J990j849Q30q51K663k233m31J318j103N33o26K926m041J196
1375b85J148n83n75N28R71l436L095m98J16j631J365N78k343K432q54M2k255L201
1393A016j034j100J816j568J73o55K994k547L66L0r5L99l07J711k713J528m14
1410d00R73q83J38O23j939K300o64N09j715J850r43j96J672j308K71j328K484
1427A444j623M87J73n38n2q57K747k101O61q62J126l99k52R95j832J062j152K311
1445A338j491L75k21l65Q31r45J911k481J099p27J575l73p22R01j651J440r89
$$ plain form
1325 -288 923 -1339 1542 -1158 -171 -342 865 644 -966 513 -1027 711 -820 1641 -865 -1115
1341 -1115 698 -205 406 -695 900 -1954 524 1008 143 -387 -290 747 -1394 1124 280 -62 -950
1358 -950 706 637 -607 1383 -466 364 -487 2176 -57 -488 830 -273 260 -366 2560 -1481 -285
1375 -285 863 280 -295 233 1204 -2232 863 365 481 -1150 215 793 -1550 882 28 70 -2185 1016
1393 1016 -18 -1118 698 -870 -697 -1352 1642 -905 -539 -509 -604 -205 -512 1199 -1514 14 -400
1410 -400 573 -310 -172 451 -1488 812 148 657 -1058 792 -151 -347 1325 17 288 -1040 1444
1427 1444 -179 308 481 -57 -109 -966 1781 -320 341 -521 605 206 -46 949 -883 179 -973 1338
1445 1338 -153 222 1 -364 467 -478 1433 -1048 51 -676 899 526 -196 705 -946 494 -495
1462d95J498j687L87L97n62Q23r50J211k252K168j010N08j47l79M14j444K793
1479A273j845M48r92J580q45j17J880k309O48J76J400k062Q87K96j030O89P8J562
1497A717l142J669N04n32k56O36L55k655L063r87K53j138J050m64r09K528j558
1514A34J48j272J979j409P58P15j558J8J54K020k467J195r3n99j78N58J095k502
1532a304J948q45N30q61J076m46j552K195q28O70j565J461j079K26J309j073j4
1549a52j299K300j567R60l37k91k76L9J468j876J412j309Q53k82M48K64j148J071
1567B78j181J811j532J116l41o07R27n11J134j769J217p22R84m21k60J79p70J290
1585H22j029J346j854J094l80j06O61p54J071j647J251p35N74k87k05j43m75J710
$$ plain form
1462 -495 1003 -684 -297 100 -462 361 -589 622 -1630 538 -472 36 -111 -490 -76 -1520 1273
1479 1273 -572 -124 -1116 464 -381 -498 1382 -927 -279 -103 1297 -765 122 418 -612 77 155 1717
1497 1717 -1425 244 748 216 -40 596 951 -1704 1359 372 625 -513 537 73 -836 1692 134
1514 134 282 -990 989 -420 338 1053 -505 -487 -333 1687 -780 415 322 -277 -455 103 1198 -1304
1532 -1304 644 -201 329 -532 544 98 -1454 741 -87 583 -982 479 -600 -374 935 -138 -152
1549 -152 -1451 849 -718 242 -95 -386 -662 -623 845 -1031 381 -928 -75 -357 91 355 -793 278
1567 278 -903 908 -624 492 151 -456 471 -40 1094 -675 542 -180 804 383 123 302 -468 822
1585 822 -207 1139 -715 379 -1 -107 554 -200 871 -776 475 -260 314 27 -178 -321 -796 914
1603I14j166M42o77O01m74J13J262k037R97m15J458j851J107P1j090P52R9P33
1621H39k450K213q12j01K16N51l66j298J947j200P37o65M97n67k80J405j067L82
1639a9p52J492j436R01L43j216N72P8P99j819J897o02j88M7N05N52j625J403j279
1658c47Q35m27J193j128o75J482q92M61j058J431j086K95M15o16L65r83J116j177
1676g96J345m13l81k46L7J212j449J264j173O97q06J167k55j087J044q14Q80q93
1694f67J484j338K23K67l16Q56j347J353j186P41m07N60k66p16J308j128O82n84
1712d81J061j091K51P12n06L08j160J242p59J168r06R3qj00J334j816J584j262
1730c36O46o82J177l52o92R47j023J013j106J479j157l18N70j29O32j297J588
$$ plain form
1603 914 -252 190 -487 114 -360 -247 1015 -1022 -25 -440 1018 -833 274 345 -745 7 106 839
1621 839 -1611 602 -210 -311 -95 456 90 -1208 739 -461 276 -389 108 -459 -739 666 -401 -19
1639 -19 -771 721 -715 186 529 -687 -115 -37 762 -1057 840 238 50 97 602 1154 -471 932 -347
1658 -347 488 61 1254 126 -549 933 41 502 -556 875 -211 84 499 -117 248 -735 381 -796
1676 -796 549 136 -245 -491 -454 758 -691 573 -600 97 -709 458 203 -884 160 -654 226 -667
1694 -667 817 -521 -298 -31 -347 509 -838 515 -671 70 -337 223 -43 -759 549 -579 103 -481
1712 -481 580 -511 -260 452 -54 254 -906 336 -423 745 -161 -68 -76 -176 1158 -658 926 -336
1730 -336 310 -372 805 453 -239 708 -315 698 -408 1071 -86 -404 166 37 669 -628 960
1747I60j624P38%K66n52n66J668j627R49k40M67j274P55Q92j420P46p77J019j249
1766h69J298j25q67L41q4P43j318J443j104P3j5O90n3p67J359j414P86k17N50
1785D50r60L18Q02j048J153r21Q74j412P99L31k30J0k76O72j295J575o81M9l06
1804i6M52L39j162J214j247P27m32P12m05l62Q83p59M47q90J444j221L59j50R6
1823e1N48p51O67j229J310l82M00o50J06L23o39J045q65Q13j590P40L08n72P82
1842C13j221R92j057J443q93K96m3j79L84p83J103q50M85o54Q98j14l88O70j070
1861f68Q74n41J252j360K51M60l15M64m31O98j547J219k17M35m20k77P72j316
1879f67J379n47N04j353R04L96q94Q09j051P75j017J222o05M2L74m85M42p46J347
$$ plain form
1747 960 -664 74 74 340 -212 -778 890 -737 212 -28 439 -835 -80 812 -608 138 -639 380 -869
1766 -869 429 304 -563 -222 -306 437 -881 562 -542 -469 -484 206 153 -614 745 -669 117 -100 450
1785 450 -510 -192 610 -438 715 -206 668 -744 55 386 156 166 -110 562 -733 842 161 210 -96
1804 -96 356 695 -467 747 -500 227 -205 507 102 -260 623 -136 311 -579 865 -356 3 -147 -51
1823 -51 497 -254 413 -816 494 112 512 -138 -32 291 -348 697 -168 645 -945 -205 103 -469 313
1842 313 -908 84 -973 470 -423 -127 -170 -349 35 -748 355 -495 -10 -664 234 120 -268 402 -668
1861 -668 206 -335 917 -443 -192 268 -47 417 -14 684 -863 356 139 574 154 -123 649 -667
1879 -667 712 165 669 -684 220 616 -278 531 -520 255 -762 460 -145 -103 271 -214 228 -518 829
1898H29j372Q35n48M10q9j64P79j488J025l80P02r98O15j3q28J054n63N47j082
1917g29R75m89O1J35j81L76j151J682j059K57j65M50m50j20J129j231L71m64J004
1936D01n60K67K37o43N69p61J312j060M68k4J01n2m26P21j195J282o97M58p18
1955c20M80n2k97Q94q82P04r61R09m50K7L53m93N66r91J231j026L98k31K05l80
1975c16k57J333j192M68l13O66o62K99O4q23Q55m90J290j448N80l85K32K35l10
1994a74N47j172J328q97N04k89o6L05p64J235j018P41q19P35l20q4P23p76M25
2013A64r55J291p62O10j35m62K75l77J143j410R27j95K08k92J41L54q32R11o95
2032i1P14j021O83l25j13P69m46M8p98J101p03K54K64m49K6m19J194j043N73q17
$$ plain form
1898 829 -543 292 -256 154 65 -99 680 -808 217 -163 539 -459 156 143 -685 369 -194 353 -729
1917 -729 246 -243 -182 -47 -228 148 -1003 679 -380 -123 -288 162 -288 -408 721 -510 -139 -603 401
1936 401 -159 108 345 -298 271 -490 822 -238 230 206 307 255 -171 550 -645 637 -60 398 -320
1955 -320 160 108 -189 705 -177 527 -434 475 25 52 405 -88 478 -513 718 -308 90 -141 64 -316
1975 -316 -573 760 -432 36 -277 389 -273 26 90 -733 122 -368 922 -526 54 -331 -99 136 -174
1994 -174 373 -799 529 -368 136 -153 -219 86 -678 557 -461 280 -539 196 -124 -208 515 -261 164
2013 164 -791 500 -262 348 213 -249 26 -351 792 -618 309 114 322 30 171 525 -307 604 -91
2032 -91 623 -398 285 -40 -153 616 170 218 -580 521 -182 72 336 -113 -87 -506 688 -355 218 -599
2052e99O78j78J19O52j132O39p80J028r62P33k56n00P05l00P82j447J315j024
2070e27L67l2o0O65j145J087r13O64l26L94m44k68J122j243O70j61O13q91O74
2089B46J20p10N35l80R40j126Q94n20J29r1m8P32r78P03n85O33p16L35l6k78M25
2110B24l35P82j130Q98m56K25J11o7K56j060R01r00R29o12N22j86n31R68r63O81
2130B57o76Q20o32L66J04o17O99r41J024j068J031o54M4O8P0O55r87P03p37M43
2150b8m42L92J89o34Q75q20P49n25Q17o16k98O41j85K87p14P63p66P64j07k11
2170A31j76q7P74j080Q88o38M98p37M95L89p84O73o26O74n55N71l84k28L87k53
2190f8M93q56N83n13L31J50N3j57n00R82r33O68l35L20n78P1N43o97Q77r71Q77
$$ plain form
2052 -599 79 -99 20 672 -460 179 -601 427 -535 198 -58 -558 147 -153 629 -818 497 -527
2070 -527 -160 -192 -252 413 -732 355 -558 106 -220 174 -270 -538 584 -659 11 -150 463 -428 246
2089 246 366 -344 191 -189 751 -375 519 -1 128 37 -11 721 -257 446 -139 494 -222 113 77 -201 224
2110 224 -111 671 -459 439 -17 208 319 252 508 -552 349 -551 378 -234 288 102 -429 539 -424 257
2130 257 -419 401 -231 135 239 -378 321 -620 404 -664 367 -287 -243 -175 -105 550 -437 266 -471 -28
2150 -28 -470 -78 111 -523 352 -468 281 -244 573 -43 -341 300 115 402 -312 451 -315 449 342 131
2170 131 -45 -132 642 -438 450 -188 310 -427 68 457 -327 346 -280 394 -161 410 26 -202 185 -68
2190 -68 425 -431 152 -361 -30 120 173 16 -484 498 -435 233 -102 218 -360 -289 254 -443 434 -537 340
2211C40r30P03j11p3R9m54O04p25J071q34K94k49K32J33j97L01o88O39n76P25
2231C04j50n87O53n31R48q48P12p41J74J70QJ33l94M45m97M54n78M49k83r2M92
2252B41l83N67o42O63p79O79q3l91M67n82O32o59P64p69P3K17R6J02p17J132j011
2273c83N83m86N33j41l72O05p39R31q12O35p35M30p8M8J76m69N13p65P24o13K39
2294a76j33J10L14p88R61n99O10n18L46J56o75P45p28P54p73J004q82K52J66j86
2314d0L88n74P33q90O13o8n5o4jM36j108J020k77K80n40K60M1n06O58p40Q57p79
2336c56Q26l16N3k44q0L70o14J063j028O27m62L34j2n60P75q06O87n89P68p92
2356c56L33P3j64K88k57O02j110Q28k23l61J85k02O57o50P52m59L52m36L01q7
$$ plain form
2211 340 -590 113 2 -71 28 -426 178 -547 524 -310 -16 -265 -33 100 -97 204 -484 155 -421 304
2231 304 154 -433 220 -311 637 -211 501 -240 -66 104 112 245 -149 296 -201 253 -325 124 -159 -251 241
2252 241 -142 425 -217 446 -333 346 263 -128 339 -243 389 -270 494 -275 -202 15 111 213 -504 628 -383
2273 -383 200 -286 247 106 -266 339 -400 531 -281 354 -381 49 -29 19 195 -274 239 -526 198 -415 -176
2294 -176 -309 -199 115 -673 288 -311 299 -219 127 283 -392 353 -375 379 -394 610 -272 -20 146 -40
2314 -40 348 -226 507 -383 230 162 107 43 42 478 -630 390 113 393 -147 113 154 -352 306 -434 423 -356
2336 -356 470 154 207 -37 -117 253 -361 702 -326 301 -161 173 161 -399 376 -430 257 -332 436 -356
2356 -356 -23 50 -114 174 -83 519 -591 237 14 -347 -162 -364 293 -357 395 -64 288 -148 153 66
2376F6n59Q86r49P80o47O97m74K44J01k91J62k84P94p52L94j67J78k4k30M07o32
2397c00P06l37M18m25m8J68k83M44l48P00j022M43J04l44J89R1J03p98Q66l80
2417e3K53m93K14P0l09P60n53L98p78N99j67j2J90m32M98l97O41p51M55J44n77
2438c00M27n32P86q69N95k72L66j93j09K05m04M42k80J70m34M88j18p3L83k32
2458D6q4j38K38j49M48k46J0M4m59R29r19L66k87M88k80MM20p67P97m95O14r51
2480c71M98J32o59M87lK60r28P64l27K88kl63K60n06Q03p12L92l20J23L65k62
2501h1N61r30O40o21P18o87L32J94k79K55k52O95o23L17n23j36M56r0J77p39O60
2522D4n75P24m35J35J03m19N94l70M82n96M43l16K21K7k03L29k84K52l32M10k23
$$ plain form
2376 66 -493 393 -556 224 -423 274 -200 44 145 -146 16 -268 526 -226 168 1 179 155 -75 332 -300
2397 -300 406 69 487 62 14 182 -101 343 -5 695 -327 116 220 -124 65 156 259 -539 327 -53
2417 -53 200 -293 -79 -9 -318 442 -111 287 -491 108 -59 -71 119 -313 185 -212 429 -322 133 277 -300
2438 -300 127 -405 381 -488 107 -165 201 8 -101 104 -300 142 -138 32 -402 86 -32 -105 278 46
2458 46 -38 -176 62 -87 361 115 125 169 -290 639 -280 86 -201 287 7 11 431 -336 461 -34 580 -371
2480 -371 127 259 -400 87 84 344 -584 180 -147 141 139 -224 36 -470 333 -379 13 -307 -184 181 -81
2501 -81 480 -450 190 -431 287 -400 -68 126 -153 102 -150 545 -78 239 -284 -420 36 -54 123 -616 44
2522 44 -531 193 -242 -107 -4 -423 171 -199 283 -313 130 -186 35 62 -141 188 -96 156 -176 234 11
2543A1J23m7j08K72n61L55o8J85m58N23n7o24M73m61R12q74P03m27Q1M4n9M34
2565C72p72M93l89L21j26p3Km6N19n03P25p67K28k70L26J83l84K12l75N16l99
2586b07L29m58K78j26Q8J42o82R85n14M33m63L66km60M31n36O75l58L68m90J34
2607f7J51r5J88o17O67l18L72k41K35j04m52P57o99N38l22J02l52L24K33k99K27
2628B28l02N15p03N55n07K05K03l05M91q38P61m24K45j77N8J06m67M09m04L21
2648c0j35K68l88m9N73m86L60n65P32o53L35K40l94P5m8M40q31Q49m13J14k71
2669b77L37J29k40L93m92L53l15M30j72m03L68m52N89n59O25l62J41l69N01r9
2689A26m09P73p36M51k71K37m65Q3K16l36Q24o58N42n99L88N5p9k54j58N73q00
$$ plain form
2543 11 134 87 -21 251 -310 45 -23 162 -296 227 170 -454 19 -442 470 -404 299 -128 -47 -3 -62 372
2565 372 -400 93 -296 25 -101 -174 -172 -218 301 -202 523 -244 -16 -286 40 223 -161 51 -324 192 -207
2586 -207 122 -336 -58 -184 -96 46 -636 349 -165 268 -195 171 169 -291 140 -396 279 -79 289 -201 -67
2607 -67 84 -11 177 -440 227 -91 281 40 275 171 -281 476 -223 315 -7 95 -257 67 300 1 228
2628 228 -74 441 -262 293 -214 -9 194 -111 380 -458 303 -121 124 -53 5 111 -356 53 -351 -30
2648 -30 -165 103 -285 -334 239 -247 113 -452 280 -373 -38 202 -192 -117 -165 275 -556 293 -120 -6 -277
2669 -277 60 189 -51 342 -150 203 -112 318 146 -257 111 -341 248 -311 314 -48 93 -276 225 126
2689 126 -283 490 -246 205 -66 171 -294 -211 5 -331 493 -165 377 -222 166 221 142 -112 -270 303 -497
2710d97Q90m41L23l78J41J64o94Q54m26J59k92M08r3m02L76n27N73p14O75m84
2730c85N80k06k01K05l66N58o47N26m25K80j88n1N91n41M17n91O01l97K15k1j62
2751b08K96n66P38n73O02k25m3j24J26J94n02Q42r06N28l23J39J91k94K62n29
2771c75P67m33K56l00K50J53n62P44o20J03k53L04n6K4L0j97N15o48N20l45K08
2792H5k46L98p9l24M75o69M27m06P15m57q8J21k86M03m17P85p44L25o8K31j73
2813Hm14M32m44M41l86Q22m69m9Q5j44J67k61L25l44J96J06q2O8j35K36m05O92
2835D45o40K74q7j3K64k97M11l31Q6k76L93j67o1k53K82K09m63O16q31N03j41
2856g7J36K55n46M38n59N21j50J93l54J49j40p9N98p10L66k48K54K3k93L08j58
$$ plain form
2710 -497 393 -48 275 -103 38 202 -492 362 -64 95 -197 211 118 -284 92 -435 138 -576 99 -385
2730 -385 195 -11 -212 -7 -373 185 -462 64 -361 -81 -269 -320 271 -270 147 -444 157 -240 -25 -46 -208
2751 -208 88 -478 260 -313 289 64 21 -103 23 217 -285 557 -349 179 -144 -5 186 -108 154 -375
2771 -375 392 -41 215 -85 165 318 -244 500 -120 -17 -270 34 -22 2 32 -165 350 -298 222 -123 85
2792 85 -161 237 158 -166 309 -360 67 -339 376 -81 -169 -48 -334 69 -348 437 -307 18 -50 181 8
2813 8 -406 26 -418 23 -363 459 -10 -59 26 -118 49 -212 113 -231 -35 71 -11 57 -78 158 -247 445
2835 445 -195 79 -8 -21 243 -54 357 26 112 -164 229 62 1 -252 30 239 -224 392 -439 64 -77
2856 -77 59 314 -232 206 -353 168 18 211 -143 6 -134 -213 385 -325 41 -207 47 70 -223 85 -73
2877g3P0k81M19l92J84p6n2L79l07L04n02N93k91J55j7p8J2m34O36l92M23q07
2899e27N28j82J02K22l67O81q05O30k95R2p2K05j64j63N11o61M30j27J83j90N1
2920H2J91n85P15o22N66o17L30o4o8L57m07M14m90L31m44M08k35o2L19m04L47
2941F2l17J8l9R9jr3L93k16K82o06P16o60M86q4k65M63o87O64k58P6l07K47m4
2964g1p8M31p16Q87p23L26j35J42k3m08L92k04M56p24Q72p19O0K46j61O20p27
2985b57O81m47J41l96L59p8k31N46o39N38k79M63o67L84P0k67L11n45P04n93K71
3006F9k65J86q0J3L04m99L36k47K48n04N33n9k16M84n18L49l78M22l96QK95k60
3028a75L01m38O05m48J15q4J0J02q9M19n77L58j68K56k76K1M73o28M27m48M08
$$ plain form
2877 -73 -3 -284 135 -257 -73 -149 -201 178 -129 175 -327 266 -25 130 113 35 47 -387 249 -143 280 -527
2899 -527 1 -181 -79 143 -224 457 -348 282 -13 79 7 212 48 -115 396 -265 165 38 221 31 82
2920 82 273 -312 403 -219 347 -270 60 -4 -72 285 -122 292 -198 133 -311 97 -138 -200 119 -285 62
2941 62 -255 -237 -276 -177 -178 -271 122 -94 188 -418 298 -362 124 40 -225 238 -449 215 -43 33 -274 -27 -71
2964 -71 -149 282 -434 453 -270 56 -79 63 40 -368 24 -180 276 -448 424 -295 -235 11 -150 470 -257
2985 -257 424 -23 118 -278 81 3 -228 318 -321 217 -62 401 -266 118 188 -79 232 -313 391 -202 69
3006 69 -196 -10 -90 -77 227 -272 64 -183 65 -439 94 35 -181 303 -215 134 -244 178 -218 -210 85 -175
3028 -175 126 -312 293 -155 -40 -124 -114 -12 -101 318 -259 99 -69 187 -89 -68 405 -223 204 -244 164
3049A64m74M97m16J84L6M1R2k39J25j02L48l93K15m9l55N70m01N14o25K81o4j23
3071a74K49k14N76q01P15o39L50j4l3P6J4L42p72O64m42J76k4q9L52p08O07l31
3093a20L90n17M40k37l89O57m15K23m43P49o38N19k11j0J39k19L04o30P01m16
3113a23J96m9N0J10l00j09n3M94l05J60J44o77N35j6L1k70L62j34j31N0N0M24
3135D39m37K54o05O23n81M43k06k00L71k93M24l29K92l27M96n10r0N71n69L93
3155A59l76M38j40l2j26p3K35k22L64m68L84l08J24j04kN43n84K71l99M79n01
3176c38L21l6k6K64n22M84l45M29j44j11j10N9N5l3M10o10O04o55L96m7k46M93
3198B92o57N06k33K44qm4L2k81M18r6K03p37N39q1J30l5j05J01m24L02j65K74
$$ plain form
3049 164 -310 187 -229 -45 -9 32 124 -115 10 -92 256 -137 78 29 -326 244 -157 357 -268 13 -51 -174
3071 -174 75 -139 437 -364 351 -288 62 48 15 91 105 447 -325 339 -103 73 49 -40 312 -396 211 -120
3093 -120 270 -247 193 -44 -433 224 -191 32 -411 338 -300 219 8 -2 137 -82 222 -408 293 -123
3113 -123 73 24 74 184 -116 -225 -278 216 -89 71 215 -462 73 57 88 -182 180 46 -85 -35 15 439
3135 439 2 256 -349 274 -307 136 -70 -270 101 -192 232 -97 195 -132 364 -146 -236 335 -234 159
3155 159 -217 221 81 49 -77 -150 85 -137 227 -241 143 -165 -41 -145 -147 396 -188 83 -316 163 -338
3176 -338 -17 -53 -79 185 -337 147 -198 231 87 -24 -134 -75 -20 -53 357 -253 351 -304 92 45 -201 292
3198 292 -365 141 -92 152 144 100 132 -149 269 173 376 -361 178 97 227 192 87 188 -236 66 -99 175
3220A75l48K17j90pM00n61K87J33Q3k31K12J4l38K46l29L89j76J02j84j29M47
3241B12k94J69l07L44k04L32m97k3M16n86N71n07M91k05K70l72J17j2P2J36l23
3262b00M24l45K69k43J66j82KK64m47N29k39J39l33J60K31k1J62n01N23n60L05
3283A03k34K96k42q3M33n56O21l25L17k20l8o0j92L49k25L53n24L18j31qk8J30
3305E4L28o98N88k69K28l96J40J1j78N75o95M23m21L17jkK66m09K10k90N17k02
3327I6j94l9n5l7LL02k53L76l96J90k9L0p9j63M13o02R39o74L14k50p3K10qJ12
3351A33l45N14l36K65O1l55K11l83L51m17M30k44P6J60l22L87l33L35l59L45j88
3372a4L4L53l38k5j16K51l27K23k03L88p4k33L85k79L22n40K64n11M20K9k46L90
$$ plain form
3220 175 -173 44 -146 -153 247 -314 -27 106 189 -42 170 184 -154 92 -237 152 -24 78 -106 -235 212
3241 212 -82 87 -220 124 -80 252 -245 -268 148 -438 133 -374 117 -88 182 -190 -73 -85 -13 123 -200
3262 -200 224 -121 148 -95 71 -111 -109 155 -292 237 -2 137 -196 -36 195 174 336 -165 358 -202 103
3283 103 -131 165 -77 -160 273 -283 338 13 330 110 72 12 -180 169 -56 297 -227 91 -40 -48 -76 54
3305 54 382 -316 272 3 231 -165 -25 -14 -192 383 -312 111 -310 7 6 4 270 -139 71 -219 298 96
3327 96 -98 -137 -192 -229 -226 76 -177 199 -197 -7 -36 -6 -85 -248 165 -437 502 -172 142 -108 -181 29 21 133
3351 133 -212 302 -34 231 292 -63 148 -235 116 -301 129 -115 -39 121 -201 186 -147 188 -171 174 -14
3372 -14 20 373 35 10 -106 145 -182 41 -162 226 152 -81 304 25 347 -193 71 -440 -20 9 -237 153
3394A53m06L82o27M85j21j36Q3J27J20m33O05l85K54k02j11Q6K09k4l60O02l77
3415g6J37j69J45k09P9K90k94J53k27L20r0J75j36j9K38m84M95m07L07j78O1J6
3437A27k03M15n24M54k46J26k17K5L07l57L00j87J39l45K08j44R8Q0j77L35l59
3458a45N16k71J30m96K35M6j58J96j30M94m40J85l89L68j26l0q4k04L09j33L40
3479B13l48J5K18j39K82l25J56j63L23l61K2J22j10L23m25L03n04M07M0j55K41
3500A35j09M43m97K54m12K11m0rL7j17M75m85K33k40K33r0j0J24j58K73q6K0n20
3523c35N26j39n2J89j85K59l46J31K06m06J08j32J68l52N16r4J79n88L05K55l34
3544a21K56m21M53k43M3j64K26l07K82N2k29K67m26O55k83J41l32J09L08m75K24
$$ plain form
3394 153 -253 129 -498 -13 -134 -270 -187 -60 60 -373 232 -153 101 -101 -212 -126 83 59 -301 301 -76
3415 -76 61 -108 37 -172 -93 197 -97 56 -171 149 59 234 98 79 317 -167 328 -79 228 50 111 127
3437 127 -76 339 -185 269 23 149 -68 -43 264 -93 207 20 159 -186 22 -122 -24 56 -121 214 -145
3458 -145 371 100 230 -266 -31 15 -143 53 -77 417 -23 162 -227 141 15 -15 -99 -303 6 -127 213
3479 213 -135 -120 98 -41 241 -84 72 -91 232 -129 -107 15 -95 228 -197 106 -398 9 49 -106 135
3500 135 26 469 -28 226 -186 25 -15 -24 13 -104 371 -114 119 -121 112 22 12 136 -22 251 165 185 -335
3523 -335 191 52 0 189 4 263 -83 48 254 -152 -44 -176 -8 -360 156 62 241 -347 -42 213 -121
3544 -121 135 -286 167 -76 -33 -197 29 -278 4 56 -173 94 -332 323 40 181 -151 -42 266 -209 15
3565A5k07O08n85J45J29l09K78l39M63j21K77l62K38l12Q6J96m82L34j76M59m89
3586a54K43j07Q5J00j54M22r93Q54k64j5j87K36R2n26M20j80K40J86k63L4k64
3607a95L15k41K09k89J83k55R8K0J4K83m57K49k03J37k16J43K60n49N01r5K78
3628A90l99M46m55l6K60j18O3m39K89P4J68j02Jpq1N79o38O51q16M99o5j26j1
3651g3J6J68k13K84l90L81k27J31L1l26L85n16O57n74O71o15J12J56OO4k54L49
3673B23n23M59j48J87l56R5J5l85O26n42N74j35L6j09k90L89j59K41l16P9j3N
3695d7J93o3J39k33j32J48k3j48L30p3k59K85k62J78O9j23j48J94J5j58M36o72
3717c54M54k90J88K4R2k0l18L88m07M71k03j10k1K14j44o1N93o50K64L0R6k91
$$ plain form
3565 15 -192 416 -169 -24 105 -204 74 -265 198 77 354 -8 230 -82 4 200 -282 52 -124 335 -154
3586 -154 89 -18 67 167 13 435 -558 296 32 17 -170 66 158 -368 52 -128 112 298 35 69 -195
3607 -195 120 -121 88 -201 -18 -273 -175 -155 -141 142 -315 -66 -269 -132 -348 -205 55 -494 7 -88 190
3628 190 -209 237 -218 -254 6 -112 -49 -488 -199 -125 43 -59 -58 -65 -146 433 -205 446 -370 129 64 -62 -73
3651 -73 -57 111 -102 182 -208 173 -54 77 108 -218 167 -349 308 -266 405 -210 -98 58 64 128 -126 223
3673 223 -300 159 11 198 -158 -63 -48 -433 193 -349 225 90 126 17 -273 116 -43 198 -118 -39 -52 -47
3695 -47 146 83 222 -11 -143 5 -18 -166 164 91 -168 117 -145 33 102 -21 -169 25 40 -118 318 -354
3717 -354 100 -190 -2 22 114 94 -224 164 -243 228 25 -85 -106 108 -36 -97 496 -154 110 140 236 -55
3739e5l8M77m43M43n87M36n38M84k58K9J27k12M54m67J05j84K60n1M6p3j79N13
3761B89n29L79l36J38J15j32J56m78N92m32K52j99j2J47k17L21j96J65j77K34
3781H0q7J9q7n7K85l66J27l46O45k35j2L0j65K73j24K09l98J82%ok2j43K52j46
3805i2O7l55O27l65k6K56j50J72j04Jl24L80j51J07J33j8l6k90N09o92M45j30
3827c6J49m12J06K34l05J73L5J31k83j20N74l32j05O0L56m34K47j68J41j06j22
3848b17J98o4M67l52R7l24L14Qk47L33k84j02M4K74m89K53P2J6J75l03L88l76
3870a19K44n1j29L8p8L20m70L46l3j8j37R6N2o9K11j18j34q6L87k72j84J89r0
3893a05J35n8J92l12K44l24K98J93k32J20k79K41m70K55L2N1o5Q9J48j87L4l43
$$ plain form
3739 -55 -93 384 -59 384 -203 233 -305 179 -79 -50 77 -135 319 -148 -43 -227 33 -18 28 -45 -224 289
3761 289 -240 139 -197 -59 56 -76 80 -398 194 -238 14 -185 -197 -50 -267 54 -142 23 -154 80
3781 80 -7 12 -75 -132 153 -213 -86 -432 213 -22 -34 -4 -169 104 -20 189 -209 -27 -27 -33 -55 -198 54 -92
3805 -92 -25 -380 247 -118 -144 112 -38 134 30 31 -293 87 -64 43 176 158 122 -168 341 -351 94 -36
3827 -36 113 -299 -193 41 -264 -91 -56 75 -208 -328 246 -86 -191 -131 225 -209 38 -130 11 -95 -217
3848 -217 -19 -83 384 32 129 -195 119 127 -120 213 -71 -173 -129 145 -344 -91 -19 -3 172 -131 257 -119
3870 -119 125 74 -55 -17 -95 225 -245 101 68 50 -87 9 61 -8 203 85 -49 -135 252 -20 -204 -15 -105
3893 -105 30 -28 164 -148 96 -228 70 263 31 151 -128 113 -357 -102 -70 -19 -84 5 153 -34 0 -343
3915c43L39r4o7L76l49L61n46L47j39m6j25P4L55m63N42n20O40o27K21J77m28
3936c15P23n39N52n03N51m35M9j64P9J74m21N21m31R9J1J23J52k42J63l40O27
3957D34p26J77J98J40m07n7K47mK6j65M09l17J53j71m4J10q8M08m81K89m29M89
3979A91k05j29K97m29L53j25L50m06K86o9m9l2n72O52j12j12K5L69j94k38J15
4000c4j62L43m95L60n02N37k37R5J82k94K77l84L59m13N65j55m40N31k59L29k90
4021h7L99l44Q6K5m0K9k25M58o03L33rk7K45j04j4j76K88l22K40l14K26M0k64
4044a60M80m97M76m01K06k14Q2m8pL35m51K93l75L70j23j01K16J3J7n42L18j45
4066b58L00k20Q0j07m04Q56k59P0k91M90n35M08k31J82K72m45J44l08M75l87J14
$$ plain form
3915 -343 -4 -98 -165 211 -138 223 -323 24 -115 -161 -286 -212 143 -320 222 -298 342 -285 -64 113 -315
3936 -315 408 -131 421 -82 469 34 83 -81 -2 172 -249 272 -159 -60 -49 74 226 -16 147 -193 434
3957 434 -292 -115 83 223 -184 -241 6 2 28 -137 272 -45 108 -63 -107 3 -85 323 -158 131 -298 191
3979 191 -14 -143 154 -275 78 -47 303 -103 183 114 65 33 -539 113 1 -111 -86 283 89 -149 -34
4000 -34 -196 147 -348 12 -490 47 -190 -95 87 -207 70 -314 45 -368 197 42 -398 133 -126 203 -87
4021 -87 312 -32 54 79 39 68 -157 301 -302 31 22 -5 240 136 122 -54 234 -88 152 -162 64 104 -160
4044 -160 320 -177 299 -102 104 -110 -28 -76 -83 252 -199 94 -281 89 -34 -135 81 94 111 -431 -113 -258
4066 -258 42 -178 -98 -205 -609 247 -12 58 -233 257 -278 130 -101 81 353 -92 52 -256 219 -168 -54
4087e4Q8j79L12m42L85n5J90j87%L76o24J45j75M42k11J84o0j51N4j20K86nq7
4110A12j19J88k30K9K8j09L21m93N65o50N86l61J88Nk02O01o77L34k77L20j28
4131C1j20q3j41O49l03K9N45l03j33J62l79m1M44n32J49n9o9j89L77j97RK72m07
4154b89K79j24L13k82j62L43l52N06k94L38l21j88J64k67L61M8J10k82J38k12
4174a73Q6K78k22l4j89N02l14J6l6J94l2j95J8J01J93n60O31l31j99L60l15K61
4196D0l55M70l72N40l21m9L2j27kj40K97n44O68k42K66j09k07J55m56N31m53N04
4218A26l64J93K24k39K28l87J80j98K65k22J92j05q4K57l74N59k00K33l42J40
4238H2Nl17N92l43J95o06M73j69j60K78j08M38n84M01m64M04j09q8K55j78K39
$$ plain form
4087 -54 34 -145 167 -275 110 55 245 58 58 434 -190 -45 -220 222 11 195 135 -16 38 -82 204 199 112
4110 112 -7 181 -49 -20 8 -101 220 -273 292 -358 228 -133 55 60 -142 459 -218 116 -161 159 31
4131 31 -89 -172 -313 336 33 62 607 304 171 333 -46 -87 357 -175 -26 -85 -154 -343 34 -163 -154 118 -289
4154 -289 -10 -134 179 -103 -265 78 -274 232 -62 276 -45 -233 -69 -336 25 73 183 -99 39 -173
4174 -173 -87 191 -31 -65 -254 248 -66 -50 -86 108 76 -119 -101 0 193 -367 264 -67 -266 94 -221 40
4196 40 -315 155 -217 323 2 -47 -15 -142 -144 -284 13 -531 137 -105 161 52 -155 0 -456 75 -378 126
4218 126 -238 -45 179 -60 168 -219 -39 -237 28 -194 -2 -107 -191 66 -308 251 51 284 -58 82
4238 82 87 -230 362 19 214 -392 81 -88 -248 30 -78 360 -224 177 -287 117 8 -80 175 -3 236
4259B36l99K48r1P5j13j50K11k13M67l93N69o57J49mm2K47j5O6k26K2k82M14j12
4282GN8o4p2J60j31L20n43M18j47l3J17j89o8N0K07k98J94k83L74j08M9O9k00
4305a13J81j30J32J46l35L50l41K30m45J44k00O36m49P7K42j71J88l53L44l37
4325b04M42n3Jk56j70M93m04K39j52L3K63k90J72l01L42l56N16l84J08j02k9K39
4347A47l50K26p2L8O2p7O3jJ2k58J60j10K80j33J04N7j57J88l26L21p05Q56o87
4370c62M71Q1k69J65j53n2k5K46j24K1k20l6N90m64L83l56K98k88K79q6k47K52
4392A04j50P4k30L89k84J80J27l3kj31j0p0P6l06L29k61o0L67j08J42k85K28O
4415I2l40L65j70J74l05K28n0J47j58m3K81j88J05j82o5qK48j74J28j3l5J70l35
$$ plain form
4259 236 -163 85 -6 69 -44 -194 17 -196 271 -122 447 -210 -61 -65 -107 140 125 191 -35 -13 -295 119 7
4282 7 65 1 -71 89 -42 278 -265 153 6 -27 90 -99 -167 -117 90 -208 -14 -297 77 -31 18 87 -113
4305 -113 68 -62 70 216 -119 231 -110 120 -325 -181 -381 255 -194 -117 125 -46 142 -211 133 -204
4325 -204 238 185 186 -70 -240 253 -151 88 -64 -31 232 -58 114 -187 155 -201 315 -69 39 -63 -92 147
4347 147 -203 23 -49 -11 51 -26 37 36 48 -210 -50 -160 120 -13 91 148 -9 179 -147 174 -531 325 -362
4370 -362 109 190 -79 86 -67 -119 -144 102 -22 -1 -221 -257 333 -131 252 -104 194 -94 185 99 -148 104
4392 104 -46 28 -202 187 -97 83 210 177 175 44 34 -36 40 -266 63 -198 -258 109 1 143 -142 86 92
4415 92 -248 117 -53 121 -184 44 -6 141 -17 -60 221 33 138 -44 -109 -117 131 -43 85 72 37 207 -128
4438a28N65n34L94l21k6k6NM7j11K01j68K04q2j83J62o3J88n5k56L66l05J40l18
4461c04M60m1pl16L03j78J68M9k74J69j84M13l39J37m6j84K25k38M09k96K17l45
4483b02k4p0L88j7l59L84k88L14k64K96l15K58k50Q0J7j32K55j10J32R5j14k52
4505a78L6J11j3j26pK49l23L08P4k73R4J23J41l40K20l86L27k03L06k26m8L52
4527B18n77L52J87L7k74K23l02p8L59k69K51l22L54k16k33M09l11J27p1K31J20
4548B15o9m3k67L9j3N69n75L32r9K92n7k37R1n73P12n61L82o8P2K1l24L01m79
4571c39K98O8p9m2J18j75o1L51m73L99n8j7k9L5k2K11J77o58P28m91q4lN15o24
4595b55J61K10r8O8l2m05L02J47l26Q8K04j73K61j29J71j92K3k79K86J4j99M15
$$ plain form
4438 -128 437 -97 297 -24 -50 -76 -71 -24 -135 66 -102 102 20 -163 -1 -64 124 69 -187 179 -126 14 -304
4461 -304 156 115 108 -208 95 -83 85 134 -140 29 -155 258 -81 56 10 -174 51 -187 222 -74 143 -202
4483 -202 -226 -296 92 75 -284 100 -188 126 -138 158 -157 101 -149 -69 -52 -184 71 -39 93 188 74 -178
4505 -178 -142 -31 -44 -170 -177 72 -251 57 131 -142 -48 75 216 -124 96 -290 37 -166 140 -86 -134 218
4527 218 -359 -7 180 217 -57 166 -136 -214 145 -124 127 -195 159 -57 -290 119 -192 -65 -136 95 215
4548 215 146 103 -164 -125 -138 431 -144 188 89 381 324 87 178 -395 317 -244 138 70 142 163 -161 140 -339
4571 -339 -41 27 -52 -94 24 -151 -212 139 -334 65 7 -10 -39 -4 -26 185 362 -296 432 -59 -143 -146 369 -255
4595 -255 -94 116 18 86 54 -351 -49 98 -228 -140 64 -109 152 23 194 2 25 -254 32 46 -153 262
4617B62m18K88r7p1j10K15Q4k48J25k16L61l61K51K06m00K92k19K20m79N68m25
4638a72M36k79N0J0j92L60j24l7m98N04N96n51n0j43L74m90R23o82n0M67n28K75
4660A99m06Q9R9K48k47J81n8l12N95j070J546j942M51M92L91L01n58j99K53J31
4680A84n75M38J1O4j4j21P3l61L37j40J06mm8K20l90M39j99Q3l16K86j69Q8J28
4703A20l24M63j82o3RP0j10K91j16o4j85j3K33R7l86K70n9J07k28J6O7J25l17
4726a79J46J2J9J7j11J42k30M82l20k39N57m53M25n10L25k37J62k41R1J02j39
4747a79M93l59O4o5K00j71o1k1K87k41j14K86l93K51PQ2k69L83k19J62m3k02J83
4770F1j55O3J49m08M95k60p9J75k73q7O26l15K5j66M1K45j20r5J04k0R9M4j38
$$ plain form
4617 262 -156 132 35 -36 -146 69 153 -95 30 -186 175 -186 65 271 -129 163 -56 164 -315 253 -172
4638 -172 264 -15 35 45 -147 213 89 52 -446 58 654 103 53 -90 284 -206 717 35 -15 452 -76 199
4660 199 -207 -118 -19 229 -18 163 105 -207 388 -682 864 -1078 -627 -135 256 557 -1 -200 53 184
4680 184 -391 47 58 122 108 -13 60 -301 36 -104 2 -2 -50 170 -220 219 20 103 -213 73 -96 -8 120
4703 120 -204 259 77 14 23 93 -17 274 158 94 -91 -104 129 226 -160 110 51 158 -70 -54 13 138 -179
4726 -179 -33 -21 -2 15 -96 46 -184 298 -22 -261 296 -157 268 -242 83 -154 8 -233 -142 -40 -179
4747 -179 314 -45 19 -46 154 -17 -78 -99 188 -53 -167 119 -274 -23 -16 66 -203 180 -39 123 80 -122 61
4770 61 -94 -31 118 -290 205 -55 -134 41 -232 -319 307 -8 17 -149 -108 137 17 -78 26 6 105 149 11
4793A1qM1k8J5j72L6j71K81m3j23M69k89L35l93J03o7O5n2l3j61K48P9k45m7K87
4818A38m94L68J2J56l98L47K0j69L3o0K84k77L6n4J64k11J84j67K39p2k58L22
4840A43k64K01k9J68j99j69K73j84M2L03k59j54M07l08j26K30J29j42l36J52J82
4861F0J92j20k81J48n0P0j08n1M01j41N6l71J44J48o1m48N14j07M0j02J18j11
4883f0Q9J47k27j02J62o2L27l31R3n6J12m8J03j36J02j46r6K49l47L78k56J31
4905B6k41M8o0J95K60n24N43l76k2L71l75n6K9K85j51O3O6l82Q01n32M5p3J24
4928F4l27L31P2Lj20Q7L0qj45k63N62m58K92k66K99j20j22p4R9L4n4j57L77k40
4952a04L01n89M63k82J64J0Q1j14J06k56kK15K3O4p5O4ll19M34k14Q1j03j0K45
$$ plain form
4793 11 3 44 16 31 -141 -105 -276 5 -38 -161 308 19 354 -39 64 -3 62 10 -23 -184 64 143 -102 -149 138
4818 138 -356 12 24 180 -218 129 149 -20 13 -47 237 -40 -4 -58 106 -105 79 -88 151 79 -179 143
4840 143 -121 80 51 219 20 -149 124 -60 -18 285 26 -128 279 -29 -155 75 204 62 -274 -122 60
4861 60 252 132 -149 -1 -51 19 -89 -140 261 120 176 -195 -51 97 36 -412 102 -5 35 -67 51 -60
4883 -60 29 176 -51 -153 9 -53 274 -57 36 -20 92 44 147 11 113 -33 -129 120 -227 151 -105 26
4905 26 -215 -167 -227 -32 228 -296 247 -129 -151 220 -155 -211 -182 103 -48 15 81 -301 500 -32 13 -60 64
4928 64 -263 68 140 143 23 110 140 132 -13 -276 286 -172 120 -146 153 33 -89 -163 -64 -30 -84 -241 136 -104
4952 -104 197 -392 71 -211 -47 -37 44 -70 36 -220 -222 -7 16 80 5 69 66 -253 181 -33 48 -55 -65 180
4976A80Q3K0k49J91l53J96j66J50J84j08jk83L34o2j4k15K87k11J30p8j73L87
4998B29l99N20n23lq8M18n8k25J49r4k7L82k79j00K21J69k04o6P3j9k63K11k92
5021b68K24P5R6p2j62K41m40M24k90mR7N2J3p5m2k14M31r3J12j51p4J21o6L66
5045C01m15M35m98L45K0k44M8j25M12l70J73R9m87K97m1J07J06q9l00N05k77k5
5067b3K68o5m1k98M07k64K52k94P5J9L2J00k90K15k59M14l50MJ82j44Q4J44j2
5090A56k53J1K18q5j26j36K57j57n8qK47L43m54J91m48L20l34M33k47L38l30K54
5112A32j42J16N3j76J13j63O7M8r5J39k03K08k67L19l04J69J12j7j33m3K58m36
5134b45K41j18J09J47k21J0J18J40r4q0j39J02n1m8L21j80n5M8P5l12K89L25j99
$$ plain form
4976 180 263 283 34 225 -128 68 -98 52 236 128 127 -156 178 116 102 -113 174 -37 93 15 -158 229
4998 229 -170 350 -173 -176 -264 154 96 -129 20 -74 -101 281 2 -98 123 292 88 22 95 76 -187 24 -268
5021 -268 -44 31 127 55 -107 134 -306 118 -172 -176 -79 -27 -14 -89 -131 -345 86 -7 105 -46 -120 1 -65 301
5045 301 -114 321 -177 168 188 -56 -8 -133 279 -91 82 181 -306 -9 -50 57 163 74 -226 279 2 -23
5067 -23 245 180 139 -159 248 -16 236 -58 17 36 68 168 -122 93 -166 248 -102 -98 84 -60 24 168 156
5090 156 -97 -86 132 47 -79 -215 42 -115 -173 -181 66 409 -45 146 -302 18 -316 117 -130 208 -122 132
5112 132 -10 106 159 -17 96 -67 0 48 -47 92 -111 97 -170 149 -155 14 126 109 -24 -67 191 -245
5134 -245 -4 -122 -13 134 -87 -77 41 181 87 7 -132 -30 -81 -129 192 12 -43 5 80 -232 57 382 183
5157A83J22l38L86m53K97r7j95M1l92M90PP6n2j75j26J83J7lj65k6L75l32K19
5180D2n3N1j13MK1k5J62M1K9l37O7m2l7J21JJ36j25R4m3n1K34k64M25m06K15k70
5206a23J84o5O5l45J60J64J33L8k32J77l04L3k6L21o0l45L67j7q3O7j6n2r3K7
5230b5j32K52j27j57J36J17N6l47M72l22J38M9N3Qp8P2n8p0p6J26k13Q3q4L41
5254B14j87j1o2k76K19k36M84l01L11q9j67L66l90J84L5j15q0K37P0r2j78k18
5276b82K27r6R9M7r5L06l47L50l41R0j69K14J77k31K81m65J42k3J47l08L45k5
5298D3m2J94n17L10q0L26k30j8j79R6L68m06K19J0o3k41K99r6M00n47oL89l52
5321a23K6j37L52j7k30K38k00K17k67J41LJ42r1k41LJ60M90m03J01k94J30j06
$$ plain form
5157 183 305 -33 353 -100 197 100 -95 -54 -446 44 51 127 75 -100 -226 -43 -26 -29 -194 -220 155 -177 42
5180 42 -11 40 -73 -69 -48 -73 89 130 159 -178 -111 -153 -190 -69 -68 68 -57 37 -6 -57 177 -87 338 -68 147 -123
5206 -123 61 -4 61 -284 -124 40 173 211 -21 156 -148 -115 -141 180 120 -225 142 125 42 109 93 41 -52 -25
5230 -25 -157 95 -32 -189 -53 64 120 -227 245 -77 61 110 163 171 93 165 107 37 -39 87 -126 -43 -127 214
5254 214 27 16 -46 -322 -103 -339 145 -156 155 66 -101 265 -125 59 94 -21 -101 136 206 114 -64 -282
5276 -282 -55 -151 -52 -5 -100 206 -141 209 -132 -42 -211 3 180 -51 230 -235 -93 -116 31 -277 68 43
5298 43 1 195 -322 -12 -92 234 4 -14 -193 -97 271 -135 84 94 31 -210 89 -7 393 -154 -160 229 -123
5321 -123 -97 -234 118 101 -129 109 -91 126 -141 0 3 145 54 -187 -184 -24 466 63 164 -130 0 -106
5343a06R6K20k22J80j93J15k60J25K45k11K2J16r9Q7k40P6Q9o8J9Q4r8On8Q1l3
5368b7J23k7j46K11k55L62k94J83j45J72k74K08k4p6ln6q9Q3J25j45K52j92m1
5391g5K88l27K2K8L90l69q4N0O3k20K49j42p1J30j26RM68m35L16l96K30q4J17
5414C1k2J7q6o0J83J60j8k03J13k47J11Q8k36J55Mk29K81JP8k42K69j29O2k04
5438a23K98L9k28J30k1k36J30J47k04P3J70l31Q9k1j6K61j74K59l5l1N7l02j07
5461a76R1K25j4j70L63k19l70JK38M2l7l8j1J74K7n0J42m06R0r5M25j28j3k9j49
5486h7J13k36K94n4N3k23J23M9J76j49r7K3j32L10j34M0N8k82L03J1K14k61j00
5509A2j80J97q7J63m2k16J79q2p0l71O18L9k63j00J57n1j7K84j29k1k31J06k3
$$ plain form
5343 -106 -10 210 -12 168 -25 90 -170 -45 200 -11 11 127 28 115 -125 -49 40 -28 -9 75 -23 -17 -75 6 -27
5368 -27 96 69 -77 134 -121 241 -53 130 -15 157 -117 91 67 -9 -12 -68 -157 -74 51 -94 158 -34 -75
5391 -75 213 -114 -92 -64 326 -43 -127 -77 -14 -234 15 -127 -198 -68 -194 -185 283 -152 164 -232 -2 -86 31
5414 31 9 26 -60 -120 63 223 205 2 115 -132 -21 67 -169 -14 -10 -239 42 43 121 -121 148 19 81 -123
5438 -123 175 214 -14 116 95 -141 -11 136 -68 5 175 -156 -67 -88 -104 157 -17 242 207 176 233 -69 -176
5461 -176 -85 140 126 -44 319 100 -270 -269 -31 11 -26 -64 -75 99 126 76 218 -188 -98 -193 232 104 91 62 -87
5486 -87 26 -210 84 30 83 -140 -17 32 208 59 -38 -15 -147 163 29 69 127 -155 148 159 373 112 12
5509 12 -168 29 -58 105 63 -153 26 -56 -126 -497 121 160 -103 -203 -46 -97 -114 170 41 20 -211 -105 -128
5532a28K93l1j52L00k61j22k9R6O6o2L87m94J88j19J59o0O2k6j15K39j88o6L2
5555c1J80m2j66K69l98L53j37J53m05J91L8l75K04J46J29k30L02j90J4J44k34
5576h5q0L25r4j83K05k71J25K70j99m3m9oM7L28j91m3J45l98J48j46J34J76j4
5599A01Rr3j37K93l31K39k20J00j4p8r6L53pj96P1J77k68P7P7r4j58J17L20l62
5623a20K35j48N0K7p0o5J5P9j5J03l18L38k7j19J69m64M26m4j86L32j38k2P4k7
5647H5k28K09j66L09j19J29k05J42r6k54K04J10J8l9R7m44L47J9J5r8j73K35J67
5670B64l10J88o0%M49k13n75R0K7M87k66J5M4l75L79j14k55m8M07J64m39j1k21
5693c73J22P3J47j41J47j94p02J144n93m32Q29O2l95L59m79J20L23m26P96o11
$$ plain form
5532 -128 165 134 -18 282 21 -101 -130 -34 32 -30 357 -137 51 -68 91 31 93 67 -48 191 3 -63 -31
5555 -31 149 107 -59 210 -188 165 28 181 -224 -33 5 -370 -166 -20 109 -121 181 -9 5 149 -85
5576 -85 -165 160 66 -117 88 -183 -58 212 13 -30 -79 -85 -38 290 99 56 201 -197 -49 -195 -61 115 101
5599 101 110 17 -120 173 -158 81 -139 -39 -53 -131 -227 126 119 -77 -6 171 -97 -20 57 -37 -195 -78 242 -120
5623 -120 115 -33 17 44 -26 -91 -76 3 -12 91 -227 111 84 -35 134 -330 96 52 -134 198 60 38 112 85
5647 85 -143 66 -100 209 90 219 14 156 60 -194 10 120 138 99 196 -248 99 118 133 35 -138 97 264
5670 264 -46 142 82 82 531 318 -257 -167 -140 347 81 96 140 -235 144 30 -225 -273 134 298 -141 -152 -373
5693 -373 -251 -178 -31 -172 -25 -219 -921 223 -370 -802 27 89 -306 53 -426 -306 17 -409 387 -224
5713b24L09J36l28L05m35J76L6K27l01J88k64K98k78M4J06K7l7Q9R4m0l65L36
5735I9P1j08j29K22k67J44rJ50j90K0J30j87J81k94J25j85J16J69J7K9K7J32n42
5758b79N78m10j48K91k18J54J10N6KJ4n4j25J98m59M62l07K74j44O2j31J43r2
5780b3p0J52j93J95j59Q3J40j2j73J16P7p9p0j11Q4K0N7l7Q2j11J44rJ8j06M6
5805F1J16k88o3P5m8K08k91K06N3j54j3J63K48j26n9j09L21l11J67j53k25J51
5827g1j22M88l96N8j34J54j02K29J94k23p8o6K45Lo5l23K73Q1k47j24J58J31j77
5850a14P6mJ23J4k24L02k85J12j67N0J63j07q8L75j06j92Po5J76j64K60j61pR7
5874G1j74J65m5j5J18j49J28j62L41N8m13O0R7J1Q6j6q5J07P0k23M2J25j84N1
$$ plain form
5713 -224 85 221 -107 198 -237 -61 -25 202 -99 89 -175 123 -155 -111 -5 22 -15 74 168 128 -237 99
5735 99 170 62 -67 155 -112 32 23 173 -17 3 133 -54 127 -167 -42 -227 -111 58 75 104 131 263 -279
5758 -279 299 -111 -259 32 -186 -32 78 134 136 150 96 -29 169 -290 172 -135 139 -5 57 -74 69 -23
5780 -23 -93 59 -134 61 -98 -15 125 113 -60 56 133 54 -16 -127 -43 -23 34 -3 79 -32 112 103 121 15 61
5805 61 177 -111 -174 -99 -147 61 -230 -24 29 -125 -138 25 273 147 88 -21 300 -11 156 3 -222 -71
5827 -71 -193 295 -101 -43 -177 -23 -125 104 298 75 -3 -69 176 179 114 -209 64 145 -102 -226 -68 63 -114
5850 -114 -38 -42 81 95 -129 173 -112 0 -167 -117 46 -61 -149 226 120 -72 -65 -130 46 -118 142 -19 -26 71
5874 71 -103 62 17 2 120 -29 99 -63 278 336 -77 -17 80 91 177 161 76 183 253 30 72 197 13 64
5898F4k77J71k0R0P6j79J30k1j70L06j62P7K01k76j15K71k11j69L55k11L21m55
5920b04q3O00l37o1k32N11j77l01K6N86q9j72o1j03O7Q5K2m12K97k83n5m20J065
5943B69j74L58k30Rl20Q2J29K46n03J10n53R19q20O81p3r8Q16p02J59l18J32R9
5965B18k36P1j8k7j13K75j52L66l65j7L2o4J22k52J98k47k3J79J6p1p0K81m7R3
5989A49j85o6P9L0J70k41J35l03L24k67J81o9L35O8l19N0k28K84k26J35j39j5
6011a18K13p1J41k88J69j75K6k1J09p1r1M18j80k19j46L34j60q4M27k52J33j57
6033f3J10J99k01m3K45k98J6J70j71J53l10J76k44M0L53k70K05k34K66j80l4J72
6055E7N8j77m8J36m7J17j11L9R3j8l23J5LP4%j72L71j20j17M6J12l4K72k41J47
$$ plain form
5898 64 -213 -42 -62 28 104 -75 55 34 -136 170 8 85 286 10 -105 166 -45 -214 141 -70 251 -204
5920 -204 -287 313 -24 -85 -317 194 17 -284 -258 328 239 67 6 -97 -30 55 77 -335 -38 -321 -376 -796 269
5943 269 95 453 223 232 -88 -6 123 369 -134 -24 -577 342 -478 203 130 32 848 146 305 -13 119 218
5965 218 -18 53 35 8 -105 170 18 384 19 2 34 -30 92 -160 38 -209 -232 -53 -37 -108 -178 103 56 149
5989 149 -36 -102 -23 7 177 -64 71 -232 92 -175 6 -63 272 340 21 71 -157 127 -99 36 -103 -118
6011 -118 95 24 165 -123 46 -129 -103 -124 -15 -86 -177 241 61 -158 -304 30 -130 -214 213 -39 94 -63
6033 -63 47 246 45 2 247 -51 -35 135 -36 117 -193 -17 -261 -221 132 -138 67 -167 99 -81 -115 57
6055 57 115 -62 -110 26 -21 96 -15 24 117 99 -224 -209 -206 -132 -132 -304 67 -53 -170 -124 -12 -46 226 -15 132
6080A32n9j11J31m8L2j61P4J36l23K5L00k6nj54R2j21K63j95J70o3k5J05l40J03
6104f8J46n1J8J78l15l5M45k25j20R5n0j00k4m6R8o4n9J17j75K95L1r5j99nJ15
6129i3L6L05k55J14j32N6Kj17J25k5K3m3k5R9J04j75j73M28m5j93k02K05l9P8
6153E8M0j51o2M3J32k21J02n7R0J93n9j43k3l9J39J22j36K83o05L28m7l6KO6M7
6178F6L0j70m2J31J17k02p1J47J02l34K43L2l59M41n1m0M4j81J87o4j42m1Q7l
6202g3O6j60L04k44K13l38J35n4J25K15q8k68K34p0q6J53k04J91m8k9Q4j2M3n7
6226C2J78j75k51J47n7L20k62j91J00J06K54k20K77k56K11l08J37J3J75k72J4
6247b8qr3K00n0j64p9J69j1J47j5o5R2m0m8N3l89N32k60Q1Q0j70p6J05k9k39L66
$$ plain form
6080 132 73 -38 93 45 77 -84 -10 126 -197 -172 128 102 97 -57 35 -86 177 -18 152 89 64 169 -171 -68
6104 -68 78 27 45 223 -92 -127 318 93 -27 68 18 -82 -106 -152 -54 -118 -177 -60 -235 60 91 -4 -203 -208 -93
6129 -93 -57 248 -7 107 -25 31 33 -84 41 16 39 -4 -29 70 174 -1 -174 254 209 16 -186 19 -20 58
6153 58 98 -53 -115 -72 60 -161 -59 -116 -26 167 108 -35 -58 -97 42 164 28 311 -294 34 -13 -49 -47 19 66
6178 66 96 -74 -116 15 132 -70 -141 6 108 -226 17 49 -310 131 80 40 84 -97 90 26 -116 -157 -70 -73
6202 -73 -7 -167 137 -107 106 -232 -97 -151 -26 189 101 -167 67 -3 -89 64 -140 51 3 -26 58 46 89 32
6226 32 210 35 -216 -69 -126 194 -68 -259 -159 -53 201 -19 258 2 213 -95 42 55 230 -42 -28
6247 -28 -36 -129 71 21 -143 -222 -53 -64 83 68 3 95 55 7 60 -329 203 -57 24 104 -66 -142 -37 -66 -305 61
6273F1j42L28l11Q8j32K40k76K36k70NJ75J26j44j96M18q8J16l10n7J37j33J18
6295a1k16K25j88j45K25J52Q2j16k22M08j45j06MR8l54L63j44J6j8q1K73j50K25
6318A75n04N28j07j07j00J03K40n8j19k04L58J1k70k0J21K9K9j15k04K00J06k08
6340a16j2j6J77j39J8O2K06l77N53l47N2j03j54L02n8Q7j27O2j04r2j02L28k17
6363a17J44p5m98N89J61k22Q7Q5l8k75K82k68J49JK67l39k34N28m29M06m51M23
6385A76j24J51j55j65J66m14L14Q1m2m9J84j46k07K61j13J47J72k54J26k36K36
6406A09j09l8o9J02K9J17j26QL17k58k0j62J93k06j2J82r4q8oN25m37j3J56J57
6430B57j46j99J15M8K02k01n8j66J91n3P7l3m4j7Q7j62qj66M25k91J34K50j56
$$ plain form
6273 61 -81 247 -64 24 -108 132 -144 92 -178 -173 2 128 -16 -212 206 118 234 -76 -133 4 -129 -11
6295 -11 -227 -2 -190 -335 -110 42 124 8 -214 194 49 -57 -53 45 -309 54 -90 -74 -92 -173 100 -50 175
6318 175 -329 199 92 -15 -115 -12 228 170 51 -153 205 216 -54 -74 47 76 105 -10 -214 -14 92 -116
6340 -116 -128 -144 33 -106 -88 -26 180 -197 356 9 61 -42 -196 106 48 135 8 70 -34 -126 -228 100 -117
6363 -117 27 -48 -546 43 204 -18 69 154 116 -159 123 -145 4 5 272 -67 -301 227 -202 204 -247 176
6385 176 52 203 48 -117 49 -365 -51 30 -12 -61 123 -23 -230 31 -82 65 237 -17 109 -127 109
6406 109 0 -38 -107 -5 24 141 15 23 340 82 62 -100 93 -113 -125 57 -37 -125 -131 394 -43 -56 100 257
6430 257 111 -88 27 75 277 76 18 -148 43 -10 67 34 -10 -27 60 -102 -110 -276 149 -142 -8 242 86
6453H6o2J26O2m52O18l52j54J90q6j56J99k48J91J48J18k52k20N24k52N7k4k7
6475C4JO6j20j17J29r2n5J65o2J37J15k56K1Rl80L65K3r0K52j14j21nP8O5q9N8
6501A7k71L54j43K19l3p6Q2o0p7N2j21K14j71M3j15j08J21M9P9j3jJ37j89j93
6525b04O9K9J29j22J30j47R9n5j09J29R2P8M6J33k2k26J27k92J38K77n33K36k36
6548b34K47J46J19j95r5p9J29j5M0J65j63k22K18lR8l97K86J81m1J79l30n7j25
6571a48N0M7L7j6J93j33j01K79k1o9l4q1o4qj91K50L51m02k14K96j31j86K15j08
6595a89R2J48k42K04l12K94K57j82j07L35j92j95K50m00L27o0O7K4j41j53K75
6616A00m22K31K17j3j06J6q9l3NQ1N9J74j27l19K49m4m0j95J17M6J34p9k71J75
$$ plain form
6453 86 24 150 212 -240 378 26 -128 62 -24 -180 19 -229 -38 110 228 -24 -244 280 28 85 61 34
6475 34 35 101 -19 -136 -7 -99 -154 11 -51 86 201 -55 -34 -25 -405 -40 -17 -107 145 31 -90 -95 -17 48 -41 17
6501 17 -254 100 -43 176 143 67 149 89 12 64 -57 157 -14 29 -86 -194 -73 -24 55 42 41 178 -11 -204
6525 -204 -135 -106 23 -99 31 -116 -17 -72 -181 -52 40 118 164 297 275 49 176 -116 22 299 -234 2 -234
6548 -234 13 159 278 83 -12 -91 38 23 63 228 65 -157 61 58 156 -241 45 226 185 364 34 -23 -148
6571 -148 -98 -51 -14 -30 163 30 -71 208 187 118 84 3 -61 -69 -260 -10 341 -61 -275 21 -110 -296 -81 -189
6595 -189 -97 51 -191 13 -299 -5 252 70 -37 298 106 -89 161 -239 88 28 95 119 -22 -175 100
6616 100 -322 -91 126 113 7 23 -66 -99 -94 -13 46 220 93 -226 23 -21 -61 -256 -139 -93 41 -38 -309 -134
6640a34J68p3j73L89j11K0j59r1j1K32J04j78Rl0r6j3L2J80Rn4J25p0k0j08j05
6665a58J25J54j5k1l01L38j45O8K13k75k27J79N9o2K38j22l2Rj63J93k48L44k60
6688a09J34J89l12K82m63L87O5k28J64l43K98k19k1K99j4r0J10j19k7Q2j21J3
6710d3n8J46j4L38n40L65k61m9J8Q9m4K5M17o09M62l65q5L95k92J22l6K51j90
6733D2j49o4J39Q7K2J04j98m1l5L03k35n8J12l1L4K77m79J44K76j21n9k65K14
6756A9O6o7J2p8J34J6l02K24j57Rr2N39k15o2J82l39J31J04j2k04k0K25m4p5J39
6781A33j81L2K8O1j26K48k41M5k8K79k55j10k3L31K5l54K69k55M2j58M01j59J93
6804A97k68pJ9J32j63J00P5j12K61l93J55N9n6j53J96r6M8J04j32O7Rkj12L04
$$ plain form
6640 -134 34 -39 -212 177 66 86 -73 -164 -175 57 161 -17 -8 -38 -134 -147 -115 65 74 20 145 75 55 -53 -158
6665 -158 -33 121 106 85 -216 122 -23 45 258 -17 -244 -65 -6 -68 170 48 16 25 -138 55 -193 151 -109
6688 -109 25 214 -98 184 -279 108 173 -55 109 -234 64 -155 -176 123 109 19 129 10 -17 65 -56 -43
6710 -43 -101 45 31 369 -171 194 -67 -116 -98 -9 -53 -28 389 -220 242 -123 -208 187 -105 17 -19 232 42
6733 42 -107 -171 -32 55 77 181 -17 -58 -93 210 -25 -83 29 -2 32 309 -170 -26 250 129 70 -195 19
6756 19 85 18 30 -48 86 102 -200 24 -133 -124 -216 323 108 46 228 -111 20 124 112 -92 -112 113 69 -6 133
6781 133 -48 -16 12 73 -53 195 -46 -1 -29 250 -5 -115 -138 193 218 -136 133 -122 -80 -238 163 4 197
6804 197 -71 -78 -59 73 -90 10 85 -27 234 -159 -4 55 -1 -154 42 -54 -6 98 -34 33 42 40 -72 232
6828B32k08L9j04q6j25L02q3N6m5J28j93p3K15r5K40j58n2N4J42l36L63l07J11
6851A7J76k70J7o0J20k7J33l12K94J62l13J73n7p9J73J8k88K74k23%R8M1j49L7
6875d5j19J15p7M4J49Q5k34K32j7j47p1Q7M0o5K90k83Qk4L14k44j47o8J32K4Q8
6900F7m8j97J4K45l17J70N8J7J42r9k8j90J85m0J2J09l3J7N9qk21K6l4J69j09
6925c4P7k3J17l2K44l04N4R2k75n2K0J30K32m46J50J40j68k3q4K21m3k91L06p1
6949f3j95M55l71J90R7k04q9Q1r4J04K85l98J08k7P9P8R4nm59L18j50J12J24K5
6973I5r1J04j87MK61j46l4j70K07n7LP6j69K22j48K00j95k72L17J5N3l3P9m9k8
6998E7j43J98j29J87l07J46k0L7J3k00K80j09j66K70J00k37n6O5r4L92l84J93
$$ plain form
6828 232 24 63 -41 -127 -252 50 -33 23 -22 106 -87 -160 55 -40 200 42 -10 44 186 -150 213 -94 17
6851 17 193 -77 -60 -120 0 -27 106 -206 88 250 -63 110 53 -26 147 165 -123 151 -72 -72 26 67 -82 -45
6875 -45 -164 -49 -126 -82 67 152 -82 150 133 -14 -85 2 42 -23 267 -16 -8 -32 282 38 -109 -177 -45 -21 67
6900 67 19 -178 -164 81 -236 -66 -8 9 151 52 24 -166 19 -21 -9 100 67 84 143 135 -86 -60 -94 75 -34
6925 -34 43 20 137 105 349 45 99 191 -84 -136 -116 14 246 -200 -50 90 -78 -101 -185 36 -7 -298 8 -63
6949 -63 -258 197 -174 16 113 -91 -180 -99 -193 -89 196 -202 -94 -121 -42 36 130 125 -334 -16 -166 -54 70 95
6973 95 4 108 -79 -75 186 40 6 -164 43 -14 -11 65 -104 118 -30 170 -25 -297 20 35 88 55 134 85 57
6998 57 -86 112 -17 170 -137 9 -11 26 39 -161 119 10 -156 114 214 -23 -79 -14 -108 284 -100 93
7020I3l04J66m6l00L63n2QmQ8p7J3J00k54J80K08j40j96M2K8j2R0J01j31j93M5
7045a84L42j58K80m90K02j06O9NJ13K38k91r1l4L58m22K74J49k19K0N7l2P9j19
7068D0j72Q0K43k20k6K64l6k34K17j23r8K85k44K22m54R4K22j7j79J98j53J61
7090G0l18K0J50j36M03k84J53Q1k38O5k20L67Q7k05K7M7j18k21K60j38L70j90
7112C2oj20O6J93k0j4j12j0j97K20J66k76kjp6K65j23L7n0R4j30J08j21J8K09
7137A50q7J51j96j3J35k94N5L42L8l72N2K0l7jj41p8M11p5j13K04j94J2j32L9
7161a24J84O0k41J38j04J27r4m2n9O4L4j02L17j95L21m52p3R9K05l7j78K92j11
7184B9o8p4L01k97J56n2l3O4k01M9JN3r7K30j94K56j6j98K32j68M2j02J38J73
$$ plain form
7020 93 -211 -45 -91 -391 -28 -80 -72 -76 12 -65 -52 48 -206 -26 182 42 -154 -112 -84 -96 -6 95 -36 -229 -184
7045 -184 158 0 280 -210 -8 -114 -45 -40 73 311 20 -71 -105 253 -169 105 254 35 55 112 80 159 40
7068 40 -132 -52 191 -29 -55 209 173 -61 156 33 -65 220 -24 198 -256 -162 60 43 -136 62 -91 70
7090 70 -248 -228 -78 -214 189 -95 58 139 -99 -34 -254 113 200 -5 22 69 -49 -270 -10 -148 222 32
7112 32 26 -94 -28 165 145 131 19 9 -188 32 198 -78 -80 -81 -157 108 -15 22 -28 66 -64 44 -77 -59 150
7137 150 63 214 18 5 140 -154 -99 243 281 -91 -39 -19 -56 -57 -198 -276 135 60 -53 151 -43 -31 -163 -124
7161 -124 60 120 -121 17 -87 40 -54 -96 -155 -91 -57 -159 158 -37 284 -168 -241 -142 63 26 -152 140 29
7184 29 -39 -113 188 -109 47 -5 -38 26 -175 -126 -125 -72 -169 61 -133 123 107 -91 141 -27 15 -87 51 224
7208B24l95J19j21M2J56j56K04n3L5n2j41L36l5M1k20K6J29r3o0L64l96K56j57
7231E3K6k4j38K15k54O2o4J52K30j45K6k33J90K8l8j88K11p1N5k47KO1N2M3J02
7256A06m5N2k5r6p2Q1j02lJ51m7j50K34k42L58l02J8J94k62R4k0J38j6J96k26
7280A4k21M95m12K24n9n5L28l33K3K21r5l52L03n3R4n4j97K14q0J19j89J22J32
7303A89k91J67j82J02n4R9k37M24k60j47J46L8K3K6j73K56j54L4O7n8k48J11P8
7326d4M5P5l34J87k40N48j45l68N3L84j8j7J1J3n2o1k02J76j1j76J35Q5P9j04
7350A9K7j24o0P6J94k61K19j98J34k62N6J25K8jL5k25K80p1M6Q1k21R7M6j12k3
7375i5J12j1j4N7j98L02Q5l55K6K13n3j98J25k8J07k09L22j98j19L6M10l33m47
$$ plain form
7208 224 -171 -52 -173 -131 25 -131 73 20 55 3 -138 198 163 204 -16 10 139 46 -14 350 -46 210 53
7231 53 79 55 -83 132 -122 -60 -124 28 258 113 139 -94 96 124 86 -102 109 38 93 -154 -152 -91 -39 4 106
7256 106 61 113 88 -8 -80 1 -101 -104 47 0 -150 84 -158 200 -102 -84 110 -152 -58 -78 60 44 240 14
7280 14 -207 288 -124 100 41 -14 314 -19 4 225 130 -222 81 28 122 68 -129 85 5 124 -65 57 189
7303 189 -102 65 -117 -15 -69 30 -207 217 -43 -190 -44 -6 17 43 -130 126 -28 6 73 15 -233 -122 -44
7326 -44 1 76 -258 -71 -311 237 92 -276 -223 161 143 126 137 150 98 37 -165 11 0 -176 -41 44 123 19
7350 19 46 -78 -138 -62 132 -129 90 -108 26 -236 -180 -55 -27 -28 7 -218 62 -9 37 118 -103 -6 40 -72 -95
7375 -95 17 6 -8 49 -149 153 238 -117 -91 122 69 -129 -4 -32 75 -134 188 -10 -129 -93 317 -16 -463
7398d63j74K15L73q67J441o01nM22n09J39K01j29qo2J46j01k3kj11J13K44q8O3
7421B14j34r0J40l96K92m2N7m5j10J9J68q2J0rk63J80n9J99n2J38j07J81k86L3
7445d4K8l6j48K78j58L19k68L7M1q5l1L14l14L7L5J09o3m6J44q2k3O7k83N0J80
7470E8J18m4j12j9j7L13j27k72N6n9j9J44k10L23k20J74j64R5N2j19J18J3j67
7493h5K20l28K4J09K71k43O7j73r7K88m24K97J96j81J78l12J43K08k30j09K77
7514I6m0J60j26m8K8j21n0K0J25p3J7m8n4R2r9K48k13j86K49m6j09K22%rP1j41
7540c5j19Q9K95j78k30J5L22j62j29J34K1nj09L4J76l18P0K38l4k2Qnk33L83l61
7565a55K04J56n0j62K73j18j63j93O3K72o2k10J02Q3rj10p1L4K7J50j2j7n5Ol0
$$ plain form
7398 -463 -637 -422 -49 -916 525 -76 -81 341 -168 -29 172 43 35 -27 119 18 -5 -7 -118 -5 239 151 214
7421 214 80 -10 130 -266 26 -16 41 -4 -114 -95 73 -9 1 -8 -271 -91 -150 49 -3 135 28 209 -77 -44
7445 -44 -16 -52 -200 78 -80 239 -29 8 49 -36 -67 247 -67 -30 5 114 51 5 149 67 44 111 -172 -122 58
7470 58 176 132 20 1 -16 297 170 -102 -46 -105 -124 20 -190 133 -87 87 -77 18 70 -49 69 82 -85
7493 -85 135 -193 -169 -60 211 -32 35 -138 -235 53 -371 -74 122 -59 119 -193 -50 158 -72 -181 96
7514 96 56 216 90 42 70 -51 -101 -81 44 -29 -12 -60 -114 -22 -121 127 -86 -272 -23 -69 -178 44 44 35 106 -35
7540 -35 -154 -65 230 52 -178 -163 159 -3 -132 2 23 18 -91 -57 119 -199 -129 109 75 53 61 56 -177 206 -155
7565 -155 49 205 155 -7 266 148 -15 -208 -145 127 65 -145 -43 40 31 -79 -150 -116 -89 61 49 32 -23 -17 -47
7590d7O6k09L71q3n1n0J68m3j56K6O6j48k79M44k12K98m0k60o6M22L5n29K06k1
7614i2r8R4j05J39j7K35q2j11L03l07N2n8K76k83Q3k1J16k79J71P7n1k16L35j25
7638C6j51P9n0J69k98P2L38l20j04m5L01l7Q4J28k80O8J28K12m65J27K11J14m36
7661a19J1Q6P2Nj75K40j44J18k41l6L5L1J53r0k5L9J93J14l97O0q2J57K39q4j38
7686B2j65L8L4M6j41L17l04K35k76M83j95j49K02n4j89O6q1M02j44j43N0k8j30
7709a04L5J51p6J99m40J97m8o0l5J26J71j52j93J35J80j63j29J28M4m7J24K2n
7732F0j30J5K68l91K98j89K19m01K89r8L12m44K7J50K2O7q8J48k5r1Q2J3O7j13
7756F7l46M09r9K17k31J35J8j75p4K5j22K52j23k24K31L5k16LK56J21P5k68p6
$$ plain form
7590 -47 19 -190 181 98 47 -3 165 122 -34 -8 58 -90 -369 75 -137 161 121 -139 -205 217 252 -277 -71 -92
7614 -92 -190 -96 -201 -62 -79 156 74 -37 266 -41 11 -47 229 -54 29 8 124 -155 16 93 42 -174 161 36
7638 36 -115 -36 -86 83 -215 -143 195 -125 -229 -274 27 -10 74 202 -78 -10 118 330 -135 -8 203 317 -119
7661 -119 -108 -22 50 55 -120 120 -24 94 -147 -183 -148 -117 36 -54 -79 -40 153 267 -130 -70 -152 5 244 160 22
7686 22 -143 -105 -71 -25 -166 151 -153 82 -194 289 94 -55 147 93 -96 -30 -111 291 147 4 54 26 -104
7709 -104 -69 82 6 205 -235 -38 -86 -146 -181 -55 116 -36 -229 -94 86 -77 -206 -78 -34 -81 43 65 60
7732 60 -70 -55 213 -178 120 -69 150 -251 38 -60 252 -192 -165 -15 7 74 -14 134 109 18 100 113 180 67
7756 67 -279 130 31 248 17 152 170 -5 -79 -54 -176 76 -47 -271 -40 -5 -221 -218 38 159 234 -34 -110
7779a10l9K52nm13P3J20j84K47J3P9j38mj50K32j1m6L9J04J24j93J40j19J43k79
7803a25J83j87J6K28N2r5n0j48j01J92l9o5J11N5K8j91J78J68J47k53k24J05M2
7826B7M5j42Q1L4j81J70R6j02j8K33l93m8P5K51j65l6L65n31J11P4J14Q2j56J67
7850A53l94K78J4m0L9j33J89j5o5r4J61k44K70j07l1m0J47j81R2P5k00J65n6J77
7874A60l69J88K15j57R0k75N9N35n17k95J84MP43p95L08P7k03R2J54j33Qj6Q6
7897A43j52m3P5j96K15q4L46j93k79o5K30J62j68P7r4K29j47N4p9Ll48L37M3j16
7921e0J07Qj40J41J36k90L6L7Q0j47J81j50j43P4L87k49k0J16L0L5k63J03l9O4
7945D4J59r1l66M26J07k30j65L14p5k0M9k89L49l11J70k64O0K6J06L2j30j17K78
$$ plain form
7779 -110 -149 103 98 -315 -242 -122 -306 -59 -46 33 -105 -109 -259 -27 -38 -84 -45 59 183 -10 130 11 154 -125
7803 -125 58 -129 -113 115 167 72 22 -126 -227 -35 -74 -139 -28 27 55 -136 42 210 357 104 -120 -15 27
7826 27 72 -70 11 45 -136 34 130 28 10 243 -150 -198 -123 128 -37 -73 292 -239 -128 -54 60 142 -14 153
7850 153 -241 37 51 11 50 -83 106 91 26 -68 93 -151 119 12 -19 -59 88 -93 -1 74 -126 39 -17 160
7874 160 -209 -21 194 37 127 -148 -89 446 -71 -366 -182 -178 565 -230 78 155 -48 44 198 65 73 57 143
7897 143 -9 -52 23 -173 42 -42 304 111 -168 -233 -3 159 -9 68 -26 203 56 110 31 34 -314 23 66 -50
7921 -50 57 65 -75 66 202 -88 -52 -15 65 -82 99 -51 -194 -120 267 18 -2 114 144 179 -84 19 -20 44
7945 44 203 112 -254 172 279 49 -116 198 123 103 152 -137 212 -99 71 -193 -133 -107 -1 31 -99 -216 62
7968F2j56R8J19j31P6J80l74J8j5K27p1p9l3k0J08k50M33l40R1m0P0L09j79J44
7992B47l37J01m3N9p4O2K87j52j26j09J6n6L83n69K36K13k72N96J7o94P3L8j34
8015b38J34p4Q2J37n0K37k1j89k58K32J97j47J8m0k09mJ03J32J0k46L81k77k18
8038c08J39L85Nj57j44n6K32J43j77r7p7J6j7Q6l5K58m23K18j17k1jK28m2k2k11
8063a95L15J11n28J84L70l30r3k57P61j91r61Q00o03J72O45J42p31P17k25m07
8083c04L44j25O6L0K1k34K34Q0o4q0J13mj07J49J9j53j20K02N0k15J17LJ65L6
8107B23j85j6MM2j14n2N5P0j31J54J98l60K70k61J67m2k72L15Q5l4j56K18k13
8130c5mJ16O1m14J17O4J5l6M4k7J32l20K95p3J75l9j66K34n3l88K34q2J94j49
$$ plain form
7968 62 -94 4 123 -8 68 248 -126 -108 -123 104 33 -46 -79 -99 9 -241 192 -148 -57 -97 -27 282 103 247
7992 247 -90 11 -32 27 -47 15 302 150 24 -85 -69 -125 258 -311 -75 138 -134 462 479 -215 -142 -104 -238
8015 -238 -104 -178 -96 41 -9 228 207 18 -240 -8 189 42 60 20 -189 -193 -90 42 52 -194 187 -90 -308
8038 -308 -169 216 221 64 -80 -136 96 239 62 -35 -112 -96 -113 -27 -62 196 -227 -9 -126 -147 -148 80 38 16 -195
8063 -195 120 231 -297 -113 257 -73 -166 -423 338 147 -814 -14 -617 -445 200 342 -389 328 103 -304
8083 -304 40 -85 -19 11 32 -202 32 112 48 -32 81 77 -30 119 138 -15 -135 67 117 -98 19 22 187 223
8107 223 38 22 26 68 -46 -98 -43 27 -104 50 248 -112 158 -103 64 22 -250 65 150 116 -40 178 -35
8130 -35 -39 77 138 -276 -159 -95 -80 -116 -72 -99 33 -287 8 -65 110 71 -95 139 86 -302 -68 -150 44 -105
8154a05K6K06m4l46K40Q8k51L48j74N9O8j68J55j08j69J99o4n9M3Q3j29J22Q5
8177A05N4o0k9O5j30m4L63j82k30J27P1k43K16r6
$$ plain form
8154 -105 -79 127 83 -263 -23 65 -186 162 -12 47 115 -53 102 -6 -175 24 -40 -99 -56 27 -102 20 105
8177 105 159 99 70 135 5 -39 324 142 -88 39 110 -133 83 -13
8191a3
$$ Imaginary data points
##PAGE= N=2
##DATA TABLE= (X++(I..I)), XYDATA
0@%%%%%%%%%%%Qj6J6j6K4l2L4m2N6o5P3q8J04j28J52j76K02k28K66l05L45l93
33b09M45n02N65o36P15p99Q90r91J101j222J355j496J650j823K012k216K440k686
51a407K957l259L594l970M393m872N421o056O802p693Q777j0132J1879j4224J7554
66I764k2676L1619n1512J68776k9455k77463K85604n2041j44611J52361P548j44041
78f6127J30685o3879j5924P1923q3583K9136M9129j00806K3216J06070j25620
89d5780j581P7460n5709L1144m625l0785L724L6713k8643K0883m777j6234J2024
102f186k5171N3903k0796j7615L0440k1086l6420P6604Q981r9967O4783J3107
114B0577k7246K203J0188l714p069M245M016J2370m4867M3052j1470k6619M3990
$$ plain form
0 0 0 0 0 0 0 0 0 0 0 0 0 8 -8 8 -8 16 -16 18 -24 32 -33 40 -48 56 -72 80 -96 106 -122 144 -161 184 -209
33 -209 236 -266 299 -337 378 -421 469 -522 579 -643 712 -784 866 -957 1055 -1161 1279 -1407
51 -1407 1550 -1709 1885 -2085 2308 -2564 2857 -3199 3603 -4090 4687 -5445 6434 -7790 9764
66 9764 -12912 18707 -32805 135971 106516 -170947 114657 62616 -81995 70366 77914 -66127
78 -66127 64558 679 -15245 56678 -26905 2231 51360 -49446 -26230 79840 -45780
89 -45780 -47361 30099 -25610 5534 909 -29876 -26152 10561 -18082 2801 -1976 -18210 -6186
102 -6186 -31357 22546 1750 -15865 14575 -6511 -42931 33673 42654 -57313 7470 20577
114 20577 -6669 -4466 5722 2008 -5061 -816 3200 15570 -29297 13755 2285 -24334 19656
127A9656q717k0485r509J0637J4903L1352p0359K1511M4222o6779M2190K1948
139C0570m8618J6091L4837o5902M7764J6912o3015O3311l2061k7150P5395k8645
151A9489q3108J01884n797p8766Q8632l8297m4556O1590l111m5554M8702k0465
163F43k8550M6132m2897L3418J5536n6003J0496M6336m1519M073M0735o6088L1116
176f572K8525l2849j0097L3831q858k7003L2503l032p498j6648K7501j1903n036
189g136L2388k8923j6485J4441L1872k5844k652n56R268n981j5504M4277l0351
202a186j4336L0723o737l5716N1163j89o3006N0951L629j6887K406k060p028J8062
216I789o957l723J4503m4629M4389K040m4677M3233J2251o4710K8886M5938o5363
$$ plain form
127 19656 10939 -9546 -19055 -8418 6485 37837 -32522 -11011 33211 -33568 8622 30570
139 30570 -18048 -1957 32880 -33022 14742 31654 -31361 31950 -111 -27261 48134 19489
151 19489 -63619 38265 32468 -46298 42334 4037 -40519 21071 17960 -27594 21108 643
163 643 -27907 18225 -24672 8746 24282 -31721 -21225 25111 -16408 -12335 28400 -37688 -6572
176 -6572 21953 -10896 -20993 12838 3980 -23023 9480 6448 -1050 -17698 9803 -2100 -7136
189 -7136 25252 -3671 -20156 -5715 26157 313 -2339 -2895 6373 392 -15112 29165 -1186
202 -1186 -15522 15201 8464 -27252 23911 23722 -39284 11667 15296 -1591 815 -1245 -8273 9789
216 9789 2832 -891 13612 -31017 13372 15412 -29265 13968 26219 -38491 -9605 36333 -29030
229b9030L9666L071m5781L5200J2838k7132J1519K585k4542M8363l7178q505M8557
242B9631m0468j0450M4872j6783l0943M9353l7156m274M5156k6857j1348J0039
254G72p83m575K6423k9327K490J4242j6403P907P58P544j4443N067o063R977K015
269E601o867j444j0068K5087j1869q88o344P50R342N3m457l903J1355k3316K3729
284F761l434j1023J9773j5901j5583K4464J6279l9808K3602m727j2561K2428p909
297B361n084m22L660l923J5996k6915J8126J3223m4631L2010J9579l5067k028
310a3115L4195l7650J6033K9331m3206P041J3284p59n485P608j0399J1564j1543
323c101q065L6654k9773l251J9872j3694j4686L9273j4905l6741L9198k205j3002
$$ plain form
229 -29030 10636 13707 -32074 3126 15964 -11168 351 2936 -21606 26757 -10421 -18926 29631
242 29631 -10837 -21287 23585 6802 -24141 25212 -11944 -16218 28938 2081 -9267 772
254 772 -11 -4586 21837 -7490 -5000 9242 -7161 746 1504 9048 -5395 -328 -6391 3586 5601
269 5601 -1266 -2710 -12778 12309 440 -448 -6792 -6042 3300 3353 -1104 -5007 6348 -16968 6761
284 6761 3327 -7696 12077 -3824 -19407 5057 21336 -18472 5130 403 -12158 10270 2361
297 2361 -2723 -3145 515 -3408 12588 -14327 3799 17022 -27609 4401 23980 -11087 -13115
310 -13115 21080 -16570 -537 28794 -14412 -7371 5913 5154 -331 7277 -3122 8442 -3101
323 -3101 -11166 25488 -4285 -7536 12336 -1358 -16044 23229 8324 -28417 10781 8576 -4426
336d426m89J0930j4561J957J2097o602n09j0468J6666j4629K421J4725l873j8022
350a4783J443K4906j8229M890K478m258q744J9631K082k6002K3433j405j2001
363f559L312J9100j7984k566J1194j0054J5752r771p60k391J25L464J3006j7742
377a874j2446L2985k3786n01J8102r642j3936J6840n767q871K5925k3976O16Q744
391B413l663K926M871j4331n0K2888k1310Q608L01p243N812K364l377J894N018
406G121j9920J8079l833k113Q437j2214n772J0524R799k1305J2246m034m604N633
420a956J379j389p811J0544q789N246q77O582p508q928J7151R2l247q796J3952
435E645r788K738J4639j1242p565R109J0897k3704J8074O582j8035K92J2129j047
$$ plain form
336 -4426 -4915 6015 -8546 -6589 5508 -1094 -1603 -12071 4595 -10034 -7613 7112 3239 -14783
350 -14783 -13340 11566 -6663 -1773 705 -3553 -12297 7334 9416 -16586 6847 5442 -6559
363 -6559 -3247 15853 -2131 -4697 6497 -3557 12195 2424 1664 -727 -602 2862 15868 -1874
377 -1874 -14320 18665 -5121 -5622 12480 2838 -11098 5742 -25 -8896 17029 -6947 -6331 2413
391 2413 -1250 1676 6547 -7784 -7834 15054 -6256 2352 2653 -4590 1222 3586 209 2103 7121
406 7121 -12799 5280 1447 -666 7771 -4443 -10215 309 10108 -11197 1049 -2985 -7589 -1956
420 -1956 -577 -1966 -9777 767 -8022 -2776 -3653 2929 -4579 -13507 3644 3736 489 -8307 5645
435 5645 -4143 -1405 13234 1992 -5573 3536 14433 -9271 8803 15385 -2650 -2358 9771 8724
449H724j0476J3732j3324N30K521P782m991j5207J2772L917p837p881K1939j9348
463g147p393K3720j0170q269R182L717k2060K0269N337j1568j630J328Q701q459
477d442O533j762J09r060J3308J793j5714J5809l963r195L285J7255j7856l150
491g050J2301q749M568J117J696j3899R652M030l322k371n71P185j3082Q569L663
506C737l25r627N433L772o861J1472o915k912k274J2242n677k187L335o330P758
521D641l913L466m813M800o946J654P683o937L759p497L853r64O850m885l311
536b560J478k822R762q973L838j814l90k798O700K84r696J0788q656K354M399
551A894L276j2476K005J0475p887M157l351L303p903O455M186n809l33R83M404
$$ plain form
449 8724 -1752 11980 -1344 -814 1707 9489 4498 -10709 2063 5980 -1857 -9738 12201 -7147
463 -7147 -14540 9180 -990 -9259 -77 3640 -18420 1849 7186 -4382 -6012 -4684 4017 -4442
477 -4442 2091 329 438 -8622 4686 6479 -9235 6574 2611 -6584 -3299 13956 -3900 -7050
491 -7050 5251 -3498 1070 2187 3883 -10016 -364 3666 344 -2027 -2598 4587 -8495 74 3737
506 3737 3412 -6215 -782 2990 -3871 7601 686 -2226 -4500 7742 2065 -122 3213 -3117 4641
521 4641 728 4194 -619 4181 -2765 -1111 6572 -365 3394 -4103 -250 -1214 5636 751 -2560
536 -2560 -1082 -3904 5858 -3115 723 -1091 -1481 -4279 2421 2705 -6991 3797 -4859 -2505 1894
551 1894 5170 -7306 -5301 5174 -2713 1444 -1907 1396 -6507 -52 4134 -1675 -2008 -1025 3379
566C379j2596J4429J018j0284j786R686j32q594J2608r936j636N052P136j0561
580b217k050J0972q824J265K156O754j3909K950Q261o490O50K921J273j5727J5209
595C194M165j0237k616P977j090r980J5340n005n866o4Q641m935l774J0558p970
610a662j908J367J1183j0230k002O194l528J078J234M490j2628P999J350l654
624g17J867K098j926r291J2867l226j137k345K044k670l10R121r065k65n34P562
640D073o477M12M168n189R06m00P685q612L499j818p26K642J029K314q864N682
656C24j824N457l066k269J673j452L276l952P418p291L55R34K466o97l062N196
672C486p796M808P42L125p785Q07O396n161K527p35L114r456P095K529m238J414
$$ plain form
566 3379 -9217 5212 6230 -4054 -5840 3846 3714 -4880 7728 -2208 -3844 1208 8344 -2217
580 -2217 -4267 6705 -2119 -854 1302 8056 -5853 -2903 5358 -1132 -482 2439 3712 -12015 3194
595 3194 7359 -2878 -5494 2483 1393 -8587 6753 1748 -4118 -4182 4459 -476 -4250 6308 -1662
610 -1662 -3570 -2203 8980 -1250 -3252 2942 -586 492 1726 6216 -6412 1587 2937 -717
624 -717 1150 3248 1322 -7969 4898 1672 535 -1810 234 -2436 -2746 6375 -2690 -2955 -3489 4073
640 4073 -2404 -1992 2176 -3013 -2107 -2507 5178 -3434 65 -1753 -2479 163 1192 3506 -5358 324
656 324 -1500 3957 891 -1378 295 -1157 2119 -1833 5585 -1706 -1351 -417 2049 1352 -1710 3486
672 3486 -4310 498 1240 4365 -3420 -2613 3783 -1378 1149 414 3528 -5928 1167 3696 -542 872
688H72l07R8o006J1924m349l802j42L245K08l158O742q149J857P87M081n934R14
705a119M980r163L984L216K010j0929P088J096o431O053J776m554p913J4716m036
720G74n503L701L050n398l243J3206o955k742O60O568o492J34R704r477j735L837
736H9P818j0945L324L914o269K516K329K280q844O368k638M75J849n95p13n577
752d619P798k813J246k393K062m231J256P895q985J194J603J992o416P054O74
767C317p228L307Q1M111n885M435k910m42P23K583J783q973N936j013J839l366
783a702L373j761l679M827k740M104n496J876j453K354j90j476L597o993M519
798h40N62K378n918L083J369m111N332j548J731n961N347o05N94M10j571J712
$$ plain form
688 872 565 663 -5343 6581 2232 -1570 -1712 1533 1741 -1417 5325 -2824 -967 -180 3901 -2033 -1119
705 -1119 3861 -5302 -1318 1898 3908 -7021 67 1163 -5268 785 2561 -1993 -9906 4810 774
720 774 -4729 -1028 2022 -3376 -6619 6587 -368 -3110 -2450 4118 -2374 -2240 7464 -2013 -3748 89
736 89 7907 -3038 286 4200 -2069 447 2776 5056 -3788 2580 -58 417 2266 1671 958 -4619
752 -4619 3179 366 1612 -781 1281 -2950 -1694 6201 -2784 -1590 13 2005 -4411 2643 3317
767 3317 -3911 -604 -523 3588 -2297 2138 -772 -1214 -491 2092 3875 -5098 838 -175 1664 -1702
783 -1702 1671 -90 -3769 1058 -1682 2422 -3074 -1198 -2651 -297 -487 -1963 1634 -5359 -840
798 -840 -278 2100 -3818 -735 634 -3477 1855 307 2038 -3923 1424 819 1413 1823 252 1964
814A964m942Q488l507j373n50K925l173N31O528j0082L847R87j63k627M073j659
830A267n919N851q99K360o407M114o43k819L388K110l313o292J1887n980j851
845c146M963k69o110J988Q144q379K688l74J241l549L380L887p575J317J640L729
861C575p493O052k66n683L300K716m04o261P446m746j68L479Q73m127k288P406
877C411n961L046m2q6l398K800K961m565K828k175K949n063N209J547n633R23
893a249K461J413n537P994n585j869L900Q15j235k272L125l682M456l573L469
908B631j429m188M157l08M04k939M378n990L866J123l056K981m086J489J32L167
924B332n487L813j115l501N555k032O06l280L615k951L484m10k350J899k612M693
$$ plain form
814 1964 -2978 5510 2003 630 80 3005 -168 363 6891 -3191 656 1643 1480 -1147 2926 1267
830 1267 -4652 1199 300 2660 -3747 367 -276 -3095 293 2403 -910 -7202 4685 -1295 -3146
845 -3146 1817 1548 -4562 -2574 5570 -2809 -121 -495 746 -2803 577 4464 -3111 -1794 -154 3575
861 3575 -3918 2134 1868 -3815 -515 2201 1797 -4464 2982 -1764 -1932 1547 2420 -1707 -3995 3411
877 3411 -2550 496 454 368 -3030 -230 2731 -1834 994 -1181 1768 -3295 1914 3461 -2172 -1249
893 -1249 1212 2625 -2912 5082 -503 -2372 1528 2343 1108 -1164 1961 -1721 2735 -838 2631
908 2631 1202 -2986 1171 863 1267 -1672 2706 -3284 582 1705 -1351 1630 -2456 -967 -835 2332
924 2332 -3155 658 -457 -3958 1597 -435 171 -3109 506 -2445 1039 629 -1721 178 -2434 2259
940B259l144J894j859J198j470J031L249n602L637j892J383k049M453j839m940
955c691M845k42K47l220N683n740lM913j600j772j582M900n252K922L66L92l433
972b267L32O344o302J759J089j99m869P411k62o999N718j677R1q61M831m829m97
989a187J509O98J423n160N618m106o15L023K096o183Q69N912p877M753Q87j961
1005c01l138L871k34k024L198l482K184l482M937n00l267J020R57N43k882O077
1021C477n642K83K500N34j367m82L196n267L737m60J786l589J216J398k613L764
1037B471k769K006l598K727J48K83p40j924L286m037M399j868P3j799J190O64
1053E12m72K237n331M772k566P03J767j027j854O37L089m833M947k889p12R11
$$ plain form
940 2259 -885 1009 -850 348 -1122 -91 3158 -2444 1193 -699 684 -1365 3088 1249 -3691
955 -3691 1154 912 1159 -2061 3622 -2118 -2121 2792 1192 -580 -2162 2738 -2514 408 774 1166 -2267
972 -2267 -1935 4409 -1893 -134 955 756 -4113 3298 3036 -3963 1755 78 169 -692 4139 -690 -1187
989 -1187 322 1020 2443 -2717 2901 -1205 -1820 1203 3299 -2884 -2015 3897 -3980 773 1660 -301
1005 -301 -3439 432 198 -1826 1372 -2110 74 -3408 1529 1029 -2238 -1218 -261 282 -2600 3477
1021 3477 -2165 -1882 618 1152 -215 -697 2499 -2768 969 509 2295 -1294 -78 1320 -1293 2471
1037 2471 -298 1708 -1890 837 985 1268 528 -1396 1890 -2147 2252 384 457 -1342 -152 512
1053 512 40 2277 -3054 1718 -848 -145 1622 595 -1259 -622 2467 -2366 2581 -308 -1020 -109
1069a09J3J205j228O13l093M269l297L348r34l686L382j45q18j095M808p215L161
1086h21K665l151J035k44Q53l506M316r79J70k481J475K754m437L677q68o46k637
1103b825N766j829l301L982j878J62r27M852m984j25K414k56q17l54L350o018
1119b788L194Q92r7j856Q62J358l958L893p20N92m288L639P41l577L729r57k075
1136a416q55N799m773L64J921k425J372n39K664l615J657j277K266j626l54L299
1152B462n228K353J288K36l322L348j496k499N266l171R03j797J921j061J143
1167C46o55p04J731l376M151j785K88j150J286o80L32J871l209K796k352J872
1183G62N9p2p75o19J987k392L223k336Q35j329J608P10k144K048k660J932j064
$$ plain form
1069 -109 -96 1109 -119 494 -2599 1670 -1627 1721 787 -2899 483 338 -480 -1575 3233 -3982 -821
1086 -821 1844 -1307 -272 -516 337 -3169 1147 168 338 -2143 -668 2086 -2351 1326 458 -188 -2825
1103 -2825 2941 1112 -2189 1793 -85 77 -850 4002 -982 -1107 1307 1051 234 -120 3230 -2788
1119 -2788 406 1298 1201 -655 207 1565 -2393 1500 780 1372 -2916 723 1464 -2113 1616 659 -1416
1136 -1416 -2271 3528 -1245 -881 1040 -1385 -13 -552 2112 -1503 154 -1123 1143 -483 -837 2462
1152 2462 -2766 -413 875 1111 -2211 1137 -359 -2858 2408 -763 140 -1657 264 -797 346
1167 346 -309 -1013 718 -2658 1493 -292 -4 -1154 132 -548 -216 1655 -1554 1242 -1110 762
1183 762 821 749 -26 -645 1342 -1050 2173 -163 672 -657 951 1661 -483 1565 -1095 837 -227
1200b27K233k533N33P88j928K380j561J838l371J764L5L10m39k13J512m522N008
1217A607p60j577q99K775j715j277M521l893N61n07K347j171n77J124j034M57
1233a8j516M787m713P20J699j571J9J317O99m506M507j638K3L78J77q49j787L502
1251A230j263M67k217K846j686o04L283k433o29k59L970l953J237J463j652m63
1267f63O63K651m010J855k88M56r18J533K68l389L008j127J364k318J761j020
1283a74o04J885j024P92k578K778k118R51J087j780o5k1J882k488K474k314N76
1300g41L83l90J334j648J118j715K801k366J793j19k003J959q38J592j894J661
1316I27k137J388K31p86J682k640J520n86J817k295J489m09j543K050o00J173
$$ plain form
1200 -227 2006 -527 6 794 -1134 1246 -315 1523 -1848 -84 -49 261 -178 -391 1121 -3401 1607
1217 1607 847 -730 -1629 1146 -569 -1846 2675 -1218 -657 -1164 1183 12 -565 559 -475 -18
1233 -18 -1534 3253 -1460 -740 959 -612 -593 724 1423 -3083 1424 -214 -191 187 364 -485 -2272 1230
1251 1230 -33 434 -1783 1063 -623 -1227 2056 -377 -1006 -1265 2705 -1248 -11 1452 -200 -663
1267 -663 0 2651 -1359 496 208 664 -254 1279 1547 -1842 1166 39 1403 -915 846 -174
1283 -174 -778 1107 83 875 -1703 1075 -1043 -92 995 -785 -850 -871 1011 -1477 997 -1317 -741
1300 -741 -358 -748 586 -1062 56 -1659 1142 -1224 569 450 -1553 406 -432 1160 -734 927
1316 927 -1210 178 409 -377 1305 -1335 185 -401 1416 -879 610 201 -1342 708 108 1281
1332A281k459J796r21O04P4k87L33k294L399j248j5r76J453j126j30K374k397
1349e39R28j130K232k156J233M54j958J214l79J894k951J981o83n88M65O83J91
1366H91k871K946j357L74k47J272k036q43L571k066%n47J795k661J456J699k396
1383a020J76k74K481k975J817K02p68j059J486J523l433K776j202l0j4J870j504
1400E2j345K310j589J421j210J374j455J22J259q34O00j606K012k246J813K41
1416I19r98J2j04J255k017K403j640Po21J411L99j717J640j836J573j172J615
1433A129j150o05M82k70J171j727J939j685N79QN58n1j535J417j214K093j724
1450e85J110p30n98J113k71O57k051J799j139M53M23j46j00j215K188j636J208
$$ plain form
1332 1281 -1178 618 -303 301 375 88 421 -1873 1526 278 263 -713 740 -386 -516 1858 -539
1349 -539 389 -741 1491 -665 568 1022 -936 278 -101 1793 -1158 823 140 -448 17 700 891
1366 891 -1980 966 -391 -17 -264 1008 -1028 -1871 1700 -366 -366 -913 882 -1779 -323 1376 -1020
1383 -1020 -844 -1118 1363 -1612 205 407 -361 -1420 66 1589 -1844 932 -270 -300 -314 1556 52
1400 52 -1293 1017 -572 849 -361 1013 -442 -320 939 105 705 -901 1111 -1135 678 919
1416 919 -79 -67 -171 1084 -933 1470 -170 -163 -784 627 1026 -691 949 -887 686 -486 1129
1433 1129 -21 -626 -144 -414 757 -970 969 -716 -137 -129 429 378 -1157 260 -954 1139 -585
1450 -585 525 -205 -803 310 39 696 -1355 444 -695 -242 181 35 -65 -1280 908 -728 480
1467D80j016O86q11J70J306j413J087j231J201j329J732k10j678J251mL96j635
1484a018K494j835k09J120K55m20j228J934j763J072k35J136j777n06K610j802
1500a72L69o93J561k384J372J038j410L10k58J027k242K437q45o07k30P06R42
1517I21j758J910k119O05J26J175j163q23K065j974J124j08R13k161Q51R23r52
1534d45O93o32R70k191K238k32p36m38L91R18j572K131j869N46o09J370k55r03
1552f25J461j602J064q65J775j218L6M25p36J146j069J247j692J405q13N18L52
1569H09j239J322j404J485q34J083j514J86N88p62J291j710J470j460J133k71
1585A73j70j00o60J398j757J536q42N40q52M32L75n89J159j669J337j171J895
$$ plain form
1467 480 -536 150 -661 -491 815 -598 489 -742 459 -870 862 652 -1026 225 221 617 -1018
1484 -1018 1476 -359 -568 552 807 387 -841 1093 -670 402 167 1303 -474 -980 1630 -172
1500 -172 197 -496 1065 -1319 53 1091 -319 -9 -267 760 -1482 955 110 -497 -727 -21 921
1517 921 -837 1073 -1046 -441 -315 860 -303 -1126 939 -1035 89 -19 894 -1267 -416 507 -445
1534 -445 248 -384 586 -1605 633 401 -335 -773 -382 536 -1036 1095 -774 -228 -837 533 278 -625
1552 -625 836 -766 298 -567 1208 -10 26 451 -285 861 -208 1039 -653 752 -61 457 809
1569 809 -430 892 -512 973 139 1222 -292 -106 482 -280 1011 -699 771 -689 444 173
1585 173 3 -97 -757 641 -1116 420 -422 118 -734 -302 73 -516 643 -1026 311 -860 1035
1602A035j205o00J111o08O57q27J486k094O27N71R6m45l43J217j895J360J32K98
1620E73j363M87P57j334J190k73O42j809J788m90m90Q08p23L41r99J952j145N4
1638c4MM21l8p01J661j963J061j02P78j306R1J110j854J378l89Q34j886J237k99
1657Ck85P36o33P27j923K020m20o19k6J83K58j049J733j448O54o42R01n24J25
1676b29O61j266R18r54J514j338P94j62n63P17k17Q94j744J226m29L38j20J17
1694A57L0j177J801j064R38j182L92K19k31Q31p94P10j588J478m58o5J35j24J37
1713A45o85J510j137Q01j127P68L40p45P62j216Q88q29J553j110K3K57m79O60
1731C79p63J199j508J311q34J54K22k74L09j378J429o89P97j144J000n17m14J380
$$ plain form
1602 1035 -170 -770 341 -267 390 -437 1049 -1045 -418 153 249 -196 -539 678 -1217 143 275 573
1620 573 -790 -303 454 -880 310 37 679 -1130 658 168 -322 486 -237 104 -895 1057 -88 -34
1638 -34 -30 391 353 -348 1313 -650 411 309 1087 -219 -128 982 -872 506 117 951 -935 302 3
1657 3 -282 454 -179 548 -1375 645 225 -394 -420 -237 21 -1028 705 -743 -89 -731 170 -354 -229
1676 -229 432 -834 84 -870 644 -694 100 -62 -625 92 -125 769 -975 251 -178 160 40 157
1694 157 187 -990 811 -253 685 -497 -105 114 -117 714 -80 630 -958 520 62 -3 132 8 145
1713 145 -540 970 -167 634 -493 275 615 -130 632 -584 304 -525 1028 -82 -59 198 -281 379
1731 379 -384 815 -693 618 -216 -62 160 -114 195 -1183 246 -443 354 -790 210 -307 -721 659
1749F59r17N06j500J766j239L71K10k60n1m01J799j551P10l77M01k84j90J142
1767G94j664R53n52J188j035M77J41j210J195j80P16j411J195p35K63M25l65J57
1785C52j106J676j303Q28m34P7o2l90J444j406Q62q40Q54p77K54N69j323R21n85
1804c89J210j202N58m51Q3K56l30P88j073R32r33N97j97J73k7p45J485j089P05
1823C51q54O81p30R8J043j191Q60j035J154p79M90j37j13k2l56J314j203P65j042
1842g06Q05k41L74K89j288J110q29J208j119J014o63l26O88m59J032j447J136
1859E78p84M82j17Q6l8p82J512j209O22m72P90o92j90J034r38L54j040J209j188
1878g83Q22M15o21K07n45J538j819J131o90M4l5O9P81j465J462r95P92o25M90
$$ plain form
1749 659 -258 248 -1252 514 -725 -354 -144 -404 -455 -856 943 -608 102 -275 126 -158 -348 794
1767 794 -870 83 -469 719 -316 161 302 -908 287 107 823 -588 607 -128 135 560 195 352
1785 352 -754 922 -381 447 13 90 28 -362 1082 -324 538 -302 552 -225 29 598 -725 196 -389
1804 -389 821 -381 177 -274 -191 65 -265 523 -550 382 -551 46 -151 22 -5 -750 735 -354 351
1823 351 -503 178 -552 -454 589 -602 258 -777 377 -402 88 -49 -162 -184 -540 774 -429 336 -706
1842 -706 99 -142 232 521 -767 343 -486 722 -397 617 -46 -372 316 -143 889 -558 578
1859 578 -206 276 159 245 207 -575 937 -272 350 -122 668 -24 -214 820 -118 236 -804 405 -783
1878 -783 39 454 -167 40 -505 1033 -786 345 -345 -301 -336 -267 514 -951 511 -484 308 -317 173
1897A73q5o93P15n53J113j417J323j382P53L40k81J57o08J179j593J391n29K8
1915C1m43K0J021j316J215r75O03p38R21J79j455J387o66O72j219J415p62k42
1933c52M03m7O76j169J109p46O48j46p3k68n05J048o40N54j036J185j052N22K57
1952C68m26J99p61J020j058J069p02J29j72m1Q26j080J171j195P77m52O84j86
1970A70o26O45n26M98o61J185j107N6N33k37L13o36Q00r40M78j43J75k3o42J223
1990E35j057P63m17L15o87K66O76o95O57q22R73j174J104l88k11L19k23R65j343
2009d44J245j118L03j1N20M8j091J313r96P53o83P22q59J63P54q96P98r93J222
2028G50j458R03O1k89R8o27J091j163Q86n38L83n71K87L44q10J141r19M05m13
$$ plain form
1897 173 88 -605 110 -443 670 -747 576 -806 -53 287 6 163 -445 734 -859 532 3 31
1915 31 -412 -392 629 -687 528 -447 156 -582 339 518 -937 450 -216 456 -763 652 -110 -352
1933 -352 51 4 680 -489 620 -126 522 376 303 35 -470 578 -62 492 -544 641 -411 111 368
1952 368 -58 141 -620 400 -658 411 -291 -162 -334 -375 451 -629 542 -653 124 -328 356 170
1970 170 -456 189 -337 161 -500 685 -422 -366 167 -70 243 -393 407 -533 -55 -198 -23 -46 -688 535
1990 535 -522 241 -176 139 -548 -282 394 -301 356 -466 507 -667 437 49 -162 157 -66 899 -444
2009 -444 801 -317 -14 -25 495 543 -548 765 -231 522 -161 561 -298 -135 619 -277 521 -472 750
2028 750 -708 195 256 -33 65 -562 529 -634 252 -286 97 -474 -187 157 -653 488 -431 -26 -439
2047d39R19p90j51O59n13N95j100J458j205L59J93lL62p76P09j070J059k92L24
2066B98k41k10L91p17Q17p31P71r10N81J32n0L93r05O85p85J456j052K11l6j07
2086iJ98l98Q42j033Q01m35L39l87K4M92q60O64n11Q85j092N10N1j69L95n68P03
2107D42j017Q12l23K88m79J14N57j151J117o81P19j105O96j75j61O44n97O66j121
2126g55J207o68LL1k7J02j36O11j014O74j96J92Q1k54P25j027R35p50Q76r72N12
2147A50K44o85L97N1K36j014J091n13K54P2k61L55p93J077n33L08o53N65Q2l88
2167D2M72r04R36r73Q27n31J93n1p8M80o11P97j302Q11l67K71k77J35L41r15J122
2188D18q22M66n29N91mp17Q86n84N25q61P08l4l13M26o58L87n76J297j037N57
$$ plain form
2047 -439 480 -310 -461 198 -315 280 -820 638 -567 -208 -15 -18 344 -432 277 -793 266 -26 298
2066 298 57 -153 238 -479 338 -393 378 -532 49 181 131 524 -381 304 -481 975 -77 134 98 -9
2086 -9 189 -209 633 -400 401 -34 305 -82 -58 434 -426 238 -273 612 -480 30 81 -88 307 -261 442
2107 442 -575 237 -86 202 -277 -163 394 -757 360 -321 398 -707 -11 -186 -347 297 -300 366 -755
2126 -755 452 -216 -213 -182 -209 -107 -243 368 -646 28 -168 24 105 -149 576 -451 484 -266 610 -362 150
2147 150 394 -291 106 157 393 -621 470 -43 211 283 22 377 -416 661 128 436 -217 348 430 42
2167 42 514 -390 546 -427 400 -131 62 11 -67 413 -198 599 -703 108 -259 12 -265 -130 211 -704 418
2188 418 -404 62 -467 124 120 -597 289 -295 230 -631 77 43 -270 156 -502 -115 -691 606 -431 126
2208A26j53j07J80m17R11j082R36p85O31l30L33J67o95O48o01Q52q53M74j37k25
2228a27M77l15M00j034J087k78J83m14J91On56R86q93O92o22N54m66K80J75p46
2248d20P93p89R57j051O49l41J90J68k44L79q57O72m54M92k95K09O2n09P47n84
2268b26M63o65N66k15k71N12k75J72n57Q37p20K95J60j29J05n01R26p54N41n31
2288b67M83m47j77P70o63M24m57P36p67L77Q7q0q6q1O88r72O16k24J9M07k62K28
2310C52n80N05l23M41n79M83k98k10P63n44J41p91P30k03O4K18m46N46o61P36
2330C44m87L01l10J87l99M1N14o74N76n10N65m49N75p3r14Q14n04O13r50J266
2350E26o73r0K03J16K37r97J133p41N83m06K31k12j84Q66p26O4l20P63o45M79
$$ plain form
2208 126 -27 -134 46 -371 540 -542 394 -391 240 -90 243 410 -285 363 -238 614 -239 235 98 -127
2228 -127 350 35 435 -599 488 210 393 -21 170 176 -380 606 -287 405 -217 337 -129 151 326 -420
2248 -420 373 -416 541 -510 139 -202 -12 156 -88 291 -566 106 -348 144 -151 58 120 -389 358 -226
2268 -226 237 -428 138 -77 -348 164 -111 61 -496 341 -379 -84 76 -53 52 -449 477 -277 264 -267
2288 -267 216 -231 -408 362 -301 123 -334 402 -365 12 99 19 -67 -148 540 -432 184 -40 -21 386 124 352
2310 352 -228 277 -46 395 -184 299 1 -209 554 10 151 -640 90 -113 -49 169 -277 269 -392 344
2330 344 -143 158 -152 35 -364 -323 191 -483 93 -417 148 -301 274 201 -713 101 -403 210 -740 526
2350 526 -147 -237 -34 82 319 -678 455 -286 297 -109 122 -90 -274 592 -134 -70 -390 373 -272 207
2370B07j18j87J39k94R00j272Q05J13j74P6m79P44q82P29n06M87k86J53K99r32
2390d78Q34o40N85p57P47l89j73N75p60O68m80N88q70Q50k30j64j38k83Q58q31
2410d88P14l44K88m69O4L82l67L14m56O49n47N41m08j35R2j9N03q13P08n78M97
2431A28k03m2J11k19M92o04N97n12M97m03L72K68q65N59l71O06p98Q36k18k37
2451fj1j25L60n03O37m06L67p5J08J41n56N42r72N74l84O76m08k34N54o58P50
2472C71n76O50q40N02j30N0K0k96M57o29N28k34J15j89J60J17r2L27p52M91n46
2493d96R72o77o6L71k59J31k33O43o35K34P9k18M47o76Q68p83M16l8K69l42l02
2514b95N79n29K86l7L76p86M20j05J83j64k03O40p33O76j00o4p8r6M36o11O85
$$ plain form
2370 207 89 -98 41 -253 647 -625 180 293 119 195 -284 460 -422 307 -199 288 2 155 454 -478
2390 -478 356 -284 301 -456 291 -98 -271 304 -456 212 -268 320 -550 300 70 -94 -232 -515 343 -488
2410 -488 226 -118 170 -299 -235 147 -220 94 -362 287 -260 281 -127 -262 -170 -189 314 -499 209 -369 128
2431 128 -75 -117 -6 -225 267 -337 260 -252 245 -158 214 482 -383 176 -195 411 -387 449 231 -6
2451 -6 -17 -142 218 -285 352 -54 313 238 346 487 -69 473 -499 75 -309 367 -41 -275 279 -379 371
2472 371 -205 445 -395 107 -23 27 47 -249 208 -421 107 -127 -12 -201 -41 76 -16 311 -441 50 -496
2493 -496 476 -201 -267 104 -155 -24 -257 386 -249 -15 64 -154 293 -383 485 -298 118 80 349 7 -295
2514 -295 284 -245 41 4 380 -406 14 -91 92 -72 -275 365 -368 308 208 144 66 -30 406 -205 480
2535D80m46K73o63M71J83n93K82m05P43n30O13l91k51J77NL70o73N20p54P89k68
2556f8K5M4k05M24o48R21q06M81n71K02O7J55r1j08L92p63P41k63j5J66j82K70
2578A68n02O16p28L93j15J90r2k39K34l90P19o38Q00l41k36K68j65K66p60Q65
2598C13o21N24k40J76J28k68L62q08Q39p09P66m46n6K77k81J05j34K88n49O17
2618B83o02L90O4l97N86p29N95m85O77l14J67l25M6J25l32K94l97N61m80L57L
2639H7m76M36n13Q16o83M27k73J33J62l37K13k58M55k64K60l30K62l37j53P43
2659C70n86L15l76N47m56J58K97l30Q0k57P24q08M95l35J41p0l1K09k33N94l72
2680G6K25k52q8J47j16K67k45M30n48K57j10K3N9k91K53k47O70p48K53N4k17J61
$$ plain form
2535 480 34 307 -356 115 298 -295 -13 -418 325 -205 408 17 -234 -57 -52 318 -355 165 -589 200 -68
2556 -68 -43 1 -204 220 -428 493 -313 168 -403 -201 -134 21 -70 -178 214 -549 192 -71 -86 80 -102 168
2578 168 -334 282 -446 -53 -168 22 -70 -309 -75 -465 254 -384 416 75 -161 107 -58 208 -552 313
2598 313 -308 216 -24 152 280 12 374 -434 405 -304 462 16 -40 237 -44 61 -73 215 -334 283
2618 283 -319 71 135 -262 324 -405 190 -295 382 68 235 -90 -44 81 -251 43 -354 207 -273 84 87
2639 87 -389 47 -466 350 -333 94 -179 -46 116 -221 -8 -266 189 -75 185 -145 117 -220 -373 370
2659 370 -216 99 -277 270 -186 -28 269 -61 19 -238 486 -322 173 -162 -21 -91 -122 87 -146 448 76
2680 76 301 49 -39 108 -8 259 14 444 -104 153 43 66 125 -166 87 -160 510 -238 15 69 -148 13
2702A3j55K46n13K58o3K93k86J28o4j87N02n24M84m44L22j80j46K45p3M73q23
2723d94O75l64J11j43P0N22m16L67n26Mk12M13j03j05L79l73L54k10L25k74R1
2744I1K28m74N01m66Q46j101P86o16L00O7n5J57m31N58o33N71o77N20l21l9M41
2765B53k23J3j68M75m31J08J02r9J22o44O13n28N36l27n1L73o15J023r12N22o39
2786d97O95k63O1K4m66M27j99M05l77M09o11L06J61l17M14o94P90o33M89j69K10
2807A65j78k93K80M5L00m59L46l02J13R2J27j67k53N57k56J85o40L45J85k47M81
2828D26n54L07l99M49k23k64L72k18L65m46K35l37M74k80j92L50j56L09m72N80
2848C26o89M89l99L46N4m11N55n86O51p36M93l75K74J69k25K72m12L28n35M69
$$ plain form
2702 13 -142 104 -409 -151 -214 79 -207 -79 -143 -330 172 -352 132 -312 10 -170 -316 -71 -144 329 -494
2723 -494 181 -183 -72 -215 -145 377 -39 328 -198 -194 -406 7 -96 -201 178 -195 159 -51 274 0 91
2744 91 319 -155 346 -120 726 -375 411 -205 95 162 107 264 -167 391 -242 329 -348 172 -149 -188 253
2765 253 30 43 -125 350 -81 27 129 30 152 -492 121 -407 129 -198 -249 124 -491 532 -380 142 -497
2786 -497 198 -65 -4 20 -446 -19 -218 187 -190 219 -392 -86 75 -242 172 -522 268 -365 124 -45 165
2807 165 -13 -306 -26 19 319 -140 206 -96 17 109 236 69 -184 373 117 302 -338 7 192 -55 426
2828 426 -128 179 -220 229 6 -258 114 -104 261 -185 50 -287 187 -93 -285 65 -91 218 -254 326
2848 326 -363 126 -273 73 127 -284 271 -315 336 -400 93 -282 -8 161 -64 208 -204 124 -411 58
2868E8k17o6J34j26O18o37N89o41M66l84K80%l53N65l66K20j02K33k23L5K43m28
2890a02J22k17M86m21J04K11J08o15n5N00n46O78j45P0k28l9K58k29L69m95L99
2911B13l18R5J36l26O43n72K36m22Q21p33K25J28k52J95k82L43o38O37l09K25
2931D5j54k49L76l36L92m94R05n60K02k75J23k2n74Q18n50L94j78M0J8L38j76
2952H3l35M31o06P97j070Q71l1n14L98k35N26m60M12m82K57L1j70K75n00N94m50
2973a78K32J9k9K3l45O44m57M35n80M44m62K65pq0N62o54L38j33M09o12J97J32
2995A63k23K28m44O95m63J05j89K10j7m78O08o12M84j72M25p49L14J56J3L08m81
$$ plain form
2868 58 -159 -225 -91 -217 401 -236 353 -288 178 -206 74 74 -279 286 -80 140 38 271 48 83 326 -102
2890 -102 20 -197 289 -132 -28 183 291 -324 -379 121 -425 253 108 178 -50 -89 169 -60 309 -186 213
2911 213 -105 -10 126 -200 443 -129 107 -315 506 -227 -2 126 -126 69 -213 130 -508 129 -180 45
2931 45 -109 -358 18 -318 74 -420 485 -75 127 -148 -25 -47 -621 197 -353 41 -137 -97 -79 259 83
2952 83 -252 179 -427 370 -700 171 140 -374 24 -211 315 -145 267 -215 42 73 -97 178 -322 272 -178
2973 -178 54 73 44 67 -278 366 -91 344 -236 208 -254 11 4 -76 486 -168 170 37 446 -166 31 163
2995 163 -60 168 -276 419 -44 61 -128 82 65 -413 195 -417 67 -105 320 -429 -115 41 54 362 -119
$$ [...]
8191a70
##END NTUPLES=NMR FID
##END=
