##TITLE=1H_CA-8762
 CDCl3, 8 sc, 
 21.9.2020
##JCAMPDX= 6.0         $$ Bruker NMR JCAMP-DX V2.0
##DATA TYPE= NMR FID
##DATA CLASS= NTUPLES
##ORIGIN= UXNMR, Bruker Analytische Messtechnik GmbH
##OWNER= root
$$ XWIN-NMR		Version 3.5
$$ Mon Sep 21 10:40:50 2020 Russian Standard Time (UT+4h)  she@DPX200
##.OBSERVE FREQUENCY= 200.1315066352
##.OBSERVE NUCLEUS= ^1H
##.DELAY= (6, 6)
##.ACQUISITION MODE= SIMULTANEOUS
##.ACQUISITION SCHEME= undefined
##.AVERAGES= 8
##.DIGITISER RES= 18
##SPECTROMETER/DATA SYSTEM= spect
##.PULSE SEQUENCE= zg30
##.SOLVENT NAME= CDCl3
##.SHIFT REFERENCE= (INTERNAL, CDCl3, 0, 15.7039)
##AUDIT TRAIL= $$ (NUMBER, WHEN, WHO, WHERE, WHAT)
$$ ##TITLE= Audit trail, XWIN-NMR		Version 3.5
$$ ##JCAMPDX= 5.01
$$ ##ORIGIN= Bruker BioSpin GmbH
$$ ##OWNER= she
$$ F:/spectra/data/she/nmr/H-F/1/audita.txt
$$ ##AUDIT TRAIL=  $$ (NUMBER, WHEN, WHO, WHERE, WHAT)
(   1,<2020-09-21 10:39:34.20 +0400>,<she>,<DPX200>,
      <created by zg, POWCHK disabled, PULCHK disabled
       configuration hash MD5:
       00 E9 B6 7A A2 85 ED C7 34 08 36 98 17 FE 4E 26
       data hash MD5: 16K
       B2 3C 67 5B 86 65 E2 77 DB 75 56 03 BB 16 C9 BA>)
$$ ##END=
$$ 
$$ hash MD5
$$ F7 5D 7F C5 76 D1 3A E9 49 53 0A D0 5C 5A 5B 3B
##$RELAX= 
##$RELAX= 
##$RELAX= 
##$RELAX= 
##$RELAX= 
##$RELAX= 
$$ Bruker specific parameters
$$ --------------------------
##$DU= <F:/spectra>
##$EXPNO= 1
##$NAME= <H-F>
##$PROCNO= 1
##$TYPE= <nmr>
##$USER= <she>
##$AMP= (0..31)
100 100 100 100 100 100 100 100 100 100 100 100 100 100 100 100 100 100 
100 100 100 100 100 100 100 100 100 100 100 100 100 100 
##$AQSEQ= 0
##$AQ_mod= 1
##$AUNM= <au_zg>
##$AUTOPOS= <>
##$BF1= 200.13
##$BF2= 200.13
##$BF3= 200.13
##$BF4= 200.13
##$BF5= 200.13
##$BF6= 200.13
##$BF7= 200.13
##$BF8= 200.13
##$BYTORDA= 1
##$CFDGTYP= 0
##$CFRGTYP= 5
##$CHEMSTR= <none>
##$CNST= (0..31)
1 1 145 1 1 1 1 1 1 1 1 1 1 1 1 1 1 1 1 1 1 1 1 1 1 1 1 1 1 1 1 1 
##$CPDPRG= <>
##$CPDPRG1= <>
##$CPDPRG2= <>
##$CPDPRG3= <>
##$CPDPRG4= <mlev>
##$CPDPRG5= <mlev>
##$CPDPRG6= <mlev>
##$CPDPRG7= <mlev>
##$CPDPRG8= <mlev>
##$CPDPRGB= <>
##$CPDPRGT= <>
##$D= (0..31)
0 1.2 0 0 0 0 0 0 0 0.06 0 0.03 0 0 0 0 0.0002 0 0 0 0 0 0 0 0 0 0 0 0 
0 0 0 
##$DATE= 1600670373
##$DBL= (0..7)
120 120 120 120 120 120 120 120 
##$DBP= (0..7)
150 150 150 150 150 150 150 150 
##$DBP07= 0
##$DBPNAM0= <>
##$DBPNAM1= <>
##$DBPNAM2= <>
##$DBPNAM3= <>
##$DBPNAM4= <>
##$DBPNAM5= <>
##$DBPNAM6= <>
##$DBPNAM7= <>
##$DBPOAL= (0..7)
0.5 0.5 0.5 0.5 0.5 0.5 0.5 0.5 
##$DBPOFFS= (0..7)
0 0 0 0 0 0 0 0 
##$DE= 6
##$DECBNUC= <off>
##$DECIM= 32
##$DECNUC= <off>
##$DECSTAT= 4
##$DIGMOD= 1
##$DIGTYP= 9
##$DL= (0..7)
0 120 120 120 120 120 120 120 
##$DP= (0..7)
150 150 150 150 150 150 150 150 
##$DP07= 0
##$DPNAME0= <>
##$DPNAME1= <>
##$DPNAME2= <>
##$DPNAME3= <>
##$DPNAME4= <>
##$DPNAME5= <>
##$DPNAME6= <>
##$DPNAME7= <>
##$DPOAL= (0..7)
0.5 0.5 0.5 0.5 0.5 0.5 0.5 0.5 
##$DPOFFS= (0..7)
0 0 0 0 0 0 0 0 
##$DQDMODE= 0
##$DR= 18
##$DS= 0
##$DSLIST= <SSSSSSSSSSSSSSS>
$$ [...]
##$SUBNAM2= <"">
##$SUBNAM3= <"">
##$SUBNAM4= <"">
##$SUBNAM5= <"">
##$SUBNAM6= <"">
##$SUBNAM7= <"">
##$SUBNAM8= <"">
##$SUBNAM9= <"">
##$SW= 16.880792210976
##$SWIBOX= (0..15)
0 0 2 0 0 0 0 0 0 0 0 0 0 0 0 0 
##$SW_h= 3378.37837837838
##$TD= 16384
##$TD0= 1
##$TE= 0
##$TE2= 300
##$TE3= 300
##$TEG= 300
##$TL= (0..7)
0 120 120 120 120 120 120 120 
##$TP= (0..7)
150 150 150 150 150 150 150 150 
##$TP07= 0
##$TPNAME0= <>
##$TPNAME1= <>
##$TPNAME2= <>
##$TPNAME3= <>
##$TPNAME4= <>
##$TPNAME5= <>
##$TPNAME6= <>
##$TPNAME7= <>
##$TPOAL= (0..7)
0.5 0.5 0.5 0.5 0.5 0.5 0.5 0.5 
##$TPOFFS= (0..7)
0 0 0 0 0 0 0 0 
##$TUNHIN= 0
##$TUNHOUT= 0
##$TUNXOUT= 0
##$USERA1= <user>
##$USERA2= <user>
##$USERA3= <user>
##$USERA4= <user>
##$USERA5= <user>
##$V9= 5
##$VALIST= <valist>
##$VCLIST= <CCCCCCCCCCCCCCC>
##$VD= 0
##$VDLIST= <DDDDDDDDDDDDDDD>
##$VPLIST= <PPPPPPPPPPPPPPP>
##$VTLIST= <TTTTTTTTTTTTTTT>
##$WBST= 1024
##$WBSW= 4
##$XGAIN= (0..3)
0 0 0 0 
##$XL= 0
##$YL= 0
##$YMAX_a= 160491
##$YMIN_a= -48480
##$ZGOPTNS= <>
##$ZL1= 120
##$ZL2= 120
##$ZL3= 120
##$ZL4= 120
##$ABSF1= 10
##$ABSF2= 0
##$ABSG= 5
##$ABSL= 3
##$ALPHA= 0
##$AQORDER= 0
##$ASSFAC= 0
##$ASSFACI= 0
##$ASSFACX= 0
##$ASSWID= 0
##$AUNMP= <proc_1d>
##$AZFE= 0.1
##$AZFW= 0.1
##$BCFW= 1
##$BC_mod= 2
##$BYTORDP= 1
##$COROFFS= 0
##$CY= 11.3945322036743
##$DATMOD= 1
##$DC= 2
##$DFILT= <>
##$DTYPP= 0
##$F1P= 16.9975609425685
##$F2P= -3.02152046262296
##$FCOR= 0.5
##$FTSIZE= 0
##$FT_mod= 4
##$GAMMA= 1
##$GB= 0.15
##$INTBC= 1
##$INTSCL= 1
##$ISEN= 128
##$LB= 0.24
##$LEV0= 0
##$LPBIN= 0
##$MAXI= 10000
##$MC2= 0
##$MEAN= 0
##$ME_mod= 0
##$MI= 1.114404
##$NCOEF= 0
##$NC_proc= 0
##$NLEV= 6
##$NOISF1= 3.799351
##$NOISF2= 2.8
##$NSP= 1
##$NTH_PI= 0
##$NZP= 0
##$OFFSET= 15.70392
##$PC= 1
##$PHC0= -9969.257
##$PHC1= 12.0009
##$PH_mod= 1
##$PKNL= yes
##$PPARMOD= 0
##$PSCAL= 0
##$PSIGN= 0
##$REVERSE= no
##$SF= 200.130013532006
##$SI= 16384
##$SIGF1= 3
##$SIGF2= 2
##$SINO= 400
##$SIOLD= 16384
##$SREGLST= <1H.CDCl3>
##$SSB= 0
##$STSI= 0
##$STSR= 0
##$SW_p= 3612.71676300578
##$SYMM= 0
##$S_DEV= 0
##$TDeff= 0
##$TDoff= 0
##$TI= <>
##$TILT= no
##$TM1= 0
##$TM2= 0
##$TOPLEV= 0
##$USERP1= <user>
##$USERP2= <user>
##$USERP3= <user>
##$USERP4= <user>
##$USERP5= <user>
##$WDW= 1
##$XDIM= 8192
##$YMAX_p= 0
##$YMIN_p= 0
$$ End of Bruker specific parameters
$$ ---------------------------------
##NTUPLES= NMR FID
##VAR_NAME=  TIME,          FID/REAL,        FID/IMAG
##SYMBOL=    X,             R,               I
##VAR_TYPE=  INDEPENDENT,   DEPENDENT,       DEPENDENT
##VAR_FORM=  AFFN,          ASDF,            ASDF
##VAR_DIM=   8192,          8192,            8192
##UNITS=     SECONDS,       ARBITRARY UNITS, ARBITRARY UNITS
##FACTOR=    0.000296,      1,               1
##FIRST=     0,             0,               0
##LAST=      2.424536,      0,               0
##MIN=       0,             -48480,          0
##MAX=       2.424536,      160491,          0
$$ Real data points
##PAGE= N=1
##DATA TABLE= (X++(R..R)), XYDATA
$$ [...]
1826f7J99m40J90K29n56M91r75Q19n15L62k05l54O58o03O89r33J011m46L10l16
1846d52M6M70p25Q45o51R37j195Q06j17n3L89o07R18j134J183o92K70M2j24M72
1866F28p93P29m12O18o28L73k91l39N56o35J146j105O37o92M91J31m82M87n54
1885a35P58r88R96p89L68j06J53J28q45J099j056Q28m29K09J31j54N26q08P26
1904F12o32O75n98K53J1j61K05n09N24o44M44k47q3K19k90L59o10Q00r82M49k13
1925d18n6N62p80P33r00O43l68L63m03J83K24l17L37m63O88m49N21l15j4M54n18
1946b93N54o61P04n27M69l73J49L02n55R08q11O02q47O74k73J2K16o39O23r17
1966f83J072p54M46l78K11K70n86M59o11P55n90L69k90o0M17o44O72p76N25k54
$$ y = [-67, 132, -308, -118, 111, -445, 46, -929, -110, -625, -263, -468, -822, -164, -767, -78, -1011, 0, -446, -136, -452, -406, 64, -661, 184, -467, 470, -725, 81, -36, -89, 300, -307, 611, -523, 660, -32, 238, 280, 156, 628, -165, 564, 152, 770, 142, 515, 224, -115, 441, -194, 952, -153, 484, -208, 283, 414, -68, 419, -135, 623, -365, 631, -158, 210, 104, 257, 385, -460, 639, -417, 411, -18, 191, 322, 168, 694, -114, 612, -20, 655, 57, 310, 321, 160, 365, -144, 380, -264, 180, -67, -150, 69, -221, 138, -472, 328, -654, -205, -418, -474, 88, -692, 41, -859, -216, -584, -221, -624, -441, -217, -534, -197, -660, 28, -421, 100, -215, -229, 225, -293, 261, -400, 304, -223, 246, -127, 22, 324, -231, 677, -134, 468, -379, 295, 22, 34, 250, -389, 234, -683, 389, -365, 81, -297, -86, 184, -402, 57, -554, 201, -389, -20, -310, -370, 47, -597, 75, -701, -176, -430]
1986d30J88P1o0L10n88P08p32O03m63K51K01l23L03n59Q66n83P16n60R2m0L0M51
2008D52m48M92p05O02k60k6J56j42R8k53N74o84N22j37L9N0l56K87j48L45p32
2029b74P26k33nM0k63M06q37R04o18N93p79L30J21m25N03n26P83p02J23%nj5j75
2052c28N42r28Q28o04N36l45N5J5m61P64j002R81n37M90n94M46m0k26N46q77O39
2073a00k79J67l3l0K93l03M91p04M23l04M23j78j81L24k68M47o25O57p47N76N2
2094A01k12M57p31M81l80N88l05Q5j49pL03m87R26o47N09j12j77R0l60L81n78
2115b24P62n30M65o70M41j41K8K50p64N68k60L69l74J62k04M2K95n97N21n94M70
2136A5m74M70j1m21O59o76O61q93R15k84j94K99p09O35m58N73n23O70m90M48k00
$$ y = [-430, -242, -171, -231, 79, -509, 199, -533, 70, -393, -142, 59, -264, 39, -520, 346, -237, 479, -81, 11, -29, 1, 452, 4, 496, -209, 393, 133, 107, 263, 121, 219, -34, 540, -144, 378, 241, 280, 330, -26, 261, 113, 458, -274, 452, 219, 214, 254, -9, 397, -440, 464, -154, 439, -340, -10, 111, -314, 189, -337, 446, -256, -133, -133, -138, -153, -328, 214, -714, 114, -490, 46, -299, -244, -229, -690, 74, -928, 53, -484, 6, -588, -142, -182, -408, 138, -739, -100, -379, -212, -245, -275, 18, -285, 206, -498, -75, -379, 44, -134, -315, 9, -259, 188, -437, 220, -527, 49, 101, -111, 346, -385, 96, -284, 304, -1, 84, -65, -72, 231, -256, 670, 23, 532, 420, 243, 333, -27, 354, -224, 538, 8, 473, -197, 244, 103, 131, 381, -383, 185, -75, 294, -80, 82, -122, -80, 215, -382, 139, -455, 15, -459, 11, 0, -421, 238, -438, 223, -670, 245, -39, -233, 66, -643, -8, -466, 107, -416, 254, -236, 212, 12]
2157A2j66M16l99M32j96J28l33L22m0m42M77j92R9l08L78o0j75J85m9L55o64N48
2179C28m07M99k94j73L02m61L68l79M47l98K03Kj39M11n41L96o75O18o55L12m0
2200b76j69M42o17L22m35N03l96K22M0k84L99l35J67l76M84l93K10L9L0Q8l27
2221f62N63l26M05l72L34k29J60J92j24K25n26N13n70M09R8k16J72j85K66l33
2241b06R8k45J56K28O2k25k37O95o10K15j61K23R2Q7pk84L93k14K29o32N44J17
2263C18k78O37m79M88l81J50k89L76k65nK35l94N01m74M39l42J36r9j96N07o11
2284b6L00l08L00k82L8n9k46K62k84J04j41J27k52M86k32l40L96l44M97l16J82
2305a38N1n9J85k16K94o71O70m03K13K01J16K71n63L12l54N80m89M80p1j18j6
$$ y = [12, -154, 262, -137, 295, 99, 227, -106, 216, 176, -266, 211, 19, 118, -190, 188, 128, -47, 138, 89, 444, -220, 328, -79, 420, 126, -47, 255, -206, 162, -217, 230, -168, 35, 37, -102, 309, -232, 164, -511, 107, -548, -236, -276, -445, -3, -620, -298, -733, -230, -626, -404, -364, -648, -249, -584, -417, -793, -309, -702, -492, -453, -423, -335, -662, -99, -425, -20, -392, -58, -287, -127, 65, -59, 166, -360, 153, -417, -8, 90, -126, 46, -139, 127, -206, -108, -353, -197, 31, 93, -132, -369, 326, -284, -69, -230, -7, 85, 172, 165, -119, 274, 60, 289, -343, 201, 318, 40, 677, 198, 686, 305, 455, 166, 542, 277, 272, 507, 113, 614, 140, 579, 237, 373, 274, 78, 585, -26, 274, -34, 266, -16, 22, -37, -283, -21, -305, -201, -342, -215, -467, 19, -213, -553, -157, -501, -4, -320, -138, -87, -146, 39, -177, 117, -554, 116, -287, -74, 127, 243, 514, -49, 263, -91, 489, 0, 480, 409, 291, 275]
2326B75k6K85o24L99j22q5N0J71k40m00O59l32K32m64J99j25R5P0k28K55l49N43
2348B38q08N45l2l3O8l06O12l87L60l62L06j37N5J29m91N63k87L97n41L38q9l71
2370b33L93o1K87o27M82m29J85J03k56J13k87L44M4K26m70j13L89l04J81Q5M61
2391E13o55J99q1j45P9j47L10k66N18n38M74k06N7R4j22M6l89M52l81K50K0J03
2413A85J35k85L23l19J65k54K57l07m8O3j87K16k63M47l09K30j08k36K99n8K19
2434A65n42M71n75M85k88o2M18m73K92k63N57l81J86o9K04m28L5J02l34O39l11
2455a72L07l61p8K64l14O82m36N2j31K49j34J40j60k9K72n66P72m38q9M46k81
2476eM38k31M05n24Mk08L30Q4k71L39j87L40n82L21L0k95Q6N6J34n40N89k31K35
$$ y = [275, 249, 534, -90, 309, 187, 102, 152, 323, 83, -317, 342, 10, 242, -222, -23, -148, -53, 17, -211, 44, -305, 238, -570, -25, -57, -90, -22, -328, 284, -103, 257, -105, 201, 64, 119, 248, -243, 320, 33, 430, -111, 227, 138, -233, 160, 99, 386, -241, 241, -188, -3, 100, -156, -43, -330, 14, 58, 284, -186, -299, 90, -214, -33, 52, 513, -142, 57, -24, -169, -90, -237, 73, -193, 325, -213, 261, 55, 112, 206, 84, 130, -259, 193, -188, 62, 82, 185, 320, 35, 358, 39, 204, -50, 207, -100, -148, -85, -272, -56, -319, 128, -181, 49, -59, -295, 4, -54, 165, -377, 94, -481, 4, -284, -346, 72, -401, -109, -372, 185, -196, -10, -79, 125, -303, -268, -166, -500, 139, -172, 135, -226, -304, -40, -354, 328, -108, -56, -187, 62, -72, 68, -92, -121, 151, -415, 357, -81, -170, 276, -5, 433, 202, 607, 83, 87, -121, 209, 293, 22, 361, 174, 514, -68, 253, 283, -12, 74, 130, 264, -276, 313, 82, 317]
2499C17k29n4J08k96K21k52L71l67L9K43q1l1o7j92J13K78n34K64k6j92N26l31
2521a72M26m79L29j35P1N7J00l68N4L64l53K06l21K04km1J91j51M07m12J39k36
2543a22L19k44O4K12m17O26l77K01k62K89l16J48J39l43K13l52L89k47K38j75
2563a7L38n7k32N34n11J09j47J50J60o6J87m99J18j41J48L42k11K7M3l18R3J68
2585B18k51J14P8k36J96L0o9r4K76m06M65k68j43L26k38N7j83K16m11K17j28q7
2607c21L82l2K83m40J81l43N24k53j17K31l12L91k37j0k76N36j68mK23l19L72
2628B91l28K59l14L13j93j8L40m80M82n17M26k24J72k36K15O0l13K62k10K34k58
2649c7l8K26j64K17k49l4j73L15l70M11Q1n60K01j27J93j32M2J49j56O8j83K10
$$ y = [317, 88, 34, 142, -154, 67, -185, 186, -181, -142, 101, 20, -11, -78, -270, -157, 121, -413, -149, -175, -367, 159, -172, 254, -225, 104, -31, 40, 97, 197, -171, -117, 247, -106, 100, -221, -17, -19, -60, 131, -20, 387, -25, 114, -122, 197, -47, 17, 229, -188, 438, 61, 262, 0, 289, -27, 121, 260, -83, 130, -222, 167, -80, 158, -17, 321, 264, 32, 566, 55, 164, 17, 167, 327, 261, 448, -51, 67, -74, 74, 416, 205, 232, 275, -43, 50, 218, -33, 81, 159, -77, 119, 149, 80, -14, 262, -144, 321, 53, -90, 236, -2, 55, -128, 88, -323, -106, -234, -321, 61, 29, 312, -128, 53, -290, 234, -19, -136, 95, -217, 174, -63, -73, -349, 187, 19, 15, 238, -81, 291, -37, 222, -92, 221, 28, 10, 350, -130, 352, -165, 261, 37, 209, -27, 188, 248, -65, 197, -13, 221, -37, -75, 151, -13, 204, -45, -79, -252, 63, -307, 104, 185, -375, -174, -301, -108, -240, -198, -49, -205, -137, -320, -110]
2671a10m66N16k17q9J65l8L18k79N6R1L97m62J30J6k0Q5O8O2k08N9p2M16k44j83
2695iK61l80L67o29K88J52M64n89L20k26j41O6m0L23l59K85l57K67j78j28L23
2716H0l42K20J03j33m8J24Q1j99L40l75M20l56R4K33k88J57j14L49m52L37j96
2737C5K13j40P3o2J63K12l16Q1n15J24N2nL2O1j9k32L31l72L78k28j17Q2N9K39
2761A29k74K88l2o2l80L07L10l52j05l06P39k65R1k8l3On5j09K47r0KJ07K8j90
2785b7M27n47K11k20L02k54J74j25J8K34m01L9M4L35k96m1j19K10q0k7K01l50
2807b92O8k2k5N84m97K46l57K63q1N2J74k06K60o0j68M8J54q0j20N6j38R7o8L6
2831g6j80K83k76K96q3J60l3r9K01k16L12m30L12j35O0N7J02o2M9P0j16m4K30
$$ y = [-110, -576, -60, -277, -366, -201, -239, 79, -200, -144, -53, 344, -118, 12, 28, 8, 93, 161, 223, 15, 74, 2, 418, 174, -9, 252, -128, 239, -390, -102, 50, 514, -75, 245, 19, -122, -56, -96, 227, -132, 153, -204, 63, -115, -243, 80, -262, -42, 61, -72, -120, 4, 85, -114, 226, -149, 271, -85, 9, 242, -46, 111, -3, 346, -106, 231, 35, 248, 108, 181, 119, 282, 494, 178, 259, -256, -132, -80, -85, -53, 8, -11, -243, 88, -284, 94, -134, -251, -169, -110, 129, -145, 143, 111, 49, -331, -24, 286, -66, -171, -477, 262, -3, 88, 60, 27, 33, -22, -131, 116, 26, 28, 135, 163, -27, 400, -147, 64, -156, 146, -108, 66, -59, -41, 193, -208, -169, -125, 210, -86, -127, -246, -36, -116, -143, 58, -292, -224, -246, -271, 313, -184, 62, -295, -32, -113, -61, 113, -93, 167, 107, -61, -13, 141, 61, -59, -3, -141, -44, -112, -76, -256, 27, -249, 47, -36, 124, 91, -8, 193, -23, 289, -141, 171, 36, 96, 153, 255, 193, 242, 312, 196, 152, 382]
2854C82n57K79k84L25q4N8j63L3L43m48J50m20N65j11j25j64K58j64K20m9n8L8
2876B4k45J56j08K68k99K63P0j68K28m24J47k49MJ62L4L32k26kj64OO2K5K12j93
2900h5k1k89L36O4n0l2O2P6m16K64p8J26p4R0l1rr5J17K64l53O5j08J66k02L51
2925A38o5n4r4j62L75j80j04K21L1k07k0K74k9n7k10Q4M7L49k21j42J94j31K28
2948B65l01K13k21q6J85j51M60o59N72k17J19q4k98N18n37K79p0j3j25J00J99
2969A48l37K65j15P3j55Q1J26m4o5k66L13m7K50m63J40p1L45K29m90OJ7L17k74
2992a7J04k97J89MR8J27k82O5j80R2J03M8P9j66l6k7K37k15K03q7p0M02p27N44
3016A91j27q9j14L18k86K29j48J31j76K2j97K22R6k6Q0k18j3K26J3j85r0R3L8
$$ y = [382, -175, 104, -180, 145, 61, 119, -44, -11, 332, -116, 34, -386, 179, 68, -57, -221, 37, -127, 93, 44, -14, 24, -221, -65, -173, 95, -204, 59, 129, -39, 189, -235, -88, -337, -333, -171, -137, 195, -31, -33, -197, -191, -129, -104, 108, -85, -106, -395, -59, 5, -45, -77, -15, 61, -355, -91, -169, -43, -117, -27, -58, -67, -162, -45, 219, -134, -69, -177, -11, -213, 138, 73, 19, -75, -237, 138, -42, -146, 75, 106, -101, -121, 153, 124, 67, -143, -59, -12, 337, 116, -26, 168, 37, 265, -36, 177, -44, -130, 55, -96, 364, -295, 277, 60, 179, 95, -203, 315, -222, 57, -13, -26, -151, -51, 148, -189, 76, -39, 34, -121, -40, 86, 42, -23, -289, 24, -23, 227, -236, -96, -167, 178, 407, -83, -77, -60, 257, -17, 87, -210, -21, -17, 81, 208, -74, -9, -189, -97, 6, 54, 133, -33, -69, -96, 141, -74, 129, 42, -28, 374, -353, 191, 64, -25, -139, 179, -107, 122, -26, 105, -71, -49, -246, -24, 72, 46, 126, -92, -105, 121, 134, -51, -141, -48, -10]
3039a0K51l57P5k03L95j12Qp6o8l4K37m9J9k35M02m59K59j8Q7q4k23K55Rj21k9
3064h1O7j06K09k22nO9j3M19l58K26m29J14L15k98P4j19K32k87j17M64j82M0O9
3087H1r3j43K57j29K42p3m5m0j3K63j97p8L7R4l60L89k8O5k80j78J89L2j62J09
3111f1J89L3k18L59l52J69j89NK55m17K36L7m2m8J89j15N9Q1n7j61J00r6o6K43
3135A33j10j31N8J14k19R9K95k43R0j23k46M59j71L8J71k56J98p7k34L00j51O5
3157E9m7n7J40m9P8J29m38J40j21J05k4L59l55J60k83J51p0O2j21R8m3P0j98K72
3181A7o2J8n9J8J50j09k78L36m5j89J84n7J63o9p5k4L4K82k40K39l03R2j01p3
3205a51K40qL8j86J85k31K3R7N1r9K97o2k88M9K10j74J63j85p8Q0K69k02K12l07
$$ y = [-10, 241, -116, -41, -244, 151, 39, 47, -29, -97, -131, 106, 57, 76, -159, 243, -216, 43, 25, 112, 28, -195, 60, 69, -52, -81, -14, -120, 89, -133, -138, -69, -82, 337, -21, 205, -224, -110, 205, -93, -19, -138, 94, -193, -310, 154, -28, 12, 81, -12, -155, 102, -27, 215, 142, 97, 57, 44, 307, 110, 32, 69, 163, -197, 192, 164, 229, -51, -229, -40, -8, -170, -61, 128, 161, -57, 302, -50, 119, -70, -65, 190, -227, 9, 46, 4, -44, 145, 30, 89, 170, 113, -48, 52, -44, -110, 133, 23, -108, -50, 64, -155, -56, 239, -4, 86, -37, -283, 176, 5, 43, 214, -42, 156, 79, -155, 145, -6, 59, 12, -45, 95, 46, 124, 253, -185, -45, -166, -61, -85, 274, -81, 79, -204, -53, -123, -61, -182, -84, -127, -57, -255, 17, -45, -27, -86, -68, 82, -27, -305, 31, -14, -203, -19, -76, 87, 18, -57, -81, -47, 235, -5, 234, -69, 23, -78, -151, 89, 81, 119, -67, 118, -113, -90, 7, 58, -41, 256, 194, -94, -45, 165, -9, 154, -31, -109, -29, 240, 38, 250, -57]
3229e7J62j86L1o5Q5J1Q7m2j67J83J77k01O4m0Q8K5M6j13k9k38J29j8k70N29k20
3254b9N6M1j41K65j24q9n8J39j52J05k68L89k64N1O6j6L9n8K78j94L9k1l50K83
3278a3k83K06j14J43j18K52p7q5J66k15K55l22K11j75K40p4J39k1j73J38j75K44
3300A49l51K12k8m9J0K27k00j82J95J62j07n2J61k35j62L36k6P3j73Qn9KQ8k74
3324b75M62m16J92R5j78j2J73k64K01L19o05L31j45J46j57j57R2M50j32k2N2k83
3346a33o7qQ8K69k02o0K96k72r9J77j53k6J16k9K5J3R8q8j01K98q0L98n37o5K29
3371H7J3l09K83L1Qk10mO4J3p0J48j3K24l43Jk73J63J60Kj25J90L5q1j2O8J30
3397A80j18j44J65l0j29R9J64J03m42JJ11m2J99j08J02J07l88L35k89J55Q6j40
$$ y = [-57, 105, -81, -50, -115, -30, -19, 68, 26, -141, 42, 219, 18, 82, 42, 130, 155, 201, 88, 59, -179, -50, -68, -338, 191, -29, 27, 68, -73, 192, 68, -21, -79, 60, -92, 13, -255, 134, -130, -79, -13, -29, 10, -48, 230, 36, 75, 54, -296, -13, -296, -90, -204, -61, -179, 73, -4, -89, 77, -138, 117, -205, 6, -169, 71, -3, 136, 115, -58, 80, -95, 149, -202, 10, -18, -67, -57, 170, -30, -212, -17, 145, 38, -14, 147, -88, -250, 86, 60, 133, -40, -32, -91, -89, -1, -275, 187, -229, -37, 58, -120, -132, 41, -223, -22, 297, -308, 23, -122, 24, -133, -290, -198, 252, 120, 98, 150, -133, -200, -208, -120, 149, -53, -113, 183, -89, -188, -11, -164, -190, -74, -103, -78, -65, 33, -55, -156, 142, 62, 460, -77, -142, 87, 100, -209, 74, 105, 113, -97, -101, -37, -24, -94, 54, 41, 265, -78, -77, -350, -187, -27, -25, -150, 40, 75, -6, -18, 50, 180, 62, -82, 83, 53, -76, 23, 187, 290, -152, -151, -40, -82, 117, 9, 111, 218, -170, 165, -124, 31, 117, -23]
3419b3K15j87j45J85j88j1M03l75Q9K53k59J56n7j3J1k38J05j0k19L20MJ69l88
3442b03K08J42j59R6j2k2k80K29mj44P8p6J85j94O8M00n41L82n8m1R5j35r1L8
3466c9j11P6J41J45M7k57j2j79O8K00O6r3O9j36k0R6o5LO6o5K94o57L62J52p0
3491H1k57P4L95k85P9j60K65j73j0P7o7P2j71J2N9J3j7PJ18k54L5j8K22j33L8
3516BJ83k64o7K53j50r9L16r4P9l06OL03p9J26j52Q3o5N1K02n11K23j06j3r7J18
3541e8j04K84q3J84m00K33O5j52P9j90N1J52j11K5k11L90l91K19k4q5J45r5J08
3564C1k54K43L2J47p5j28K25l40K77k31K1J80J3K5l11J88j80J38j02J65k44L27
3586A47j23R3k68RK49j45K31j90J25k63J65j27J04j27K36k03J02L4j10Oj61J32
$$ y = [-23, 192, 5, -140, 45, -143, -154, 249, -126, -37, 216, -43, 113, 56, 43, 54, -184, -79, -89, -308, 12, 16, 185, -203, 5, 147, -12, 84, 72, 50, -230, -1, -5, -149, -71, -147, 38, -156, -88, 312, -229, 153, 95, 54, 149, 14, -77, -39, -150, -74, 67, 212, 259, 2, -10, -189, -121, 79, 145, 52, 121, -15, -35, 61, -4, -1, 65, 0, 294, -363, -1, 151, 81, -176, -102, 293, 8, 87, -73, 192, 19, 9, 86, 19, 91, -80, -68, -9, 4, -13, -6, 112, -142, -107, -125, 97, -36, 2, 185, -79, -146, 107, -43, -142, 174, 80, 159, -147, -141, 162, 83, 209, 57, 140, 75, 126, 328, -183, 40, -66, -79, -176, -58, -162, 122, 39, 223, -177, 56, 121, -31, 48, -142, -91, 61, -50, -25, -236, 154, -237, -18, -42, -127, 18, -77, 31, -223, 20, 52, 199, 124, -4, 221, -119, 158, -73, -52, 128, 141, 166, -145, 43, -137, 1, -101, 64, -180, 147, 24, 117, -151, -142, 107, -38, 193, 3, 128, -135, 30, -97, 7, -120, 116, -87, 15, 49, -61, -55, -216, -84]
3608h4K42j67J05p0%k7j39nJ10J32M6k9r4Oj61J27O0j73M9L3q9M43l8m23L12j04
3634F2J00j40O6k29L1o8N64o37M34j90k32K86N6k62J10r1J29N2M7O9k94K2o1M7
3658a29K79r5P4k35K57j54J87j08L7k02Q4P8n4K14j77k3J01k56J81K6r7j86R1
3681a07o2L11j95k7J17l67M79k05L02j74J7j85J65j0k10M9J14j31n5J61j10j1
3703a34J44O3j79J62j30N6mM3k12n9K78N1k9j1K22r1j31on9j98J97L9k39J04K7
3728i6Q4q4l8J35j78L91Qn54M15L5l53K22j4J27j61j46K09J4J77k56L4k8J18O6
3752A27nj49k70M22k85K12j35m7L41j30J31J0j24p4o7L3P1j06j06J04m4N3o7R3
3776a2j51O3K48j18j75k38M17Q7j07J47J31l99M1K15Jj73j44K31k04J06N2O8r6
$$ y = [-84, 158, -9, 96, 26, 26, -1, -140, -145, -35, 97, 143, 114, 20, 26, -135, -8, 52, -121, -72, -39, -128, 315, 277, -146, 166, 62, 162, 22, 88, -141, -110, -178, 386, -251, 183, -7, -239, 47, 103, -159, -49, -140, -11, 41, 88, 157, -137, -115, -176, -129, 150, 55, 129, -106, 151, -3, 184, 76, 113, -89, -5, 73, 19, 233, 56, 33, 134, -122, 59, 85, -12, -198, -107, -169, 142, -53, -80, 37, -330, 149, -56, 246, 72, 89, -96, 69, 59, -151, -102, 12, -119, -174, -13, -123, -134, 10, 73, -106, 56, -74, -18, -22, 21, -191, -250, 28, 79, 50, 39, 261, 170, 39, 33, -26, -224, -27, 12, -227, -123, -96, -12, -96, -134, 1, -177, 214, 222, -332, 83, 118, -235, -13, -27, 100, -61, -207, 2, 16, 193, -63, -29, -57, 61, 127, 122, -27, -297, 125, -160, 52, -83, -130, 211, 81, 212, 222, 98, 24, -43, -10, 61, -45, -151, -47, -91, -38, -105, -12, -163, -100, 148, 30, -145, -383, 34, 121, 14, 161, 292, -107, -66, 149, 150, -23, -167, 64, -140, -34, 18, 86, -10]
3799a0r8j53L13j27k36J44K34j38J30n4o6R8j18r6K20j91P4J51k1J78j59R0k87
3822a22K45n2M7l09O4K54k25J75k11K17l7o0K22l51O4K59Q3l31J91jk88L60k96
3845a02p9L96o3k31J34j88J67j30J48Jk53L30j58J12J5n9j48N2j45K73n8Q9K26
3868C29m43O3n3K93j57O9J38n9j36j97J66j43l0K58r0j38O8M2j27K78p3p0O5l68
3892c15M78j95J38p5P9j44k56L32k8J85n8j6j35k96L90n9k9k37L17N5k04O2Jj9
3916b9M2J87j18l74Q4J91p8K11j14p0J66k93l9L88k91J23n4Kj15J79q4O1K03q5
3940I3K8k22J76r9J19m1r2J54j15Q8Mn9L5J9j17K0Rj19j8N7K15j32jJ9k2j25J67
3967D1J9l67N20k03P6j77L0J64k53K74j2j56j98K84N6m2j97L37l06l0L56k96J77
$$ y = [-10, -108, -261, 52, -75, -311, -167, 67, -71, 59, 5, -61, 37, -81, -177, 43, -148, -74, 77, 56, 234, 75, 165, -122, 123, 71, 118, -191, -127, 127, -98, 77, -134, 83, 46, -14, 208, -143, -79, 180, 263, -68, 123, 122, -166, 194, -102, -181, 215, 152, -79, 55, -133, 34, -96, 52, 53, -200, 130, -28, 84, 99, 40, -108, -56, -201, 72, 14, 103, 329, -114, -51, -104, 189, 32, 101, 239, 180, 44, -153, 13, -130, -160, 98, 8, -130, -62, -20, -147, 131, 58, -12, 53, -315, 163, -32, 106, 31, 110, -34, -290, 42, 14, 199, 141, 125, -10, -306, 84, 25, -4, -241, 76, 131, -73, -11, -10, -29, 13, 200, 82, -292, -208, -17, -95, 116, 2, -68, 98, -195, -234, 154, -137, -14, -68, -66, -181, -2, -86, -25, 178, 93, 121, -101, 75, -24, 95, 54, -38, 116, 1, 89, 93, 34, 69, 88, -29, -9, 0, -119, -137, -80, 135, 3, 2, 21, -1, -126, 41, 60, -307, 213, 10, 86, -91, -61, 103, -150, 124, 112, -44, -242, 42, 98, 56, -141, 196, -110, -140, 216, -80, 97]
3990I7k31K70J4m1k1l68M10j11K69l65R0l0k4J59k01K86p0o4O2j16L0O1q4q8K17
4015A51k82K88l7l16K24n9K03l27L96k49K05j05P3j69N6N1j84J37r2K19l91K68
4037F0k4N2J8k03J47r4n1N0O0K07k42Q2j12Pj52K31j06%L4L2L5J9J02l75K31k08
4063b00k9L27j9o0r8K8j71K69r0J6J43o6N0l71K12K7n9J8J10j71j53L43l54L63
4087F5l13R6Q1J28P8k31r9qK26J07r7k67K72J56l35K52nJ79n11K94R4m40L91j14
4111ap5l1L39l98J14R5J27k35Q1k09K58K38m70J67%l10N63j85J36k26r8J79Nl9
4135B5j26J44m0K9j47N9J20k60K53j59K23k42m3J60k0K1N1j00j75K01l4L03l16
4158g3j41J35R4r0K23k56J46K60m28K71J14j77j21l7J63j43nK75k96q8O9K86J68
$$ y = [97, -134, 136, 150, 109, 88, -280, 130, 19, 288, -77, 13, -17, -41, 118, -83, 203, 133, 69, 131, 15, 45, 106, 22, -66, 151, -131, 157, 120, -196, 28, -31, 172, -155, 241, -8, 197, 92, 165, -4, 52, 103, -81, 56, -36, 183, -208, 60, 36, 88, 106, -97, 50, -44, -95, -45, 15, 222, -20, 62, -50, -43, -195, 36, -70, -70, -36, -4, 31, 50, 152, -223, 8, -200, -229, 98, 79, 19, -79, -51, -222, 47, -43, -27, 116, 50, 100, -271, -59, -32, -91, -73, 37, -134, -287, 56, -298, 65, -248, -152, -71, 57, 135, -96, -195, -203, 23, 130, 33, -234, 38, 194, -141, 111, 106, 285, -226, 68, 162, -278, 113, -1, -76, -107, 232, -166, -52, 43, 170, -65, 16, -193, 65, 303, -167, 0, 0, -310, 253, 68, 204, -22, -120, 59, 64, 25, -101, 43, 3, 32, -115, -56, 64, -196, 57, -102, 121, -121, -164, -4, -24, -3, 48, -52, -227, -26, -60, 243, -73, -214, -79, 15, -75, 148, -108, 38, 298, -130, 141, 255, 78, -43, -80, 83, -60, -65, 210, -86, -174, -105, 181, 349]
4181C49o87K73J17L4j22m7K84k77r7M69j47j55J56j43j05Q0M4Q3M3l2K3l43K72
4204G2j74k9K05j19N7o5K59k37J03j46K60j54l2J90j3r2j5K3q3K5q5O9Q1k81K10
4229B9R1m5Q2j84P7n1J01k65P8K37l92K57n9pj42K96j49j8j37k5L35j78Mk01J53
4254a13J38q1J40k21Q2J9J10N8k34K40l8j16j0Q8j29mk1R3o9J89J8k14Q2O5j10
4279c8K02k64r9Q7K06j47l2J21k19L16q6J21k01K67j20r5j16K28p6Km4o6Jj34
4303a86K37J05j44j83J97Q9nq0NJ86r6k40K07J3k33K57Q9l10K76k93K98j60J89
4326B18Q1j52k67j47R7J51J16n54O64k56p8K72j76Loj1l1K46n42M39r0j37J07
4349e3J64M6k21J0K79o11L99J10K2k83K46k52K40K7r9j0n3O3j83L59m37K25n3
$$ y = [349, -338, -65, 52, 86, -36, -83, 201, -76, -173, 296, 149, -6, 150, 7, -98, -18, 26, 109, 152, 120, 143, -200, 72, -102, -131, 74, -45, 12, -53, 206, -31, 72, -74, 186, 32, 0, 190, 177, 85, 70, 93, 10, 35, -50, 19, 100, -181, 29, 120, 75, 157, -27, 50, -1, 100, -165, -87, 150, -242, 15, -44, -51, -193, 103, -46, -64, -201, -226, 109, -69, -65, -266, -113, 25, -56, 84, -137, -55, -36, 74, 132, -102, 138, 100, -16, -26, 62, -67, -71, -92, 1, -68, 121, 139, -75, 7, 72, -38, 164, -100, -199, -112, 94, -53, -85, 36, -183, 133, 47, 168, -33, 234, 114, 19, -97, 131, 55, 57, 13, -53, -52, -186, 51, 156, 12, -171, 26, 115, 110, 30, 35, 221, 125, -115, 92, 105, -128, 129, 218, -92, 184, -109, 189, 29, 218, 299, 147, -120, -267, -170, -19, 97, -457, 207, -49, -127, 145, -31, -28, -34, -45, -76, 170, -372, 67, -23, -160, -53, 111, 157, -64, -54, 225, -386, 13, 123, 145, -138, 108, -144, 96, 123, 24, 14, -39, 24, -159, 200, -237, -12, -65]
4372f5j36K85k46Q9j12K02k12K75k2k06P8l5N1J0K71o00L93J12j83Q4j55J07Q
4395gJ49j94J77j72j9O8k04K94j51K28j45Q5j21k0J65j75J59j36j53M52k23j31
4417g4j00L25k16J97k52J83N3q2p6k9J18j55L13k11J03p8j68M1M25k25m3J24j59
4440A4K17j88j5ORp1r6%j94K91L96k01J02k92J00j50o7K2K76k45NK02n69M25j57
4465a80K47j38J30j51J34M3k80M06k36O7n0n9l3J16L04n03K81k70L09l00K13j19
4487f9j8j2k8M52n69N76k73k16K53J12j78m5M8l44L32j63R6l32M84k26J47N7j11
4510b7n6J35J89j39k04OJ06J07k34mJ88j11Q5l4j0k9J04k26N8m8J82k27m1N5K10
4535C5R7j70K33p2m8K7r3J37j49L14m86K05k85J88j66J77K2o5J82N4k70K1M9K4
$$ y = [-65, -201, 84, -162, -73, -185, 17, -195, 80, 58, -148, -70, -105, -54, -44, 227, -373, 20, 132, -51, 33, -122, -15, -7, 142, -52, 125, -47, -66, 2, -202, 92, -59, 169, 24, 109, -12, -32, 133, -42, 117, -19, -172, 280, 57, -74, -174, 151, -65, 132, -120, 63, 116, 34, -42, -71, 47, -108, 205, -6, 97, 19, -149, -108, 317, 92, 49, 173, 14, 231, 43, 28, 34, 43, -28, -124, -124, -318, -27, 369, 168, 270, -22, 78, -72, -139, -117, 159, -86, -81, 121, -448, -23, -180, 67, -71, 59, -92, 42, 85, -195, 211, -25, 42, -8, -67, -100, 16, 320, -183, 98, -172, 137, -163, 50, -69, -87, -99, -127, 325, -244, 332, 59, -157, 96, 208, 30, -15, 33, -311, 21, -142, -46, -378, 106, -120, 27, 84, -27, -83, 52, 241, 102, -102, -96, 10, 117, -117, -121, 67, -44, 41, 7, -3, -32, 72, -154, -96, -144, 38, -189, -230, -175, 35, 132, -38, 195, 123, 75, 102, 9, 146, -3, 311, -175, 30, -255, -67, -233, -56, -34, -99, 83, 137, -133, -112, -63, -39]
4559c9j57K13rJ27j27P2j58K9K51l38K08N9nj38J28j94J64P0o3j6j70M33l53j33
4583a46L06j66r9J91j10k51K69J9p2P3P1R0l2j9k83J92m8K37m4k71P9j35J97j76
4607a28L73j14o6j41m3Q0K44l8k73J17j16kl4J10K26j67j5M9j46j96M31K21m68
4630i6k0M6K03l51J40L8K1J50J41l28Q4Q5o1j51QJ35M4j03o3j72L85j76n2J57
4654F4k4J3J19o2pJ65k62L21m13P5P2k00L71j52L18k39k81J45OL7J39o3q2J34
4678A94k05O8J72l40L17k11L19k72K21l39J45m5L1j11m0O0N5j08J88Q2l42J30
4700c1kj36J26k0L92j40p8k03K2K07k07j79K41R2m0k7O6j51K01l48J73r1J02k4
4724e5K97l14J80J62j47j70K71jj09k3j13J67r0P2l1j2l4l5M8pM1J21k68J28L8
$$ y = [-39, -196, 17, 8, 135, 8, 80, -78, -49, 202, -136, 72, 131, 126, -12, 116, -78, 86, 156, 93, 77, -93, 340, -13, -146, 160, -6, -105, 86, -24, -275, -6, 13, -59, 14, 85, 175, 143, 124, -159, 33, -15, 222, 178, -93, -14, -149, 48, -128, 245, 131, 65, -76, -119, -39, 205, 167, -106, 11, -105, -107, -141, -31, 195, 28, 13, 62, -84, -280, 151, 372, -96, -116, -70, 133, -218, -78, -40, -19, 131, 272, -56, 28, 113, 52, -99, -91, 44, 88, -15, -78, -250, 135, -41, -93, 64, 40, 53, 172, 110, 103, 268, 6, 327, -86, -11, 61, -139, 232, 80, 398, 159, -122, 23, 29, 66, 205, 142, 60, 194, -11, 57, 229, -111, 206, -5, 314, 42, 263, -76, 69, 24, 55, -56, -96, -36, 19, -89, 99, 181, -161, -31, -33, -169, -43, -63, 329, 189, 111, -92, -70, 137, -70, -249, -8, 84, 44, 17, 83, -68, 133, -215, -42, -133, -31, -55, 242, -72, 108, 270, 123, -47, 224, 223, 114, 91, -22, 145, 55, 127, 96, 84, 50, 15, 63, 56, 97, 218, -50, 78, 116]
4749A16jj25j6J60M7J69l98J77K1j14k67M24r4o8O6j25K16r5p7Q3R1%K9k2j20
4774G7J47j34k32J87m4j45J67j05N9J54k11J39J06j80q1K70j12m40N53k44j05
4795a74m8J80K17l15j26J72Q8k34L27l24K36j26p4L36j49k87MJ10p3J66K70l81
4817b05N11l89J66l49j4K08K7L2r3k46Q3K20k25K90K6J7j66j67K73o6J47k07k6
4840a53P5k5J42j00L08m29Q8p9J93j04k2J51j82J04m9Jj82K34K05l79J32K52k40
4863e9N5m3P1l1J00l31L22m79M49r7J09l09M23oj57P1j28J86l45L51k36J24r5
4886e5N4n7J46K94n66L20j86O9P3r8j26M0J60k00J99n9p1n9J59j00K0K65n13M11
4910A20j45J56j6j04J3l01K91PJ35J4J30m03J41K18k33J30k36N5K23m1k92K22
$$ y = [116, 115, -10, -26, 134, 181, 350, -48, 129, 150, 36, -231, 193, 99, 31, 97, -28, 188, 93, 16, 99, 190, 190, 219, 197, 77, 224, 90, -142, 45, 1, -144, 23, -82, -23, 131, -80, 59, 165, -15, -96, 174, 62, -378, 175, -69, -174, -222, -42, 175, -140, -266, -94, -6, -240, 87, -237, -1, -127, -201, 135, -14, -301, -297, -187, -260, -94, 176, -205, 306, -83, 83, -266, -280, -72, -45, -13, -106, -352, -269, -49, -274, 16, 42, 59, -107, -274, -1, -67, 80, -127, -153, -78, -103, 39, -61, 247, -182, -94, -173, 20, -84, -106, 45, -137, -33, -82, -81, -263, -29, 176, -203, -71, 181, -59, -4, -47, 24, -7, 93, -238, 84, -395, 54, -43, 66, -243, 180, 174, 17, 88, -40, 146, -199, 152, -84, 40, -55, -1, -58, 88, 382, -184, 136, -50, 19, 92, -6, -132, -92, 68, -132, 67, 8, -63, -122, 37, -63, -43, 222, -291, 120, -25, 131, 115, 11, 24, -277, 14, 21, 156, 170, 300, -103, 38, 256, 23, 153, -83, -28, 195, 154, -138, 84]
4932H4J51j76J35k78O0L55k15Q2k72M8q0J47Pr3M4r2J63l01Q3J26l5q1J97j4j42
4957i7J65q7N4k74O1J32J59j30Q2j88J5L55k98q2N2O4J0Rj72K5K8j39L80j88J29
4982F5k03L4Q5j07K73j28n0j59k8L32m26M94l26J60j41K28J92m10L77m06K56l23
5004b11K26K0k52M92n80O2L78n4q7K09k99R5J31j49K38k46LnNR1J35l68K19p0
5028a7j24K2J82O0l00J21J71j08j4j85L52k54k06L67L3j47O9l2j73M31m22K22
5050D8k12K33p8k31M43j43M6j02j37J35j06J0m13L94j57J40%J62j27j53J42LQ7
5073a6j87j02rJ82j27M05l46lR0k77K96l82L07J73k88J88jr8p0J58r2K04j79K62
5097H8r5l0k57j8L87j63K4J78j48J36j97p8K36J06j83J98k05j7L5oJ1K5j18J38
$$ y = [84, 235, 59, 194, -84, -24, 331, 116, 198, -74, -26, -106, 41, 48, -45, -1, -93, 70, -231, -148, -22, -57, -138, 59, 45, -97, 68, -19, 35, -239, -178, -46, 113, -17, 65, -123, -108, 247, -51, -133, -81, -17, -7, 2, -170, -145, -117, -256, 124, -64, 65, -138, -104, -19, -126, 147, 19, -31, -190, -218, 114, -312, 182, -144, 16, -125, 103, 295, -115, 262, -144, 112, -211, 15, 35, -217, 275, -305, -243, 135, 81, -6, 203, -96, -1, 130, -19, 219, -27, -24, -29, -24, 67, 202, -166, 53, -17, -141, -119, 63, 123, -177, -56, 115, 7, -7, -192, 160, -94, -300, 67, 100, -47, 22, -10, -183, 248, -174, 48, -164, 69, -9, -240, 203, 60, 106, 4, -133, 2, -104, -94, -507, -113, -270, -130, -130, 32, -95, -248, -106, -103, -16, -203, -305, -314, -132, -259, 146, -200, -203, -113, -390, -94, -476, -169, 4, -284, -96, -97, -195, -265, -107, -199, 5, -174, 88, -7, -37, -294, -312, 75, -88, -64, 114, -34, 102, -95, -173, 63, 169, -14, 184, -21, -38, -3, -9, 2, 27, -91, 47]
5121D7m7j11P9j32L1J95j91J87OL3j11K9J23KJ09k46J0L4p9K93j39j41L12j82
5145A11r5Q8j90K45L7j28K39j75nj39J31r6J35p8j84J11j06L62k40M2p4K07j86
5168A2n3J51k65K40j10P5j21m5n6J67j10n0J96j84J90J42o5q5J03p0j25J84j08
5191A3J45k46K42j69P8j2K18k41Qp5J62J36l19J47L6j03M10m08qJ21J7k30k4J90
5215H8k35lJ07P4rj54J04j83K84k97N4L74k00J2L4M97n92j5k45M73L8p7l8k8J76
5240B39k31K56j22Q2m46L38j68J30J36k10K02jq5k75P1Kk3K60q3M9LM6j97J61
5264A34l59n8J69k02M32m43L83l79O5J53K14j74j16L15j47N0k15MJ81j59J63k19
5286b08L09j40J66k04R5O5j87R8j11M25m29K80l95L94r8m1J03l27M03l34L46l23
$$ y = [47, 0, -111, -32, -164, -133, 62, -129, 58, 64, 97, -14, 15, 138, 140, 249, 3, 13, 47, -32, 261, 122, -19, 293, 111, 16, 104, -86, 159, 196, 68, 307, 132, 127, -12, 119, 23, 158, 80, -104, 7, -99, 263, 23, 65, -9, 198, 12, -41, 110, -155, 85, -25, 50, -71, -116, -172, -5, -115, -165, 31, -153, 37, 179, 114, 29, 132, 62, -63, 121, 13, 158, -88, 154, -15, 63, 51, 269, 28, 36, -39, 123, 259, -60, 87, 123, 20, 430, 22, 14, 135, 152, -78, -102, 88, -147, -150, -43, 31, 22, -132, -28, -211, 73, -224, -170, 204, 4, 16, 50, 547, -45, -60, -305, 168, 206, 129, 91, 63, 239, 8, 264, 142, 224, -222, 116, -52, 78, 214, 4, 206, 205, 120, -155, -84, -82, -105, 155, 72, 121, 124, 170, -27, 134, -225, -283, -114, -316, 116, -327, 56, -323, -258, -105, 109, -65, -181, 134, -13, 37, -178, -174, 7, -152, 11, -208, 101, -39, 127, -77, 18, 83, -104, -6, -117, 308, -121, 159, -236, 158, 60, 19, 122, -205, 198, -136, 210, -113]
5308a13J11o9R1j84N9K89k76M3K32J32Om61K20m0q8r3K99j87N2K77m46J22k55
5331b79M77N0j04k37K33l2l4J36l01M04m80J94O3j98M05j98J89k76J80k87M19
5352C24l60n8L90j35r4QL09m48K56N7k6R5m09K72k53M21n06K07Q9N2j23p8P8K5
5376I3K99k46k70q0M32l7r9k42M8O9J45J60j80j45K73k61J23r4L36l31L01l19
5398b5n3lj9l0K77L5k30M32l18j36J77k84M07k59J28l42L03j14n7K98j81K51J5
5421B72j35j65j19q3K87l9k53J81M1j4L4n8K85k58L6r8K64j52m8mK42k25J56j6
5445A31j16k86K40kK5Q3N8Kk0R6j59Rn6J29j12J0j25R8R7rn3J72o6j12Q4q6K12
5472B44nl06j7J83j77J09Q8k18L94l74J19J54j69L5j42J54m1K24k62N3o5j2K13
$$ y = [-113, -2, -71, 20, -164, -105, 184, -92, -49, 183, 315, 321, -140, 80, 40, -48, -141, 158, -29, 23, 300, -146, -24, -279, 198, 248, 144, -93, 140, 108, 74, 210, -91, 313, -167, 27, 90, -108, 297, 99, 288, 12, 192, -95, 324, -36, -94, 296, 161, 67, 75, 384, -64, 192, 249, 223, 318, -91, 181, -72, 349, -157, 50, 139, 191, 68, -10, 68, 93, 392, 146, -124, -204, 228, 191, 92, -150, -102, -33, 112, 272, 92, -53, 220, -41, 82, -12, 324, -7, 294, -25, -78, -81, -100, -130, 147, 182, -48, 384, 66, -70, 107, -177, 230, -29, 99, -243, 60, -54, -111, 187, 6, 257, 272, 137, -28, -147, -230, 57, 18, -235, -54, -13, -27, 7, -51, 234, -24, 12, -86, 178, 26, -22, -26, 216, -9, 147, 131, 15, -271, -31, -33, -8, 75, 133, 135, 115, 211, 52, 61, 5, 134, 22, 32, -93, 5, 102, 93, 40, 212, 146, 34, 118, 32, 244, 239, -67, -84, 99, -78, 31, 119, -99, 295, -79, 40, 194, 25, 60, -82, 72, 31, 255, -7, 46, -19, -31, 182]
5495A82J0j05P3l31K51j29K87k39O8Q2l4j53J73j5J23n2l8j90j00M15l31q6L71
5518B32j88J3Jj95J06J74k64k6K03R2j62k27J36P7L13l57J73k32J32j2k40L82
5540A31l22j56R1N91m94N0j49K04j67J32K55l59J75l30K72Po0N2J53m04J2K75
5562d1m7L78j52j19k28O4J09k05L40J5l23j14J93l8K02j40L4J37l2k06J77o4n5
5585a15J1K17k44J78J6M1j19l31N72p7R1j88J29J7j49j70K15O9j85K29j29J71
5607B49k59L8J17k0pJ19k94n1K07k53n9K73J02K3l54L51oo5j78J24j91m1J90m04
5631c89L09K4J0j34O2j25J74Q8m45L08l37N01j08kJ37r4J30j39l8J40R4j12j52
5654i8J88l25L78j92J05j26K11j29l4J97m78M77j73J17k49L0j74L2K18k05L6N7
$$ y = [182, 192, 87, 160, -171, 80, -49, 238, -1, 67, 149, 115, -38, 135, 120, 243, 191, 153, -37, -137, 278, -53, -139, 232, 44, 57, 58, -137, -31, 143, -121, -147, 56, 148, -14, -241, -105, -28, 285, -72, 101, -131, 1, -11, -251, 131, -191, -347, -256, 335, -159, -109, -258, -54, -221, -89, 166, -193, -18, -348, -76, -69, -129, -77, 76, -328, -316, -41, -88, 290, 138, 19, -209, -145, -36, -241, 99, 114, -209, -323, -130, -168, 34, -106, -72, 65, 33, -173, 4, -60, -115, -104, 113, -131, 47, 63, 104, -15, -346, 226, 149, 240, 52, 181, 198, 49, -121, 94, 163, -22, 207, 78, 249, -10, 28, 145, 125, 118, 237, -57, -108, 99, -154, -213, 60, 162, 185, -169, 182, 176, 111, -67, 57, -134, -175, 15, -389, -80, -56, -46, -180, -118, -243, -69, 19, -426, -118, -455, 46, -62, -64, 73, -21, 109, -30, -68, 72, 166, 54, -98, 90, -235, 143, -49, 56, -70, 141, 12, -22, 175, -303, 174, 1, 118, -131, -101, -275, -243, -25, -230, -194, -137]
5676a37O1j81J90j23p1J25K9O3Nj63l3J98N9K7Mr9k04P9K5K42lj82P5j24J80J16
5702A58k83K06J3j18n2J52m4J91L1m15J89k89K50K4k98R9J10J04k92R7lJ36j5
5725d9nO8k03J89j89J30j72M38m32K24Rj45K50k76L85l62P1J56k15K27r0K20j95
5748C4o9j5J7R5j93J84M7J77l18L06l67L71j82k83L57l74N01k03m6j8M4J65l60
5771a30J84k38J92j65K80l61L29J41j27l5j35J49N3M5q4q0k94L17J20l17L28N6
5793B28k32K5n2j41J55J10pM5j96J04O0l30J36j2L61j35Q2m32K29j16m9K55P3
5816A61j62l00N66l60L23j28K14o10L49n1J82j54m8nP7r0j2N2l5L8j49J29J94
5839A81k09j9j0q8J31n5J5J83k65J08r3K75j32K85n34J89k56J54q6J60j4l33M39
$$ y = [-137, -76, -257, -67, -190, -261, -136, -107, -44, -39, -202, -235, -37, 22, 49, 53, -46, -250, -171, -146, 96, 93, -89, -14, -138, 42, 158, -125, 81, 94, -24, -76, 76, 32, 223, 254, -161, 28, -261, -11, 13, -285, -186, -76, 28, -264, -167, -170, -34, -49, -54, 14, -189, 0, -189, -59, -231, 207, -225, -1, 8, -137, 113, -163, 222, -140, -69, 87, -128, 99, 9, 229, 34, -35, -50, -33, 62, -131, 53, 100, 277, -41, 265, -102, 269, 87, -196, 161, -213, 288, 85, 39, 21, 65, 230, -130, 54, -184, 8, -157, 123, -238, 91, 232, 105, 70, -65, 84, 137, 182, 98, 18, -276, 41, 161, -156, 172, 228, -4, 21, -31, -172, -17, 93, 86, 131, -65, 39, 99, -231, -95, -107, 254, 119, 201, -231, -2, -118, -167, 88, 161, -1, -301, 265, -95, 228, 100, 314, -296, 53, 2, 184, 30, -18, -23, 54, -36, -48, 4, -31, 7, -142, -13, 181, -28, -47, -57, -145, -14, -69, -54, 129, -136, -28, -121, 154, 22, 307, -227, -38, -294, -140, -226, -66, -80, -413, 26]
5862B6o7k94N04k36l1J05l36J66k5J20J28k80J91j8J96J21k26j37R2j74L71j43
5884E3Q6l39K94P1m0l66K71k89J98O3o2K12j80M1l5Pk06J54q0M32k14LJ44k96
5908g8L68l90J75R7k11O8j19K01r1K62k91K3j21K55m2j72J64l08M09j37L0j36
5930d4j14L29r6K16k87jj25K67k78J28P2k91N45l29Qq3J30J18j12K12j47J26L4
5953B78k32J3J2oPJ00m44L42j52K48j58j57K53k39L85k10k33L68J19j13k92M01
5975B90k88J63j84K09j19j99k6O2L27q6j37l14J43j77L61m3J26j87q2P4J88j37
5997c6o7P4J64m66K89q3L50k87L02k97J34j92J77J28j66j3k44L06J04l56K27j53
6019a05J15n2r2O1K70p8n5K53n23N71m17J6J0J96O6l15J43k3J3j60N9J88k5Q5
$$ y = [26, -41, -335, 169, -67, -98, 7, -329, -163, -188, -68, 60, -220, -29, -47, 149, 270, 44, -93, -1, -175, 196, 53, 139, -200, 94, 165, 125, -241, 30, -259, -61, 2, -60, 152, -28, 13, -22, -15, -221, -67, -147, 285, 71, 74, 218, -78, 290, -100, 75, 172, -39, 29, -90, 111, 20, 282, -9, 14, -107, 148, 106, -66, 98, -210, 199, 62, 92, -44, -158, 171, 75, 291, 4, 3, -122, 145, -133, -5, 67, -224, 321, -8, 0, -83, 47, 165, 53, 265, 118, 244, 278, 46, 59, 71, 65, 72, 172, -272, 70, -82, 166, 8, -149, 104, -135, 250, 40, -193, 175, 294, 181, -111, 290, 2, 165, -19, 190, 71, -128, -154, -92, 235, 149, 12, -302, -159, -336, 25, -18, 108, -79, -161, -87, 101, -36, -103, -29, 135, -331, -42, -125, 225, -62, 240, -57, 77, -115, 62, 190, 24, 11, -233, 73, 177, -179, 48, -105, 10, -42, -134, -73, 197, 119, 64, 317, -206, 365, -52, -36, -26, 170, 236, -79, 64, 41, 54, -106, -47, 141, 116, 201]
6043B01j31m3J79j61j02J27j11J6j57K25j14j03J69N7j64L90j52j21J42l9l1K
6065G9n4Q2q0L30k33j6j8Ql2OMp4Q8j05K1K2J31m9k88J66J76l32K11L0k23j6R6
6092g0j49K05N9K79j72j36k47J22Lm5P3r4K69j8n0Q9k02O2k03K72j2j5L6k4J96
6117B28k66J0j54O6j56R7J15P5J74k81K28n9r8J57q7J62k75J85l94K53k3J10j91
6140a24P0J0p0K78k20J24P9j50J23k4k89K21j98J47M22l95R8l7O9P3k67K02k80
6163a38J46J48j57J77p0J1k18l8j4K28n5n1M1k38L80l48K65j71O2k24L75j76l4
6186i9K57k54L02j36j87L2K31p9J13k59j71J82K56j31L0q9R6k01R6j72K61LP1
6209A52k9k33J63j19M6K32m1k4k1j61L63j70j43P2K08j12k53K28j80Q4l14L35
$$ y = [201, 70, 27, 206, 45, -57, 70, -41, -25, -182, 43, -71, -174, -5, 52, -112, 278, 126, 5, 147, 108, 77, 79, 25, 107, 27, 357, 124, 108, 90, 98, 66, 72, 76, 2, 90, -15, 6, 28, 159, 110, -178, -12, 164, -168, 43, 73, -150, -166, -70, -219, -14, 45, 324, 152, 16, -231, -109, -106, -151, -78, -172, 97, 79, 29, 118, -84, -22, -225, 47, 35, 20, 56, 32, 228, -38, -28, -182, -116, -272, -175, -60, 15, 189, -92, 136, 77, -21, 136, 49, 211, -64, 121, -273, -20, -43, 67, -124, -54, -44, -114, 164, -56, 68, 147, -3, 120, 96, -193, 28, -170, -23, 399, 4, 102, 65, 134, 207, -60, 142, -138, 8, 156, -1, 176, 106, 117, -101, -139, -153, 75, 20, -31, 10, -228, 152, -196, 69, -102, -40, -264, 111, -65, -99, 158, -96, 206, 70, -117, -85, 146, 67, 180, -79, -250, -68, 188, 57, 87, -2, 94, -107, -11, -183, 78, 81, 152, 123, -110, 53, -66, -20, 212, 171, 147, 126, -35, 328, 158, 15, 87, 295, 183, -70, 158, -22, 62, -252, 83]
6231H3J3Q7j07j46J68L08j61m54L2N12m71K50j09P2j87L43N2k43O1Qj14j46K10
6254F1k07N2j27K40r1L23k44K2r8J39j06K36k40R7j02L81k43r7n8J68m5p7j40
6277a56L39j62J20j11j31o2L90j12K16l92J72k68K65M5j89K13j02j91K24Oj04
6298A0R5l82K59J38q9p2Q4J4j56J91j00J44J6k95M22k82K04l90L98j24R4j42k31
6321a94K09n5j62K30r9R4l0L81o75L16k95M91j64j42j64M40j02j97L57k88o7L8
6343g8l9P0J5j26L43r4p9l2m8k4K45j07J34k99J65j49J54r5Q7q9j35p0K21n9j20
6368b09J29K68j93L2j03K54l9j28j81N17l88j41J63O3M0r2K3J11j8p3p7l31O14
6391B41j62k02J92j61L88l11k76L24m13L16Q7q1j8J01l36M73k26j27j2M28P2l24
$$ y = [83, 96, 183, 76, -70, 98, 406, 245, -209, -177, 335, -136, 114, 5, 77, -110, 233, 285, 42, 103, 111, -3, -149, 61, -146, -94, -221, 19, -72, 251, 7, 29, -69, 70, -36, 200, -40, 57, -45, 336, 93, -4, -62, 106, 61, -16, -156, 183, 21, 141, 30, -101, -163, 227, 115, 331, -61, 111, -157, 108, 153, -36, 177, 75, -116, 108, 114, 10, 105, -277, -18, 120, 31, -41, 43, 57, -99, 92, -8, 136, 152, -143, 279, -3, 201, -189, 209, 85, 179, 37, -194, 15, -40, -202, 28, -71, 23, -7, 374, -301, 15, -280, 211, 47, -95, -259, 181, 79, -118, 239, -49, -116, -78, -117, -47, -32, -158, 185, 91, 12, -20, -68, -92, 153, 46, 180, -119, 46, -103, 51, -44, 43, -46, -181, -251, -30, -89, -209, -80, 188, -5, 27, -76, 178, 139, 11, -170, 347, -41, -182, -19, 44, 84, -8, 15, 126, 108, 35, -42, -373, 241, 79, -123, 69, -92, 296, -15, -291, 33, -380, -64, 23, -58, -76, 25, -311, 162, -64, -191, -203, 225, 297, -27]
6413b7j62K21k74L73l99M52o0Q0j97r8L4K0J41l15N10l83J13K42j63J50k46J96
6435B08m01K46O9l98J42P8K25k87L49j94J92k56J69j74J18j72jK13l29L81l93
6456b15L51k69J30N7m53J36J68K03j64j86QL64j7k56K65m34L11lJ50pP7l06Ln
6480i2K74K7j14O0l85J56R7Nm7J32k9j66J27K02j57j32j63P5J60k7rL4j30j06
6504b08M52n4k7j96K02j85J18j32p2L40l35K42k01J52j96K34l56Q4L00k08K20
6525A74l11K13k7l3Oj13J29j21L1R0n3k44L88k06J23O4j55p9K5M06k90j75J56
6548bJ01j66N2Q6k79N15k35q4Lo9K25l12K60m10K43Q9j16J08N9K8l14J75n7P3
6572b7K15j80K10m52L52l09J64k70N98j39j47J38l52K25q5R2P9k27J97k02J86
$$ y = [-27, -189, 32, -242, 131, -268, 184, 124, 204, 7, -91, -57, -37, 104, -211, 299, -84, 29, 271, 108, 258, 12, 208, -193, 53, 122, -276, -134, -56, 169, -118, 231, 37, 229, -27, 142, -32, 86, -86, -87, 126, -203, 178, -215, 136, -133, -3, 54, -399, -263, -95, 108, -56, -242, -234, 130, 113, -143, 122, -312, -1, -4, 146, 139, 216, -90, -87, -92, 182, 209, 95, 155, -230, -74, 23, 28, -19, 113, 84, -82, 45, 247, 90, -42, -205, -130, 30, 3, -6, 28, -102, -208, 244, 190, 163, -33, 169, -16, 102, -30, -102, 238, -97, 145, -56, 96, -100, 134, -222, -138, 162, -46, 174, -137, 76, 49, 16, 22, -91, 38, -83, -52, 38, -15, -259, 129, -77, 46, 110, -45, -124, -99, 307, 17, -158, -2, 99, -67, -15, 71, -208, 307, 72, -12, -9, -78, 147, -165, 95, -315, -72, 17, -99, 9, 68, 96, -218, -43, -100, -27, 188, 8, 218, -234, 118, -191, -27, -297, 301, 162, 15, 153, -199, 26, -59, 33, 112, -115, 82, -120, 66]
6593F6j21N6M3J39m25K09N7N0l6J33l27K52Ml39J09K12m3j6o1q1J7J72r2R2j21
6618e1o0J24k9J30j79K32k03P5q4O8j07R5J63j49J01P4n5k61K16k23L3J39Q8J14
6642B51k48M9k28L01L5l92K56j33J22L2j57J93k26K96j71O3q0p6J85j5j14k21
6664b78L64k03P8k0R9j98J87k5Q4J09j32j17k07L34PR3k42R0M5p7K11l70L14j08
6688C8j19L4k6J50j40L10o9k87Q3j59L72k73K02k12L60k21J01k27J96j87k78O81
6710C29k36j46Q4RJ85k60J97j93m7K47j68j52j64L40J54k36K5L92n44K89K30l34
6732Aj80J41j27J35j74OM47l69P9R5l04J93p9K62k70N2m3L3J23J42k23k4K21k72
6756a35L27l79J41j19K04J59j04l19J98L1ro3J96l23J59o1q8K84k43L00J2k54
$$ y = [66, -55, 1, 44, 183, -242, -33, 24, 74, 38, 171, -156, 96, 100, -239, -130, 82, 39, 23, -38, -119, -102, 70, -22, 70, -51, -111, 13, -16, 114, -65, 167, -36, 39, -45, 23, -84, 11, 174, 25, 126, 200, 145, -116, 100, -123, -90, 49, 137, 251, 3, 52, -176, 125, 160, -232, 24, -109, 13, 45, -112, 81, -145, 151, -20, 43, -37, -113, 72, 57, -57, -278, 86, -117, -39, -59, 40, -158, 29, 4, 88, 197, 65, -52, -259, 75, 82, 175, -67, 23, 68, -9, 202, -168, 146, 38, -81, -47, -73, 77, -63, 247, 178, -109, -26, -185, 187, -86, 116, -96, 264, 43, 144, -83, 113, -74, -352, 329, 93, -53, 31, 40, 225, -35, 162, -31, -78, 169, 1, -151, -315, 25, 179, -57, -32, 360, -184, 105, 335, 1, -179, -38, -165, -30, -204, -198, 249, -120, -41, 54, -250, -57, -136, 126, -144, -92, -135, -102, 21, 163, -60, -84, 137, -135, 192, -187, -46, -165, 39, 198, 94, -225, -27, 4, -5, -68, 128, -195, -36, -97, -185, 99, -144, 156, 168, -86]
6778h6Q4j0j5Q7l08K51j12K99k78M6L48m48L3P1j10J35Qn8K5J85mj94j19K66j05
6803iP7O8r9j02Q8J01l63K27j01K37j10j52L87l57L60k90LN3p9K49l5j2j12j8
6827A1j32K00j74K26l9p2J77j47J11l39K64k19M61n55Q0J36j48J84k40M87n4q7
6849A31r6j30oL09k15m0J18O9m65M47j0K1j19j10K4R1J6K19m67J64%k6j52J97
6873c0K97l62R5J58l08L70j97j5p1j1K3J1J13m9m5J55Qk14j9N2k0J01p6l9r3J29
6899c7j16K73J5j85L3l9n3K69m10J91n8K09j35n8o4K36k84M49j92j10N7J04j56
6922f1j70J10kO1rJ03j07J09k19j15J04k46M44N7j40K65m08L25j44J30k80j3K92
6945H6L6J17l97J45Q5N8l27K77j40Q2j73J97K53k72n8M8l8q2K03p9l3J45l45J58
$$ y = [-86, -2, -12, -27, 60, -248, 3, -109, 190, -88, -42, 306, -142, -109, -38, -148, -13, -5, -63, -38, 147, 143, -51, -170, 96, -9, 68, 136, 37, -65, 23, 124, -239, -12, -113, 124, 14, -138, 249, -108, 252, -38, -35, 18, -61, 188, 153, 141, 29, 11, -121, 79, -95, 131, 92, 20, 197, 50, 161, -178, 86, -133, 328, -227, -147, -11, -159, 25, -215, 272, 218, 131, 35, -95, -101, 208, -7, -47, 71, 140, -325, 122, 112, 133, 14, -96, -72, 19, 35, 254, -213, -49, -49, -75, -227, -30, 267, -95, 0, 158, -150, 220, 23, 8, -63, -74, -51, -40, 73, 24, -21, 134, 142, -72, -91, -39, -59, 42, -34, -73, -166, -37, -153, 120, 135, -50, -17, -56, -109, 160, -250, -59, -117, 92, -43, -101, -165, 71, -213, 236, 44, -66, -9, 95, -61, -231, -121, -123, -62, -71, 32, -75, 34, -185, -300, -196, -442, 2, 59, -81, 184, -224, 101, -43, 87, -193, -206, 86, 122, 239, -158, -13, 72, 130, -197, 80, -60, 22, -151, 46, 299, 27, -31, 17, -21, -103, 100, 21, -12, 133, -212, -54]
6969e4m2n6J36q2L19k08O5l86M29j26k88L15k28L62l37Q3J87Qj91J14K13n50K35
6992h2K74j41k37K05j06L6L6J85on1n8l0j47J78j2Q4J4L3k97J46R6k8j19q2J04
7017el92L81M9J02J78l60RK36k44J53j74J1L89m56K76j34k23L8Q6k6P9k7j85M62
7041B23l70M48o07M87j09j24J40k18m0J29r0K2j9L46k48R9k53L45k08J55j64O8
7063A2M2o3J84k20J49j2j60M0j1J65j38l5R4k28K77k88L95m74K52R0J46j99M0
7086E8L4j50n0K66l0k1l7j21J14j07L7nj63K52j87n4P3j08L18m6J7k54M4j39L58
7111I9p0J66k01J9j70j33K41K28j56j3J13j31k22L16l48Q5O7R2J8j46J42L1K6
7134E3l24L68l50L15j58r8J46n6O3J20J18l17l7J74mJ08j47O4k3n1r0K24l13L54
$$ y = [-54, -96, -152, -16, -98, 221, 13, 78, -308, 121, -5, -293, 22, -206, 156, -181, -98, 89, 97, -94, 20, 233, -317, -82, 192, 51, -186, 19, -87, -51, -15, 170, 164, 113, 55, 25, -122, 56, 44, 128, 142, 175, -122, 24, 120, 92, -27, -109, -5, -397, -16, 33, 135, 313, -47, -38, 198, -46, 107, -67, -56, 333, -123, 153, 19, -204, -166, -80, -106, -27, -54, -239, 223, -147, 301, -306, 181, 72, -52, 88, -130, -170, -41, -131, -109, -128, 218, -30, 69, -184, 161, -47, 108, -56, 12, 54, -9, 175, -45, 104, 92, -68, -28, -39, 126, -12, -47, 47, -181, 96, -192, 203, -271, -19, 71, 217, 18, 58, 92, -58, -108, 158, 128, 107, 70, -51, 63, -44, -7, -12, -175, 77, -110, -164, -91, -199, 119, 73, 90, -164, -120, -259, 99, 29, 195, -6, 13, -157, -290, -49, 179, 23, 10, 123, -8, -230, 86, -262, -177, -110, -18, 0, -146, -4, 27, 53, -271, 97, -253, 62, -96, -194, -48, -104, -41, 79, 197, -120, -157, 17, 13, 121, -26, 38, 15, -36, -126, 98, -215, 139]
7158A39j03L3o6q9J0J14J04j43K25l29L66k12M1r8o3J72j20j3J35l24J40K72k09
7181a8j89J04k12J99O4L4M1K0P1M7q5M9j51k05K22J29j20N6l3P3l8n9Q5j75m7
7206a38o6K39L8r5M7p2j3m6k15J31l9K97o3J00j70Jp2P6J42L30o84L58L0K2l26
7231a88n4m5l3M40N6k49j76N02r7k26K44k63K00k60K76m24J87K63j05K85l46K39
7253B26k43o8J12J12j20q0M3j43R0R5P5j07j0O7j27K03j72J47k62L04j3j74J09
7276F4qj2o9J96l09L13p4j62l8J11J67l8k1jk58m4J37J63%j47M2q8k0k7L18K0
7302B15m9j52O2j79K27n36L97J76m3J9k42P8p7R0J7J30j73k08N34m80J49K8K61
7325B44k35J04n1n0p9P6K8j23J62J01J59k25M3m0J29k70J83k09L1j6J57m3J44
$$ y = [139, 36, 69, 3, -86, -76, 38, 142, -1, 224, -105, 261, 49, 90, -8, -71, 101, -19, -32, 103, -221, -81, 191, -18, -207, -103, -315, -116, -52, -18, 23, 43, 114, 161, 76, 125, -26, -231, -9, 120, 0, 56, 23, 96, 58, -1, 84, -91, -138, -204, 35, 73, -22, 25, -47, -60, -106, -321, -190, -229, 68, 5, 105, -65, -64, -136, -60, 82, 412, -272, 86, 116, 138, -188, -242, -287, -320, 120, 176, -73, -249, 253, 156, -70, 174, -89, 111, -149, 127, -297, -110, 153, 48, 333, -13, 226, -17, -85, 27, 139, 19, -61, -18, -161, -71, 24, 99, -8, -18, 49, -78, 125, -47, 100, -162, 142, 129, -45, 64, 56, 44, -25, 171, -138, 175, 101, -61, -99, 12, 179, 141, 120, 119, -139, -183, -46, 117, 117, -30, 12, -76, -96, -123, 195, 215, 166, 14, 76, -103, 124, -412, -15, 161, 118, 137, -105, -27, -104, -14, 3, 133, -40, -248, 286, -194, -45, -17, 244, 9, 113, 62, 12, -67, 9, 37, -86, 76, 177, 336, 111, 154, 114, 243, -27, 156, -53, -22, -38, 119, 76, 220]
7348B20k57Q2j05q1k6K89J01p2p6j85P9J5K2K01r8Q5k01j20J41L2m7K3j35J9L76
7373B82k25kj11J56J26j95j22o6L05k81lJ42R9j12m5J60j03J6m9N9J86M5j52r5
7397A5k29K19j06P6K83k94K8J25N4j4l66K55r6m5R8o5L16l63P8o2J00k02j8L15
7421A02o4q8R3Q8n9m3k71K03j56J00J03n9N0j92N12o43K36K74j18k42m5L10k06
7444a15K82k93K29J59m67K49n1j44K1O1m0J4J38q6J22j03j15K26n5j96J53O7j03
7467d7lJ03J64k68j7J39k58J48n8P9J37J10k99J18N1j67K55j06j10j8J02r8K32
7490A89l92K76O1J25j72p2j54J2K61l3k45K93j56K11n07L49J9j09n6J95j2l7j01
7513e5L0Q4Kr9k6n3K28l2k13Q8M6j91L76j29k12J47L0j26K17k3p0L6j89K38J48
$$ y = [220, -37, 45, -60, -141, -167, 122, 223, 151, 75, -110, -31, -16, 6, 207, 109, 194, -7, -127, 14, 46, -1, 22, -113, -94, 282, 57, 55, -56, 100, 226, 31, -91, -157, 148, -133, -136, 6, 105, -7, -52, 108, 5, 21, -28, 31, 217, 262, 110, 15, -214, 5, -101, -25, 258, -36, -8, 117, 171, 157, -209, 46, -50, -95, 3, -62, 254, -109, -31, -93, 7, -195, -213, 102, 38, -50, 43, 131, 72, 29, -242, -39, -195, -95, 8, -51, -1, -193, 319, -324, -88, 186, 68, -174, -219, 91, -115, 167, -126, 103, 262, -205, 44, -7, -151, -130, -69, -109, -95, 43, -43, 79, -24, -139, 87, 32, -164, -11, 56, -47, -50, 53, 217, -51, -68, 71, -187, -39, -97, -18, 119, 229, -70, 48, 99, -68, 187, 81, -29, -47, 55, -43, 189, -203, 73, 134, 259, 87, 15, -139, -127, 134, 101, -144, 149, -7, 204, -303, 46, 65, -44, -100, 95, 83, 46, -55, -25, 59, 61, -38, -64, -117, 111, 79, -134, -46, 0, -191, 185, 56, -156, -9, 21, -105, 112, 89, 19, 55, -134, 104, 252]
7538B52m24oQ6J77j40J19R5j03j75j81L72q7P1q5p7J18L5k12K32k59K85m6k58
7561b11J94rk1K30m5l26K32J71k51J69j62J21m5Q3k47J27j16L8mP5Q2Q5k01k99
7585c30L24J42j37L1q3Q%K00k23Lk5M1P9j77K33R0Qk12J66k55Q8K15m04L8M0O0
7611h0K9J75O8l31J35MK3k50K05o7J14k0k7K16k85J74M2R9k83r4J50n1J66j11
7635Aj87k0K25r0J5K86q3n0k95K92j33j24K13j22qM07l52M0N8k63K06p6q6J79
7659C3j00lK44M8k82J26k3j06K31k8k48J83j1ok04J97N7k39J30J40p1Kj27kp2
7684a31J58lo5m5r4K26p8r5L3R8J46k54J08o2R3m5N8p5j22J73m2P1Q8Q9j85Mm0
7711IkNm8J21LPj53k4jj28J25j4j06J82J45r7Km7p4J82j4M3k04l9Q0J23O6k8j1
$$ y = [252, -172, -178, -92, 85, -55, 64, 159, 56, -119, -300, 72, -15, 56, -29, -106, 12, 47, -165, 67, -192, 93, 47, -211, -17, -26, -47, 183, 138, -188, 44, 215, -36, 133, -29, 92, 47, 130, -117, 10, -106, -68, -72, 3, 85, 170, -31, -330, -6, 136, -1, 30, -53, -45, -45, 155, -68, -65, -90, -49, 30, -147, 86, 176, 184, -28, 138, -117, -29, 186, -218, -180, -140, -80, -51, 124, 192, -139, -4, 0, 23, -227, -22, -89, 25, 5, -22, 194, -91, 83, 125, 224, -59, -153, -3, -54, 112, 1, -186, -206, 19, -71, -56, 230, 147, 97, -198, 94, -39, -163, 50, -72, -80, 327, -25, 15, 73, -190, 16, -60, -146, 33, -67, -70, 174, 222, -60, 66, 43, -63, 168, 140, -108, 75, 64, 58, -146, 51, 108, -131, -1, 139, 68, 70, -57, -59, -131, 27, 24, -41, -86, -180, 46, -32, -127, -94, 4, 150, -104, 4, -58, 35, -10, 48, -27, -149, 24, -18, 53, 141, 230, 45, 49, 9, 7, 12, -36, 85, 88, 95, -58, -82, -83, -211, -86, -100, -206, -24, 121, 24, 26, -21, -95, 87, 73, 116, -88, -127, -47, 76, 142, 114, 103]
7740A03j71K11pj41O3j97K28O8o4O1k19J85j66j59R4R9N6m2J22n0o7K4L22l99
7764d6J14j87L76k11K15j10j32R2q5K08k75J48J15k95K42l8j49j88L54l59L39
7785A28N9m84L88k31J94n9P2o8j40M27l99J31J75q8k85J15J45J86j42j03r8L2
7807d5N1K05j77r0n9L72l74J04J25M8k31J56K1j93k2r4L25m15K44J47j24K3l10
7830c13N05k01R8nl8l69K54M2J4k3n7R4J83l65J2M64l64J67k2j09J18K40m69Q
7854a36J79q3J17l6J39k0k17r4L15K79j54k81J68m8N5k37j47K75N8j16j38J04
7876a8l7Ok36M78k48m9J74j18J98k6r4n3M5j12K1J85j23J17l99L35J01j16J07
7899A38j76l6j84K12L2K23k85N9m5k05J24N6J52Q2j78r2m6K07n6K56J72l82j17
$$ y = [103, -68, 143, 136, -5, 58, -139, 89, 157, 93, 154, -65, 120, -46, -205, -111, -12, 44, 2, 124, 74, 7, 31, 353, -46, 68, -119, 257, 46, 261, 151, 19, 111, 26, 234, -41, 107, 222, -73, 169, 131, -18, -206, 148, -211, 128, 187, -297, 91, -140, 54, -5, 67, -1, -141, 286, -113, 18, 193, 105, -180, -65, 80, 266, 124, 21, -77, -45, 6, 211, 34, -56, -115, 257, -117, -13, 112, 160, -71, 85, 106, -87, -109, -203, 122, -293, -49, 98, -26, -3, -313, 192, -9, 89, 84, 46, -323, -69, -27, -13, -36, -93, 1, 184, -181, -169, 295, -69, 98, 76, -33, 85, 325, -144, -136, 43, -40, 77, 41, 180, 160, -57, -151, 164, 443, 289, 8, 176, 128, 183, -54, -201, 74, 132, 16, -122, -18, -55, -49, -285, 193, -55, -104, 70, -48, 150, 124, 30, -23, 22, -90, -69, 116, -7, 110, -289, 46, 147, 31, 138, -38, -74, -258, -46, -14, 209, -76, -17, -62, -267, -143, -87, 65, 147, -31, -123, -169, 38, -18, 238, 410, 28, -89]
7922h9K43k19P8J06j26J56j34M8j32K92m98K17j75L26n3O5j27K6j74lL49o3j7
7945I6Q7k29Q2k6Qk10K27J42q5k67MK25j63K29L6k26k7k0L58k35j65N3L2J43m4
7970B5j25J44m3p0j44M02J47m20M7R9J46n8k30L92n31M18Q4k24r9J05q6o6J3J38
7994F4m0J68j12R9j30M5K4j10PM2k76K79Rj51J05j34K2J11P0Lm0O5j83L4L57j68
8020A60k27O6kJJ00jL4J86l69J13k35K16Q5j29n6Q3l7JR3j7N6k03l0K82j69o7
8046f6J44o1K46l47J80J3j43Q3l19L83J0Q3l65K13k69N19j87L4k46L72k46O0J1
8069A02m20K67P6r6Q2Pk91J51K11q2Q0j99R3N4po8M7Pj10L5J09k02J52J40r5q6
8095d3K32m13J67J17K9r3J68Q0j81m6J2k06J16l32J80K81j32J73R2k13M15k12
$$ y = [-89, 154, -65, 13, 119, -7, 149, 15, 63, -69, 223, -275, -58, -233, 93, 40, 105, -22, 4, -170, -173, 176, 113, 96, 183, -46, 36, 10, 18, -192, 35, 177, 92, -175, -171, 54, -109, 120, 156, -70, -97, -117, 241, 6, -159, -106, -74, 69, 25, -100, 44, 1, -69, -213, 189, 336, -84, -37, 62, 208, 150, -80, 312, -219, 199, 283, 59, -40, 65, -21, -87, -74, 64, 24, 192, 80, 179, 49, 94, 118, 8, 15, 57, -219, 60, 69, -82, 23, -111, -89, 22, 92, 95, 55, 120, -63, -29, 328, 160, -67, -1, -3, -2, 98, 97, 131, 317, -52, 61, -174, 42, 127, -2, -58, 25, -12, -11, 82, 65, 121, -82, -112, 170, 1, -66, 78, 17, 263, -84, 96, 109, -34, 49, -270, 113, 123, 206, -159, 54, -215, 304, 117, 151, -95, 277, 31, 91, 102, -318, -51, 25, -71, 11, 18, -273, -122, 89, 7, 87, -112, -19, 35, 28, -40, 7, 14, -96, -61, 48, -154, -2, 138, 43, -43, 189, -224, -57, 60, 89, -4, 164, 244, 63, 17, 29, -177, -61, -393, -213, 68, -64, 109, 201, -12, 403, 191]
8117A91p8j44J12j46k2J52k7N1J53l50K74j58j42K29n9L4j90J84j63K28n4J37
8139B12k88J83K00l26j26J54J67j39k3L0j96L12j31j24J02L2l23M61n2n8M3k87
8161a77K49qk47J58j13r4M9J00j9K77l2j40J54j29p7M9n4J48R8k32o4K16o9lP5
8186A15n8j70OK15j02
$$ y = [191, 113, -31, 81, -65, -87, 65, 38, 89, 242, -108, 166, 8, -134, 95, 36, 70, -120, 64, -99, 129, 75, 212, -76, 107, 307, -19, -145, 9, 176, 37, 14, 44, -152, 160, 29, -95, 7, 39, -284, 177, 125, 67, 110, -177, 72, 64, -183, -25, -138, -232, -183, -83, -102, 175, 143, 3, 157, 28, -49, 0, -54, 94, 192, -40, -104, 112, 43, 40, 115, 57, -113, -107, 108, 6]
8191F
$$ Imaginary data points
##PAGE= N=2
##DATA TABLE= (X++(I..I)), XYDATA
0@%%%%%%%%%%%%%Pj5J6j6J6k4L2l2M0m9N7p1Q1r2J08j24J44j66J89k15K44k76
35a46L11l50L93m40M89n44O06o72P45q25R11j005J108j221J344j480J630j795
53i41J981k188K418k681K981l325L728m210M797n524O457p703R466j2176J6940
68A0020k7859J01452P6878n5854j3666l4789J9085j9143L7784j4634K7188k3229
80H3233k376j5190j4137P755k0691J6818j9778J2013j4463n508m094j4485J1999
93B1096k2924J6358k1749J4242j2266j6l51j0434J3783j7532J6091j6165J4140
106e727q226J950L636r318J6958j7351J7059j5394J3079n336J32L539r982J4613
120c68j6500J5200j7000J0612n916j923L659j2724J3929j6926J3281j5839Q841
$$ y = [0, 0, 0, 0, 0, 0, 0, 0, 0, 0, 0, 0, 0, 0, 7, -8, 8, -8, 8, -16, 16, -16, 24, -25, 32, -39, 42, -50, 58, -66, 78, -88, 101, -114, 130, -146, 165, -185, 208, -232, 257, -287, 319, -353, 392, -433, 478, -527, 581, -640, 704, -776, 854, -941, 1040, -1148, 1270, -1411, 1570, -1755, 1973, -2237, 2560, -2964, 3493, -4210, 5256, -6920, 10020, -17839, 83613, 160491, 104637, 90971, 56182, 75267, 56124, 93908, 79274, 106462, 83233, 80857, 65667, 51530, 59285, 38594, 55412, 35634, 47647, 33184, 27676, 23582, 9097, 21096, -1828, 14530, -7219, 7023, -5243, -5259, -5610, -16044, -2261, -19793, -3702, -19867, -5727, -13953, -12003, -8367, -17685, -727, -18078, -1019, -16413, -3334, -8670, -8538, -4999, -14981, -368, -16868, -1668, -18668, -8056, -13972, -15895, -12236, -24960, -11031, -27957, -14676, -30515, -21674]
133b1674n153k346M374j2409J4721j5342J3630j3441R233j721j103O580r942J5318
147a9275j2793J6076j1066R957K94m65R038r574J6393j1239J4267r011Q436K18
161A256j322P854j0740J4694j2442J2852j0586N498l51l430O474j2879J2954j3552
175c720J1203j0964L423p13n265P153j3362J1880j2584J0311j0067L102L42m639
189a3900Q338j2794J2598j1257J0984p538K281K616m651R779j1422J2941j0375
202a2400J0564n820K501K986m856J0172j1467J2139r949R864n177Q62K830n130
216b881R668j1853J1289r831Q432m811p3L147o287R671j1766J0669r881P927m454
231a034q75L720o613J0040j1692R969q811P037l300q79L796p123J0480j1085R734
$$ y = [-21674, -26827, -29173, -24799, -37208, -22487, -37829, -24199, -37640, -28407, -30128, -31231, -24651, -34593, -19275, -32068, -15992, -27058, -17101, -16807, -17272, -8234, -17808, -1415, -12654, 1613, -7398, 1038, 1256, -66, 7788, -2952, 11742, -700, 12152, 1566, 7064, 6713, 3283, 9757, -3122, 9832, -3720, 7483, -3481, -58, -771, -6036, 1117, -12245, -365, -12949, -2638, -12705, -9603, -9261, -13900, -5562, -18356, -5758, -17015, -6031, -13569, -11288, -8672, -13323, -3544, -14966, -2025, -12400, -1836, -7656, -5155, -2169, -7025, 3147, -8320, 3819, -6130, 3734, -1443, -581, 2249, -2881, 6787, -5066, 6223, -3608, 4824, 13, -60, 3087, -3200, 6471, -5295, 5374, -4507, 3420, -1034, -1909, 1811, -4802, 5238, -6454, 3515, -5296, 1741, -1559, -2438, 1358, -5765, 4715, -6370, 3364]
246C364r107P023k209j672M039o956J0075j0610R266q449O193j689k312M763p930
261f211J0508j0179Q597p904N174o18k688M985p858J0200r859Q787p494M739N8
276B37l105N514p990J0341r470Q115p108M654M63l380N931q508J0427r411Q009
291D719o261L460R22l555N982q708J0318r048P154n658K463J704m449O352q527
306c132R159q502P003n326J960K006m693O378r198R282p817N987m611R67K397
321A860m727O400r035R089p476N835m175M62L055m928O849q960Q748p248N914
336A663l692J24L234m954P058q841Q547o548N334k995o49L655n402P061q646Q051
352C000o511M821k867j535M053n937P263r108P367o264M134k253k155L956o156
$$ y = [3364, -5743, 1280, -929, -2601, 1438, -5518, 4557, -6053, 3213, -5236, 957, -732, -3044, 1719, -6211, 4297, -5882, 2715, -5189, -15, -633, -3321, 1664, -6194, 4006, -5853, 2934, -4560, 179, 237, -2868, 2646, -5344, 4997, -4473, 3642, -3466, 1188, 1651, -1729, 4202, -4306, 6121, -3290, 4719, -1542, 1918, 2840, -715, 5267, -3441, 6877, -2171, 4983, -675, 1788, 3492, -957, 5395, -3132, 6027, -2475, 4528, -798, 1162, 3168, -1525, 4853, -4345, 4937, -2880, 3107, -1504, -537, 1860, -2867, 3533, -5502, 3587, -3889, 1946, -2229, -1767, 1288, -3640, 3209, -5751, 2997, -4251, 1663, -2029, -1905, 1329, -3625, 3433, -5408, 3139, -3409, 1925, -1070, -1719, 1936, -3466, 3595, -5051, 3000, -3511, 1310, -1557, -3092, 961, -4976, 2287, -6821, 546, -5718, -1584, -3837, -5992, -2036, -8192]
367h192P286r274P153n665L759k111k232M026n858P515q634O898n489L541p79
382h056k720M486o002P478p999O383m837K629q1l344M831o398P349p942N721n163
398a3665K433m6l924M604o852P213q462N234m477J535O43m256M656o697P722p772
414b2111N425l679J543J635l786N641o196Q147o207N820k517K297K838l170O324
429g996n121Q341n059N707j763K063L204l347O691n398P757m916M735k205J125
444C818K787m181N480o597P025n988L475k720n08K212n211N078p276O036o082
459b652L250k817j048K764n316N030o731O487n602L418j450q88L638m494O059
474c52o396O657l867K897o50n11M258m306O272o417O320l742L021r15j372M119
$$ y = [-8192, -906, -10180, -3027, -8692, -4933, -7044, -9276, -5250, -11108, -3593, -12227, -5329, -10818, -7277, -8056, -10776, -6290, -12292, -4814, -12813, -6430, -11267, -8638, -8719, -12063, -7232, -13630, -6281, -14223, -8502, -13665, -11232, -11278, -15202, -10598, -17450, -10237, -18699, -13465, -17942, -16407, -15764, -20020, -15364, -22061, -14339, -22111, -16686, -20365, -18822, -17187, -20973, -15332, -21528, -13381, -19588, -13768, -16285, -13988, -11150, -14320, -7996, -13117, -4776, -9835, -4128, -5891, -3828, -624, -3971, 2720, -2678, 5079, 163, 4898, 2693, 3818, 6605, 2424, 7904, 1307, 8332, 2344, 5819, 3099, 2591, 4803, -408, 4670, -2606, 3430, -2652, 598, -2219, -3267, -503, -5819, -789, -7520, -1033, -6635, -3217, -4667, -5555, -1917, -6411, -352, -6748, -91, -3958, -1061, -1711, -2222, 2036, -2270, 4002, -2415, 3905, 163, 3184, 2269, 897, 5016]
490E016n282N856o577N351m259J765j002k689L827n557N066o831M867l977J461
505b965n23k570M139n480N669n982N352l271K094Q52k447M985l971O219n183N896
521B814k087K337J420j988N566m140O444m870N114j855J727J080k974N184m967
536H805N187n720L975k534M4N25l945L905n903M649o168K608l028l12K23m389
552b078L636n802M646n952K974k464J55Q06m012M523n280N411m932L426j688Q08
568e823K169l464N032m669N640m246L223o64R7K466l830N211m804N487m320K731
584B36j007m15K665m709M772n176M892m321J988j019r10K822m441M194m867M840
600d56l729J759m30j088L244m351N168m846N131l244K306M2r58L815l976N199
$$ y = [5016, -266, 5590, -987, 4364, 105, 1870, 868, -1821, 2006, -3551, 1515, -5316, -449, -4426, -2965, -3488, -6058, -1919, -7399, -1730, -7712, -2360, -5631, -3537, -2685, -5132, -147, -4118, 2101, -3082, 2814, 727, 3064, 4484, 2496, 8062, 3922, 10366, 5496, 10610, 8755, 10482, 11562, 8588, 13772, 8805, 13992, 8272, 12247, 9713, 9757, 10282, 6337, 10242, 4339, 8988, 2820, 5428, 2400, 2088, 2311, -2078, 1558, -4244, 402, -5550, -2576, -5040, -4885, -4079, -8091, -3568, -8848, -3437, -8369, -4943, -6631, -5823, -3654, -7118, -2086, -6755, -1115, -5361, -2138, -2802, -2705, -239, -4069, 1142, -3662, 1825, -2495, 236, -771, -1186, 1479, -3230, 1542, -3634, 1258, -3063, -1075, -2094, -3004, -182, -4623, -429, -5296, -456, -4185, -2426, -2856, -3944, -700, -5051, 117, -4729, 402, -2842, -536, -494, -1452, 2363, -1613, 3586]
616C586m162M693k426J656J91j064L744l833M447m359M297k436J212L70j870L790
632G836m828M563m963M094k809P31K29k515L679m464M202m905L754k696Q21J44
648B873k372M106m962M456m403L366j608L99Q39k620L996m076M224m314L522j595
664A831N68J004k716L787l788M207m358L421j743N91Q91k767L896m255M146m028
680F87K677j228J17J001l415M287m502M049l903K202o71p66J709l607M313m319
696a369L863l812K427j018m95K000l650M121m054M180l661J998p05n13K013l612
712b287L919l980M054l173J499J03q92K533l914M039l665L746k863J426M7j099
728e07K779l674M380l686L540k648J234J54r14K815l942M230l809L645k455R72
$$ y = [3586, -576, 4117, 1691, 3347, 3538, 2474, 6218, 2385, 6832, 2473, 6770, 4334, 5546, 5916, 4046, 7836, 3008, 7571, 2608, 6702, 3893, 4624, 4853, 2338, 6017, 1553, 5755, 850, 4604, 1908, 2729, 2873, 501, 4607, -355, 4101, -302, 3064, 1456, 1855, 2694, 74, 4070, -6, 4218, -96, 3426, 1831, 2399, 3403, 687, 4474, 686, 4893, 535, 3956, 2213, 2804, 3695, 928, 4824, 569, 4715, 687, 3364, 2136, 2253, 3254, -161, 4126, -376, 3673, -230, 1972, 1301, 535, 2244, -1363, 2950, -1369, 2494, -1318, 1109, 91, -404, 1596, -2054, 2067, -1987, 2193, -1468, 530, -175, -688, 1325, -2287, 1632, -2348, 1706, -1467, 32, 135, -757, 1776, -2138, 1901, -1764, 1982, -881, 545, 592, -507, 2272, -1402, 2978, -708, 2832, 184, 1418, 1572, 658, 3473, -469, 3761, -48, 3597, 1142, 2114]
744B114N61j230K853l935L935l349L422k345O32M46j532K821l870L984l719K752
760C540j466K01O63j928L204m141L628l363K743j760J68O51k202L585m056L490
776B957l157K571j602j31R30k053L220l542L407l491K570j049m5Q75j984L439
792B915l657L606l482K786j040m63J499k449M025m005L405k690K172n91n52J727
808C206k688L734l731L469l236K466n88p84J271k663L496l806L326k803J507o03
824A573j051K252l353L711l807K996k904J306J02j154J521l064L747l769L124
839A230k649J316J51j007J865k876L524l264K876k063Q60K91q75K045l333L597
855A688l187K747k177R11M69j447K150l359L473l356K687j935N71L84j699K484
$$ y = [2114, 2675, 1445, 4298, 363, 4298, 949, 4371, 2026, 2658, 3104, 1572, 4393, 523, 4507, 788, 3540, 2074, 2275, 2938, 1010, 4214, 73, 3701, 338, 3081, 1321, 1489, 2140, -62, 3523, -533, 2957, -200, 2371, 769, 638, 1568, -485, 2735, -807, 2600, -891, 1679, 630, 585, 1460, -524, 2915, -742, 2864, -618, 2168, 1128, 665, 2164, -285, 3740, -265, 3140, 450, 2622, 2031, 1479, 3206, 518, 4252, 521, 3990, 754, 3220, 2632, 1848, 3119, 456, 3952, 146, 3472, 669, 2176, 1573, 522, 2774, -579, 3132, -675, 2321, -583, 723, 825, -329, 1192, -1872, 1875, -1894, 1230, -1419, -103, 48, -959, 906, -1970, 1554, -1710, 1166, -897, -37, 254, -621, 1424, -1909, 1688, -1499, 1248, -929, -18, 451, -996, 1154, -2205, 1268, -2088, 599, -1336, -765, -381, -2080, 404]
871D04l735L779l046K175j863P65O76j366K500l516L770k780K638j474M04J413
887G44j402K934l126L838l016L041j009J52J315j333L161l594L523k183K254j037
903D262o2J157j880K813l380K962k824K110j514l14J073k576K660l353K667l038
919G63J859j184p64J193k558K856l669K973k837J935r46n85J492k207L156l478
935b001K871k091J642m51o67J809k129L153l060K764k009J294r2r29J710k415
951f01L310l295K288k091J311q2j300J660k669K759k939K213k061P68j49j296
967b174J576k508K954l094K554j877Q91L79j502K169k620L153k567K252j395O56
983a153M83q89J652k134L171k411K370j480O94N83j571K311k967L438k610J771
$$ y = [404, -3331, 448, -2598, -423, -2286, -1521, -845, -2211, 289, -3227, 543, -2237, 401, -1073, -669, 744, -658, 2276, -850, 2988, -28, 3013, 2004, 2156, 3471, 2138, 5299, 1705, 5228, 3045, 5299, 4262, 4200, 5357, 3477, 6290, 2910, 5872, 3048, 5158, 3644, 3330, 4403, 1827, 4487, 1134, 3801, 763, 2622, 1438, 674, 1867, -691, 2165, -1504, 1469, -1368, 567, -379, -964, 528, -1679, 1477, -2001, 870, -1221, 421, -30, -697, 1112, -1017, 2136, -924, 1840, -169, 1125, 1033, 104, 1814, -601, 2709, -586, 1702, -389, 922, 840, -460, 1200, -1469, 1290, -1649, 564, -1497, -729, -878, -2174, -598, -3106, -152, -3246, -692, -2569, -1678, -1299, -2801, -632, -3252, -99, -2666, -414, -1809, -1153, -670, -1559, 93, -2041, 1130, -1281, 1089, -391, 303, 886, -685, 1626, -1341, 2097, -513, 1258]
999A258j629K99R87j759J982k940K574k546J713j172qO49j780J870k997K946k614
1016c167J612j210J26J123k044K303k449K607k495K003q66j21R52j321K347k702
1032c302K938j863J791p93l67J643j561K259k966L046k114J398o91m06J441j967
1048a514K486k787K241j522P80k06q44J492j766K081k679K333j714R78k99r09
1064a849J897k102K224k563K338k031J312l0q30J636j742K162k406K333j411J027
1080c5M1j001J664j969K542k525J774j223J085L4r56J614k081K573k768K151j236
1097c16P89j29o05J340k108K368k320J767j080O65J35j092J980k182K124k270
1113i34J782j161P83N28j392J600k141K518k146J575j093L43N05j494J922k281
$$ y = [1258, -371, -72, 915, -844, 1138, -1802, 772, -1774, -61, -1233, -1241, -592, -2372, -502, -3499, -553, -3167, -1555, -2765, -2639, -1516, -3560, -1257, -3706, -1099, -3594, -1591, -2457, -2578, -1626, -2947, -600, -3302, -364, -2227, -436, -1229, -1596, 47, -1514, 745, -2221, 825, -1289, 109, -582, -988, 453, -1514, 972, -1815, 426, -1096, -316, -522, -1366, 126, -1640, 441, -2238, 95, -1619, -641, -940, -1849, 48, -2054, 170, -2393, -55, -2086, -774, -804, -1634, 2, -1740, 422, -1984, 349, -1062, -35, 6, -995, 669, -1300, 1242, -1283, 491, -732, 353, 387, -569, 1045, -1036, 1537, -1231, 920, -316, 473, 344, -261, 1079, -1029, 1339, -981, 786, -294, 371, 506, -586, 1394, -788, 1336, -934, 848, -313, 470, 998, -394, 1206, -935, 1583, -563, 1012, -81, 262, 767, -727, 1195, -1086]
1129a086K535k015J461j117J94P49j537K053k245K234k220J077l09M5Q29k075
1145a427K246k245K335k007J381q02k38J196j942K107k184K362j955J168m77k24
1161g06J213j992K252k176K051j697J048l68m17J130j706K323k401K216j903J020
1177a13q6k40J065j647J982k104J853j315P26r0l87J114j535J708j918J964j516
1194e39R56m0n51J164j708J704j940J812j199O17m4o76J487j858J849j922J984
1211A096j608O31j36p96J732j901K044k283J539j000N16M7r36J698j997J702j753
1228a405J752j161N14K45j114J731j866J936k084J586r03N74L64j438J443j388
1244a214J737j799J483r03L86O55j418J577j748J844j596J283o32K32K79j174
$$ y = [-1086, 1449, -566, 895, -222, -28, 721, -816, 1237, -1008, 1226, -994, 83, -226, -181, 648, -1427, 819, -1426, 909, -1098, 283, -519, -757, 439, -1503, 604, -1580, 782, -1173, -5, -482, -706, 507, -1485, 767, -1409, 642, -1055, -7, -375, -792, 338, -1368, 955, -1446, 770, -1133, -113, -199, -439, 626, -1021, 961, -1143, 710, -605, 121, 31, -356, 758, -777, 931, -987, 977, -539, 417, 377, -174, 990, -718, 986, -954, 858, -341, 276, 232, -444, 1043, -815, 1034, -888, 1096, -512, 119, -17, -813, 919, -982, 1062, -1221, 318, -682, -166, -119, -1055, 643, -1354, 348, -1405, 347, -814, -300, -55, -1169, 562, -1304, 632, -1452, 134, -769, -195, 169, -1269, 174, -1214, 523, -1276, 207, -696, -310, 345, -1073, 504, -1244, 600, -996, 287, -345, -113, 166, -1008]
1260a008J608j649K003j611R59o42K25P08j261J651j718J840j853J080j63j08
1276F1O00j578J649j896K021j536P25k07o13J347j412J463j666J571j418Q28l91
1293d52K04O42j756J794j923J871j629P06K7l04J005j329J578j608J625j061L68
1310b42J70o05J156j381J719j725J442p39O0J57n39J431j710J527j608J939j453
1327d01P14j23n25J002j293J567j362J335j029M08j9o69J327j607J590j663J442
1344F94q53K64J63q49J291j477J741j748J230n40K26k9p52J347j331J354j378
1361f47J215o69N1M54j163J382j544J599j541J254q64k0M88q69J352j626J635
1378D87j118P94m91o6J38m67J247j614J656j358Q08J5l08N26r36J334j396J359
$$ y = [-1008, 600, -1049, 954, -657, 302, -340, -115, 593, -668, 983, -735, 1105, -748, 332, 169, 61, 661, -917, 732, -1164, 857, -679, 46, -161, -774, 573, -839, 624, -1042, 529, -889, -61, -452, -248, 394, -1362, 432, -1491, 380, -1249, -543, -516, -820, 185, -1144, 434, -1174, 451, -610, -242, -72, -677, 479, -902, 817, -908, 534, -205, -145, 12, -527, 904, -806, 721, -887, 1052, -401, 313, 190, -335, 667, -626, 941, -421, 914, -115, 293, 274, -395, 932, -675, 915, -748, 694, -159, 105, 268, -581, 710, -767, 974, -774, 456, -84, 142, 113, -639, 708, -623, 731, -647, 568, -101, -50, 404, -759, 623, -921, 678, -863, 391, -473, -493, -5, -874, 478, -1148, 487, -631, 163, -328, -394, -256, -723, 524, -1090, 566, -792, 16, 31, -277, 249, -687, 647, -749, 610]
1396F10r70M29j06J80M78j293J738j565J639j614Q95j88m7O02j182J399j379J257
1414H83j183Q66l18k75N66r86J578j315R50r09O94m7p27Q47j069J319j345J011
1432E40r51M92N5k10N46j151J269j280J176j059N59J37l36O14r77Q16j228J196
1450B08r06J73O96j071R56r02J196j400J334q37K90J31l54R76j224J252j388J549
1468F79j027J90M41n83P23j312J747j174R21q52L21M00p89J012j195J200p38R00
1486H64q84N07J95o93J078j344J002p79O33o77J63N31n55P15j253J104r93O62
1504B76l41J7R0m85J065j072Q20j055Q97p01K98M26q46R36j103J036r11Q86k01
1523C2n61O50o76J037j170R99r42N62j74mN01q40J061j423J357o85L66k13l02
$$ y = [610, -360, 69, -37, 143, 621, -672, 1066, -499, 1140, -474, 421, 233, 186, 788, -394, 1005, -374, 883, -300, 566, 248, -27, 539, -447, 1131, -184, 766, -143, 551, 504, -223, 624, -445, 874, -471, 540, -411, 81, 136, -74, 472, -679, 590, -690, 486, -573, -14, 123, -213, 401, -576, 240, -988, 208, -698, -525, 171, -900, 56, -846, 350, -1050, 284, -553, -263, -132, -486, 490, -734, 518, -870, 679, -348, -158, 283, -300, 423, -889, 858, -316, 605, -247, 74, 474, -315, 697, -498, 702, -36, 864, -20, 487, 682, -11, 1067, -277, 725, -54, 579, -98, 65, 596, 41, 756, -497, 607, -386, 276, -65, -48, 42, -443, 622, -450, 370, -685, 212, -489, -191, 235, -611, 325, -778, 258, -653, 233, 32, -529, 121, -555, 482, -688, 311, -631, -69, -243, -247, 254, -586, 475, -948, 409, -276, 90, -123, -425]
1542d25P12q43J017q15Q01j204R43om64Q71j294J224r45Q58q27L47M45m69L75
1561C01q77J316j103R11n22p9K55l24O59j143J427j471R71m25J52q0l32P59j129
1580g34J136r91J058q55J38K59n24R50j142J039r61Q16m93K64L2m75O94q91J217
1599E37j157P10o81K78M34o66R01j044J017q80O66k98k37L26m26O86o14Q35q08
1618d21Q04o65n8O18m90N81j005J132j060R10m84q7M76q50R16q26R43o73N79k20
1638A20l88N73l36N99j214R49p28N76k76j17M05m98R36j365J157r44L68J00j64
1657b47L45o70Q93j434J309q32N66j59l93M67q01J351j122O47o61O14k47l97O25
1676a46q48J089q39J007p84L08Q6m73Q14p48R34j031R14m71K38L00m87P62r00
$$ y = [-425, 287, -556, 461, -354, 447, -757, 186, 180, -284, 587, -707, 517, -428, 430, -397, -50, 395, -74, 301, -576, 740, -363, 548, 26, -53, 202, -122, 537, -606, 821, -650, 321, -104, 48, -32, -364, 395, -734, 402, -589, 469, -386, -248, 11, -513, 437, -705, 334, -627, 189, -304, -40, -8, -483, 211, -680, 537, -620, 90, -591, -313, 121, -545, 356, -688, 329, -551, 115, -183, -420, -94, -520, 166, -448, 387, -421, 383, -282, -340, 278, -212, 369, -636, 496, -564, 346, -138, -225, 251, -599, 317, -509, 434, -239, 340, 120, -268, 305, -31, 568, -646, 303, -425, 151, -125, -242, 163, -335, 601, -764, 393, -551, -183, -83, -247, 98, -572, 321, -1113, 196, -636, -70, -229, -622, -155, -956, 395, -727, -80, -741, -127, -374, -771, -146, -994, 95, -744, 263, -521, -213, -127, -600, 214, -534, 400, -631, 283, -188, 50, 350, -137, 625, -275]
1695b75R10j063R42n00L10J17n23R48j069R31r24Q08l45r2L28n38O75p28Q72q60
1715g6M71j00j20N05p97P40q34R98o72K11l93J39J53m17P00j133Q38o98O71m24
1735b38K31K59o13P74r58J016r42Q06m65J41K72o29J019r52O37o41N46m09K38
1754I2M40m63M11o00O35n02O84l57l17N11n84N46p12Q58n87M67k82j6M31o91P19
1775F83o99N23l17K03k77mO37p57O63q40O85m88L90j95j16M55o04O88o48P21o33
1796G0M04j78k85N91p64J078j385R48l86J14l2n77N98r03P83o24L72l73K30j76
1816d95k84N52q82J078j193P57n10J12J42l93P01n18N05p21P33k64l8K95n94Q51
1836a66n07O58o80P62k25R1K52n41Q04p09Q54m45L07MK7M6m72P21o70P44p25N04
$$ y = [-275, 635, -428, 514, 14, 324, 441, -82, 866, -203, 728, -196, 612, 267, 175, 503, -35, 640, -88, 784, -76, 395, 295, 175, 680, -117, 623, -211, 787, 115, 326, -67, 72, 225, -192, 508, -625, 213, -485, 186, -238, -7, 252, -361, 413, -545, 471, -471, 335, -130, 11, 283, -346, 673, -279, 358, -283, 263, -146, 92, 532, 69, 480, -120, 515, 13, 697, 340, 23, 534, -50, 496, -216, 642, 55, 522, 240, 224, 655, -36, 683, -16, 507, 190, 393, 116, 112, 749, -8, 655, -185, 500, 12, 402, 207, 91, 546, -58, 630, -18, 703, 70, 474, 296, 11, 602, -162, 916, -469, 479, 93, 207, 175, -402, 196, -707, 76, -548, -176, -549, -319, -495, -779, -227, -1109, -31, -1224, -467, -977, -865, -723, -1116, -415, -933, -428, -1149, -416, -680, -718, -423, -1017, -166, -673, -15, -695, 67, -158, -67, 185, -356, 448, -261, 593, 148, 455, 459, 486, 532, 60, 781, 111, 855, 130, 634]
1858F34k77p9M10n84N27q64Q61m39%l00N10R0m25N26o31O44o29L75n7l71K74k76
1880h1O58r77P98l60N39k41k80M28n44Q84p12N10o74O16k81J7K41n48O91p86N99
1901D97o55L77r3m7K99p26P83p89O26n45M03m37Q5L37o75P92p73N90j02l0j51
1922b34n8N05o52O23n23P27l60J36l8k57N28p04Q00o24J017r09J21J32j73M18
1942D75o41Q61p48N68j61N8L4o48Q11n92M43q75P53m41K25J84m58N46j012O70
1962E2l62L69k57R1O2n73P90o79M84m87M02j65q9M93n71R06j008Q89o79L16j01
1983a17L6K90l71N61p14P89p19M43q8j65L87n52P45o17O43n02J07K43l07L49n74
2004a33N54l40N18o31L36j82R8J61l63N77p16O53l79J49j01j51M99p51N10m16
$$ y = [634, 357, 278, 688, 104, 631, -233, 628, 189, 189, -111, 399, 489, 64, 590, -41, 603, -26, 349, 292, -79, 195, -81, 577, -400, 398, 38, 577, 336, 56, 484, -60, 824, 112, 622, -52, 564, 283, 300, 541, -7, 684, -102, 497, -158, 219, 126, 79, 378, -348, 435, -354, 272, -273, 130, -307, -222, 115, -560, 232, -541, 49, -53, -83, -234, -292, 213, -439, 184, -339, 388, 28, 164, 126, -131, 397, -307, 493, -131, 886, -23, 98, 230, 57, 475, -166, 695, -53, 515, 354, 412, 446, -202, 609, 17, 460, -415, 338, -103, 122, 306, -152, 394, -618, 52, -310, 59, -198, -107, -45, -618, 172, -507, -23, -510, -108, -273, -362, 131, -440, 466, -542, 347, -332, -16, -117, -81, 209, -162, 399, -315, 474, -245, 198, 110, -55, 332, -220, 525, -92, 551, 49, 156, 399, 92, 441, -133, 421, 81, 599, -32, 304, 122, 220, 381, 18, 595, -121, 532, 153, 302, 201, 50, 549, -202, 308, -108]
2024a08M03m08L63k99j49O38p89P25p02L35k29K86j95k9J46l00M95n42O23l77
2044a13N6j65k40P01o63M97n46N65l45J24K61n44N09m20N68n41M04k13J77J3m12
2065c27O87n13M74l61L94p14L59Q7j04J18m42Q25r48Q79l37l1J16k14N27p17Q52
2086F10p67M55k87Q4K8l64O28n03P65o84L89j46k40K36k45L89k77K58n05K88l7
2107G5l74L68m18N58p00P81m42L14k22j36L81q67Q23p36O17o12L60j64Q9K58m05
2128d52N23m83N23l81P4J01k08L18j73J75j70L77p95P25k31K2L01k70J54l65N01
2149B66l11K83k81O7k7k5N45m22J91l24L46K70l25L82m50L43l94L12k99M43m86
2170A04M9K84o42Q41q22N81l53j59M78k98J72p23P47o27M54k51R2j13k31M96o02
$$ y = [-108, 295, -113, 250, -49, -198, 440, -349, 376, -326, 9, -220, 66, -129, -158, -12, -312, 183, -359, 264, -113, -57, -222, -462, 239, -424, 73, -473, 92, -253, -129, 132, -412, 97, -323, 245, -296, 108, -105, 72, 85, -327, 360, -153, 321, -40, 354, -360, -1, 86, -18, 100, -342, 483, -465, 414, 77, 46, 162, -52, 475, -242, 610, -157, 298, 11, 95, 123, -241, 387, -116, 649, -35, 354, 208, -32, 204, -41, 348, 71, 329, -176, 112, 75, -299, 69, -349, 209, -491, 290, -152, 162, -60, -196, 185, -682, 141, -595, 22, -590, -230, -394, -305, -47, -452, 71, -412, 111, -270, -196, -95, -303, 15, -158, 17, -153, 224, -571, 154, -77, -55, 246, -24, 130, -235, 266, -45, 238, -43, 24, -3, -28, 517, 95, 286, -38, 308, 578, 253, 635, 185, 528, 134, 446, 147, 590, 104, 153, 437, -205, 636, -186, 395, 42, -117, 361, 63, 235, -488, 259, -368, 86, -165, -73, -186, -417, 79, -523]
2191e23M93p40P80l61J73K43m66M37o19N38l32M37m23J59J03k42O98o54N71m53
2211a81K95J6k11K46n3J70o57O69o05P42K7m44j6L3K06k94M25m88M17l03j91J75
2233b2q4K65l77K88j56K15j97j39M24l82K21n94P04p51M31J9qr6P3M33m28O04
2255D43l80j46L4q3K48j67M02l58J10k50Qk1j43L17m32L50n39M83k36J29J8n83
2277g96P11n37L73n39M89k72k4j6j45M44m84N33m77O3J87K79r7j89M72m25M82
2298C2l71N64l88k10M99k31N63l99M21m86M07j54J62k19j44K23k91N81l29Q7M
2319C21J20k82k01L46m88M94o28N58R4l93K25k63J11o07N79j15J73j91O6J63k69
2340a87L61l74L69k83K11j35JK39l32L52j01K36m77K73J84j24K15n32M38l02M81
$$ y = [-523, -30, -770, 10, -351, -178, 65, -401, 36, -583, -45, -377, 60, -363, -204, -101, -343, 355, -299, 272, -181, 114, 130, -81, 165, 112, 282, -375, 294, -311, 431, 458, 14, -2, 31, 237, -57, 368, -120, 297, -6, -197, -22, -106, 159, -218, 70, -86, 129, -68, -207, 217, -165, 56, -538, 166, -585, -154, -135, -143, -239, -166, 267, -161, 443, 63, -83, -49, -132, 116, -51, 351, -7, 103, -147, -139, -160, -303, 14, -418, -68, -607, -124, -360, -231, -213, -796, -85, -622, -249, -788, -299, -571, -595, -611, -756, -312, -796, -263, -740, -677, -490, -211, -308, -497, -25, -450, 32, -339, 225, -163, -373, 126, -105, 458, 59, 480, -6, 401, 247, 409, 190, 46, 269, -22, 559, 230, 317, 321, 441, 159, -42, 304, -184, 310, -318, 240, 334, -59, 166, -97, 14, -593, -14, -129, 44, -147, -81, 82, -187, 174, -200, 169, -114, 97, -38, -37, 202, -130, 222, 121, 357, -120, 153, 337, 213, 428, -104, 334, 32, 513]
2361E13m57K27O9l93K41j94J25k88J51L2j0J69l80L25n42L68q5J18k02J97M5l19
2383b90N47l33J24m92M58l3j41L05k67J65j81L76o12P01n84L37j4k47K14j94L16
2404A55m66N40l99K37j02k45M93n90N02m14J68J29j48P2k23K54m50M30j51J80
2424b8k95K48k29J18K13l47M35o06M55k36K84L0k09K25k58M41l61J37l42L88J59
2445B22n64O04m79M87j40L8j32k04J66j07N70l57J37j36R7l7o7J99n06O41m70
2466c8N33k67j06p9K24J41l23M16n89K13j9K05l36M7J43k58J45k93M53l42p7J88
2488a9j56K48m43L79l09J55o5Q8j09j71L65l35K14q0Q5j82OK72j43L79m36L34
2510G7n09L12k51J54m6j79M56m49O78l52L54l58K84l14p2P72q17N92p0k57Mj41
$$ y = [513, 56, 283, 352, -41, 200, 6, 131, -157, -6, 26, 16, 185, -195, 130, -412, -44, -129, -11, -213, -16, 29, -290, 257, -76, 48, -444, 14, -19, -160, 145, -122, 43, -138, 238, -374, 327, -257, 80, 66, -181, 33, -161, 155, -311, 229, -170, 67, -35, -280, 213, -377, 125, -289, -121, 8, -140, -68, -291, -37, -487, -57, -208, -28, -323, -75, -304, -186, 27, -320, 115, -491, -36, -272, 12, 42, -167, 58, -200, 241, -120, 17, -325, 63, 222, -342, 262, -217, 270, 130, 168, 36, -168, -2, -109, 461, 104, 241, 105, 202, 165, 98, 297, -209, 432, -38, 495, 228, 122, 43, 267, 408, 85, 501, -88, 125, 106, 311, -25, 22, 165, -93, 52, -241, 212, -130, -207, -19, -175, 73, -370, 9, -300, -145, -210, -122, -231, -402, -37, -372, -158, -238, -153, -335, -329, -57, -200, 179, -257, 77, -432, -120, -371, -217, -263, -442, 14, -435, 243, -109, 245, -113, 171, -143, -215, 557, -260, 332, 262, 5, 9, -132]
2532a32K98l67L98k71L08m23N67p92N60j62k86L66j50L85m00K01j73j47M47l78
2552a51M04l41K64j67JJ21j42L83o17L82k68L38j15j63K46k84J72m20M95m43M22
2573A17J23j65J50m41L74k42K75l38J75k02K66k11N7K58l88M24n21K65l9Q4J7
2594C8P7J14l55L9M2J21k30K17J19l73L55k41L16j19j33MP9K8P8j05j84K56j87
2617d4M37n01K65j1m2J78m07K96l41K13P7j15L48k38L49p83O32k77K08l03O3k33
2639b29J14K58l02M87n23K40J15k15p1q4J47k10L24j75L20m11K49J3j55J34j41
2660a15K96m58J25k2jJ98k8j32m5L54l48K58j25J33j15oK69n12N94r6k76J53J46
2683B47k57j14N52n10J29R3n4l04K10J2Q2K04l19o1k46O06l67J47k53P7J50j47
$$ y = [-132, 166, -201, 197, -74, 234, -189, 378, -414, 146, -16, -302, 64, -86, 299, -101, 100, -73, -220, 227, -151, 253, -88, 176, 9, 10, 131, -11, 372, -245, 137, -131, 207, 92, -71, 175, -109, 63, -357, 138, -305, 117, 240, 75, 225, -216, 158, -84, 191, -147, 28, -174, 92, -119, -62, 196, -192, 232, -289, -24, -63, 21, 38, 115, 229, -126, -87, -45, 76, -154, 63, 182, -191, 164, -77, 239, 120, -13, -9, 70, 98, 176, 71, -113, 143, -44, 393, -108, 157, 146, 104, 282, -125, 171, -170, 43, 120, 5, 353, 115, 464, -319, 313, 36, 244, -59, 4, -229, -115, 143, -159, 328, -195, 45, 160, -55, -126, -210, -63, -273, 51, -124, 196, -215, 34, 47, -108, 26, -115, 181, -277, -152, -174, -175, 23, -5, -137, -182, 172, -176, 82, -43, 90, -25, -31, 238, -274, 320, 224, -52, 101, 247, -10, -124, 428, -82, 47, 140, 86, -218, -8, 4, 86, 290, -29, -90, -336, 270, -97, 50, -203, -126, 24, -123]
2705a23M4m9j7K49k09n9L42j00k95K25r2M5J64o1j72N8J59l90M60k62L3k4K81
2728B07j08k38K16k4o8r9K6J26o6L28n50M36k64k4LO2J70j53q3J02J9r9O4m05
2752d22M63l11j4L10j04N9k22M30m9m01K98l59M73l71L18o7L3J20k29K11l90M14
2774A90m1o0J8qJ29k00K84l52O6K34n1m15J09J27j8L0j67J51k01K71j77J37r2
2797c6O8N3j20O5k08K64l72J03j42L57l5o7J80J02%q5J49j13j47J46j43L33k25
2820A27o4N0O5ok01K86k28K35o1L6l55L08L1j84L45m57K54l52M89m44J55j74j64
2843c09L26j67L07k25K13j99j6n5M4K20n13M28j53K21l60o0J55J23J53l06K40
2864F7j9Nk01qP0kJ29k12Q9J45k72J26l2J74j26L23l50J61k26K74o4l57M52j86
$$ y = [-123, -79, -128, -145, 104, -105, -164, 178, 78, -217, 8, -84, -39, 125, 64, -108, -50, 109, -281, 179, -83, -50, -74, 207, 99, -139, 77, 53, -15, -114, -88, 38, -28, 300, -250, 186, -78, -102, -99, -37, 133, -20, -103, -1, 18, -81, -17, -422, 41, -270, -284, 26, -78, -19, -241, 189, 140, -261, 37, -322, 151, -220, 98, 31, 64, 184, -45, 166, -224, 190, 149, 89, 107, 99, 228, 28, 312, -40, 26, 260, 209, -206, -97, 30, 12, 42, -125, 26, -175, 96, -81, 56, -36, 32, 85, -35, 30, -178, 86, -286, -183, -325, 32, -3, -70, 110, 212, 212, 127, 276, 163, 16, 162, 19, 352, 127, 63, 113, 178, 172, -29, 257, 29, 264, 203, 239, -116, 192, 223, 39, 384, -73, 181, -171, 318, -126, 29, -145, -309, 17, -150, 157, -68, 145, -54, -70, -125, -81, 139, -374, 54, -99, 122, -238, -298, -143, -20, 133, -173, 67, 48, 53, -148, -156, -86, -88, 41, -171, -82, 63, -209, -83, -115, 59, -67, 256, -94, 67, -159, 115, 51, -306, 146, -40]
2888d0Q4k11L80j74K27k44k8K60k04j55K00R1m26K25P8r3J31k61M60l39R3k1J94
2911B27p6j66K09k87K95j75K89n12K23K15j90J85k82L29m12L36l39K00K57l93
2931f7J34o4N5q4O0j92J64K75k35J1k22M11k67L7j19q2J29j56L71m17L65k86L35
2954A56k58Q2j57L15N0k22Q2o0O8l04K49k97K40L78m88K01k21L33j01k40L43k53
2976a04Jj6oq2M89k75K72r7k44K08j75J78k30Q1N2r1K77m26N21l65K96j32k3k11
3000a02k10M70m27L26L9k8j82j1J12k04K79n2K45m44J67KJ04j00k39K47j18L39
3022B13l09J05J70j55j07j80M32j20M9l00J19N8n1P0kJ96k52O9k09J52k16K12
3044e6K48k31J13j40Q9k28M42l0m3m8l14K39n6p2p0J21M7q6K33k89J27k9J82k00
$$ y = [-40, 44, -167, 213, 39, 266, 22, -6, 254, 50, -105, 95, 186, -240, -15, 63, -30, 101, -160, 300, -39, 54, 33, 227, 151, -15, 194, -93, 202, 27, 316, -196, 27, 242, 52, 237, -45, 284, -128, 208, -131, 69, 326, -67, 67, 3, 58, -26, 34, -158, 6, 281, 46, 57, -165, 246, -21, 16, -103, -185, -56, -212, 159, -258, 107, -179, 156, -102, -20, -177, 138, 188, -34, 48, -12, 56, -248, 1, -296, -56, 322, -166, 35, -186, 147, 46, -194, 149, -104, -103, -119, -125, -207, 282, 7, 279, 182, -62, 146, -29, 149, -81, 0, 52, -39, 238, -188, 333, -32, 264, 132, 109, -102, -312, 158, -269, 57, 96, 68, -114, -125, -13, -217, 62, 10, 255, -189, -22, -20, 84, -16, -255, -8, -126, 213, -96, 9, 179, 24, -83, -263, 169, 49, 98, -202, -83, -25, -76, -6, -8, 188, -64, 5, -204, -52, -268, -56, 192, -39, 74, -66, 23, -205, 237, 207, 164, 116, -198, 41, -15, -87, -157, -36, 11, -75, 158, -131, -4, -33, 149, -51]
3068e1J98k34QJ91j20J51j59kM4j98P5K24k30R7K77l38J40K7j21R5j5J01j45J15
3092A30q9jJ34l96L95k63%N4L54j89M3M5n2l07O0J02l2R9j07j22j97L36p0j9L30
3117B38l56J67n0K19m12J85k30J29K27Lj05p3j04P9L1K85j35j20n2O8j06L85j32
3140A41N6j07q7K18l12K45m42K70J3Q4r7j3K0k51L48K8j55j02m7L03R1k49J04
3163E9LK6p0J1j0J68j36J07l28j09L63n3j25L4r6J06L5J96p8N2r2l6k4O8KQ4k12
3190e5J17j5J19m7j59q1O4O4N6o5O9k13O2N5M7j0l1J04Km8m5ro5k8M3J32l51K66
3218b2q6K02q9P3j35K7J12k10J43m0j35O9J30j26j36J41jM43l44J8r1J51q8k6
3242b0O9j25J80jJ56l32J61n2o9M6O7j95K92n4m2n4k9j7K1l4n1K57k39LL3j60
$$ y = [-51, 147, -87, -79, 112, -8, 143, -16, -18, 26, -172, -97, 127, -103, -6, 271, -67, 73, 100, -21, 74, 59, 160, 15, 130, 41, 40, 174, -222, 173, -90, -90, -36, 318, 129, 172, 217, 165, -142, -82, 20, -12, 87, -20, -142, -339, -3, -73, -92, 238, -118, 49, -1, 218, -194, -9, -239, -110, 117, 120, 15, -58, -162, -83, -52, 233, 98, -22, -74, -6, -112, 273, 141, 197, 90, 3, 221, -91, 154, -288, -18, -5, 79, -18, -31, -11, -262, 86, 114, -41, -143, -190, 113, 204, -45, 59, 62, 88, 18, 29, 19, 187, 51, 158, -170, -279, 84, 31, -94, -60, -156, -50, -15, 181, 103, 155, 63, 27, 3, 71, 73, 157, -55, 62, 47, 166, 119, -40, -121, -57, 7, 63, -2, 67, -146, -84, -29, 18, 8, -23, 81, 83, 35, -10, -19, -84, -112, -69, 63, -288, -22, -108, 94, 5, 78, -57, -30, 82, -128, 15, -25, -160, -91, 39, -87, -223, -82, -83, 360, 16, 34, -57, 94, 6, -20, 49, -76, 104, 103, 259, -73, 88, 36, -33, 13, 80, -115, 177, 123, 81, 27, -2, -19, 2, -32, -83, 174, -65, -62, -29, -189]
3268a89R9K27k10K48k44j11J52k4K25k29K02q7j05j12K60k86L46N3o2j35m5J01
3290G4j38n7j1K47k24L10j63R8k18R2r8j9J63k03j5J36J97m42M36j65m0P4%k62
3314b28K83k8O7l0oK83n29O2Q7j75K07k52J92L1Q5k07K46r0p2J7j39Q4j3K45p2
3339D8o5k14R7J06J0J16O9j12k9j33j60J63p1K20j2j98J71j54K62j08k53K61j41
3362a27Q4j02K84k59J85l64L37Q2k13J10J02J03j33j55l1K75m18K71K0j18J01
3383C4r4K18j03n0j06Q4K6qq9lJ74j62J88k18K44j36k33K45R6N6l78K10K73k83
3407a5K88k59M4j42J76k9n1M2j45K44j22k9O2n3r8J63k53j2K13m23M86j62K10
3430A35l30R9K31k63L12j83K5q2K63k18J22k48J72lj02O6Q1k16J11o7J24j1j72
$$ y = [-189, -90, 137, -73, 175, -69, -180, -28, -52, 173, -56, 146, 59, -46, -158, 102, -184, 162, 215, 153, 18, -27, 74, -64, -121, -132, 115, -109, 201, 38, 136, -82, 10, -88, -107, 56, -147, -162, -26, 171, -271, 165, 0, -40, 34, 34, -228, 55, 27, 94, 64, 58, 341, -188, -126, -39, -214, -7, -259, -67, -36, 49, -158, 88, -2, -74, -57, -196, -112, -125, 120, 48, -17, -231, -134, -28, -18, 98, 167, 55, 26, -107, -267, -104, -175, 45, 33, -165, 6, -148, 114, 6, -247, 14, -127, -43, -145, 139, -120, 65, -299, 38, 120, -93, 17, 119, 222, 89, -66, -97, 178, -240, 31, 51, -67, 34, -60, 158, 55, 5, -101, -17, 9, 1, -88, -91, 83, -79, 109, -109, 135, -1, -234, 11, 107, 163, -215, -5, 268, -15, 273, 14, 58, -84, 92, 63, 12, 54, -91, 153, 31, 2, 64, 11, -87, 76, -177, -189, 24, -399, 87, -75, 135, -195, -96, 135, -128, 184, 1, 26, -56, 207, -11, 111, -137, 35, 32, -70, -4, 77, -139, -28, -95, 29, 18, -154]
3453a54J27m8J66J78k92J9p4J53Kj25N8q0M9K06j73n3k1r1Q1J91nLj24p7J69o9
3479A6L4J01k08J20nrj33r5K03N2j71K10N6o8p6J00pm44L22l7J3J31k40M2j11
3504b04L9J58mL5K88l92J26k27K51k20K14J73l21K87k18J58M8k97j79L08J05l29
3526b01K49k3K90j41m40K19q5M24m12K28q9l41N44k21j05K53j26l2J20j4k6j6
3548E5l25L38j90Q1P6L8L7P2j98J40P2r9l93J49M00k00J88j30j83P2J08l4r2R1
3572G3l09L06J9k97J11L2J04p7J75j85J48j75p7K64m3j84R0p9J02L02l39Q2K02
3595B45j70LK78o50M34O8j44o9j11kP1j18K12J05j20K72n18L88k47K07Rl2j32
3618b1p2J49j55J6j9K25l8q5N5R8j58R8m1k53K83j59Q6j7n1R8j38K21l25K52j22
$$ y = [-154, -27, -75, 91, 269, -23, -4, -78, 75, 77, -48, 10, -70, -21, 185, 12, -41, -62, -153, -72, 119, 114, 117, -7, -84, 85, 16, 50, 151, -57, 63, 58, 49, -84, -179, 24, 76, -95, 115, 171, 103, 27, 127, 120, -324, -2, -39, -26, 105, -135, -93, -204, -165, -7, -11, 24, 312, -80, 46, -181, 70, -150, 64, 237, -84, 203, -15, 143, 191, -106, -285, 23, 128, -201, 48, 25, 315, 174, -266, -47, -132, 292, -120, 108, 19, -322, 222, 1, -104, 149, 23, -9, 111, 97, 71, 55, -270, 68, -122, -41, 35, 73, 110, 182, -16, 124, 196, 97, -296, -147, 253, 53, 241, 111, -72, 0, 108, 74, -18, 73, -236, 70, 89, -208, -97, -65, 39, -38, 137, -48, 100, -75, -152, 112, 69, -115, -25, -104, -2, 300, -39, 43, 245, 75, 78, 356, -294, 140, 208, 64, -5, -116, -118, -47, -165, 47, 152, 32, 304, -214, 174, -73, 134, 143, 111, -21, -93, 56, -99, -83, -102, 123, 85, 0, 55, 153, -5, 93, 52, -201, 82, -77, 9, -8, -59, 39, -99, 122, -203, 49, -73]
3643g3N9K01k80K19p5n7Q0M7R0k71K95j34J03j53K52m07J12K38q6P3k48O0j90
3666a45L73l82J28K03j40q8k98L49p8J54l41L45j58J6o3K4K16j10J66l92L28m3
3688F4qj06j93L58l12K68K9k01J98o4J07j05l7L0Pj01K1J72j39L27o22M78k81
3711a10K96j73j69J65o6M16m28J1K70l97k5K20m9J24j5J63j79l0j6K4j76J63M9
3734F8R6j31l5Q1J47k84o3J81j92Q7J3J46j78J76k13o9L23k42P5j31J25L4m3L3
3758DJ5n0j05L02k50K93l72P1J03p2J64k66K57k5j11J18q3L8J03Ql54L25k36K16
3782I3k4J17l74J98J23l39L77j32MkM9j95P3J58k46Q6K59j36l3q9K59k46O1j42
3806a01n8K94j17n2o2J13j2p4kJ72j30R9j59L14j95R9k30J3N4k35K02j49J62M4
$$ y = [-73, -14, 187, -93, 126, 51, -6, 74, 121, 211, -60, 235, 101, 204, 51, 303, -104, 8, 246, 160, 233, -15, 45, -145, 228, -154, -26, 177, 37, -51, -349, 0, -78, 76, -265, 80, -78, -62, -125, -101, 115, 5, 171, -221, 107, 64, 56, -50, -243, 115, -197, 71, 100, -101, 97, 33, 140, 35, -2, 28, 35, -66, -45, 127, -12, 315, -307, 171, -110, 186, 13, -156, 9, -57, 359, -69, -58, 212, -185, -210, 10, -39, 85, 70, 233, 54, 24, 8, 32, -144, 19, 68, 164, 33, -2, 79, 226, -58, -121, 60, -132, -45, -32, 114, -64, 112, -101, -170, 153, -89, -14, -145, -20, 14, -29, 4, 19, -31, -136, 166, -84, 209, -163, -92, 11, -61, 103, -163, 94, 69, -42, 76, -7, 31, 134, 142, -212, 113, -123, 93, 69, 186, -188, 10, 133, -206, 171, 39, 43, 41, 90, -105, -32, 126, -120, -34, 225, 89, 56, -33, 226, -20, 41, -101, -159, 135, 18, -34, -96, 17, 5, -69, -71, 101, -29, 70, -89, 225, 30, 129, -101, -88, -34, -269, -67, -216, -54, -10]
3830a0K8k80J04K95l53J83j15J88j27Oj31R7J94lj51K01o9j44Q8K7lJ16j73K38
3854B06k60j35J08J05J3l40L42j33P0j18r2N24l39n9n9J04k0J29n6N4K9j65J00
3877HO7L5J32k09k17J42Jn4N9q6r0K45J48k83L2K26p0L1j54r7L3J33o8J22P2k97
3903a39J09j33J16K10j85R7j89L8K00k31l2K71j27P1q5q6RL9J39l23J81k0O4j25
3927a31R9j33O2M9n0M4O8j86P8Rnq5K38j45O5j54L27Q0j38p9j25K82l10J90o9
3952a9r0J65q1j00K1J71k79L49j61j74L60l15j2J33Pj2P9Pl7K09m08m7K48qpM3
3978D2J98o08L74LJ11j12l0j31K13k11K60r5j28J93j82J85j66J85l07O8L2J95
4000H9j18QM2j18o3J59J06L2k58j30J43K02j92R8j5q1K98k05j52l2J26j08L7k6
$$ y = [-10, 18, -262, -158, 137, -216, -33, -148, 40, -87, -81, -212, -115, 79, 76, -75, 126, 57, -87, 1, 28, 25, 141, -32, 206, -54, -189, -81, 24, 37, -303, 39, -94, -24, -142, -234, 290, -49, -108, -167, -63, -83, 46, -10, 44, 73, -92, 8, 75, 110, 242, 33, -184, -42, -41, -95, -36, -122, -212, 33, 181, -102, -70, 156, 86, 117, -37, -134, -101, 32, -36, 86, 158, -139, -30, -163, -47, 163, -22, 75, -114, -76, 124, -107, -139, 132, 5, 76, -9, -95, -86, -47, 92, -231, -50, -70, -6, -131, -32, -165, -103, -54, -104, -60, 8, -178, -100, -91, -96, -181, 57, -88, -23, -177, 150, 230, 92, 13, -112, 170, -140, 50, -19, -109, 56, -25, -125, -104, 67, -212, 137, -24, -198, 162, -153, -165, -32, -25, -37, 42, 49, 12, 221, -187, -234, 14, 6, -1, 42, 240, -368, 6, 9, 120, 8, -22, -153, 60, -151, 109, 14, -114, 79, -103, 82, -84, 101, -206, -138, -106, 89, -29, -21, 21, -97, -160, -1, 105, 137, -121, -251, -108, 94, -98, 0, -15, -96, 202, -3, -155, -187, -61, -169, -132, -158]
4024a58L73k59J70j29J94j07m7K91%o30J48J35K06j42P8n3j67L59j61j53k12K86
4046B2j44J73K6J95j04l03L50j43j01J41j75J79j03k1j17L00k80J79Qj16M8l10
4068b96N88l18jn4R4j54j1L72l74M31l01J86k05j4j06K41q8p7J43k57K12j00J50
4091F1j9l8K54m00J39J96j48j50M40m14R8R6j62J74p7J41k41R4j29M0N3j05j80
4114b77J87rq4L38j53J2n6j15P8m4L10o1n9l6j81pJ47J60m58K70j5K21j66P0o
4139F6p7j31QL24m17L6L13j01k73Q7K47j00Mj11n9L29k27l4o5L43K9j03j04O1
4163D5k53K15K39l45J36n5j12P4J64j1k11K30m9J25k04K01q7K18k20k99M58l64
4185a05J33p7K61k17J02Ro5L9j96L43k60L91l02J9O1k67J8O0K11k36L64k16l1
$$ y = [-158, 215, -44, 126, -3, 191, 84, 37, 328, 328, -302, -154, -19, 187, 45, 123, 70, -97, 262, 101, -52, -264, 22, -122, 51, 77, 272, 168, -135, 215, 72, -29, 112, -63, 116, 13, -8, -125, 175, -105, 74, 82, -34, 14, -296, 292, -26, -27, -81, 13, -141, -152, 220, -154, 277, -24, 162, -43, -57, -163, 78, -10, -87, 56, -201, 11, -89, 61, 42, 4, 258, -142, -3, 193, 45, -105, 335, -79, 19, 115, -47, 127, 50, 191, -50, 44, -85, -45, 8, -97, -277, -90, -99, -183, 155, 2, 14, -42, -157, -79, -123, 187, 126, 67, 31, -150, -157, -10, 150, -308, -38, -53, 168, 2, 72, 66, -11, -142, -134, 190, -227, -191, 122, 21, -252, -165, 82, -18, -14, -125, -184, 145, -82, -116, -181, 162, 191, 88, -16, 45, -208, 7, 246, -99, 37, -18, -130, -56, 108, 97, -114, 116, 67, 192, -12, 189, 102, 320, 100, -199, 259, -105, 28, -49, 212, -5, 97, 106, 41, 80, -116, 227, -33, 358, 56, 75, 136, -131, -113, -53, 158, -78, 286, 70, 39]
4208C9M7k33J62J32k84M5J96q9J84k83M7k4r2P9n9L60k73M4k08J63Q5l68L72j90
4232a48L03j39l21J05L0O2r5L40j35Kj4J34o3j12j1J13Q4j07J73o3k31Q0j71K12
4256B8J8j18k4J88k10l3K94Kk67K64k8k14M06l70J39N3j18j32K09M1k02J57j1
4279G2m2J13j55J17l3J13j93k7K06k83K77j96K14k38K52k83J28l7n8K22l86K09
4301hJ0K96k87k5l4j8j41K7K42k40N10l60j6P8k23K19J56J32m37J55n4R9k24J96
4325E3p1p1J8p0L93l27J28o6J05j54%L7q0J7J53j07J95k4l44M29k28J15Q5k27
4349d1j23K11k58J04J51K1k72K58j10J38o9p0J98k45K99o1q7k1j27J30m6J52m4
4372H8K7k52J97j91J56J96m59L49k60J37j82K07K3j73q4R9L90l72j30K50j74L15
$$ y = [39, 86, -147, 15, 147, -137, -92, 104, 15, 199, -84, -37, -61, -153, -74, -133, 227, -46, -2, -210, -47, 38, -330, 42, -148, 155, 16, -305, -200, -170, -108, -203, 137, 2, 4, -10, 124, 61, -51, -62, 51, 135, 28, 201, 138, -93, -13, -184, 28, 46, -72, -96, 92, -118, -151, 143, 145, -122, 142, 114, -100, 306, -64, 75, 128, 10, -122, 87, 128, -74, 83, 72, 30, 143, -12, 105, 72, 185, -8, -35, 171, -112, 165, -31, 183, -55, 197, -86, 42, 5, -53, 169, -217, -8, 2, 298, 11, -14, -48, -66, -207, -180, 62, -178, 332, -28, -44, 34, -189, 30, 186, 318, -119, 36, -18, 81, -143, 53, -18, -89, -71, -141, 252, -75, 53, -13, 92, -62, -62, -25, -105, -88, 65, -42, 153, 129, -215, 214, -14, 101, 186, -41, -164, 47, -211, -107, 44, 65, -207, 51, -59, 79, 10, -60, 138, -107, 192, 131, 44, 23, -104, 26, -20, 132, 88, 115, -137, 60, -131, 25, 221, -238, 111, -149, -12, -194, 13, 36, -137, -221, -122, 268, -104, -234, 16, -158, 157]
4394A57l11P9j15M5k1J2Q2k32N14P0l97K86j54M7J0m9J5j00P2J10n1P1n04N01
4418A37l06J01L0l8PPK99j95l98L05j82J98k0j64N4Jp5K82j11k38K89J23ll74
4442b71K24K0J02k08O5JJ16rj84N19o9j57o9j51n3l5J20J29mk42J17L6O0j12O3
4467Hj0J10q5J53j72J07j73J93k62k18L91J08o39L56J38m3p2P3J78j99k1J17j67
4490a29J87j69k5K58p9R1Kl55K23J34j17R1m92O92k52p5q4J07J46m3lJ26p8j52
4514DJ30k75K33l34P1K94j23j9o7L69j59p9j43l5K96m92K54k64M49jj89J52j54
4537h2J76j08K66o1n1k66J50p4R1J23j03J43j39o8KJ08j86r9K69p2M5l7k2K4o8
4562c9J85j16N1r8L23m63L3J07P9j40j49L38l47K84l09K83o1K01k24Q5k72L1K22
$$ y = [157, -154, -75, -190, -145, -166, -154, -72, -304, 210, 280, -117, 169, 15, 62, 72, 23, 38, -62, 10, 120, 69, 140, -364, 137, -169, -68, -38, -76, -69, -62, 237, 42, -356, -51, -233, -35, -55, -219, -165, -164, -239, 43, -68, -306, -17, 106, 103, -271, -47, -27, 75, -133, -68, -67, 49, 40, -144, 375, 306, 149, 80, -71, -124, -159, -39, 90, 86, -156, -39, -3, 57, -55, 8, -2, 108, 23, 176, 4, 111, -62, 131, -131, -349, 42, 150, -489, -133, 5, -38, -110, -37, 141, -58, -79, 38, -129, 58, -111, -136, 122, 43, 134, 136, -219, 4, 138, 21, 112, -380, 312, 60, -15, -99, 8, 154, 111, 108, 234, 156, 4, 134, -141, 92, -242, -171, 123, 0, -19, -86, 283, 124, 45, -98, -133, 163, -329, -75, -339, 110, 109, -80, 72, -82, 94, -14, 252, 191, 140, -126, 24, -50, 41, 164, 61, 204, 65, -3, -1, 107, -79, -178, 91, 19, 64, 27, 5, 29, -39, 146, 30, 81, -17, 306, -157, -124, -17, 62, -78, -227, 111, -236, 48, -261, 22, -39, 162, -62, 23, -249, -218, 4]
4585Dl10K16L3j2l5l63M3L99p5Jj11m6L92l73J7Q6J35Q9r6N2j75N8q3K2J31rj35
4612a45Q4j23L9j45K20N7J79j50L3k37M30Qn20J92o1J72o1L13k65K4M8k01K37
4635A28l29K31R5k23m2K7Q9K31r0j38J77k11N4J59J78n19J12K83n4o9j07J13j91
4658i6K7K51j81L39r6j58j62K82j38j52N7rP1k9J09k73L73m40J94J5j30J79kk9
4682BM5r2J05n6k58K47j5q1q2J68M9k88J48L7j8k43J01J40j50K65k68J31J04j07
4706a16J45j66L81l58K06l42J05K79P3J62l41P3k39P8J99r0K07k63J70m1k1j49
4728d8Q7r8O1J83j54M7Q5O2j13Jl0k08J71j04L85l91Q7M5m5n0J6L65l30J38k81
4753a19K69k62L10k57J92K98m03M1j52K49k1J5j04n8K29k88K97j50J83k65R8J1
$$ y = [4, -306, -90, -57, -69, -104, -467, -424, -25, -100, -99, -210, -256, 136, -237, -220, -134, 1, 90, -6, 46, -129, -71, -154, -132, -1, -10, -145, -61, -184, -145, -290, -70, -13, 166, 16, 49, -188, 242, 250, -270, -78, -139, 33, -28, 285, 20, 44, 92, -109, 128, -201, 30, 125, -98, -140, -113, -24, 207, 117, -21, 156, -55, -1, 158, 336, -183, -71, 212, 158, 89, -18, 95, -96, -69, 182, 1, 340, 244, 86, -76, 206, 68, -84, -27, -36, 35, 6, 115, -158, 215, -225, -31, -16, -146, 33, 31, 2, 47, -45, 60, 4, -254, -7, -22, -103, -185, -17, 32, -256, -108, -71, -89, -332, -231, -91, -241, 24, -244, -113, -9, -116, 29, -137, 244, -114, 92, -250, -145, 134, 207, 369, 28, 101, -138, -60, 139, 49, 256, -7, 163, 122, 101, -48, 39, -59, 2, 185, 31, 78, 163, 225, 112, 113, 83, -125, 46, -58, 327, -64, 23, 68, 23, -27, -11, 354, 24, 162, -119, 150, -112, 198, -59, 133, 431, 28, 69, -83, 166, 145, 160, 56, -2, 227, -61, 236, 86, 269, 4, 102, 113]
4775A13J7m1j68K81j65K22k96K03n9k08m3J67j63M3K21k80L15k30J86q7L0J3M7
4798A18m70L95m7kK80o25L86j0q0k3O1j00J20L08k92o9L24m59J69QJ18J03j9M
4822A98m23K41n6J65j88K26r4m9j60J42L57n26L99o88L94o8J16Q1O4j55k81J52
4844a53j03J42J63lJ2J2j02j29M50n5k29N4r2Q1k79K00L7rK00k10J7k7L47j66
4868A58j09k00K13n0j72P0l0j2l1K04k50o4J87R9l21K18J51o5J14j96J21M0m17
4891c42N71m12j4Q2L04j21j42J75l50P9o5K95j70J51LJ04j2j76r3J05K07j66Q1
4914I4j31M0r0l2J94l41M74k32L51m52J4Q5J50J82j67J77k36j74l5O9P8o5J90
4937A43k25R0L64n61J06J95J03l73J58rL45k77K7J05k03O2l02M33l71L89j52Q3
$$ y = [113, 130, 89, -79, 202, 37, 259, -37, 166, 107, -101, -144, 23, -140, -97, 124, -156, 159, -71, 115, 28, 58, 71, 118, -352, 43, -4, -6, 274, -351, 35, 25, -55, -78, -17, -117, 3, 311, 19, -50, 274, -185, -16, -8, 110, 213, 194, 198, -225, 16, -40, 125, -63, 163, 69, 20, -140, 2, 359, -167, 232, -456, -62, -130, -14, 67, 131, -24, -305, -153, -256, -114, 49, 46, 58, 70, -32, -161, 289, 234, 5, 59, -33, 48, -231, -31, 6, -3, 197, -13, 4, -23, 324, 158, 49, -151, 62, 12, -160, -90, -120, -132, -163, 41, -209, -273, -86, 13, -308, -90, 61, -4, 110, -86, 35, 75, -342, 229, -183, -197, -115, 189, 68, -74, 101, -249, -170, -235, 60, -110, 41, 44, 148, 136, -40, -133, -28, 179, 13, 94, -37, 3, -87, -119, 75, -266, 208, -24, 327, -125, -111, -26, 124, 306, 139, 316, 80, -94, -129, -60, 18, -47, 143, -82, 8, 372, -189, -83, 112, 215, -158, 0, -9, 336, 59, 86, 191, -12, 50, -252, 181, -190, 199, 47, 130]
4959A30k7q3J89j05Nj95M13k98J98l8K9k68j9R6k39K34jJ39j31j2J46p6j02j27
4983a42N16n84M28k9j30j32o9K51j31J86j71J8J43j29O3j44J40k91L18l42K86
5004E5o1k98L46k81M81m30K89j13K91J00n83L41j56J17j11K81j34j66J25k93K74
5025G4j68L04n8J5k16J23k8k3L03k65J4k13J54j93J46K41l31K04j71R4l20J66
5047a48qP9M7J7K52j81j14L5j08R6k24P9l6K27k84K37K8J79l55J58j14o1L11j85
5071g3J69k97K00k2k2o9KJ50l6j16o6n6J25L1L09k99K7K3L22k04q6K65k77n7M8
5096iJ38N1j09j6Nk19mJ69j12o6j45o4M40n8M1k04K31k01N3n4Rl8K78j67o6K3
5122i4k37M54m9k06r1J46M4J12k12N9Q4L1o9j54J03J60j68l8J03j93j9K00J55
$$ y = [130, 103, 20, 209, 104, 109, -86, 327, 29, 227, 189, 218, -50, -69, 27, -212, 22, 21, 160, 29, 17, 163, 87, -15, -142, 374, -210, 218, 189, 59, -73, -142, 109, -22, 164, -7, 11, 154, 25, 88, -56, 84, -207, 111, -231, 55, -6, -304, 42, -239, 242, -188, 101, -12, 279, 379, -204, 137, -19, 98, -13, 268, 134, -32, 93, -200, 74, -94, 210, 152, 167, -49, 74, 46, 23, 326, 61, 75, -138, 16, -177, -31, 210, -121, 83, -88, 6, -314, -148, -156, -77, -30, -13, 239, 58, -56, -21, -129, -33, -257, -178, -214, 13, -271, -34, -6, 173, -182, -24, -138, -199, 112, -73, 96, -201, -1, -23, -45, -114, -112, 38, 2, -114, -180, -236, -111, -80, 229, -70, -43, -20, 302, 98, 12, 277, 0, -57, -9, 129, 180, 71, 55, 60, -159, -163, 6, -106, -172, -317, -381, 59, 1, 42, -162, 69, -132, -79, -133, -124, -162, 116, -51, -117, -94, -331, 123, 74, -132, -223, -77, -33, 79, -133, -74, 10, 41, -28, -182, -79, 81, -87, -125, -22, -215, -234, -34, 121]
5145A21k67j0M8J89l95J93J11m5L1J73k11j70J54k05L47m67K11j54R1n6J71J93
5167E3k72L19m30K88K9L5k6j41jK03J9j90J32k2KK06k21Q4J7K04j45j00j00L1
5191b6J65q7J12q5J22j26M7q6O5k3k87J21r6M32n10K13N4M1K28m21M44n79L53
5214G1k5Q4j00Q4J37j51P4QN8k94q1M52l71K98j59p2J12K31l71J74Q5k50J11j58
5238e3J29r1K20l8m84L63j83K79k82J97j75K8K2j30P9J2N4j72J76m6j00Q7o2L6
5262a34Q2P6k65L80l24K24j12j56K76q1J32k30K31p0l3O4j3J26j95Q5k01O1l7
5285a14M76k65l5l9j28J44k10M27n55R6K26N5K49n98K98p3p2p4o2K50p6L4k57
5308c03L93k00K21k40J16M6m4J49r3M0j54J69j66j0P8r6J4j7J44k72K95j32K22
$$ y = [121, -146, -156, -108, 81, -314, -121, -10, -55, -24, 149, -62, -232, -78, -283, 64, -403, -192, -346, -255, -311, -140, 53, -219, 100, -330, -42, -13, 22, -4, -145, -146, 57, 76, -114, 18, -4, -2, 204, -17, 67, 84, 288, 143, 43, -57, -26, 139, 52, 164, 79, 201, 75, 122, 36, 101, 78, -209, -88, -184, 248, -262, -49, 5, 46, 274, -147, 297, -282, 71, 46, 130, 30, 114, 251, 100, 174, 182, 240, -54, -135, 317, -54, 244, 85, 13, 125, 356, -15, 159, 244, -6, 105, -53, 76, -15, 205, 167, -317, 46, -137, 142, -140, 57, -118, -90, -68, -198, -119, -107, -53, -225, -49, -95, -195, -108, -170, -134, -52, 24, -241, 139, -185, 39, -73, -229, 47, -34, 98, -132, 99, 29, -4, 60, 47, 173, -22, 63, -138, -77, -114, 362, 97, 62, 23, -105, 39, -171, 256, -299, -203, 23, 78, 327, -271, 27, -46, -118, -192, -254, -4, -80, -46, -303, 90, -110, 111, -129, -13, 33, -11, 138, 45, 85, -69, 100, -66, -76, 2, -94, -80, -97, 47, -225, 70, -62, 160]
5331A60j97kn3nK93l64N9J15j92Q9pL69l51J3j29M04j37Lr4j97K00n4J05j72n5
5356a99J33p4k8J83r2M4N2j20J99m1R0l9j92J22k3J19m39K32J70k78J62m6L34
5379B69l26L6J05J70n5k67N3j00K05k24K63m73M55J3M1j69j38J20J26l05J57K26
5401A82%k21Q1k3q6m7J17l2L2k13R4Q8n2O4j5L45o1q9l23K43k08M6j69L8J79r5
5427a25J07l0R9N2k20L59k38l19M01L4j21p6J87j66J65l34mL07k79K33j72M58
5449C18k77j1k0j14J37J49l16l1L79n34M36k61K37k12r3J11P2K53k98J8m2J72
5471G3l96L10PJ86L9l05J84q4L44j56l8j47K47k56j81K21o2L0L1j13K29J18l45
5494f4L3j83J01K68l64J56J09K1J02k70K08j74j28K79j20j9l7M9Q4rJ60p1j01
$$ y = [160, -37, -39, -92, -97, 196, -168, -109, 6, -186, -97, -104, 265, -86, -73, -202, 202, 65, 68, -26, -223, -23, -77, 28, -144, -199, -66, -140, -168, 15, -77, -33, 19, -101, 98, 57, 147, 108, -84, 38, 15, 134, -305, -73, 97, -181, -19, -65, 269, -57, -21, 84, 254, 199, -68, -15, -115, 90, -134, 129, -344, 111, 124, 165, -4, -142, -22, 104, -201, -44, 182, 182, -39, 42, 19, -67, -114, 3, -29, 3, -210, -116, -28, -80, -16, -31, 314, 253, 164, -159, 84, -124, -78, -247, -209, -30, -125, -18, -48, 51, 103, -117, 242, 4, -315, 86, 120, -1, -77, 110, -56, 109, -225, -229, 78, -201, 32, -140, 318, 41, 30, 10, -104, 33, 182, -134, -165, 214, -320, 116, -145, 92, -120, -213, -102, -30, 223, -75, -57, -99, 73, -323, -13, -6, 180, 219, -86, 98, 14, 358, 202, 164, 17, 264, 8, -173, 48, -14, 16, 47, -66, 163, 281, -64, -31, -214, -113, 155, -209, -53, 56, 77, 179, -91, 117, -57, -185, 94, -26, -45, -82, -33, 51, 42, 202, 131, 30]
5517C0R5j42Q5j05k98K42R2m9M6m1k6j32L21k82J43J03j3j51M3L59m32K31k21
5540a02K78k00j93N7L65k43J80kk88M19l01J41j89J55j37O8K14q5k02J21kJ83
5562B37j87K42l91K78J39l32K9K05j78p3Q8k03K76j27O2L9q7J06J03p8j24M6N3
5585A23j89j52L41L9k96J97p8O2j72L39l66O1m6K72J41l63K82n9L3r9R1j21q1
5608d1n9l6J69o3r9J03Q2lj19J46m19J88qR0J12k09J50q6J46k15K44k72p6J67
5632a08p1L96k67K76k51L04j20nj15L2J22j67J16j4J02j17l2k5J32J3j25J52k52
5655b4K07q2l8P8M1%l18L06N7k33r2L68k62J14Q4M4l23n0L78k10R8j40m3L1J47
5680A38j52L81k4k71J0L7k86J31KJ06j69O17m71m4J29l0J04k86K14j69J78j10
$$ y = [30, 125, -17, 68, -37, -335, -93, -1, -50, -4, -45, -71, -203, 118, -164, -21, 82, 69, -82, -39, 320, -112, 119, -102, 176, -24, -217, -160, 205, -38, 142, 140, -148, 271, -30, 111, -78, 77, -60, 8, 222, 137, -65, 56, 54, 237, 50, 292, -99, 179, 318, -14, 15, 220, 42, -31, 57, -146, 130, 3, 65, 104, 17, 123, 226, 148, 24, 70, 123, -66, -218, 123, 162, -134, 63, -15, 47, -125, 214, -152, -91, -137, 135, 276, -87, 195, 136, 169, 70, 161, 40, -41, -100, -136, 33, -30, -129, -26, 56, 53, -66, 80, -339, -151, -159, -69, 43, -166, -16, -102, 44, -171, 73, -199, -275, -108, -179, 217, -50, 226, -25, 279, 159, 154, 39, 71, 193, 26, 142, 128, 230, 113, 81, 56, 188, 201, 76, 228, -24, 183, 101, 63, 141, 182, 182, -136, 170, 227, -6, -98, 270, 8, 122, 206, 250, -73, -123, 255, 45, 143, 3, -40, -9, 138, -14, 367, 343, 72, 82, 119, -167, -36, -34, 72, -97, 520, 49, 5, 134, 104, 208, -78, 136, -33, 145, 35]
5702C5j2k44J48K47m58L28l05J55j19P9J07j8J65k92J66l3r0P4k35L09l96M56
5724F7l45K69m23L02K53k19J18q4k0K0J98k58j04K24J86m37K36k23O4J22j94K92
5746D4o5Q6k7k42K36m3M7Q0j97L3m16M44qr3k9K65l90K51J56j20k46K46N3j33
5770f8M4n6J12k1J3j53K04k4j78R7J21M8Q0j72O2j41j1o8K86j59K7K4j92lJ57
5795B9j12K81k40j68K73j1P9j12J83J13j34J90l61p4J63k02K33k72L41j42n8Q2
5817H1j28J36l74K83K0o8R0M1j8r0j15kJ48N3J75r1m45L25j19N0j97L98k55M1
5841f1oK7N0j52J47J05m5k94J56j30L83k10p1J00l2N5m9l0K48rj30j22n1j7J86
5866D8j35L31k15q5m8J48j49L8K28m7k07J5K35l23J80P2l72M06j30J98n07J95
$$ y = [35, 23, -221, -73, 174, -284, 44, -261, -106, -225, -146, -39, -57, 108, -184, -18, -51, -141, -67, -302, 7, -389, 67, -278, -9, -432, -130, 123, -96, 22, -62, -82, -62, 136, -122, -226, -2, 184, -253, -17, -240, -176, -54, -248, 44, -21, 65, 38, -204, 32, -11, 36, 116, -81, -48, -464, -20, -28, -121, -150, 115, -275, -24, 132, 12, -234, 12, 65, -68, -24, -80, 32, 11, 24, -129, 75, 51, -127, -30, 91, 139, 219, 47, 109, -32, -43, -111, 175, 16, 43, 67, -125, -128, 29, -83, 198, -42, -210, 63, 52, 131, 19, 202, 315, 181, 371, 10, -64, 99, -103, 130, -142, 199, 57, -1, 81, -47, 89, -285, -2, 18, -50, 40, 81, 63, -27, -142, -144, 4, 57, 232, 141, -304, 21, -98, -48, -245, 153, -102, -61, -67, -40, 10, -142, 5, 110, 65, -229, -73, -203, 180, -30, -101, -1, -33, 22, -27, -57, 191, 182, 52, -70, -121, -138, 48, -87, 244, 29, -56, -104, 44, -105, -67, 161, 114, -93, -78, 157, -166, 14, 86, -286, 120, -10, 188, -319, -124]
5888a24p0k00M38q3%J91l05L2o2L52k74j52L28k67J35l6R0P3L3j75K00k35j4q2
$$ y = [-124, -194, -394, 44, -39, -39, 152, -153, -121, -183, 169, -105, -257, 71, -196, -61, -97, -7, 66, 99, -76, 124, -111, -125, -207]
$$ [...]
8191C6
##END NTUPLES=NMR FID
##END=
