##TITLE=1H_CA-8760x
 DMSO, 8 sc, 
 21.9.2020
##JCAMPDX= 6.0         $$ Bruker NMR JCAMP-DX V2.0
##DATA TYPE= NMR FID
##DATA CLASS= NTUPLES
##ORIGIN= UXNMR, Bruker Analytische Messtechnik GmbH
##OWNER= root
$$ XWIN-NMR		Version 3.5
$$ Mon Sep 21 10:24:08 2020 Russian Standard Time (UT+4h)  she@DPX200
##.OBSERVE FREQUENCY= 200.1315066352
##.OBSERVE NUCLEUS= ^1H
##.DELAY= (6, 6)
##.ACQUISITION MODE= SIMULTANEOUS
##.ACQUISITION SCHEME= undefined
##.AVERAGES= 8
##.DIGITISER RES= 18
##SPECTROMETER/DATA SYSTEM= spect
##.PULSE SEQUENCE= zg30
##.SOLVENT NAME= DMSO
##.SHIFT REFERENCE= (INTERNAL, DMSO, 0, 15.7039)
##AUDIT TRAIL= $$ (NUMBER, WHEN, WHO, WHERE, WHAT)
$$ ##TITLE= Audit trail, XWIN-NMR		Version 3.5
$$ ##JCAMPDX= 5.01
$$ ##ORIGIN= Bruker BioSpin GmbH
$$ ##OWNER= she
$$ F:/spectra/data/she/nmr/H-F/1/audita.txt
$$ ##AUDIT TRAIL=  $$ (NUMBER, WHEN, WHO, WHERE, WHAT)
(   1,<2020-09-21 10:23:17.26 +0400>,<she>,<DPX200>,
      <created by zg, POWCHK disabled, PULCHK disabled
       configuration hash MD5:
       00 E9 B6 7A A2 85 ED C7 34 08 36 98 17 FE 4E 26
       data hash MD5: 16K
       30 73 41 1A 70 6E 5F 70 86 B4 BB 0E BB B0 7A F4>)
$$ ##END=
$$ 
$$ hash MD5
$$ 4A 88 3D 78 0D DD 04 DD A3 E6 DC A3 A5 01 27 EF
##$RELAX= 
##$RELAX= 
##$RELAX= 
##$RELAX= 
##$RELAX= 
##$RELAX= 
$$ Bruker specific parameters
$$ --------------------------
##$DU= <F:/spectra>
##$EXPNO= 1
##$NAME= <H-F>
##$PROCNO= 1
##$TYPE= <nmr>
##$USER= <she>
##$AMP= (0..31)
100 100 100 100 100 100 100 100 100 100 100 100 100 100 100 100 100 100 
100 100 100 100 100 100 100 100 100 100 100 100 100 100 
##$AQSEQ= 0
##$AQ_mod= 1
##$AUNM= <au_zg>
##$AUTOPOS= <>
##$BF1= 200.13
##$BF2= 200.13
##$BF3= 200.13
##$BF4= 200.13
##$BF5= 200.13
##$BF6= 200.13
##$BF7= 200.13
##$BF8= 200.13
##$BYTORDA= 1
##$CFDGTYP= 0
##$CFRGTYP= 5
##$CHEMSTR= <none>
##$CNST= (0..31)
1 1 145 1 1 1 1 1 1 1 1 1 1 1 1 1 1 1 1 1 1 1 1 1 1 1 1 1 1 1 1 1 
##$CPDPRG= <>
##$CPDPRG1= <>
##$CPDPRG2= <>
##$CPDPRG3= <>
##$CPDPRG4= <mlev>
##$CPDPRG5= <mlev>
##$CPDPRG6= <mlev>
##$CPDPRG7= <mlev>
##$CPDPRG8= <mlev>
##$CPDPRGB= <>
##$CPDPRGT= <>
##$D= (0..31)
0 1.2 0 0 0 0 0 0 0 0.06 0 0.03 0 0 0 0 0.0002 0 0 0 0 0 0 0 0 0 0 0 0 
0 0 0 
##$DATE= 1600669396
##$DBL= (0..7)
120 120 120 120 120 120 120 120 
##$DBP= (0..7)
150 150 150 150 150 150 150 150 
##$DBP07= 0
##$DBPNAM0= <>
##$DBPNAM1= <>
##$DBPNAM2= <>
##$DBPNAM3= <>
##$DBPNAM4= <>
##$DBPNAM5= <>
##$DBPNAM6= <>
##$DBPNAM7= <>
##$DBPOAL= (0..7)
0.5 0.5 0.5 0.5 0.5 0.5 0.5 0.5 
##$DBPOFFS= (0..7)
0 0 0 0 0 0 0 0 
##$DE= 6
##$DECBNUC= <off>
##$DECIM= 32
##$DECNUC= <off>
##$DECSTAT= 4
##$DIGMOD= 1
##$DIGTYP= 9
##$DL= (0..7)
0 120 120 120 120 120 120 120 
##$DP= (0..7)
150 150 150 150 150 150 150 150 
##$DP07= 0
##$DPNAME0= <>
##$DPNAME1= <>
##$DPNAME2= <>
##$DPNAME3= <>
##$DPNAME4= <>
##$DPNAME5= <>
##$DPNAME6= <>
##$DPNAME7= <>
##$DPOAL= (0..7)
0.5 0.5 0.5 0.5 0.5 0.5 0.5 0.5 
##$DPOFFS= (0..7)
0 0 0 0 0 0 0 0 
##$DQDMODE= 0
##$DR= 18
##$DS= 0
##$DSLIST= <SSSSSSSSSSSSSSS>
$$ [...]
##$SUBNAM2= <"">
##$SUBNAM3= <"">
##$SUBNAM4= <"">
##$SUBNAM5= <"">
##$SUBNAM6= <"">
##$SUBNAM7= <"">
##$SUBNAM8= <"">
##$SUBNAM9= <"">
##$SW= 16.880792210976
##$SWIBOX= (0..15)
0 0 2 0 0 0 0 0 0 0 0 0 0 0 0 0 
##$SW_h= 3378.37837837838
##$TD= 16384
##$TD0= 1
##$TE= 0
##$TE2= 300
##$TE3= 300
##$TEG= 300
##$TL= (0..7)
0 120 120 120 120 120 120 120 
##$TP= (0..7)
150 150 150 150 150 150 150 150 
##$TP07= 0
##$TPNAME0= <>
##$TPNAME1= <>
##$TPNAME2= <>
##$TPNAME3= <>
##$TPNAME4= <>
##$TPNAME5= <>
##$TPNAME6= <>
##$TPNAME7= <>
##$TPOAL= (0..7)
0.5 0.5 0.5 0.5 0.5 0.5 0.5 0.5 
##$TPOFFS= (0..7)
0 0 0 0 0 0 0 0 
##$TUNHIN= 0
##$TUNHOUT= 0
##$TUNXOUT= 0
##$USERA1= <user>
##$USERA2= <user>
##$USERA3= <user>
##$USERA4= <user>
##$USERA5= <user>
##$V9= 5
##$VALIST= <valist>
##$VCLIST= <CCCCCCCCCCCCCCC>
##$VD= 0
##$VDLIST= <DDDDDDDDDDDDDDD>
##$VPLIST= <PPPPPPPPPPPPPPP>
##$VTLIST= <TTTTTTTTTTTTTTT>
##$WBST= 1024
##$WBSW= 4
##$XGAIN= (0..3)
0 0 0 0 
##$XL= 0
##$YL= 0
##$YMAX_a= 508109
##$YMIN_a= -536432
##$ZGOPTNS= <>
##$ZL1= 120
##$ZL2= 120
##$ZL3= 120
##$ZL4= 120
##$ABSF1= 10
##$ABSF2= 0
##$ABSG= 5
##$ABSL= 3
##$ALPHA= 0
##$AQORDER= 0
##$ASSFAC= 0
##$ASSFACI= 0
##$ASSFACX= 0
##$ASSWID= 0
##$AUNMP= <proc_1d>
##$AZFE= 0.1
##$AZFW= 0.1
##$BCFW= 1
##$BC_mod= 2
##$BYTORDP= 1
##$COROFFS= 0
##$CY= 11.3945322036743
##$DATMOD= 1
##$DC= 2
##$DFILT= <>
##$DTYPP= 0
##$F1P= 16.9975609425685
##$F2P= -3.02152046262296
##$FCOR= 0.5
##$FTSIZE= 0
##$FT_mod= 4
##$GAMMA= 1
##$GB= 0.15
##$INTBC= 1
##$INTSCL= 1
##$ISEN= 128
##$LB= 0.24
##$LEV0= 0
##$LPBIN= 0
##$MAXI= 10000
##$MC2= 0
##$MEAN= 0
##$ME_mod= 0
##$MI= 1.114404
##$NCOEF= 0
##$NC_proc= 0
##$NLEV= 6
##$NOISF1= 3.799351
##$NOISF2= 2.8
##$NSP= 1
##$NTH_PI= 0
##$NZP= 0
##$OFFSET= 15.70392
##$PC= 1
##$PHC0= -9964.609
##$PHC1= 4.4009
##$PH_mod= 1
##$PKNL= yes
##$PPARMOD= 0
##$PSCAL= 0
##$PSIGN= 0
##$REVERSE= no
##$SF= 200.130013532006
##$SI= 16384
##$SIGF1= 3
##$SIGF2= 2
##$SINO= 400
##$SIOLD= 16384
##$SREGLST= <1H.CDCl3>
##$SSB= 0
##$STSI= 0
##$STSR= 0
##$SW_p= 3612.71676300578
##$SYMM= 0
##$S_DEV= 0
##$TDeff= 0
##$TDoff= 0
##$TI= <>
##$TILT= no
##$TM1= 0
##$TM2= 0
##$TOPLEV= 0
##$USERP1= <user>
##$USERP2= <user>
##$USERP3= <user>
##$USERP4= <user>
##$USERP5= <user>
##$WDW= 1
##$XDIM= 8192
##$YMAX_p= 0
##$YMIN_p= 0
$$ End of Bruker specific parameters
$$ ---------------------------------
##NTUPLES= NMR FID
##VAR_NAME=  TIME,          FID/REAL,        FID/IMAG
##SYMBOL=    X,             R,               I
##VAR_TYPE=  INDEPENDENT,   DEPENDENT,       DEPENDENT
##VAR_FORM=  AFFN,          ASDF,            ASDF
##VAR_DIM=   8192,          8192,            8192
##UNITS=     SECONDS,       ARBITRARY UNITS, ARBITRARY UNITS
##FACTOR=    0.000296,      1,               1
##FIRST=     0,             0,               0
##LAST=      2.424536,      0,               0
##MIN=       0,             -536432,         0
##MAX=       2.424536,      508109,          0
$$ Real data points
##PAGE= N=1
##DATA TABLE= (X++(R..R)), XYDATA
0 0 0 0 0 0 0 0 0 0 0 0 6 -8 8 -8 16 -16 24 -24 32 -40 48 -56 67 -80 94 -110 128 -150 173 -199 229 -261
32 -261 299 -340 383 -433 487 -548 613 -685 764 -850 946 -1050 1160 -1284 1418 -1564 1726
49 1726 -1901 2094 -2306 2540 -2800 3090 -3414 3780 -4192 4668 -5220 5872 -6652 7605 -8799
64 -8799 10346 -12439 15428 -20063 28315 -77225 508109 128369 -437973 71493 16211
75 16211 -5453 92530 -198602 13114 332085 -207079 -214578 256713 127565 -79150 -4162
86 -4162 -35407 85528 144829 -81985 -93018 150647 113897 -136098 -78307 132457 41390
97 41390 -46294 -26871 -64711 68242 78123 -213216 22536 257571 -187257 -182706 195462
108 195462 26433 -37939 57576 -121915 29039 149572 -98086 22755 116667 -94996
118 -94996 -3293 54526 -28072 120553 -19659 -181588 100339 85869 -108793 4722 6217
129 6217 -45372 16302 -74052 -14954 97241 -86873 -84800 71511 659 -37937 8340 5219
141 5219 49902 -5748 -60334 72619 71016 -21319 21609 40871 -4389 14014 64898 49332
153 49332 -31427 2415 67379 -51816 3662 138589 -58933 -105818 84946 12358 -20517
164 -20517 52024 -75801 2652 85739 -109845 13777 154174 -100373 -63373 114704 -24164
175 -24164 11647 62471 -69166 43136 74550 -88231 31968 97599 -67539 -1555 53831
186 53831 -53782 2791 59092 -32251 -44090 28471 3588 -54086 -225 59799 -31627 -65121
198 -65121 22092 7994 4886 24523 -38240 -6440 42396 -33710 18163 69362 -47648 -10999
210 -10999 45165 -24273 30864 47513 -53462 -132 32230 -24135 27979 4731 -38971 26756
222 26756 -4849 -40772 31824 15370 -25733 -9418 -12286 29759 -39 -45951 55822 25016
234 25016 -83011 33676 60122 -53472 25548 37630 -53311 14939 30096 -21004 30237
245 30237 1026 -52254 27007 15698 -32054 22501 7600 -50403 -8461 34182 -5886 -19881
257 -19881 7137 -5764 -22307 18336 13076 -14031 24234 -16408 -30558 65305 4624 -61028
269 -61028 70125 18501 -90973 62237 46159 -79224 37892 34484 -76781 27691 30312
280 30312 -54960 32283 3987 -63484 31662 11885 -48735 36686 7791 -64741 19188 30841
292 30841 -26095 3276 15048 -22247 -5011 20094 1811 3629 6854 -20151 -8554 38094
304 38094 -5725 -28385 35569 -6445 -48215 38548 24429 -49374 16233 19623 -38504 10593
316 10593 21153 -11229 7018 -4523 -8804 25633 -5750 -4003 33594 -9343 -15080 21725 10425
329 10425 6827 8108 -7643 11923 1097 -11394 32123 5071 -27692 11841 4639 -11227 21317
342 21317 -3243 -15602 13709 -17519 -3320 36199 -17203 -26292 31801 -5866 -29433 33301
354 33301 14016 -35299 331 22038 -16337 -5637 20444 -11822 -15623 8719 -9402 -5522
366 -5522 20824 -22175 -16997 27066 -22871 -18048 44221 -14574 -36307 37625 -5551 -24505 43073
379 43073 -2351 -24931 32144 -5175 -12897 49339 -8271 -28242 43394 -717 -28634 43110
391 43110 15578 -41193 15216 22193 -22029 5544 19691 -16000 -9681 11215 -6600 3237 11902
404 11902 -15337 -2978 18200 -13154 -3776 32572 -12070 -18937 27721 1150 -15172 24566
416 24566 4011 -19256 11359 -678 -5963 15279 -8457 -17978 10270 -7235 -19351 13579
428 13579 640 -28057 -8781 10101 -9927 -13940 8389 -1878 -21382 807 16254 -8243
440 -8243 -788 9788 -7907 3952 12639 -1520 10375 10745 -15559 9735 21109 -13024 2883
453 2883 20845 -14302 -11342 20292 -2315 -10076 8969 -5717 -11321 8014 -365 -8291 11782
466 11782 -6784 -17243 17584 8224 -19540 15173 15461 -27737 9013 30102 -16469 -1811 23869
479 23869 -15052 -4849 24033 -9675 -2414 13239 -19133 -3868 20862 -17988 -10678 20390
491 20390 -20334 -18914 22246 -5134 -22048 12921 -1309 -19800 11054 5417 -10561 7790
503 7790 996 -13175 14935 9592 -15616 13001 13150 -20622 4933 26137 -13417 -6319 19362
516 19362 -9588 -9192 17065 -303 -9282 6926 -6477 -4228 12701 -5289 -6314 11509 -4902
529 -4902 -12170 17163 7148 -14127 6259 10237 -8864 2000 15138 -3711 -2973 7389 -2524
542 -2524 560 9765 -3386 -3919 8900 -8208 -6052 15675 -3265 -15566 10982 2297 -17679
555 -17679 9780 10456 -15408 -1625 9552 -8162 1169 10701 -7512 -405 6970 -6938 2984
568 2984 13818 -9828 -5318 15459 -7490 -7918 18164 -1335 -17502 10493 4442 -13778 8253
581 8253 4437 -12681 3630 3249 -10854 10081 5145 -16992 7683 10162 -15899 4824 18270
594 18270 -15885 -4776 18035 -7340 -5845 14898 -3795 -9599 10227 -3119 -4257 11905 -6848
607 -6848 -10443 12360 -3100 -13536 14576 1537 -19455 7154 8776 -13381 3632 10145 -12631
620 -12631 -418 8852 -6321 2601 8277 -9611 90 11752 -9152 -185 14458 -8795 -9102
633 -9102 14248 -1103 -11203 10715 975 -12394 4440 4539 -7855 4042 2116 -10068 4448
646 4448 3611 -8036 4853 6455 -12466 1074 12513 -8431 -2204 12323 -5491 -8387 11288
659 11288 1154 -6517 6807 -1005 -6771 6242 1015 -6367 7197 -973 -11352 7381 5147
672 5147 -11601 3586 8744 -12814 -598 12649 -5749 -4068 9266 -3343 -4090 9877 -1390
685 -1390 -2114 8561 -4173 -4312 12411 -693 -8714 11535 837 -12282 8757 7821 -11484 2618
699 2618 7516 -10227 1674 8337 -6580 491 6253 -8309 1723 11238 -8246 -813 12255
712 12255 -7031 -5214 15269 -1438 -8758 11480 751 -8279 8989 4160 -7946 5946 2075
725 2075 -8265 7416 3466 -9397 5208 4982 -11744 4220 10439 -10682 -1010 10136 -6726
738 -6726 -3399 11743 -2806 -4058 8240 -2337 -2349 9094 -1124 -4735 9350 -1362 -6468 10725
752 10725 1929 -9693 6336 5466 -10229 3911 7567 -7967 -863 5751 -5311 -359 6343 -5778
766 -5778 -887 5561 -5719 -915 9181 -4452 -5537 9237 -1412 -6635 8157 2522 -8770
779 -8770 3618 4574 -6372 3081 3824 -6161 764 3716 -5975 2139 5797 -8511 -820 7596 -6385
794 -6385 -3303 9642 -4600 -7339 7969 -585 -6055 6002 744 -7391 4651 1190 -5832 5692
808 5692 530 -8505 3944 4004 -9354 3501 6057 -10516 -1079 7749 -7060 -3373 7877 -6327
822 -6327 -4972 6575 -4235 -4029 6437 -4647 -6123 7976 -3732 -6895 8297 -1537 -9994 6111
836 6111 2742 -9935 3948 3413 -9069 545 4378 -6617 -314 3527 -7832 -471 4615 -7019
850 -7019 -1609 6322 -7393 -4469 8215 -4399 -5666 7178 -1718 -7537 5712 1162 -6066 4300
864 4300 170 -5971 3782 1512 -6298 3777 1881 -8583 2071 4593 -7152 -1448 5654 -6442
878 -6442 -3778 5571 -2921 -4447 3313 -1857 -5066 3854 -881 -4240 3884 -1299 -5894 4710 1913
893 1913 -7248 3413 3018 -7839 1270 5361 -5852 -1326 5147 -5508 -1841 4695 -3972 -2552
907 -2552 4115 -4186 -3336 6115 -3453 -5082 5698 -1203 -6987 5988 2307 -7697 3578 3251 -6443
922 -6443 2294 4923 -5547 973 4458 -6013 1821 5080 -6033 -520 6110 -6305 -2210 7989
936 7989 -4852 -4148 6638 -2413 -5395 5892 -559 -5464 4493 -361 -4458 4471 1185 -5519 4319
951 4319 2392 -6330 3973 4378 -6342 842 6256 -5441 -511 6607 -3760 -2177 4978 -2717
965 -2717 -2419 5351 -3004 -2643 5264 -2513 -3274 5963 -452 -5212 4983 1128 -5210 3821 3138 -5003
981 -5003 1098 3879 -3765 1038 3678 -3435 -365 3767 -3166 -825 5258 -3919 -2715 5100 -2045
996 -2045 -4473 5142 -375 -5891 3855 972 -4627 2565 2205 -4616 1885 2310 -4238 2430 2688 -4469
1012 -4469 1042 4608 -4342 -325 5979 -3680 -2426 5486 -1362 -3317 5310 -652 -4213 4355 48
1027 48 -3681 4338 481 -5311 4408 1536 -5451 3639 2995 -6215 1892 4991 -5396 451 5005
1042 5005 -4103 -895 4621 -2655 -1132 4396 -2962 -1962 4628 -2332 -2634 4794 -1674 -5054 4641
1057 4641 -166 -5303 2936 1252 -5601 1678 2358 -4977 1291 2066 -4845 724 2857 -4552 219
1072 219 3629 -5093 -929 4638 -3293 -2521 4839 -1846 -3371 4336 -298 -2867 2710 503 -3001
1087 -3001 2775 1120 -2935 2648 1619 -3437 1978 3446 -3784 853 4348 -3469 -647 4641 -2272
1102 -2272 -2105 3936 -1563 -2470 3781 -1019 -2436 3374 -793 -3269 3865 -92 -4037 2909 1423
1117 1423 -4545 1928 3009 -4579 685 3232 -3538 -152 3360 -2654 -1237 3583 -3275 -1320 3885
1132 3885 -2681 -2878 3939 -2212 -3868 4501 -1082 -4603 3013 614 -4491 2350 1486 -4114 2081
1147 2081 1450 -3582 2082 2545 -3675 1384 3524 -3376 840 4673 -2348 -1197 4955 -1290 -2105 4614
1163 4614 -656 -2361 3350 -48 -2561 3456 98 -3308 2922 557 -3988 2628 1678 -4551 1330
1178 1330 2703 -3721 533 3174 -2690 -525 3245 -2102 -585 3220 -1735 -1266 2951 -1102 -2182
1193 -2182 3535 -664 -2903 2700 165 -3718 1868 1415 -4376 1035 1574 -3439 171 2163 -3138
1208 -3138 -225 2464 -3001 -249 2680 -2566 -940 3522 -1682 -1965 3745 -581 -2454 3535 900
1223 900 -2541 2759 1395 -2827 2108 1501 -2783 1596 1889 -3307 993 2797 -3369 241 2912 -2991
1239 -2991 -1249 3693 -2144 -1677 3412 -1405 -2006 3065 -650 -2158 2898 -529 -2611 2713 577
1254 577 -3138 2454 1094 -3400 1946 2335 -3334 587 2398 -3002 -377 2723 -2522 -609 2374
1269 2374 -2381 -1231 2703 -1686 -1646 3225 -1370 -2184 3400 23 -2725 2718 670 -3016 2060 1411
1285 1411 -2892 1076 1381 -2653 1005 1786 -2675 649 1937 -2470 -368 2861 -1855 -1089 2722 -1158
1301 -1158 -1868 2707 -237 -2794 2151 -22 -2311 2199 278 -2698 1802 1200 -2905 1667 1573 -2902
1317 -2902 675 2396 -2431 -89 3056 -1913 -763 2810 -1348 -1403 2418 -864 -1701 2260 -785 -1734
1333 -1734 2621 -142 -2151 2540 974 -2669 2066 1477 -2847 1359 1953 -2181 422 2325 -1948
1348 -1948 -149 1922 -1913 -510 2496 -1751 -1294 3005 -1538 -1726 2583 -715 -2493 2111 146
1363 146 -2566 1853 482 -2435 1125 1037 -2462 932 1248 -2519 743 1603 -2356 -20 2545 -2054
1379 -2054 -557 2585 -1634 -1252 2467 -768 -1608 2376 -491 -1679 2068 -136 -1966 1899 609
1394 609 -2390 1769 924 -2287 1129 1848 -1828 450 2199 -1782 73 1920 -1453 -526 2097 -891
1410 -891 -856 2345 -1309 -1089 1970 -461 -1803 1962 176 -2262 1763 542 -2271 1202 977 -2238
1426 -2238 460 1378 -2259 331 1398 -1975 58 1628 -1803 -894 2069 -1686 -1668 2049 -978 -1969
1442 -1969 2112 -45 -1997 1350 22 -2070 1231 708 -1831 961 861 -1867 938 1477 -1985 380
1458 380 2176 -1595 -102 2117 -1736 -793 2160 -847 -1116 2153 -635 -1468 1870 -174 -1624 1989
1474 1989 161 -2324 1479 666 -2110 1152 1452 -1936 473 1865 -1720 28 1529 -1080 -277 1708
1490 1708 -1014 -805 1823 -1055 -1058 1739 -713 -1661 1882 -429 -2106 1578 -38 -2004 894 336
1506 336 -1885 822 928 -2024 176 1291 -1622 286 1403 -1482 68 2052 -1057 -606 2103 -597
1522 -597 -1204 2003 57 -1025 1584 244 -1364 1334 683 -1501 1207 656 -1734 905 1010 -1660
1538 -1660 535 1370 -1776 48 1595 -1053 -519 1728 -717 -545 2152 -571 -938 1975 -129 -1231
1554 -1231 1459 275 -1407 1555 608 -1877 1218 1157 -1861 535 1375 -1664 220 1276 -1340 -476
1570 -476 1299 -1109 -396 1463 -1060 -564 1559 -895 -1009 1816 -265 -1051 1688 -56 -1549 1326
1586 1326 616 -1764 1022 1011 -1515 854 1036 -1558 465 1536 -1475 3 1784 -1364 -578 1855
1602 1855 -597 -969 1610 -94 -1090 1386 75 -968 1267 360 -1204 1100 605 -1730 1038 484
1618 484 -1252 707 1284 -1411 121 1434 -1448 5 1417 -1140 -533 1515 -777 -951 1759 -410
1634 -410 -1101 1512 -253 -1575 1448 273 -1452 1178 803 -1814 337 1015 -1117 300 1253 -1065
1650 -1065 195 1365 -895 -248 1128 -964 -535 1321 -703 -923 1336 -448 -1313 1628 -166 -1522
1666 -1522 1001 355 -1451 1059 623 -1539 871 812 -1187 316 1387 -1526 45 1432 -1373 -712
1682 -712 1460 -832 -1006 1434 -515 -1213 1265 -299 -839 899 -134 -1258 1243 89 -1510 953
1698 953 607 -1286 851 866 -1463 337 1232 -1324 32 1323 -1066 -531 1332 -930 -598 1825 -263
1715 -263 -771 1447 -73 -1110 1195 207 -1528 895 694 -1499 404 819 -1304 185 982 -1079
1731 -1079 -103 868 -1113 -19 1071 -1089 -300 1043 -1008 -549 1264 -982 -878 1327 -609 -1182
1747 -1182 723 103 -1469 1144 371 -1200 1020 539 -1353 557 1099 -1316 90 1557 -1227 -283
1763 -283 1258 -795 -778 1283 -528 -864 1326 -205 -811 949 -86 -1143 1040 20 -1172 1008
1779 1008 518 -1006 845 689 -1245 423 787 -1489 217 1358 -945 -291 1124 -942 -686 1063
1795 1063 -708 -769 1468 -224 -999 1180 -298 -1378 855 592 -1300 671 524 -1125 314 806
1811 806 -1111 285 732 -884 129 1136 -993 128 1116 -885 -447 767 -872 -396 1273 -727
1827 -727 -1044 1238 -36 -1078 1066 87 -1411 592 471 -1279 605 1042 -1306 183 1357 -1163
1843 -1163 -174 964 -593 -287 1391 -428 -427 905 -233 -753 986 -27 -773 938 -100 -828 937
1860 937 55 -1214 703 229 -1416 832 609 -1247 244 807 -1414 -343 1256 -977 -278 1173
1876 1173 -710 -704 961 -498 -1248 1067 -90 -1265 1004 222 -1187 832 566 -1064 553 419 -980
1893 -980 483 638 -1009 108 751 -1116 7 882 -841 -283 957 -720 -488 1052 -319 -741 1027
1910 1027 -236 -1185 900 -142 -1194 671 338 -959 601 827 -1186 206 953 -1001 -201 929
1926 929 -607 -462 1130 -608 -128 696 -313 -559 902 -592 -668 852 -99 -901 1037 86 -1032
1943 -1032 814 333 -1195 455 589 -1117 531 593 -1072 75 1181 -816 136 1221 -474 -497 981
1960 981 -410 -772 1129 -198 -942 1012 143 -1088 828 225 -1056 811 339 -801 183 614 -743
1977 -743 275 780 -724 235 964 -858 -371 1079 -850 -342 1287 -613 -643 1037 -284 -611 1157
1994 1157 -154 -1040 807 254 -1148 890 678 -1142 611 925 -1084 25 704 -909 -139 964
2010 964 -876 -378 885 -491 -311 869 -231 -533 1235 -387 -578 812 -20 -989 874 91 -859
2027 -859 726 527 -882 556 831 -977 431 949 -1072 -76 1109 -765 -198 924 -531 -377 991
2044 991 -347 -711 758 -19 -771 630 60 -853 632 165 -734 573 591 -917 755 421 -810 217
2062 217 665 -669 46 882 -992 -252 996 -520 -264 963 -454 -910 1069 -69 -851 804 7
2079 7 -844 796 223 -1039 541 526 -888 352 877 -801 -55 1076 -708 -239 945 -732 -154 791
2097 791 -631 -611 977 -480 -428 845 -11 -791 780 -52 -953 852 307 -911 748 544 -912 332
2115 332 612 -1209 294 829 -746 -88 836 -707 -313 950 -481 -590 791 -148 -788 608 -118
2132 -118 -666 631 47 -854 663 422 -750 521 400 -811 575 630 -776 -30 881 -1145 21
2149 21 894 -787 -261 1094 -663 -551 875 -441 -552 1017 -208 -1039 895 166 -782 572 308
2166 308 -962 436 266 -762 152 613 -977 74 789 -739 67 655 -498 -18 965 -434 -351 664
2184 664 -258 -829 709 135 -637 848 219 -816 545 183 -704 476 487 -967 39 686 -659 179
2202 179 749 -694 -42 1055 -615 -389 824 -86 -483 969 -279 -875 951 -77 -528 911 216
2219 216 -809 574 336 -872 561 436 -904 430 811 -929 243 928 -731 -59 680 -462 -299
2236 -299 965 -267 -557 660 -256 -663 971 68 -776 462 208 -754 512 256 -964 393 502
2253 502 -949 382 522 -561 218 616 -604 -132 968 -572 -269 462 -454 -452 668 -173 -751 916
2271 916 -53 -670 592 153 -586 296 191 -767 520 336 -817 193 714 -891 73 808 -736 -186
2289 -186 724 -530 -590 795 -553 -306 500 -187 -722 562 -34 -633 563 170 -475 518 456 -725 416
2308 416 534 -943 224 550 -815 396 885 -829 -263 709 -439 -639 661 -256 -420 663 -298
2325 -298 -826 746 23 -624 463 157 -719 474 458 -751 474 505 -883 86 566 -725 -66 904
2343 904 -511 -263 704 -271 -394 815 -329 -514 819 -411 -433 989 49 -712 741 179 -862 515
2361 515 364 -701 281 633 -728 322 786 -687 -39 845 -573 -532 769 -677 -540 781 -277
2378 -277 -637 737 -241 -763 873 -61 -672 518 40 -737 402 332 -684 287 307 -783 10 531 -771
2397 -771 210 565 -667 -186 534 -381 -471 877 -30 -346 792 -11 -361 539 60 -646 563 412 -700
2416 -700 328 341 -690 361 473 -848 138 558 -933 -110 746 -519 -110 909 -620 -345 719
2433 719 -250 -510 754 -91 -744 728 -120 -589 608 209 -962 430 297 -683 215 442 -765 186
2451 186 406 -399 -161 643 -460 -372 756 -469 -378 673 -308 -482 731 2 -568 465 93 -559 636
2470 636 123 -888 267 270 -721 181 717 -623 21 568 -398 136 552 -724 -237 608 -117 -384 846
2489 846 -215 -485 546 52 -641 601 139 -477 736 200 -679 467 478 -721 228 383 -589 82
2507 82 573 -569 -201 509 -501 -299 460 -397 -438 749 -110 -480 639 -172 -423 610 -25 -504 576
2526 576 332 -793 245 542 -626 330 619 -738 53 740 -495 -44 552 -328 -274 484 -365 -570 569
2545 569 45 -231 550 146 -497 296 96 -619 556 109 -690 356 333 -567 1 461 -511 345 517 -627
2565 -627 -192 520 -406 -302 648 -209 -143 703 -283 -715 679 -94 -625 585 10 -500 322 -4 -371 174
2585 174 254 -521 106 471 -957 -22 571 -428 -200 673 -293 -142 453 -449 -463 814 -101 -215 605 -123
2605 -123 -516 275 179 -340 587 178 -606 276 304 -576 45 269 -620 37 501 -481 -117 387 -82 -320 552
2626 552 -358 -118 584 -54 -331 517 -42 -610 607 45 -697 483 383 -479 165 329 -712 157 511
2645 511 -592 171 382 -555 19 399 -271 -130 720 -357 -365 859 62 -702 219 17 -480 329 -5 -601
2665 -601 385 265 -561 261 394 -458 246 624 -534 336 396 -372 -166 617 -317 -442 750 -360 -533
2684 -533 327 -278 -653 388 -30 -258 363 300 -769 116 140 -648 392 300 -773 41 210 -415 45 361
2704 361 -156 -333 532 -290 -112 566 -230 -428 480 -132 -492 273 83 -367 510 190 -441 252 108 -517
2724 -517 -24 298 -453 7 538 -353 78 563 -214 -260 761 -259 -395 570 -354 -294 659 86 -290 578
2744 578 -42 -376 340 256 -596 264 208 -737 -114 364 -727 -216 469 -507 -244 566 -752 -217 314 -334
2764 -334 26 341 -272 -354 469 -140 -366 540 -95 -379 246 215 -478 174 235 -762 154 297 -356 -18 361
2785 361 -286 -158 401 -261 -302 277 -199 -442 454 -147 -235 621 -83 18 240 -69 -608 -51 174 -438 472
2806 472 442 -441 127 230 -384 -19 308 -266 -93 577 -593 -172 245 -294 -285 265 -234 -458 109 -9 -449
2827 -449 384 -7 -218 160 277 -486 165 109 -476 368 416 -394 -147 290 -241 -15 541 -500 -399 247
2847 247 -139 -383 444 -117 -308 393 40 -216 371 52 -393 297 331 -276 363 145 -479 281 457 -255
2867 -255 17 372 -480 51 469 -171 -27 599 -362 -179 22 2 -396 457 85 -399 278 -24 -713 433
2887 433 286 -701 312 168 -425 33 263 -384 -53 451 -292 -78 492 -106 -70 670 -208 -206 429 -179 -251
2908 -251 483 -155 -373 229 227 -464 350 165 -666 247 224 -280 -10 260 -463 147 415 -291 -278 310 -196
2929 -196 -382 396 -358 -506 622 -167 -304 298 0 -540 271 -85 -166 390 395 -118 -19 167 -317 -15 390
2950 390 -365 90 318 -197 1 543 -249 -405 434 -302 -274 237 32 -203 382 -43 -405 612 280 -414
2970 -414 221 359 -481 -80 214 -205 142 16 -405 -207 285 -329 -182 490 -447 -155 579 -15 -159 360
2990 360 -62 -439 295 -47 -408 493 87 -485 291 120 -541 306 302 -337 -126 370 -279 -232 147 -228 -134
3011 -134 567 -146 -171 510 -132 -233 411 -32 -331 464 -27 -419 247 21 -508 339 557 -335 -128 456
3031 456 -320 -17 507 -513 -242 573 -171 79 614 -382 -130 637 -28 -156 256 18 -218 301 194 -252
3051 -252 247 -66 -586 219 103 -387 144 324 -368 83 387 -272 36 233 -171 56 577 -133 -297 244
3071 244 -164 -87 401 67 -407 369 -180 -292 275 319 -293 -70 119 -630 43 230 -286 -78 251 -430 -227
3092 -227 441 -292 1 434 -273 -372 416 -150 -324 297 106 -436 249 4 -346 150 153 -367 450 167 -381
3113 -381 249 255 -144 32 450 -187 -125 277 -278 -174 273 -62 -409 443 -11 -40 623 87 -492 479 127
3134 127 -390 113 67 -358 -17 263 -292 -47 520 -224 70 87 -224 -206 380 -162 -325 334 -69 -382 193
3155 193 229 -156 299 31 41 250 166 -385 151 -28 -572 -4 116 -524 124 385 -475 -110 431 -71 -297
3176 -297 378 7 -23 381 -39 -231 305 -143 -259 124 -39 -363 262 327 -277 -147 -60 -294 64 91 -360
3197 -360 258 360 -96 241 454 -251 -257 338 -199 -28 471 -67 -389 299 105 -259 398 93 -279 456 -50
3218 -50 -153 171 181 -217 207 282 -139 50 246 -353 -80 481 -400 -266 275 -92 -511 253 -281 -220 109
3239 109 230 -281 505 111 -329 354 -40 -319 -111 171 -282 49 434 -260 -88 309 -366 107 190 -137
3259 -137 -122 431 29 -108 178 -49 -236 325 164 -124 452 0 -457 349 78 -141 136 99 -442 237 451
3280 451 -380 141 195 -368 -281 376 -152 -156 557 -125 -267 365 -44 -486 225 163 -429 312 -71 -279 57 97
3302 97 -249 247 227 -135 8 318 -403 -211 398 -456 -22 365 -265 -547 205 -16 -271 613 -131 -333 91
3323 91 -2 -194 357 61 -270 189 -235 -256 189 204 -148 -30 13 -283 24 287 120 -323 520 -223 -174 519
3345 519 -204 -282 429 77 -188 191 -220 -385 130 -85 -139 62 195 -355 174 369 -500 -32 275 -480 -27
3366 -27 276 -215 -182 521 -383 -179 280 -50 -149 334 -2 -44 368 -99 -290 405 -76 -265 5 -69 -25 -13
3388 -13 219 -296 48 473 -420 -103 270 -13 -321 167 -80 -67 213 -327 -213 337 -28 -397 123 80 -188
3409 -188 393 136 -345 77 293 -287 148 458 -87 -26 283 -207 243 215 53 -185 184 -478 -208 544 -200
3430 -200 -236 519 -64 -196 147 -22 -268 89 283 -110 60 20 -75 164 386 -558 50 467 -149 -10 330
3451 330 -382 -344 325 -153 28 240 -61 -170 535 -184 -203 187 153 -245 69 86 -262 115 -19 -158 -42
3472 -42 128 -430 228 177 -293 73 287 15 -28 366 -169 -155 196 -31 -176 168 -8 -283 280 32 -91
3493 -91 212 211 -309 139 284 -220 -65 183 -264 -110 157 -275 -146 -32 -252 132 45 -196 -199 562 -44 -117
3515 -117 267 23 -210 319 -147 -369 224 -33 -444 -164 36 -422 100 94 -227 82 96 -209 53 151 -168
3536 -168 -67 341 -258 -254 449 196 -50 319 32 -301 365 19 -278 61 110 -89 326 26 -7 160 86 -165
3558 -165 11 195 -211 -87 330 -373 -393 521 -182 -291 229 -90 -155 241 -142 -25 -4 208 -314 168 153
3579 153 -283 474 -74 -322 67 95 -53 45 470 -240 31 290 -154 -180 269 -261 -111 382 -94 -145 143
3600 143 -66 -94 508 -246 -233 90 -122 -339 79 310 -190 -120 210 -13 177 167 -227 -165 309 -103 -207 107
3622 107 -106 -514 115 -48 -366 220 132 -205 325 286 -277 399 -25 -210 -19 113 61 -1 107 -71 -69 241
3644 241 -117 -9 279 -94 -186 332 -175 -167 112 145 -505 213 109 -134 113 270 -209 165 -1 -278 13
3665 13 -100 -279 197 234 -55 -11 255 -102 72 216 -378 -92 330 142 -248 293 -26 -99 198 -146 -259
3686 -259 238 98 -388 -43 -347 -69 101 -8 -393 -34 167 -342 -106 308 -216 72 342 -329 -269 334
3706 334 -114 -264 120 37 13 117 35 -244 182 -73 -130 4 129 -90 370 395 -252 -49 298 -441 -44 240
3728 240 -103 -84 272 -121 75 280 31 -138 253 -185 -133 185 101 -183 140 79 -348 8 -55 -102 75 84 -138
3751 -138 324 322 -225 -130 82 -520 -124 115 -497 74 278 15 -334 276 87 -184 181 165 -375 233 -29
3772 -29 -262 67 -104 -200 166 223 55 14 173 -64 -113 244 -227 -9 396 132 -185 206 -209 -62 251 -44
3794 -44 -101 36 76 -219 63 113 -3 -55 266 -68 112 290 -378 145 22 -369 88 370 -141 -25 36 -297
3816 -297 35 99 -104 155 30 -156 -145 162 -12 -235 161 127 -186 190 63 -71 352 88 -210 133 168
3837 168 -422 -129 300 -399 -8 299 -214 -34 0 22 -136 131 -33 -180 113 27 -113 76 -75 -245 -25
3858 -25 69 46 -121 172 -350 14 194 -173 -209 -10 55 -78 126 -186 -9 -164 61 -61 480 190 23 149
3880 149 -43 -150 187 99 -318 144 -204 -208 98 360 -241 25 75 -86 42 85 -169 39 166 -33 -18 -146
3902 -146 37 -43 41 -6 -66 173 -277 -306 171 112 7 18 -109 -75 127 31 -145 78 280 -289 -251 72 44 181
3926 181 278 106 132 91 -180 73 98 60 -356 283 146 -159 51 53 27 155 170 -280 151 208 71 -348 64
3949 64 -154 31 219 151 -148 73 92 13 20 -240 -66 83 -129 -188 282 -183 -97 95 -26 -286 -30 82 -200
3972 -200 -123 -244 -339 -217 249 -205 -196 190 126 -25 -162 -99 -38 84 -217 -86 223 52 -143 -43 -185 -265 276
3995 276 66 -132 170 -50 -418 6 38 -61 7 -129 365 -221 232 -367 -32 -85 43 -11 36 -169 100 333
4017 333 42 -41 207 -48 122 38 129 -182 22 -39 -78 -104 53 -233 77 71 -173 160 -105 19 -61 189 6
4040 6 -103 158 128 13 15 -21 166 -55 121 -169 179 16 -352 -70 133 -302 -176 87 -121 -342 187 -182
4062 -182 -75 88 -152 8 309 -79 -72 389 151 -182 -14 -61 -224 59 -42 30 114 25 -148 23 -25 -232
4084 -232 229 24 -274 94 -125 -52 -157 217 -251 -145 -151 -127 -291 119 -171 11 59 -165 315 242 -225 -152
4106 -152 38 -281 -305 -46 136 -306 16 13 -86 131 368 14 -61 293 95 -14 154 27 -187 226 82 -51
4128 -51 69 -84 40 -27 -21 98 -2 402 28 166 82 -289 32 263 -110 160 179 -191 -75 75 -30 -62
4150 -62 7 -11 -66 234 100 91 301 -24 -84 -5 35 -127 -12 -16 -7 280 160 -60 -101 -103 179 51 125 -387 77 82
4176 82 -49 52 241 -118 124 -95 -103 -9 73 162 -156 -51 -118 97 147 24 111 78 239 -311 1 148 -422
4199 -422 53 -27 167 26 233 -38 -39 82 152 2 182 80 -78 307 -30 51 73 40 -147 114 3 4 34
4222 34 123 128 158 -45 -209 295 133 -409 -376 -32 36 117 -57 81 27 39 56 30 -67 -161 0 -26 73 -176 -1
4247 -1 -16 -235 -77 14 -125 113 422 132 91 27 29 88 253 164 -161 39 -176 -42 13 -78 -108 140 34 73 -17
4272 -17 76 -33 96 42 50 181 -66 -101 99 -96 58 151 18 79 29 -113 52 -155 -12 -213 -59 -19 -262
4295 -262 -7 -8 44 -36 -6 101 -52 41 62 -35 -111 -116 -116 -97 -40 -74 -33 96 -28 219 91 110 46 37 172 -31 301
4322 301 23 453 121 -12 120 63 -13 181 -3 83 18 -33 50 251 288 9 -146 -59 34 -75 -391 55 136
4345 136 46 121 2 -57 -101 18 185 102 -346 -193 -80 178 -101 -173 -2 -36 -81 30 28 -31 246 4 -138 93
4369 93 236 -79 70 -18 -135 -28 22 -267 -139 -43 -218 141 104 285 121 135 43 11 -85 -102 49 -156 43
4392 43 -2 43 101 -84 -51 57 -132 -8 -25 -1 -205 -28 161 -90 -19 118 17 -211 50 -157 392 28 -238
4415 -238 135 -38 -44 264 112 73 2 116 -95 -113 108 -27 210 176 -102 -94 106 98 145 -11 60 198 -14 48
4439 48 -46 -45 147 -248 363 71 -193 178 -22 -181 -93 65 231 108 46 -5 100 -120 -25 187 -108 -34 36
4462 36 63 31 43 -221 -24 279 80 58 35 -2 -104 -19 151 -225 -216 -16 116 -95 -16 7 -23 8 93 6 -130
4487 -130 -170 -24 -83 -38 80 -81 183 -22 -133 67 6 -327 175 -25 19 -19 -389 -41 12 146 -25 117
4509 117 -79 17 -90 -54 165 21 65 72 -98 -55 -71 -30 68 11 -28 525 156 -81 389 -77 56 24 -113 -13
4533 -13 8 2 116 150 -107 -185 181 159 -58 -105 36 -144 141 256 -16 205 223 -239 -173 -198 -255 126 240 -20
4557 -20 70 -239 -52 -9 -167 144 5 15 47 -47 63 33 -170 34 -5 -31 -20 105 -149 2 156 -57 -71 -89
4581 -89 121 -46 201 81 -11 -58 57 -273 -2 217 -199 81 140 -23 135 77 40 -38 354 98 -15 209
4603 209 72 -197 133 -290 -53 222 17 -47 285 -137 -97 3 98 -212 -63 73 -156 -59 -9 10 -126 -123 -221
4626 -221 -130 186 127 34 279 37 -258 279 -239 -256 17 6 -229 45 -40 -162 69 -110 -78 344 209 44
4648 44 216 166 -9 271 -50 -329 294 -61 -48 1 -18 -265 -212 56 121 -118 56 21 -74 16 -65 -43 -78 134
4672 134 -39 -295 304 -228 -46 170 39 159 75 -195 -34 -54 -84 59 -7 128 59 21 87 -44 37 98 -278
4695 -278 67 132 -12 -124 89 -24 46 251 -74 -54 28 -102 -138 66 178 -87 198 153 36 143 124 5
4717 5 235 -17 65 -35 -82 135 -124 -45 -201 185 122 -89 -17 -78 -298 -205 -160 -208 -23 22 -232 151 234 -107
4741 -107 100 198 -317 -62 -93 95 -79 185 125 -170 230 -88 -100 194 30 -257 112 -86 -310 -154 193
4762 193 88 73 159 -9 -186 120 30 182 7 -96 -180 200 113 106 -234 -20 -179 282 -4 -62 -172 36 24
4785 24 19 23 -114 -148 14 -69 33 51 -172 -12 72 107 -138 152 -63 -149 42 236 -41 46 -100 -44 63 -25 -12
4810 -12 251 353 -287 48 218 -172 -10 167 -177 219 -45 132 -65 22 -174 -29 44 -41 58 150 73 -201
4832 -201 53 208 -28 78 -222 -324 152 24 -202 17 166 -11 -77 105 -168 151 367 -26 -36 200 -10
4853 -10 -313 117 148 -152 45 97 -246 85 -63 43 -61 19 -112 -195 34 -250 34 154 -177 -80 145 -175
4875 -175 -135 21 -153 56 313 -1 -55 374 25 68 190 43 -378 148 93 -49 265 51 174 156 213 -241
4897 -241 44 -37 -242 -20 219 -268 -176 -136 -60 -295 309 -305 117 8 52 -112 465 53 -394 306 101 -74
4919 -74 167 288 -228 -3 16 -222 116 -33 -180 10 114 -97 -6 170 -118 -198 341 -235 -280 383 43 -98
4941 -98 -37 6 -119 180 41 -66 122 -125 -165 124 145 1 -28 103 -176 31 -6 -152 -84 206 -303 -140 156
4964 156 -59 -111 247 -130 -105 11 38 -111 132 -159 -69 279 0 -135 195 -66 -348 118 125 -133 -53 300
4986 300 71 -60 355 17 -52 92 194 -110 217 -89 -206 139 -8 -274 173 272 -209 357 300 -113 79
5007 79 106 -294 11 87 -250 26 13 -114 195 234 -232 -49 151 16 -338 174 121 -375 261 -17 -141 166
5029 166 -180 -60 311 86 -273 45 61 -62 49 37 -268 -110 169 -69 -23 -45 -23 34 271 -81 -115 22
5051 22 -151 -190 141 -86 86 28 242 -216 272 214 -275 147 187 -222 91 -228 -179 160 149 -435 66 219
5073 219 -166 -39 101 51 -179 79 82 -405 244 192 -203 204 1 -163 292 -40 -237 -83 44 -172 -93 115
5095 115 -62 56 311 -92 -44 90 -178 -98 179 -17 -85 205 -200 20 254 71 -86 166 -23 -68 102
5116 102 2 -80 165 228 -120 -73 61 -426 96 118 -111 -245 76 45 -125 78 -161 -98 207 -86 -297 330
5138 330 74 -173 308 297 -87 106 -180 -288 90 206 164 -61 115 -113 -29 106 -67 -42 130 -48 -146 403
5160 403 -31 -255 96 -187 -182 166 -258 35 618 -142 -181 158 156 -351 51 -58 -370 -79 142 -136 -108 279
5182 279 -12 55 316 -315 194 247 -188 -113 324 -33 17 247 -483 -136 259 -53 -135 123 -14 76 46 25 -244
5205 -244 110 -97 -281 -90 63 -125 -16 405 33 -363 142 182 -267 170 41 -180 -49 109 -32 68
5225 68 278 -279 254 -66 -216 390 165 -140 246 54 -48 244 106 -73 -2 51 -124 -149 56 40 115 118 -2
5248 -2 -153 -20 16 -85 256 43 -140 85 199 -124 45 -156 -113 284 279 52 -95 101 -394 -197 250 -227
5270 -227 -142 139 -149 -319 248 -54 -78 219 -416 -52 254 50 -28 -69 -110 -379 242 201 -94 229 472 -167
5292 -167 -142 171 -99 71 -36 -107 -325 128 -168 -28 58 73 -114 51 151 -189 123 147 -359 151 -13 -58
5314 -58 527 113 -223 44 -35 -321 -137 -16 -102 6 139 -32 -134 403 -36 -225 176 -156 2 299 109
5335 109 -90 388 32 -337 211 164 91 48 218 -65 130 23 -201 -111 -119 -185 -197 347 -193 59 218 -112 11
5358 11 144 -164 -118 281 -161 -67 370 -109 -181 319 68 -36 86 -8 -189 166 133 -362 -59 101 -44 4
5380 4 90 -214 -69 -84 -148 -293 359 187 -131 407 -147 66 -102 -115 -290 151 68 50 64 -21 -118 -14 -7 -94 64
5405 64 404 -254 185 25 41 -77 273 -35 78 497 73 -48 48 -255 -71 255 235 -47 -4 -180 -173 -115 107
5428 107 39 3 172 9 15 209 -262 25 262 -211 1 -51 -260 -154 209 -104 144 267 38 -50 253 -20
5450 -20 -301 66 157 -275 64 -38 -60 1 67 -9 328 141 -142 221 184 -246 -477 147 -18 8 383 -206 -208
5473 -208 81 -112 -126 379 6 -71 234 160 -190 187 38 -124 171 107 -75 -121 12 -60 40 181 -74 -186
5495 -186 385 -73 81 352 -66 -48 163 -103 113 210 66 -136 324 233 -217 288 91 -109 134 130 -220 51
5517 51 364 -287 185 42 -66 42 193 -249 -190 229 -113 -217 -88 -206 -145 10 -11 -96 -4 192 -226 41
5539 41 177 94 103 -75 -69 77 204 5 -221 178 -173 324 226 -309 -37 154 147 -128 332 -6 -37 219 -160
5562 -160 -65 -57 369 -117 -150 -50 -241 -12 249 -290 -28 165 -219 137 300 -36 -237 277 -254 208 223 -142
5584 -142 -109 201 24 122 126 -75 -173 242 -111 -256 254 -6 -271 42 47 -164 132 79 -216 322 220 -15 -60
5607 -60 6 -165 -118 -10 -297 58 245 80 -20 119 -38 -51 146 125 -269 -55 48 -12 82 -39 -111 110 159
5630 159 130 55 157 -49 131 18 75 -55 555 2 -301 498 -282 -92 124 -53 -140 48 40 -13 42 246 -315
5653 -315 164 23 97 92 -73 -79 -83 -58 35 83 232 -299 26 230 -179 217 146 -200 -78 218 -103 -12 -163 2
5677 2 -11 256 18 -196 256 41 -169 -46 30 -152 -109 204 -76 -158 241 -227 -146 225 -18 -150 310 1
5699 1 -25 -24 69 -29 19 -387 -142 400 31 -313 140 1 -346 107 91 -213 244 154 -187 157 178 -67 -88 194
5723 194 193 -238 32 6 -431 92 -115 -155 19 -178 -69 496 -146 -277 143 105 -311 26 150 -204 74 92
5745 92 -283 -138 193 -145 22 278 -541 -132 172 47 87 -110 -114 -161 292 85 -402 348 -28 -117 101 91
5767 91 36 -10 144 -157 -255 198 -105 -76 65 -143 -181 21 51 222 297 -316 -209 549 -112 8 118 -121 -55
5790 -55 331 313 -224 139 127 -149 128 -14 24 -157 153 -45 -74 43 -14 -10 44 146 -42 300 -53 -271 410
5813 410 -3 19 60 -96 -101 135 -151 -409 116 -45 115 138 72 -114 -59 -5 -296 247 127 -251 136 144 -234
5836 -234 -33 246 -114 -28 341 45 -169 -8 -77 -259 134 75 -134 222 -2 -17 -8 160 -104 -36 109 -178
5858 -178 31 131 -77 -117 80 172 11 105 -94 49 425 45 -116 229 151 -101 208 -5 -268 109 -36
5879 -36 -48 244 26 -105 126 -26 -268 -134 37 -80 -232 -9 -240 -218 122 -88 -44 287 -150 -152 289 -47
5901 -47 -213 155 -131 -219 302 -9 -137 242 273 -117 144 -112 -176 46 -12 -47 -112 225 -176 248 88 -316
5923 -316 -120 173 -47 -185 137 10 -54 187 -19 -52 353 180 -68 124 229 87 55 42 -245 29 201
5944 201 11 -15 83 -54 -99 264 -92 -101 177 10 -68 85 -66 -85 114 87 -94 249 136 -109 132 161 -183
5967 -183 -63 -118 96 -16 247 -114 -136 11 -53 -258 116 -216 68 158 -82 -239 95 139 -178 -9 68 -166
5989 -166 214 -250 -250 286 43 -144 107 73 -209 137 251 43 -353 50 -302 145 -6 -129 67 198 -111
6010 -111 -128 186 -42 -67 19 83 16 191 33 -352 174 91 -111 106 -171 64 239 -33 -209 -16 -22 133 182
6033 182 -3 -179 -232 19 -331 -126 -4 49 109 276 208 -148 228 -16 -74 165 54 -201 39 97 -129 -110
6055 -110 -89 -80 -31 80 -27 -56 117 -99 -22 -86 11 38 155 44 139 221 44 -217 186 -48 -173 -36 202 -206
6079 -206 80 116 -225 -5 174 -41 72 117 -190 -126 89 -29 -165 68 -184 -25 116 -19 112 242 -40
6100 -40 -71 -93 70 -234 78 11 -201 104 198 98 281 131 -173 154 59 -9 -198 129 -23 -177 166 98 -53
6123 -53 41 -15 22 142 240 -114 239 72 -127 62 -23 -10 59 258 -117 15 46 -259 108 62 -85 -100 221 107
6147 107 -339 -2 79 -130 -65 -2 -186 146 96 16 -130 84 -54 -52 170 -69 -2 -84 -197 17 -27 154 18
6170 18 268 -11 45 63 62 -15 92 -20 -147 -27 174 -315 82 -11 -88 82 -161 -43 264 -53 -187 -91 18
6193 18 18 317 124 -10 25 -58 76 -184 83 -172 -2 106 -68 -188 151 90 -185 146 -144 -235 167 65
6215 65 -138 -32 -238 -26 -139 47 -145 -187 403 -256 126 134 -177 13 26 66 69 189 -212 -169 202 -148 -125
6238 -125 179 36 -223 -127 177 -231 -49 -96 -621 95 146 -93 166 80 55 72 192 126 -2 95 -184 -399 54
6261 54 -222 -40 141 5 -191 47 -26 -52 -44 -60 -250 51 112 -125 -131 -33 -212 -275 -36 -253 -173 -109 -84 72 233
6286 233 73 212 85 -305 -82 -21 -115 -107 54 193 -64 100 -58 64 66 76 -10 -4 -5 -80 318 228 -33 -88 157
6311 157 5 -62 83 -197 -37 64 34 -182 131 -63 -211 186 92 31 -25 -178 -55 -99 26 -1 -272 75
6333 75 78 84 220 -61 -173 234 -163 47 -150 -69 -137 211 33 -89 108 -184 -104 155 -263 69 46 25 -181
6356 -181 181 136 -235 21 -88 49 -197 1 -221 96 245 -71 -171 267 182 73 -123 7 20 122 -118
6377 -118 -48 36 -119 -218 234 -50 58 -55 75 -11 231 -95 34 -26 113 -281 90 116 -86 -6 -67 106 70
6400 70 171 -217 -198 217 -73 -351 65 -6 17 313 93 -195 -20 22 -30 256 -269 29 148 156 92 -63 -54 -73
6424 -73 -130 103 1 68 23 -110 -308 194 361 -98 123 42 -230 143 88 12 92 -68 -4 -27 24 -266 -62 219
6448 219 -178 26 237 -121 -55 249 198 -98 105 -94 -92 -12 89 -124 -16 -127 -139 -29 74 -147 17 38
6470 38 -49 28 -126 -71 57 79 141 154 -223 -208 50 217 -74 -105 34 -111 -4 405 -153 -237 -95 107 -106
6493 -106 -176 -54 -344 -87 199 31 153 -123 -125 6 -1 -164 75 7 -133 -140 94 -255 108 98 122 -369 -13
6516 -13 -226 90 137 0 65 119 -148 113 27 157 -23 -174 113 -182 -29 -133 15 20 -40 -85 -161 294 -57
6539 -57 -3 137 -250 7 378 7 52 118 116 16 221 212 79 67 -252 -32 232 43 -10 -175 124 -204 186
6562 186 144 -212 -195 75 -59 144 -14 -203 -152 -191 -23 81 211 -37 -37 16 -161 -87 21 193 -114 -122 153
6585 153 10 -168 -101 -215 24 -70 -225 94 47 -123 -25 -28 -163 -77 89 -24 22 180 41 -238 56 -54 -316
6608 -316 247 114 332 197 119 335 -1 42 99 107 -203 47 9 62 -37 -69 10 -68 -421 -40 189 -196 244 -23
6632 -23 -285 153 228 -30 42 12 38 -111 99 -38 -4 30 -83 24 -26 -109 358 120 133 -97 59 -87 -33 -70
6656 -70 -299 -130 100 44 78 122 39 -193 -67 304 -128 110 32 -314 54 150 44 77 145 214 219 49 -26 98
6680 98 -54 -108 -90 -10 -147 -128 -31 -59 -222 -72 201 -181 49 -74 -221 78 136 -221 -43 -173 144 -213 -67
6703 -67 -185 89 165 130 -25 117 -153 -114 178 -59 11 28 -175 92 -180 156 288 -92 -36 -14 -49 -46 -326 -232
6727 -232 133 66 25 -62 101 -73 -105 -308 -163 39 -127 -57 91 -121 -79 -85 -58 -315 22 393 -58 340 -27
6750 -27 141 -54 13 72 -216 -21 -273 322 121 -51 113 131 37 -109 305 51 108 46 -1 85 27 -124 36
6773 36 159 102 -30 115 -105 150 32 -45 134 35 123 -406 37 66 -309 -5 205 -141 -240 -87 -81 53 173
6796 173 -198 106 205 -39 -58 120 17 -102 -62 -212 -110 250 232 -46 -13 -49 -62 7 128 -47 17 65 193
6819 193 94 48 -9 -281 17 -120 -131 -204 40 -178 30 54 88 146 -76 -234 184 -12 -266 303 -88 -126 65
6842 65 224 -47 95 158 -78 -43 -69 -143 -76 28 64 -2 23 199 -82 210 -55 49 93 104 26 -272 34 -196
6866 -196 33 25 36 -17 26 -136 6 -39 -165 -91 129 20 20 61 26 -284 112 -21 -38 216 61 -100 128 -163
6890 -163 217 251 18 -249 9 88 32 28 83 173 -80 -40 104 -16 3 30 129 -75 -28 -116 135 3 -106 29
6914 29 209 21 -3 43 -19 208 -108 -21 61 -140 -264 122 234 -397 -4 144 -191 106 -1 124 -282 -60
6936 -60 -196 125 129 90 -252 -30 -120 -98 175 -30 -94 275 110 29 104 240 -77 -122 -25 227 114 -172 -118 52
6960 52 190 -72 -3 138 38 -143 80 145 -8 40 -1 -70 -85 82 -36 -224 -183 -104 90 39 -25 -108 254 136
6984 136 1 146 -110 -142 86 -219 -93 157 186 -42 196 191 -124 -43 -248 94 -121 47 26 111 -57 8 169
7007 169 46 -324 83 252 -59 -33 -12 -190 -129 -77 -27 57 29 64 -212 244 -39 -155 -105 -66 -130 132 -118 -124
7031 -124 -95 -152 -89 204 129 9 -76 138 -374 -120 -81 -201 -91 228 195 -28 169 236 -12 -1 94 -220 203
7054 203 132 22 20 182 -138 -55 42 -142 13 92 -39 -294 204 -215 -250 -70 -51 -110 257 -114 -136 -11 131
7077 131 -146 -124 81 4 -28 -19 -36 -52 9 8 46 88 -202 82 -145 277 99 -134 -175 -97 -136 -184 124 97 -111 9
7103 9 82 -128 -268 211 25 -186 104 -90 -135 -16 93 -126 102 43 66 11 154 -86 108 195 -83 -239 16
7126 16 -108 66 -60 178 158 23 55 -79 177 32 -156 157 264 25 3 55 -71 -60 26 -138 31 185
7148 185 206 107 154 147 181 -222 -45 91 -16 103 -73 136 67 -73 -53 302 53 73 64 31 31 15 -76 63 265
7173 265 180 -179 28 216 230 210 -107 -2 307 -41 -166 -116 -109 -89 10 356 53 16 107 70 36 24 140 281
7197 281 131 -24 153 50 116 -13 2 -69 -58 -129 -290 37 -126 -134 -102 189 29 -9 30 -65 55 162 28 49
7221 49 -26 -22 -19 134 -71 -14 44 106 -161 55 0 -225 -285 248 22 -138 -197 -97 -151 112 -149 -140 -52 -21 24 195
7247 195 136 -60 -41 -216 -146 15 75 -149 118 -118 -207 -10 50 -101 44 41 -86 -112 28 -10 25 288 -51 1
7271 1 270 -48 -102 -155 -68 46 85 -24 -19 69 150 -153 30 415 174 92 54 -68 8 80 177 -13 -85 -74 -119 97
7297 97 81 -183 -47 64 59 53 -171 -5 37 265 155 71 97 15 -52 201 -216 14 -22 -151 26 71 125 156 -143
7322 -143 43 37 -147 144 121 -87 -79 -226 114 85 -60 -60 97 -97 -47 -9 -57 59 -69 -84 -106 -78 -41 8 -104
7347 -104 38 81 118 -24 63 -60 209 182 28 -216 -99 117 -218 -42 85 -179 44 -19 45 -79 -48 100
7369 100 -208 -29 31 -21 -40 190 -203 -159 229 -243 319 3 -195 -4 -55 -76 -36 -21 -146 97 74 49 -58
7392 -58 199 -5 -234 252 -1 -16 -97 -115 -250 53 26 165 -190 -52 -30 -51 172 33 -122 1 75 -127 -40
7415 -40 -249 -155 -101 -6 -40 -78 245 120 -40 -1 -178 -223 180 -8 -90 -104 -111 33 173 -19 -64 76 191 -54
7439 -54 -6 -28 -87 68 -195 -153 115 -270 -253 -41 269 -156 25 -147 16 -153 44 18 39 -49 -105 -116 248 -157
7463 -157 -46 86 -246 -47 -60 114 143 -57 110 39 -131 10 -241 99 120 159 -90 200 -231 134 100 11
7485 11 -2 -42 -158 -232 -167 142 17 110 -183 -81 6 103 -35 94 -154 68 -59 136 179 42 -103 -162 161
7508 161 -269 -53 -18 -135 -89 -179 -230 -98 -73 212 -138 -29 175 -88 -219 -110 -39 -239 139 66 -69 195
7530 195 179 26 -38 -53 -188 20 -78 -72 -56 111 192 148 -151 -236 -116 20 4 197 14 -346 -7 -152 -131 -180
7554 -180 -70 261 49 -129 -129 192 -9 208 -71 12 -13 98 136 275 38 -68 96 279 207 94 -185 106
7576 106 172 32 -52 -150 -125 -177 -123 98 -137 -194 -24 -37 -14 53 -58 172 106 52 19 -143 151 149 -203 -210 -15 -21
7602 -21 -201 -84 -58 -89 -243 153 -72 194 111 103 234 -17 121 -118 43 8 -188 1 198 -98 -183 25 -145
7625 -145 109 -303 -175 -26 116 -303 -82 125 -1 -82 79 165 110 144 5 269 163 82 26 105 247 20
7647 20 -73 -85 111 197 -33 -37 55 151 57 26 -38 58 -320 -144 317 -21 -139 161 -11 -7 -116 19 54 58 -220 120
7673 120 129 -65 141 -24 60 102 130 -80 1 -266 -123 -56 284 106 -113 76 -21 -106 -95 -63 76 25 55 237
7697 237 145 100 26 39 -87 -192 -23 1 -116 140 -98 -68 97 -32 -86 33 206 33 41 73 5 -265 -105 64
7721 64 -63 36 83 88 74 -103 38 134 89 -10 81 434 136 127 271 -160 -1 -61 46 113 -38 28 -127 172 53
7746 53 -99 175 143 -372 41 61 8 -83 143 -127 -21 14 -62 68 -12 -80 -150 -216 -141 47 37 -17 46 81 -284
7771 -284 116 111 -229 -266 -113 -92 -167 191 -133 62 120 249 57 -191 -151 -236 38 10 -119 -60 122 -90 326
7794 326 -37 -12 -26 146 -41 116 -148 -182 -141 -26 170 407 63 193 -106 -5 -79 12 -19 117 187 -188 94
7817 94 9 98 -250 208 -17 39 25 146 71 -22 63 174 105 -183 10 159 -248 -37 7 46 23 0 -92 -20 35
7842 35 -407 -156 9 -60 -97 214 27 -407 189 156 -285 16 -119 -107 -31 -217 -7 -94 -32 112 214 294 -130
7865 -130 37 -67 -39 454 -126 79 233 -212 11 82 -10 264 31 67 -70 56 -8 82 99 187 11 -197 154
7888 154 70 -9 -42 -3 -95 27 -87 -25 -8 -37 -216 177 177 40 356 -261 -13 -10 -20 -182 -75 90 -41 232
7912 232 38 121 -200 -17 -12 -107 -137 57 161 -98 -244 -19 -35 70 -130 -84 -93 126 -94 -42 -83 44 158 29
7936 29 -19 -9 -125 139 -93 178 -253 -372 -12 -193 -58 174 143 59 -50 1 -196 -278 -78 -145 -20 10 -71
7959 -71 -132 285 73 293 161 187 -23 353 -194 187 -114 -54 20 67 -81 -216 316 80 19 -26 -242 -16 -91
7982 -91 95 82 -58 172 36 -122 54 -161 -103 107 20 186 68 160 198 -25 55 -355 -128 213 -82 -184
8004 -184 174 28 -52 -29 124 180 -65 -283 205 -66 -131 134 -94 -128 91 76 61 -162 244 90 260 241 -22
8027 -22 -130 -317 69 43 184 -175 268 178 -21 -77 -246 140 18 -185 182 55 -144 119 104 132 -25 -175
8049 -175 225 276 -93 157 23 -114 118 -18 -54 158 101 50 302 27 -303 151 -76 55 143 144 -54 193
8071 193 -175 -2 109 157 -2 -120 12 158 125 257 76 -14 -182 156 -1 -107 95 118 -183 174 3
8092 3 -146 42 72 -231 -61 -93 -66 309 33 107 -72 34 -246 -46 -9 -185 73 -2 -8 109 -302 18 -132
8115 -132 43 -36 -8 2 -187 125 103 28 214 -39 -23 -125 -20 -74 -184 -2 118 -187 -59 173 35 89 73
8138 73 -31 -9 -62 -60 -16 -48 134 -97 307 146 17 38 4 -225 -239 32 -144 216 160 -113 75 63 -129 49
8162 49 179 -36 -109 -201 107 45 -131 -8 145 -76 -111 83 -61 276 -193 39 -59 41 226 41 -76 80
8184 80 -13 22 32 -141 -130 -335 139
8191A39
$$ Imaginary data points
##PAGE= N=2
##DATA TABLE= (X++(I..I)), XYDATA
0 0 0 0 0 0 0 0 0 8 -8 8 -8 16 -16 24 -24 32 -40 48 -64 74 -88 106 -128 149 -176 204 -237 273 -314 362
30 362 -412 468 -532 601 -679 764 -857 961 -1073 1194 -1328 1478 -1636 1812 -2003 2211
46 2211 -2438 2689 -2963 3265 -3593 3961 -4367 4820 -5328 5902 -6557 7309 -8187 9227
60 9227 -10481 12025 -13982 16553 -20088 25275 -33613 49179 -87850 378831 387654 -536432
72 -536432 79412 245094 -3471 90005 -55035 -56227 322050 -114558 -274551 257531 178280
83 178280 -183668 -47600 10019 40773 102781 -78696 -119819 130065 109352 -129154 -86306
94 -86306 161837 78260 -73717 -8092 11238 54877 108504 -121788 -26980 265579 -101913
105 -101913 -229832 219508 104330 -133702 28773 -59908 -37357 153277 -81988 -80873 112466
116 112466 -83918 -69949 91366 -25976 33469 19329 -165932 75528 158724 -103458 -17965
127 -17965 78128 -22454 33084 9927 -8214 115475 -22287 -84829 103542 53161 -45659
138 -45659 23235 25537 24408 8169 -55921 48441 77916 -46894 -17383 36929 -8250 -1255
150 -1255 45511 26420 -37570 -21582 63394 -11011 -29013 112123 -25458 -128329 87274
161 87274 66567 -60876 32037 -33040 -43164 91215 -64926 -51773 137691 -73659 -129921
172 -129921 114377 5440 -66879 51585 -57919 -20853 80662 -75493 -24889 105018
182 105018 -57520 -51073 72599 -29511 -20514 65509 -18289 -50932 32881 23761 -40055 -2416
194 -2416 54735 -19131 -73388 25533 33006 -18292 6633 -30349 -27601 41547 -16128 -19392 57822
207 57822 -39010 -45310 57528 -5976 -3629 48069 -42749 -20891 57206 -10986 5458 24934
219 24934 -38029 15733 21446 -38117 20927 27145 -39217 -14244 -1343 9749 6372 -50483 18148
232 18148 32912 -82851 -2943 75295 -53774 -20602 50663 -48613 -7725 51008 -19582 5097
244 5097 18972 -43149 19795 44508 -28983 9459 22841 -38179 -6262 44897 -14 -29660
256 -29660 2476 1827 -20059 7045 15989 -25872 -504 -3088 -37052 39327 20985 -71313 31879
269 31879 47241 -88256 27045 80678 -76171 1437 67310 -62089 2289 65846 -47578
280 -47578 4972 35395 -57057 16116 41283 -49098 10122 27652 -62072 4325 47370 -30590
292 -30590 -16047 17700 -17099 -10652 24510 4359 -6288 6253 -7234 -2786 37736 12482
304 12482 -29225 29222 20498 -37454 31583 47108 -42895 376 41363 -30159 -610 33408
316 33408 -15573 -7892 2393 -14559 14406 899 -21481 19787 -6503 -28629 17978 12474
328 12474 -7682 2272 -7428 3208 11539 -10415 21001 13578 -30674 7382 20229 -12108 11033
341 11033 5185 -24756 8517 -3635 -15407 24773 -13222 -41583 18985 4928 -40010 15700
353 15700 16442 -41967 -10820 26679 -10389 -15106 20842 -2869 -16929 15716 8935 -3323 23277
366 23277 -869 -16782 33863 4247 -20008 41737 6615 -41882 32015 19287 -35068 28869
378 28869 10553 -40823 18056 9508 -28785 28548 1378 -46837 27239 13630 -39830 24200
390 24200 23749 -45383 2259 35697 -19224 -4818 24074 -10643 -13956 17010 2194 -4735 10144
403 10144 -12013 -11103 15369 -7274 -16866 20078 -9678 -34331 16236 4809 -28743 7726 5042
416 5042 -30212 1339 6671 -13770 8092 -2979 -19583 10165 7423 -15083 13556 12022 -20567
429 -20567 -1975 21798 2741 -9940 11674 7448 -13854 2627 21480 -3510 -8530 10774
441 10774 -4455 -2424 12755 -2441 -1344 7975 -13045 -289 22390 -11164 -8297 19706 -7751
454 -7751 -15539 20990 6317 -15387 8002 2184 -10720 7909 6767 -10000 5344 447 -18078
467 -18078 11580 12542 -21543 457 16953 -25154 -5673 30249 -15772 -18433 20516 -8462 -16869
480 -16869 22536 -3357 -15087 13709 -9559 -9907 22457 -6859 -18212 21008 -6102 -21922
492 -21922 23407 6607 -24570 9185 10295 -19108 7332 13566 -12449 1643 6580 -11116 8327
505 8327 14792 -15624 3357 17333 -16004 -1958 28072 -7254 -15441 20494 -537 -13376 16632
518 16632 5362 -13915 4999 1437 -7573 10771 -1821 -12136 7194 -688 -14478 10045 9130
531 9130 -18569 -1442 11222 -8889 -4700 12747 -3642 -9988 6997 377 -2701 7783 -907
544 -907 -7257 7783 -1031 -8038 13323 1510 -17377 5977 9238 -16662 2833 13534 -15904
557 -15904 -8023 11089 -5401 -6427 9084 -7019 -7269 7642 -3913 -2716 11492 -5924 -10804
570 -10804 14734 333 -11651 15048 4932 -17979 7311 12655 -13179 3035 9475 -12773
582 -12773 -786 8344 -9258 1813 8199 -17093 -387 13487 -14193 -4485 17286 -12369 -13861
595 -13861 18206 -2180 -12527 12616 1036 -13254 8765 4625 -7564 9768 -632 -11583
607 -11583 10883 5055 -13596 9224 8151 -19110 3009 14290 -11946 -3919 12170 -10267 -6794
620 -6794 11143 -4853 -4231 7364 -7041 -5262 12122 -4844 -6105 13732 -4213 -11773 13127
633 13127 5659 -13072 7562 7086 -12109 2843 9387 -6946 -274 5503 -8719 576 7125 -7496
647 -7496 -528 7095 -10214 -4324 13138 -5865 -8328 10833 -2082 -10636 9838 5849 -9559
660 -9559 4839 3748 -6437 5176 5814 -5819 4138 4602 -9466 5307 9497 -9866 -925 10671
674 10671 -8941 -5532 13565 -3952 -9507 7545 -453 -7701 7325 1311 -6880 5947 -1137
687 -1137 -6642 9335 3205 -11014 7021 6306 -12461 5291 11496 -10449 -2352 11025 -7232
700 -7232 -2954 10170 -5359 -4601 6620 -5621 -3943 10148 -6356 -7865 10195 -4103 -9962
713 -9962 11577 1743 -14025 7223 4713 -10893 5183 6855 -9286 1137 5892 -7939 3576
726 3576 6473 -9163 437 7503 -9779 -1408 11700 -9263 -6730 10086 -4181 -8307 9148
739 9148 -1036 -10230 5686 -310 -6556 5499 289 -8554 4879 1561 -9318 6541 4238 -11367
753 -11367 1652 7894 -9258 -1210 9008 -7664 -4976 6358 -3510 -4627 5373 -4773 -5730
766 -5730 5251 -4269 -4978 6378 -3047 -9601 6186 1228 -9904 4424 4066 -9555 -214 6869
780 6869 -5847 -917 5159 -5523 -1859 4798 -4394 -1779 6050 -7076 -4674 7628 -4227 -7083
794 -7083 7321 -2193 -11114 5585 1501 -9233 2360 2169 -8792 893 3514 -7109 1754 2786
808 2786 -8367 1142 6251 -7932 -709 8334 -8142 -4069 9453 -3691 -6710 7488 -2600
821 -2600 -8104 6515 -902 -6806 4507 -1277 -8327 5747 378 -9002 5649 1900 -10916 3486
835 3486 6528 -9499 607 7228 -7416 -1055 7479 -3908 -2131 6313 -4389 -1947 7348 -3679
849 -3679 -2784 6970 -3217 -6074 8641 -609 -8104 5876 1453 -8219 3685 4301 -7280 1819
863 1819 3206 -6100 1999 4102 -5439 1054 4940 -6516 467 7413 -4644 -2744 7136 -2406 -4799
878 -4799 7299 381 -5457 3827 1511 -4643 3410 2002 -5038 2835 1806 -5412 3203 4359 -6286
893 -6286 1007 5853 -6041 -543 7515 -3379 -3244 6758 -1468 -2948 6413 -889 -3451 4944 -136
908 -136 -3679 6409 788 -5759 5398 2298 -6491 3656 5498 -7450 1043 6371 -5437 59
922 59 6620 -3764 -1924 6227 -3554 -929 6997 -3568 -2480 7646 -2283 -3965 8802 -1046 -6096
937 -6096 6597 1221 -5977 4857 2949 -6446 3177 2684 -5016 2725 3362 -5532 1737 4651 -5837
952 -5837 1478 6176 -5075 -1808 7384 -2907 -3073 7388 -1815 -4090 5527 260 -3820 4979 -124
967 -124 -4594 4740 0 -4408 4379 1425 -6340 3048 3288 -5917 1516 4081 -4604 -1191 4454 -3171
983 -3171 -1623 4036 -2777 -2019 3807 -1500 -2583 4980 -1337 -4339 5191 587 -4950 4032 2609
998 2609 -5961 2502 3927 -4809 1016 3604 -3889 -234 3860 -3473 101 4047 -3543 -1113 5231
1013 5231 -2598 -2400 5781 -1784 -4138 5583 1012 -4728 3826 2014 -5183 3216 2483 -4281 2501
1028 2501 2254 -5206 1766 3909 -5779 917 4734 -5728 -1120 5647 -4396 -2635 5363 -3068 -3288
1043 -3288 4549 -1332 -3498 3788 -1180 -3699 4386 -651 -4251 3673 601 -5326 3263 2682 -5859
1058 -5859 1512 3161 -4570 250 4406 -4135 -668 4007 -3634 -994 4591 -2775 -1422 4881 -2758
1073 -2758 -2156 5713 -900 -3174 4918 705 -3763 4155 2116 -3333 2394 2306 -2705 1785 3086 -3204
1089 -3204 1009 2738 -3392 356 3800 -3148 -1572 4529 -2830 -2827 4064 -1075 -3782 3287 -21 -3555
1105 -3555 3186 438 -3280 2565 886 -3828 2855 2117 -4240 1699 2908 -4109 102 4091 -3327
1120 -3327 -1402 4017 -2607 -2185 3287 -1685 -3162 3195 -1317 -3177 3867 -747 -3768 3613 500
1135 500 -4279 3762 2112 -4443 2611 3210 -3658 1856 4252 -3209 1084 3860 -2513 547 3882
1150 3882 -2331 -654 4392 -2565 -1375 4590 -1658 -3206 4148 -243 -3990 3556 554 -4079 2226
1165 2226 1172 -3681 1727 1513 -4047 1412 1861 -3807 1006 3150 -3781 -404 4022 -3166 -928
1180 -928 3699 -2111 -1948 3285 -1032 -2158 2779 -954 -2445 2300 -50 -3091 2224 493 -3780
1195 -3780 1935 1518 -3492 866 2976 -3303 -246 3291 -2259 -700 3145 -1758 -1052 3400 -1255
1210 -1255 -1192 3627 -962 -1576 3802 36 -2727 3358 747 -3293 2164 1816 -2793 1055 2141 -3144
1226 -3144 618 2279 -2452 246 2266 -2650 -805 3198 -2574 -1571 3499 -1986 -2458 3745 -433
1241 -433 -2952 3157 -200 -2887 2603 1014 -2925 1770 933 -3025 1867 1600 -3181 1195 2158 -3332
1257 -3332 476 3251 -3014 -584 3024 -1871 -1462 3043 -1280 -1884 2960 -810 -2096 2673 -281
1272 -281 -2474 2785 308 -2753 2673 1321 -3404 1745 2094 -3241 828 2299 -2469 252 2319
1287 2319 -2254 -403 2744 -1939 -593 2798 -1837 -1162 2903 -917 -2283 3099 -258 -2721 2429
1302 2429 392 -2532 1406 1369 -2676 1307 1553 -2506 864 1714 -2330 352 2488 -2365 -212 2822
1318 2822 -1617 -1114 3188 -490 -2164 2853 -487 -1801 2307 274 -2283 2102 847 -2258 2028
1333 2028 1000 -2493 963 1859 -2803 846 2324 -2645 -348 2756 -2016 -1048 2635 -1699 -1583 2156
1349 2156 -1129 -1562 2307 -964 -2103 2495 -287 -2349 2126 372 -2706 1589 1398 -2728 1095
1364 1095 1635 -2452 354 2134 -1997 106 2031 -1894 -328 2329 -1713 -740 2604 -661 -1561 3147
1380 3147 -389 -1901 2115 476 -2340 1931 883 -2418 1556 891 -1819 1098 1381 -1985 641
1395 641 1730 -2275 -175 2142 -1773 -521 2462 -1178 -1403 2487 -847 -1549 1710 -197 -2111 1680
1411 1680 36 -2198 1616 310 -2296 1465 1107 -2583 1000 1537 -2664 -67 1486 -2163 -609
1426 -609 1737 -1810 -840 2052 -1514 -962 2172 -813 -1555 2379 -444 -1600 2355 265 -1960 1935
1442 1935 1372 -2293 1094 1394 -1766 883 1775 -1393 409 1691 -1789 204 2320 -1265 -505 2351
1458 2351 -1075 -1182 2720 -775 -1232 2091 -71 -1944 1467 341 -1945 1323 652 -1726 1208 1175
1474 1175 -1891 706 1646 -2181 755 1932 -1938 -333 2020 -989 -1171 1934 -855 -1324 1631 -480
1490 -480 -1393 1623 -293 -1894 1649 318 -1710 1306 690 -2096 789 1085 -1980 611 1592 -1637
1506 -1637 458 1753 -1310 -115 1845 -1105 -343 2168 -504 -816 2197 -347 -1099 1882 421 -1716
1522 -1716 1571 623 -1939 961 662 -1517 813 1266 -1381 172 1400 -1736 114 1561 -1370 -414
1538 -414 1719 -1012 -945 1919 -1031 -1046 1910 -264 -1389 1650 44 -1792 1479 264 -1588 1133
1554 1133 969 -2049 765 948 -1811 478 1452 -1542 -193 1752 -1432 -703 1662 -865 -797 1071
1570 1071 -527 -1150 1276 -296 -1170 1617 -15 -1466 1522 541 -1590 1068 916 -1561 711 1304
1586 1304 -1522 335 1324 -1598 124 1644 -1263 -464 1572 -1053 -1087 1755 -978 -1435 1360 -75
1602 -75 -1563 1109 534 -1702 1100 506 -1411 712 652 -1608 701 997 -1257 325 1275 -1377 -225
1619 -225 1455 -1213 -578 1558 -661 -1061 1649 -640 -1245 1508 -351 -1363 1417 -196 -1633 1146
1635 1146 305 -1768 777 760 -1982 558 1006 -1415 -242 1334 -1086 -444 1428 -772 -695 1165 -642
1652 -642 -1188 1156 -275 -996 1365 -544 -1146 1183 120 -1824 979 472 -1371 634 773 -1559
1668 -1559 351 1293 -1409 259 1309 -1469 -469 1593 -1184 -922 1662 -832 -1083 1428 -91 -1328
1684 -1328 1310 313 -1263 869 575 -1394 800 756 -1548 552 954 -1555 265 975 -1153 8
1700 8 1334 -1057 -222 1240 -852 -424 1504 -596 -1001 1309 -548 -1031 1227 -179 -1560 1173 385
1717 385 -1427 835 437 -1423 450 806 -1171 106 1088 -1241 -377 1222 -962 -457 1232 -645
1733 -645 -613 1271 -389 -770 1200 -365 -927 1093 171 -1196 1130 255 -1350 674 574 -1474 495
1750 495 995 -1178 370 1052 -1246 -363 1489 -792 -335 1339 -832 -651 1316 -70 -1003 1263 216
1767 216 -1250 1306 332 -968 629 523 -831 515 517 -1355 405 638 -943 133 1046 -1426 130
1784 130 1350 -1343 -326 1231 -556 -562 1140 -795 -997 1145 -322 -1006 935 156 -1324 880 594
1801 594 -1344 413 728 -1168 78 963 -843 -68 1179 -873 -94 965 -706 -456 1027 -399
1817 -399 -494 858 -346 -693 1145 -103 -1212 1057 165 -1359 738 439 -1424 512 796 -1280 341
1834 341 978 -1092 -119 1278 -984 -326 1235 -718 -619 1314 -205 -1027 1188 -216 -982 761 -117
1851 -117 -976 640 279 -1007 556 196 -951 574 695 -1143 107 784 -1197 73 1033 -1156 -428
1868 -428 1165 -741 -716 1066 -279 -912 1282 -40 -1057 941 305 -1184 965 586 -1407 471
1884 471 744 -1177 339 823 -1085 -201 729 -769 -146 784 -628 -470 960 -430 -603 1021 -338
1901 -338 -793 1537 -287 -915 1199 -81 -1173 857 369 -1127 705 885 -1303 701 901 -1182
1917 -1182 54 1026 -1093 -147 925 -799 -641 844 -440 -726 962 -277 -843 756 -15 -660 499
1934 499 77 -976 741 294 -858 412 458 -1232 554 773 -1152 398 903 -1084 -11 887 -748
1951 -748 -363 1145 -700 -779 1073 -218 -814 1180 -27 -1146 697 392 -1240 555 794 -1295 373
1968 373 779 -963 174 764 -744 170 761 -570 -431 1043 -714 -489 1069 -635 -784 1277 -434
1985 -434 -822 1249 -317 -1114 738 199 -1374 552 604 -1232 741 640 -956 350 1091 -1181 -180
2002 -180 1103 -967 -417 1004 -337 -534 1057 -433 -669 917 211 -693 720 77 -808 786 50
2019 50 -915 838 150 -1001 453 698 -1123 435 675 -1089 -197 1130 -664 -300 1046 -658 -379
2036 -379 1171 -367 -713 1042 -106 -987 1001 228 -1124 696 239 -1040 515 256 -1077 210
2052 210 723 -681 98 715 -834 35 744 -620 -290 863 -695 -403 756 -353 -793 1113 -314
2069 -314 -1066 1024 278 -1021 715 468 -1091 691 551 -1150 76 833 -1063 32 794 -845 -149
2086 -149 836 -729 -281 1062 -367 -525 700 -460 -529 1006 -61 -799 980 -155 -799 818 71
2103 71 -939 469 551 -1026 261 857 -961 59 796 -794 68 1063 -944 -246 1106 -528 -560 781
2121 781 -350 -823 977 132 -775 595 -43 -954 720 229 -1010 297 242 -966 460 476 -905 57
2139 57 683 -742 159 848 -781 -337 1113 -588 -503 991 -392 -704 747 77 -683 840 88 -849
2157 -849 604 392 -966 393 483 -1075 125 735 -777 -152 773 -741 -175 966 -624 -302 715
2174 715 -490 -421 1071 -435 -400 890 -317 -648 829 203 -1115 656 320 -956 460 465 -895 62
2192 62 892 -809 20 854 -670 -28 800 -450 -410 1115 -357 -518 835 -296 -663 881 60 -950
2210 -950 886 228 -848 686 406 -738 384 681 -868 228 754 -911 128 1125 -746 -259 733
2227 733 -533 -326 745 -385 -498 936 -393 -505 767 -67 -745 544 -12 -1100 730 308 -755
2244 -755 464 587 -970 93 651 -962 -135 945 -724 -370 658 -712 -281 608 -259 -519 908
2261 908 -312 -412 786 -51 -836 647 91 -914 572 235 -945 374 589 -1031 166 711 -955
2278 -955 213 658 -761 -544 751 -641 -409 960 -411 -483 792 -61 -627 729 25 -647 415
2295 415 152 -688 607 275 -579 248 639 -516 361 539 -622 324 741 -440 -420 745 -409 -162
2313 -162 866 -434 -706 721 -295 -716 579 -148 -781 625 367 -884 775 397 -757 428 734
2330 734 -725 5 457 -469 9 743 -375 -290 665 -529 -326 893 -483 -254 789 -48 -643 861
2348 861 -103 -723 578 211 -563 532 540 -750 480 710 -664 229 833 -481 -42 470 -651 -479
2366 -479 631 -512 -230 677 -3 -560 703 54 -671 695 152 -533 592 115 -870 529 295 -590
2384 -590 202 519 -462 117 415 -705 92 632 -539 -159 662 -277 -398 901 -283 -398 766 -264
2402 -264 -584 506 190 -800 665 299 -649 647 386 -601 341 745 -573 39 719 -840 10 487
2420 487 -680 -231 922 -489 -265 614 -219 -589 766 -203 -715 648 161 -583 579 160 -811 372
2438 372 417 -794 370 335 -670 227 682 -680 -192 699 -494 -128 826 -225 -561 557 -452 -403
2456 -403 550 -162 -503 570 197 -682 556 284 -336 183 397 -605 126 557 -704 1 381 -627
2474 -627 -131 578 -738 -214 846 -236 -438 617 -238 -548 829 -28 -622 521 -75 -572 443 259
2492 259 -666 271 191 -614 429 502 -580 -86 408 -684 -137 665 -565 -43 801 -209 -472 811 -122
2511 -122 -584 769 -25 -644 558 135 -459 486 -38 -475 343 305 -544 234 714 -569 60 794 -585
2530 -585 34 674 -577 -53 495 -396 -222 678 -114 -388 520 -15 -393 437 43 -847 482 193 -417
2549 -417 322 369 -753 395 401 -713 55 853 -535 -420 540 -273 -189 704 -271 -291 480 -360 -484 581
2569 581 -176 -658 476 102 -313 188 248 -538 456 556 -521 41 235 -321 39 451 -444 -187 694 -137
2589 -137 -224 491 -216 -132 712 -185 -593 708 -60 -493 334 -18 -791 495 63 -730 44 555 -567 276
2609 276 437 -437 -2 358 -301 -124 599 -495 -132 667 -321 -416 596 -51 -473 367 321 -595 420 61
2629 61 -714 334 273 -615 222 306 -401 119 520 -487 76 578 -375 -20 359 -319 -330 677 -303 -439
2649 -439 406 -265 -410 421 11 -426 563 112 -725 317 262 -521 224 505 -548 154 575 -257 -115 372
2669 372 -562 -212 652 -428 -570 463 -151 -374 477 -164 -434 456 -47 -404 212 387 -440 205 638
2688 638 -490 286 144 -673 75 541 -573 17 528 -433 -152 352 -323 -340 405 -200 -302 441 18 -399
2708 -399 648 110 -680 316 79 -626 421 296 -590 47 156 -540 224 415 -399 -18 396 -333 -77
2727 -77 646 -470 -373 806 -155 -504 524 159 -425 329 317 -512 434 209 -433 127 102 -737 349 256
2747 256 -542 124 453 -206 73 443 -311 -386 545 -226 -272 519 -230 -302 270 -116 -568 376 126 -493 190
2768 190 270 -425 311 399 -514 207 527 -489 -56 421 -460 -168 75 -190 -229 389 -189 -376 583 -176 -153
2789 -153 582 101 -391 436 13 -544 318 281 -642 77 125 -680 -47 184 -730 99 339 -307 -46 165 -108
2810 -108 -116 585 -294 -262 372 -25 -25 414 -71 -385 448 242 -480 138 381 -513 185 343 -310 185 435 -313
2832 -313 84 462 -417 1 352 -202 -145 351 -239 -200 470 -301 -447 503 20 -628 470 72 -514 237
2852 237 54 -588 218 170 -407 231 413 -517 -340 171 -171 -76 217 -426 23 515 28 11 488 -179 -267
2873 -267 320 -70 -607 279 -33 -443 -57 175 -298 195 521 -417 135 297 -529 -117 411 -303 -28 379
2893 379 -362 -289 177 102 -272 516 100 -588 355 -6 -173 367 169 -313 100 3 -353 76 304 -455 -302
2914 -302 505 -313 -21 551 -446 -134 468 -181 40 529 -39 -387 466 -51 -541 700 -75 -179 427 6
2934 6 -246 48 -9 -456 17 153 -580 131 564 -263 -204 204 -288 -145 163 -118 -215 239 -191 -77 469 -304
2956 -304 -606 314 -59 -119 287 -160 -376 294 377 -505 168 317 -288 -13 345 -481 -65 237 -360 -285 245
2977 245 -340 -142 242 45 -241 338 23 -263 438 -2 -415 311 5 -144 -124 211 -301 -65 354 -224
2997 -224 39 399 -304 -58 520 -258 9 412 -271 -224 105 -190 -77 436 -76 -427 341 114 -618 303
3017 303 1 -436 309 480 -374 168 85 -242 -1 328 -577 -276 361 -69 15 435 -270 -461 211 -257 -328
3038 -328 600 -82 -318 389 -18 -238 353 124 -281 245 184 -394 123 380 -252 247 598 -411 -32 422
3058 422 -442 -338 429 21 -370 386 190 -268 310 150 -200 342 241 -423 324 66 -211 189 222 -512
3078 -512 218 331 -106 -229 129 13 -304 260 -49 -128 371 -6 -272 320 -126 -260 398 47 -582 167
3098 167 241 -394 366 112 -410 320 259 -550 24 151 -322 84 283 -153 -121 361 -77 -370 431 -198 28
3119 28 452 -208 -325 304 54 -461 386 118 -267 -34 240 -412 -176 374 -376 50 162 -339 125 456
3139 456 -197 -185 448 -220 -45 306 55 -267 192 19 -139 477 13 -507 237 277 -533 117 302 -163 84
3160 84 244 -312 176 125 -669 -73 483 -238 -121 314 -323 -258 390 -27 -484 390 105 -256 356 26 -267
3181 -267 164 -20 -393 149 245 -312 193 408 -475 -57 348 -349 -251 370 -293 -297 323 -307 -139 280 -1
3202 -1 -319 305 139 -655 133 -127 -275 333 271 -373 170 143 -245 153 134 -102 -80 236 -190 103 222 -274
3224 -274 -127 272 -138 -53 360 58 -103 162 42 -290 247 21 -372 291 181 -298 -14 193 -278 157
3244 157 85 -419 217 388 -268 -74 240 -111 -214 377 10 -323 218 -226 -216 358 -100 -134 221 21 -365
3265 -365 6 128 -271 132 295 -229 -12 134 -379 175 202 -174 -124 149 -341 -295 255 -302 -201 266 -133
3286 -133 -453 554 -126 -611 481 -49 -347 347 143 -457 281 211 -301 110 20 -273 -292 293 28 -126
3306 -126 356 -214 -97 348 -141 -190 475 45 -40 229 142 -165 173 -84 -458 93 330 -348 176 65 -94
3327 -94 117 495 -476 61 122 -463 -61 272 17 -184 192 -125 -82 410 51 -268 120 14 -487 366 122
3348 122 -365 178 183 -373 137 -20 -180 204 267 -345 -138 196 -585 -173 547 -120 56 377 -185 -5 217
3369 217 42 -106 391 57 -105 180 155 -479 59 139 -278 84 39 -389 219 349 -79 -235 301 -196 -40
3390 -40 331 -185 -83 255 -269 -323 46 -109 -418 132 55 -142 243 -196 -174 246 -137 -299 167 113 -135 -71
3412 -71 459 -187 -62 351 -440 -1 327 -68 -129 314 154 -125 388 100 -160 559 -62 -221 182 200 -292
3433 -292 63 100 -191 241 204 -252 161 449 -359 227 404 -337 8 147 -213 -218 431 -23 -127 333 -107
3454 -107 -466 336 103 -358 238 66 -340 175 -150 -382 -11 212 -211 169 190 -162 -135 20 -187 -166 350
3475 350 -273 -117 312 -197 -205 29 76 -244 256 35 -269 346 73 -198 95 106 -263 167 223 -338 246 196
3497 196 -494 -170 423 -158 -195 33 -107 57 402 37 -194 226 -86 -148 458 -39 -259 231 162 -190 286
3518 286 123 -33 483 297 -174 -69 227 -128 -149 51 -459 -165 404 -6 -34 118 -139 -175 487 -30 -104
3539 -104 262 -104 -150 104 -96 -324 120 271 -426 143 139 -273 -10 -22 -193 158 159 -262 -109 553 -131 27
3561 27 326 -167 -272 574 -129 -143 127 37 -152 406 -17 -195 184 333 -166 31 -82 -134 5 311 -165
3582 -165 -64 45 -265 39 288 -499 -329 289 17 -182 224 -142 -159 53 50 -148 215 201 -310 253 49
3603 49 -370 38 217 -358 155 14 -373 55 354 -164 -117 585 -192 -115 137 -153 -119 201 106 -350 67 49
3625 49 -218 100 27 -237 202 -84 -344 -255 -118 -462 -166 79 -307 -38 231 -198 -143 398 -65 -303 122
3646 122 -148 -36 188 -199 -495 289 105 -94 237 188 86 -33 201 -73 29 157 -163 -283 330 -196
3666 -196 -146 226 -280 -114 177 -224 -34 265 -35 -15 239 -238 49 48 -78 -52 40 63 -171 21 258 -188
3688 -188 46 369 -490 62 236 -165 -78 229 14 -192 353 6 -281 102 -74 -158 -24 -95 -296 47 150
3709 150 -165 85 64 -238 -26 -52 -183 110 -23 -188 116 283 -187 60 302 -216 -205 289 -67 36 84
3730 84 87 -436 228 -257 -234 179 -19 -360 132 80 -13 282 42 -210 160 291 -297 -165 99 -260 -106 153
3752 153 -166 -181 248 29 -162 545 -255 -166 157 -31 -61 129 344 -555 215 51 -96 135 57 -30 -65 180
3774 180 -58 -137 -148 -264 155 138 -104 -125 130 -35 -16 70 -38 -144 -27 82 -14 195 -101 60 -52 163
3796 163 -129 120 293 -221 -290 175 -338 -35 -19 -388 -77 -28 -167 -179 320 -96 -386 130 -14 86 144 -384
3818 -384 -160 146 -52 -93 50 -35 -83 4 -56 -282 54 -133 -232 -70 168 -245 135 201 100 62 -100 10 -285
3841 -285 -135 -28 -214 47 -37 -449 199 -13 -29 64 116 -214 158 333 -190 85 114 -163 -57 209 -302 -215
3863 -215 206 128 -12 64 -96 -234 -5 -101 -88 132 -116 -145 166 -78 -452 244 215 -371 167 -17 -42 80
3885 80 285 -274 241 236 -160 -18 193 -162 21 210 -67 -132 233 -84 26 266 -70 -101 160 32 -84 84
3907 84 160 -193 2 223 -94 -144 147 -257 34 57 -85 311 52 -52 42 156 70 -99 -158 -72 136 306 74
3930 74 -232 -17 -33 -343 159 -86 38 57 161 -313 181 95 -158 49 155 -204 49 54 -165 -142 114 -221
3952 -221 -43 96 -33 -137 -108 -214 -63 225 128 -91 45 182 -40 7 123 -124 112 97 -28 92 228
3973 228 -234 -162 163 -187 207 -12 -80 -103 387 137 -267 47 -151 95 343 206 138 63 133 191 48 -188
3995 -188 -311 -24 170 -90 -41 86 33 -135 12 61 -199 177 1 -226 37 -103 71 -78 -36 -251 218
4016 218 -23 -32 62 -91 45 125 -19 -44 -40 26 -320 -102 239 10 -280 41 -99 -229 107 -71 2 -21 -66 -92
4040 -92 144 -58 310 -32 96 -198 -41 60 136 90 184 51 -53 216 -203 -149 149 -59 -112 324 5 -157
4062 -157 157 129 202 139 217 93 82 261 -21 -56 -210 7 75 -102 -298 -164 78 -198 -8 31 6 13 226 174
4086 174 99 144 -18 107 -84 -92 -65 5 0 -194 380 109 -29 210 119 34 426 11 131 -117 -37 -189 84 105
4110 105 -259 -132 295 -102 9 82 -16 -194 161 -27 23 246 -37 -20 40 -330 -63 -46 -123 -200 -76 93 -72
4133 -72 63 162 -94 -76 -111 -187 -344 211 5 -257 -134 0 -166 58 -45 -79 56 -57 -3 283 -55 -83 83
4156 83 52 0 30 9 -186 121 32 -53 -80 -24 -107 38 -108 -51 78 109 -44 51 167 23 55 14 214 -23 68
4181 68 112 -208 -78 68 -28 161 106 -208 22 -100 -203 -88 -67 -28 51 -105 69 148 -12 103 147 409 200
4204 200 -90 -239 18 -37 -64 -64 -184 279 31 -125 152 139 9 -34 240 -77 -24 121 -213 -24 152 265
4226 265 -40 -87 68 -303 268 265 -36 85 107 -55 31 -130 116 -12 174 -9 14 214 114 110 -17 -59 -87
4249 -87 99 -167 221 -111 8 -34 -52 168 -347 42 -116 -244 103 -24 -223 -15 -152 231 -79 -190 -242
4270 -242 127 -20 58 -191 175 81 146 151 110 181 -207 312 233 12 -137 -120 37 -121 -63 303 148 -478 -61
4293 -61 -82 -8 -53 -29 -92 127 23 -189 30 141 -14 291 -16 -39 26 56 -130 343 49 -102 48 217 -171
4316 -171 -124 105 -65 -96 273 110 -13 183 83 110 -201 176 21 116 -63 117 67 -162 -259 -97 229 -154
4338 -154 94 -6 44 46 -28 103 25 238 289 -179 -117 -46 -60 89 -64 77 -61 63 -54 -14 -88 -89 -30 144 -40
4363 -40 -64 -313 -5 164 117 78 -163 257 -48 -111 -127 38 -50 -179 320 22 176 51 39 84 -250 79 63
4386 63 265 -22 207 79 212 295 119 131 164 -66 211 -4 -184 33 -143 194 41 -153 65 -278 74
4407 74 125 89 19 -81 288 6 86 30 27 -124 -236 -90 -238 58 -6 8 -41 -65 60 224 339 -68 -238 -67
4431 -67 229 -186 25 37 -93 -227 60 -188 13 68 -184 -102 81 -25 43 -56 -117 -17 -178 -68 12 228 153
4454 153 71 193 -161 196 137 -202 -139 106 -26 109 2 90 -119 123 -153 -53 152 -76 -124 -40 307 -198
4476 -198 77 130 -90 60 111 -191 96 -20 -97 -121 -133 -117 -188 10 -351 -65 59 25 -183 211 16 -237 153
4499 153 -58 -86 -82 -174 75 -208 73 17 97 103 -72 198 -81 -5 166 252 -82 -135 -85 -50 164 188 212 -82 -80 -109
4525 -109 78 -40 69 87 87 374 -125 41 17 -139 -231 -73 -35 169 305 104 -136 153 15 -108 78 268
4547 268 -125 105 37 -92 -58 100 21 -88 29 -24 -73 1 -247 51 -68 -8 42 -44 65 -216 134 -17 196
4570 196 19 -157 -219 153 -18 -116 236 412 -4 70 16 -95 -9 32 -350 -129 -99 -113 170 126 24 -146 45
4593 45 203 -273 46 -178 19 -240 140 -96 99 -189 27 194 44 -223 25 45 -55 -326 81 146 -23
4614 -23 99 17 -6 126 -104 -329 34 -100 -162 52 45 -166 -82 61 15 -159 56 141 94 -164 95 -153 70
4637 70 -135 -162 -15 -130 -222 -29 -110 89 156 -303 -279 115 -288 -103 58 46 24 179 149 -181 303 -93 -1
4660 -1 59 417 -133 -42 91 24 383 50 -141 99 25 -166 -142 88 31 -168 263 -124 -183 51 -29 2 44 -138
4684 -138 -75 -52 -172 -172 100 53 -207 -14 -144 -20 133 255 -205 -25 66 -230 120 84 36 -161 -27 -55 182
4707 182 1 296 36 87 34 -5 -32 -27 -106 19 -125 -177 -191 48 -159 -185 170 -112 -12 221 71 130 -93 -358
4731 -358 -191 248 -251 0 437 -11 -84 110 -90 -178 219 -19 16 -101 122 -462 245 293 -106 165 58
4752 58 23 -159 -20 -76 -18 112 110 -197 98 -170 -10 35 -14 157 -14 -241 -277 60 151 147 310 60 -351 -133
4776 -133 -15 -138 155 345 -38 23 133 99 13 197 -211 101 263 -118 7 -24 -51 -52 -158 -251 -336 -188 -23
4799 -23 56 -15 63 -26 -14 73 98 -170 216 -155 -22 -47 68 -61 400 90 -182 -22 83 -162 268 -334 -28
4822 -28 101 68 -82 55 -49 -152 15 -25 -193 93 121 -138 84 106 48 -11 315 24 -76 258 -144 -122 199
4845 199 -227 6 75 22 -65 186 43 -232 -131 143 -342 82 35 -119 202 305 -265 53 -53 -27 124 -3
4867 -3 -28 -265 155 -195 54 134 -45 18 80 297 -225 259 -72 -179 150 49 -101 149 157 -24 -54 167 -109
4890 -109 169 154 -149 175 271 -19 119 -42 -91 -157 319 -249 114 236 -93 -91 156 125 -196 80 30 -2 317
4913 317 25 -12 14 76 -257 -62 95 -13 69 71 -50 178 -18 -142 -103 293 -261 -178 106 -120 -137 299 177
4936 177 -211 208 45 -122 -191 -94 -156 165 72 -84 361 -61 126 -146 69 -19 -195 216 -233 -111 194 -20
4958 -20 -169 345 71 -145 217 -73 -112 133 94 -82 85 136 -28 -97 213 -136 -42 120 -107 -211 -17 -282
4980 -282 -85 214 -117 142 206 -199 -20 288 20 -198 218 118 -194 -19 -27 -8 19 111 -196 75 34 -164
5002 -164 165 81 -139 86 172 41 -125 212 -78 82 73 110 -224 11 -52 -222 147 118 -158 72 -167 -234 175
5025 175 -207 -100 56 -111 -157 -10 -8 -164 151 215 -122 110 252 140 229 67 -129 -114 -72 -55 -303 150 42
5048 42 -187 91 113 -87 264 105 -134 -48 103 -112 68 -88 -118 138 306 2 -109 333 -72 31 39 -135
5070 -135 -261 267 -169 -184 1 -42 -111 249 -2 -199 281 -188 58 -76 90 -233 147 -97 -147 54 83 -124
5092 -124 -63 32 -406 -271 -114 -149 -185 95 96 -89 203 -112 -76 140 5 -76 60 -7 -335 158 43 -255 39
5115 39 244 -280 163 63 -75 -76 168 -93 17 159 -14 -152 -39 120 -172 395 24 18 -129 169 -80 303
5137 303 -110 -80 103 -2 4 103 324 -296 -20 103 -206 123 57 -372 -116 332 73 -140 244 19 28 144
5159 144 113 -342 73 -56 -156 160 76 74 244 266 27 52 213 -279 -4 122 -212 21 292 30 -227 283
5181 283 113 -188 35 0 58 291 -115 -109 243 -104 -450 316 5 -145 112 114 -44 219 56 -67 -57 186
5203 186 -33 -88 173 -302 112 291 39 32 325 -169 -294 227 -194 -95 404 8 -140 92 -72 -100 -46 282
5225 282 -126 60 349 -318 60 256 -194 -1 205 -153 -234 275 -187 -62 94 -70 -250 298 -62 -318
5245 -318 370 -66 -272 200 310 -146 556 -31 -178 -69 147 -49 29 115 -63 253 255 -43 -85 -119 11 55
5267 55 277 48 -176 427 -23 88 255 -23 -298 241 171 -370 -30 171 -105 17 -17 123 18 180 -141
5288 -141 -156 102 -81 65 255 -195 -145 509 -123 -251 256 189 -46 -14 -110 -31 107 -26 -63 107 183 -175 157
5311 157 107 -240 180 286 -196 70 269 25 -249 23 40 -215 257 -163 -178 256 65 -114 289 82 -115
5332 -115 236 88 -19 110 -15 31 -15 302 -218 73 -265 8 -46 301 -93 188 115 -266 -188 21 16 -60 356
5355 356 -61 -106 -116 -315 -180 170 105 -169 -45 237 -339 278 -69 -144 101 185 -207 -83 398 -224 -154 -50
5377 -50 -173 -97 339 99 -127 370 72 -106 -49 -62 -326 321 94 -215 -82 94 -167 112 -43 -207 102
5398 102 18 -27 -83 -93 -63 287 307 -41 -142 327 -242 -181 124 -163 -164 273 -172 -98 194 106 -224 -31 203 -161
5422 -161 -70 34 -385 21 0 -157 195 104 -302 188 252 -20 -63 61 -47 -195 116 75 -11 94 26 -377 203
5445 203 50 -14 237 267 -163 -149 92 -126 64 140 -250 86 -55 -12 22 116 -217 -161 391 -16 -49 207 52
5468 52 -141 100 -198 60 173 -5 -264 26 140 -279 69 -61 4 199 98 -96 -5 2 -359 -53 181 41
5490 41 110 112 -266 -98 5 293 -3 -13 -171 -402 98 -69 -217 274 2 -188 137 249 -8 -40 59 -233
5512 -233 -156 291 -38 -95 126 113 35 449 -45 29 165 -169 -110 180 -93 -37 53 46 -285 -128 -145 -315 224 -19
5536 -19 1 280 174 -331 151 205 -125 -296 158 -64 84 325 -288 -191 8 89 -250 84 -88 -70 342 -20
5558 -20 -134 278 280 -343 -87 -59 -275 313 132 -107 73 49 -245 -147 -18 -153 -30 231 -130 -129 176 129 126 30
5582 30 72 -170 139 -77 -154 43 -125 -205 142 191 -280 280 202 -155 243 -60 -176 219 116 9 32 181
5604 181 -40 -43 101 -64 -67 296 -50 -304 181 -87 -375 -81 172 -142 98 150 -220 138 -149 -250 -131 255
5626 255 -186 -137 7 -105 190 212 -5 -403 119 -63 9 93 97 -69 2 110 -111 -143 231 -75 86 216 -248
5649 -248 237 80 -214 157 46 -149 -144 220 -37 -160 197 10 -60 192 -305 -117 231 58 -124 427 173
5670 173 -407 61 -134 128 -10 11 -6 -80 111 -160 -33 229 -326 35 115 -123 -204 28 11 -148 140 3
5692 3 -286 230 107 -220 -26 12 -71 -78 -59 -183 122 39 -282 164 -91 -384 -123 309 -221 -149 282 -336 -323
5715 -323 -195 94 -132 169 302 52 123 16 181 -6 43 -97 224 77 -263 16 83 15 37 176 -372 -18
5737 -18 89 -337 90 183 -138 34 152 -205 -169 446 2 -6 49 -82 62 195 -142 -153 -28 120 -114 -81 131
5760 131 -204 225 232 -92 113 187 -178 69 149 -221 -70 241 -205 -84 460 -134 -60 22 -43 44 2 127 -263
5783 -263 215 26 -87 406 106 -115 -63 -29 -147 31 243 -96 -8 58 17 123 139 52 -247 84 45 -139 198
5806 198 22 -60 274 -365 -59 249 -216 -340 75 174 -260 239 -286 -25 41 -9 -102 -16 131 -314 -29 222
5828 222 -332 -112 316 61 -1 116 22 -141 389 147 -196 348 279 -259 85 54 -55 -16 123 -518 101 136
5850 136 -214 303 234 -53 84 286 -6 -229 349 -14 -101 293 -103 -64 237 -49 102 193 6 -67 99 27
5872 27 -159 287 82 -185 157 55 -464 173 -55 56 82 182 142 33 289 -233 -122 -31 108 -298 110
5893 110 37 -155 235 -27 -133 366 116 -285 20 245 -36 100 -133 -168 48 2 137 -132 216 -58 -61 81
5915 81 21 -146 155 -186 -195 -53 -237 -76 156 169 -85 217 -29 -98 245 141 -259 -27 240 262 70 315
5937 315 -17 18 266 -168 -222 26 -211 -73 -95 9 88 19 -431 -450 113 224 -112 240 -52 -24 64 -110 -139
5960 -139 230 -32 -86 103 23 -179 68 123 -137 128 -52 -190 47 41 -55 -233 150 50 -47 29 55 -181 -58
5983 -58 48 -238 307 302 7 -1 110 79 97 17 -308 51 104 -118 21 336 -7 -44 13 59 -9 228 -47 -253
6007 -253 56 -119 -152 158 255 29 264 31 -148 -4 113 -333 150 160 -105 -68 335 92 -40 229 -89
6028 -89 7 436 -2 -213 334 -37 -212 105 -237 -74 10 7 -219 148 215 -165 -88 41 -208 104 48 -103 102
6051 102 220 -214 -130 76 -261 -189 -125 -101 -22 269 5 205 211 177 -12 222 117 -156 244 75 -165 154 261
6074 261 -198 121 269 -121 39 98 -288 -298 372 -526 -48 261 -30 -123 44 -139 -170 206 183 -119 246 145
6096 145 61 297 125 -140 19 115 -102 -239 165 -110 59 99 -66 -82 201 -357 -26 93 -375 -185 93
6117 93 42 -281 226 149 -136 144 127 -136 175 -190 -114 -150 -35 -30 -168 218 -16 237 110 -111 -95 27 -443
6140 -443 19 -8 -117 -358 280 106 56 300 -78 -158 -185 -152 -423 -156 62 -188 100 25 -280 0 -50 25 6
6163 6 29 -142 54 262 8 -108 -29 78 -123 317 114 -271 157 166 10 108 146 -115 215 139 -108 349 121
6186 121 -117 46 78 -65 -288 57 -57 -43 27 -353 -98 70 -170 -1 -3 -78 -40 517 -58 -240 153 -37
6208 -37 -238 27 163 -329 101 -53 -150 -149 50 1 -47 -37 -100 -44 156 -128 -42 180 -36 -71 82 -26 -211 63
6232 63 -181 -65 -41 64 -171 47 -156 -118 51 -18 54 -23 169 16 -145 46 -109 -122 109 -244 -35 -72 -55
6255 -55 -52 344 -65 -233 174 -30 45 -202 95 44 233 50 -211 99 41 -117 -67 145 -227 -31 -20 10 -94
6278 -94 -216 -15 -48 82 1 18 -43 -29 27 -7 -261 115 -67 -227 166 266 -76 151 251 150 -175 97 214
6301 214 -215 -62 225 -2 -188 109 -97 9 0 -9 -138 157 -112 -217 -52 -207 -203 59 115 -138 121 -4
6323 -4 65 218 -130 -37 14 142 -358 -9 -5 56 186 380 96 164 236 97 -34 171 334 -254 165 -132 27
6346 27 -68 -139 -128 210 -6 -91 219 -145 -221 185 -3 34 -111 228 274 -194 126 -63 -29 440 -255 -137 126
6369 126 -13 160 73 -118 -341 224 76 -59 34 444 177 147 69 11 285 21 -101 -91 164 -139 -148 233 -163
6392 -163 -21 -26 -281 5 58 -68 -2 46 14 -52 76 236 -107 144 120 16 69 -66 73 42 174 59 -105
6415 -105 -88 -221 29 97 -24 -27 192 -64 -223 121 14 25 -273 -363 -170 313 216 -80 72 -48 -127 -50 -109
6438 -109 -66 -166 116 -246 112 141 -117 -16 -74 -70 58 110 -188 -307 160 -84 -28 183 -180 -94 182 -47 3
6461 3 8 -49 -134 -27 71 -5 -9 90 -211 -17 90 -62 129 168 -252 80 137 -130 -232 193 -126 -89 113 14 46
6486 46 121 70 -219 2 139 -22 56 108 24 130 194 -130 -7 28 59 282 220 -40 66 103 -69 249 -40 314
6510 314 24 66 -103 -272 244 172 47 -42 82 -223 79 17 -272 -57 165 -182 37 215 25 347 128
6531 128 -149 75 117 -80 -120 47 85 -213 -55 -191 -25 217 198 -405 7 36 -134 220 133 -90 245 202
6553 202 -132 -5 159 -36 59 -131 -134 -187 37 -22 113 203 -208 -60 221 -114 -102 316 102 -196 151 -42
6575 -42 5 146 72 75 79 138 12 32 134 -158 88 -25 41 17 127 -161 -33 102 -242 -92 182 18 8 141
6599 141 249 -171 20 -78 -82 120 -31 -167 62 329 -93 21 109 -62 -19 13 -68 14 125 -71 -74 105 -198
6622 -198 49 161 280 11 76 252 -155 243 183 59 51 261 -19 0 155 33 69 288 -153 68 189 2
6644 2 125 -75 -173 163 134 -215 96 -43 -10 -6 102 -146 62 -105 221 160 8 -1 -36 120 46 66 36 -35 216
6669 216 82 26 -17 -157 92 -117 -177 142 -81 28 78 139 -23 -121 -29 -69 96 4 -74 -290 91 -47 54
6692 54 75 -254 2 47 49 -34 0 -178 -149 -69 -29 14 72 51 -47 186 184 -59 220 219 -221 -210 -148 -26 32 -204 -70
6719 -70 104 87 78 125 242 -125 -52 67 -91 273 265 -14 -84 231 21 -134 145 -61 0 51 2 55 41 44 -2 234
6745 234 66 -202 244 110 -12 72 257 64 252 136 -8 -146 126 -12 -28 70 -111 -96 98 38 -79 -3
6767 -3 262 190 25 254 26 56 124 -30 23 -67 -101 26 -24 -270 1 -70 63 -149 189 -8 -168 -155 -212 -65
6791 -65 -13 -140 -39 32 114 -84 -206 121 -90 127 -45 125 -201 25 -165 175 -276 10 128 -199 -223 -108
6813 -108 53 227 -231 -86 74 -13 -128 -107 -6 -197 43 34 7 -30 -119 -49 26 -83 86 -32 -214 -230 -111
6836 -111 -256 26 -57 -158 93 21 30 166 203 34 102 121 42 -159 107 7 219 250 -203 -408 103 -85 -175
6859 -175 131 125 -69 -28 211 -191 84 258 -15 -224 99 -17 34 184 -99 96 60 167 -66 98 144 -68
6881 -68 132 50 -248 202 -251 125 -103 -31 -344 83 -238 13 8 76 46 21 -31 53 -39 95 36 -120 121 -44
6905 -44 7 -283 164 -213 63 -98 -49 73 -53 -12 58 138 163 174 27 -112 -21 1 -105 -67 -124 85 -67 -2
6929 -2 -228 -148 123 -218 36 -23 105 -166 -113 -99 -126 -40 59 -46 42 -49 14 -88 156 -194 189 64 -156 -14
6953 -14 -85 -148 141 281 61 192 21 172 -201 105 -119 -91 257 30 -149 -35 164 78 -1 -59 -107 -274 104
6976 104 -214 9 -70 -125 -93 81 -21 -65 -110 107 -364 88 -139 -108 43 61 -155 -159 -43 39 -185 206 -157
6999 -157 161 57 -10 53 42 -13 -239 257 123 -103 9 25 -37 94 49 -96 -158 201 19 90 76 179 10
7022 10 -128 -19 151 42 -169 77 70 -86 9 132 -156 102 90 112 79 123 -132 99 194 29 50 43 342 56
7046 56 95 -11 34 -152 -195 -165 10 9 -246 54 -74 -103 -4 -38 5 23 177 -90 122 142 -339 -21 176 -118
7070 -118 4 179 166 -247 294 47 -129 -22 167 -120 -21 -177 -28 -76 -190 -39 -340 88 -90 61 376
7091 376 -68 -49 -17 -93 -55 94 45 -20 436 102 -69 -69 20 139 276 155 79 -69 -136 -159 -159 162 227 -15 -6 39
7117 39 92 254 58 -1 70 180 -75 82 86 2 59 -390 52 129 -124 -220 -164 -73 -258 280 214 -220 197 44
7141 44 -325 79 64 80 -52 -38 -149 286 116 157 123 62 -82 -66 -75 18 239 130 172 177 -28 -11 -28 333 75
7166 75 44 185 105 -76 -10 -59 114 -142 -19 65 28 -45 -91 -81 35 164 7 251 180 43 -159 215 138 -9
7190 -9 -22 95 9 -94 -48 96 206 -206 112 159 -55 17 102 -42 -297 -208 83 126 126 35 -122 179 -7 79 83
7215 83 105 -13 180 253 13 -79 109 -96 102 30 -2 -171 232 45 100 188 88 -74 187 -98 -239 -19 9
7238 9 58 83 9 -120 -60 67 -134 225 264 -132 146 2 86 -21 -20 59 -230 183 164 45 146 -18 104 14
7262 14 25 101 14 -89 -172 -110 153 165 50 -31 -92 155 204 -46 126 87 -164 -41 -95 143 35 276 -38 -142
7286 -142 -15 -138 143 149 108 64 62 -46 -148 -63 -54 -136 97 -126 -151 59 220 -136 146 -110 -4 13 119 85
7310 85 -23 -115 -81 -118 -82 42 13 219 233 45 7 50 31 -75 -123 117 -91 80 23 47 -122 -124 71 -127 91
7335 91 220 -32 -31 -56 141 -314 128 -93 -80 -143 261 172 -43 66 -358 -82 33 82 -234 -114 -11 -343 6
7358 6 -168 -163 -33 160 -360 282 -19 -39 60 -49 -113 -264 -79 -27 -11 317 32 116 101 122 -184 102 -38 -24
7382 -24 -47 -133 118 40 102 -163 -125 -28 74 -232 54 8 -32 -69 19 29 0 -227 -121 154 -55 14 -157 10 -187
7407 -187 70 92 15 58 -168 125 -55 -3 -4 -111 83 -15 243 99 -83 11 -104 -70 63 7 132 24 67 80
7431 80 -2 256 -50 223 196 202 -263 104 -43 -93 -139 -169 -224 46 32 78 -13 77 10 -221 8 -125 -66 61 -280
7456 -280 -236 -62 -85 197 163 26 -24 -8 -311 -139 -166 12 -9 212 93 -237 -94 221 -191 7 -59 -176 -6
7479 -6 -19 -32 148 184 -232 -268 -119 119 -32 19 -98 2 190 -57 -98 140 17 -127 -63 161 -119 -12 275
7502 275 -66 -45 119 47 93 -206 -29 -142 -18 -4 -91 -80 -99 78 137 28 -248 65 164 -75 45 -26 -103 -147
7526 -147 35 -97 -44 126 -69 -165 108 -77 152 -176 -112 102 178 -130 138 139 165 110 -118 298 -136 255 -16
7549 -16 -280 187 40 9 -99 39 -53 62 -62 -110 77 24 -103 -68 161 -71 55 -39 125 -11 72 -153 -71
7572 -71 -90 -253 32 -229 92 -137 183 59 -48 -61 -71 -113 -45 64 -121 -15 -172 96 118 -88 -104 43 84
7595 84 -72 -87 22 13 -285 -147 -1 -164 -21 195 44 -59 168 18 139 48 100 88 81 127 82 126 -14 -12 -37
7620 -37 -60 -54 68 10 -15 137 179 -45 105 16 141 29 -199 -228 -156 7 -104 -106 45 26 -216 128 -77 139
7644 139 178 37 64 136 -139 -224 -17 -44 -104 -31 -147 -36 -219 220 -85 242 32 -130 66 128 36 331 -78
7667 -78 -19 -211 215 -139 -194 63 -68 -18 70 243 -56 109 92 77 90 -125 -181 237 -81 128 -256 124 -3
7690 -3 -30 -67 4 -15 29 -20 152 105 177 165 86 138 -187 -90 -109 -179 -77 -90 -263 -164 -12 -130 238 107 -62 -151
7716 -151 38 -22 162 272 -88 -39 -128 -283 -254 -12 -104 -483 -158 -160 -2 34 -88 -392 -253 18 -43 200 92
7739 92 -16 236 -153 69 -48 140 12 -216 41 38 88 -113 288 69 58 248 38 13 17 -55 -7 -152 117
7762 117 27 144 168 -114 -32 177 -365 30 -54 -129 105 -281 95 -132 -73 157 64 -152 53 39 -90 -38 131
7785 131 59 -48 -181 61 -70 91 -230 -67 82 49 246 153 263 -167 -167 48 -87 102 83 80 -161 126 42
7808 42 -38 79 -45 168 106 129 122 -131 -27 -73 -72 -80 -81 -23 -72 -9 -108 -102 -12 3 -36 -41 -105 16 -62 -30 51 68 -260 -192
7838 -192 -1 -9 310 -109 5 258 14 45 42 87 -29 126 -174 -142 -74 81 -29 -121 120 -47 110 22 152
7861 152 -259 -126 -49 -64 59 -33 34 134 -37 -60 208 -150 102 223 120 -96 -94 23 146 20 29 105 -17
7884 -17 39 -26 75 60 45 -170 252 -67 80 48 42 81 78 61 199 -161 41 -77 -107 232 -40 89 -142 -174 -14
7909 -14 89 105 -51 68 30 49 -220 -61 272 14 126 -94 -155 81 -197 -141 -133 -234 4 -120 -143 94 137
7932 137 123 -98 225 -113 9 191 -55 27 -105 -142 -214 -126 -46 214 147 153 -54 -134 59 39 125 -69 -271 -41
7956 -41 -152 -271 34 29 254 42 -200 64 34 -207 63 340 -84 71 364 88 -287 -146 -285 -68 140
7977 140 216 -125 -61 54 81 12 22 18 11 4 10 -208 -207 272 -118 50 102 71 -213 -37 -183 -30 46 -126 -25 42
8003 42 -224 17 124 -137 57 111 -131 -271 235 -4 88 114 159 -35 -24 122 -77 145 43 90 -54 181
8025 181 153 198 -106 48 -64 44 -15 51 199 55 -133 -128 -176 -136 -115 51 -267 173 0 45 -21 127 207 78
8049 78 -77 10 91 38 -39 184 -110 -361 -118 -15 66 165 139 251 134 -165 96 18 126 -207 -112 190 -129
8072 -129 60 130 38 -143 -90 -157 -122 88 -147 -244 -82 -159 95 -54 -15 63 45 68 2 -144 185 184 89 96 195 87
8098 87 223 -254 -47 201 -87 -64 -8 92 -247 -167 -195 60 -231 153 114 -45 26 29 -125 -74 -48 227 101 139
8122 139 -42 -36 122 -92 44 51 148 150 143 57 -57 57 -135 117 -30 -221 -149 18 -192 -186 -13 -15 -73 70 17 50
8148 50 232 -25 -230 72 -98 -12 -216 -106 -9 57 94 -45 -19 -76 27 -171 58 223 -45 -157 213 59
8170 59 220 64 110 62 -37 -19 -204 3 -41 -6 -81 81 105 -35 -59 61 -315 2 -30 -84 -161
8191a61
##END NTUPLES=NMR FID
##END=
