##TITLE=1H_CA-8759-3xY
 DMSO, 8 sc, 
 24.9.2020
##JCAMPDX= 6.0         $$ Bruker NMR JCAMP-DX V2.0
##DATA TYPE= NMR FID
##DATA CLASS= NTUPLES
##ORIGIN= UXNMR, Bruker Analytische Messtechnik GmbH
##OWNER= root
$$ XWIN-NMR		Version 3.5
$$ Thu Sep 24 10:43:50 2020 Russian Standard Time (UT+4h)  she@DPX200
##.OBSERVE FREQUENCY= 200.1315066352
##.OBSERVE NUCLEUS= ^1H
##.DELAY= (6, 6)
##.ACQUISITION MODE= SIMULTANEOUS
##.ACQUISITION SCHEME= undefined
##.AVERAGES= 8
##.DIGITISER RES= 18
##SPECTROMETER/DATA SYSTEM= spect
##.PULSE SEQUENCE= zg30
##.SOLVENT NAME= DMSO
##.SHIFT REFERENCE= (INTERNAL, DMSO, 0, 15.7039)
##AUDIT TRAIL= $$ (NUMBER, WHEN, WHO, WHERE, WHAT)
$$ ##TITLE= Audit trail, XWIN-NMR		Version 3.5
$$ ##JCAMPDX= 5.01
$$ ##ORIGIN= Bruker BioSpin GmbH
$$ ##OWNER= she
$$ F:/spectra/data/she/nmr/H-F/1/audita.txt
$$ ##AUDIT TRAIL=  $$ (NUMBER, WHEN, WHO, WHERE, WHAT)
(   1,<2020-09-24 10:42:42.00 +0400>,<she>,<DPX200>,
      <created by zg, POWCHK disabled, PULCHK disabled
       configuration hash MD5:
       00 E9 B6 7A A2 85 ED C7 34 08 36 98 17 FE 4E 26
       data hash MD5: 16K
       9A D7 A4 B5 3B AE 14 22 F9 1F 8E 2F 2D EE 4F 4B>)
$$ ##END=
$$ 
$$ hash MD5
$$ 76 E0 28 AA 88 BB 0E E0 24 10 2F FD 8F 92 E8 94
##$RELAX= 
##$RELAX= 
##$RELAX= 
##$RELAX= 
##$RELAX= 
##$RELAX= 
$$ Bruker specific parameters
$$ --------------------------
##$DU= <F:/spectra>
##$EXPNO= 1
##$NAME= <H-F>
##$PROCNO= 1
##$TYPE= <nmr>
##$USER= <she>
##$AMP= (0..31)
100 100 100 100 100 100 100 100 100 100 100 100 100 100 100 100 100 100 
100 100 100 100 100 100 100 100 100 100 100 100 100 100 
##$AQSEQ= 0
##$AQ_mod= 1
##$AUNM= <au_zg>
##$AUTOPOS= <>
##$BF1= 200.13
##$BF2= 200.13
##$BF3= 200.13
##$BF4= 200.13
##$BF5= 200.13
##$BF6= 200.13
##$BF7= 200.13
##$BF8= 200.13
##$BYTORDA= 1
##$CFDGTYP= 0
##$CFRGTYP= 5
##$CHEMSTR= <none>
##$CNST= (0..31)
1 1 145 1 1 1 1 1 1 1 1 1 1 1 1 1 1 1 1 1 1 1 1 1 1 1 1 1 1 1 1 1 
##$CPDPRG= <>
##$CPDPRG1= <>
##$CPDPRG2= <>
##$CPDPRG3= <>
##$CPDPRG4= <mlev>
##$CPDPRG5= <mlev>
##$CPDPRG6= <mlev>
##$CPDPRG7= <mlev>
##$CPDPRG8= <mlev>
##$CPDPRGB= <>
##$CPDPRGT= <>
##$D= (0..31)
0 1.2 0 0 0 0 0 0 0 0.06 0 0.03 0 0 0 0 0.0002 0 0 0 0 0 0 0 0 0 0 0 0 
0 0 0 
##$DATE= 1600929761
##$DBL= (0..7)
120 120 120 120 120 120 120 120 
##$DBP= (0..7)
150 150 150 150 150 150 150 150 
##$DBP07= 0
##$DBPNAM0= <>
##$DBPNAM1= <>
##$DBPNAM2= <>
##$DBPNAM3= <>
##$DBPNAM4= <>
##$DBPNAM5= <>
##$DBPNAM6= <>
##$DBPNAM7= <>
##$DBPOAL= (0..7)
0.5 0.5 0.5 0.5 0.5 0.5 0.5 0.5 
##$DBPOFFS= (0..7)
0 0 0 0 0 0 0 0 
##$DE= 6
##$DECBNUC= <off>
##$DECIM= 32
##$DECNUC= <off>
##$DECSTAT= 4
##$DIGMOD= 1
##$DIGTYP= 9
##$DL= (0..7)
0 120 120 120 120 120 120 120 
##$DP= (0..7)
150 150 150 150 150 150 150 150 
##$DP07= 0
##$DPNAME0= <>
##$DPNAME1= <>
##$DPNAME2= <>
##$DPNAME3= <>
##$DPNAME4= <>
##$DPNAME5= <>
##$DPNAME6= <>
##$DPNAME7= <>
##$DPOAL= (0..7)
0.5 0.5 0.5 0.5 0.5 0.5 0.5 0.5 
##$DPOFFS= (0..7)
0 0 0 0 0 0 0 0 
##$DQDMODE= 0
##$DR= 18
##$DS= 0
##$DSLIST= <SSSSSSSSSSSSSSS>
$$ [...]
##$SUBNAM2= <"">
##$SUBNAM3= <"">
##$SUBNAM4= <"">
##$SUBNAM5= <"">
##$SUBNAM6= <"">
##$SUBNAM7= <"">
##$SUBNAM8= <"">
##$SUBNAM9= <"">
##$SW= 16.880792210976
##$SWIBOX= (0..15)
0 0 2 0 0 0 0 0 0 0 0 0 0 0 0 0 
##$SW_h= 3378.37837837838
##$TD= 16384
##$TD0= 1
##$TE= 0
##$TE2= 300
##$TE3= 300
##$TEG= 300
##$TL= (0..7)
0 120 120 120 120 120 120 120 
##$TP= (0..7)
150 150 150 150 150 150 150 150 
##$TP07= 0
##$TPNAME0= <>
##$TPNAME1= <>
##$TPNAME2= <>
##$TPNAME3= <>
##$TPNAME4= <>
##$TPNAME5= <>
##$TPNAME6= <>
##$TPNAME7= <>
##$TPOAL= (0..7)
0.5 0.5 0.5 0.5 0.5 0.5 0.5 0.5 
##$TPOFFS= (0..7)
0 0 0 0 0 0 0 0 
##$TUNHIN= 0
##$TUNHOUT= 0
##$TUNXOUT= 0
##$USERA1= <user>
##$USERA2= <user>
##$USERA3= <user>
##$USERA4= <user>
##$USERA5= <user>
##$V9= 5
##$VALIST= <valist>
##$VCLIST= <CCCCCCCCCCCCCCC>
##$VD= 0
##$VDLIST= <DDDDDDDDDDDDDDD>
##$VPLIST= <PPPPPPPPPPPPPPP>
##$VTLIST= <TTTTTTTTTTTTTTT>
##$WBST= 1024
##$WBSW= 4
##$XGAIN= (0..3)
0 0 0 0 
##$XL= 0
##$YL= 0
##$YMAX_a= 498604
##$YMIN_a= -319252
##$ZGOPTNS= <>
##$ZL1= 120
##$ZL2= 120
##$ZL3= 120
##$ZL4= 120
##$ABSF1= 10
##$ABSF2= 0
##$ABSG= 5
##$ABSL= 3
##$ALPHA= 0
##$AQORDER= 0
##$ASSFAC= 0
##$ASSFACI= 0
##$ASSFACX= 0
##$ASSWID= 0
##$AUNMP= <proc_1d>
##$AZFE= 0.1
##$AZFW= 0.1
##$BCFW= 1
##$BC_mod= 2
##$BYTORDP= 1
##$COROFFS= 0
##$CY= 11.3945322036743
##$DATMOD= 1
##$DC= 2
##$DFILT= <>
##$DTYPP= 0
##$F1P= 16.9975609425685
##$F2P= -3.02152046262296
##$FCOR= 0.5
##$FTSIZE= 0
##$FT_mod= 4
##$GAMMA= 1
##$GB= 0.15
##$INTBC= 1
##$INTSCL= 1
##$ISEN= 128
##$LB= 0.24
##$LEV0= 0
##$LPBIN= 0
##$MAXI= 10000
##$MC2= 0
##$MEAN= 0
##$ME_mod= 0
##$MI= 1.114404
##$NCOEF= 0
##$NC_proc= 0
##$NLEV= 6
##$NOISF1= 3.799351
##$NOISF2= 2.8
##$NSP= 1
##$NTH_PI= 0
##$NZP= 0
##$OFFSET= 15.70392
##$PC= 1
##$PHC0= -9975.577
##$PHC1= 15.8009
##$PH_mod= 1
##$PKNL= yes
##$PPARMOD= 0
##$PSCAL= 0
##$PSIGN= 0
##$REVERSE= no
##$SF= 200.130013532006
##$SI= 16384
##$SIGF1= 3
##$SIGF2= 2
##$SINO= 400
##$SIOLD= 16384
##$SREGLST= <1H.CDCl3>
##$SSB= 0
##$STSI= 0
##$STSR= 0
##$SW_p= 3612.71676300578
##$SYMM= 0
##$S_DEV= 0
##$TDeff= 0
##$TDoff= 0
##$TI= <>
##$TILT= no
##$TM1= 0
##$TM2= 0
##$TOPLEV= 0
##$USERP1= <user>
##$USERP2= <user>
##$USERP3= <user>
##$USERP4= <user>
##$USERP5= <user>
##$WDW= 1
##$XDIM= 8192
##$YMAX_p= 0
##$YMIN_p= 0
$$ End of Bruker specific parameters
$$ ---------------------------------
##NTUPLES= NMR FID
##VAR_NAME=  TIME,          FID/REAL,        FID/IMAG
##SYMBOL=    X,             R,               I
##VAR_TYPE=  INDEPENDENT,   DEPENDENT,       DEPENDENT
##VAR_FORM=  AFFN,          ASDF,            ASDF
##VAR_DIM=   8192,          8192,            8192
##UNITS=     SECONDS,       ARBITRARY UNITS, ARBITRARY UNITS
##FACTOR=    0.000296,      1,               1
##FIRST=     0,             0,               0
##LAST=      2.424536,      0,               0
##MIN=       0,             -319252,         0
##MAX=       2.424536,      498604,          0
$$ Real data points
##PAGE= N=1
##DATA TABLE= (X++(R..R)), XYDATA
$$ [...]
1699C10j0k48Q3k3n02M47J20o17M98L9m28N92r3l05N4K35k4j48l8R4l14M38k74
$$ 310 300 52 135 112 -390 57 177 -440 58 97 -331 261 168 -137 -83 152 128 -20 -58 36 -278 160 -114
1722a14Q5K91n78P9O23m01j14L36m7l54M83k70m61M77R8l16L02k5k20P8L93n33
$$ -114 -29 262 -316 -237 386 -15 -129 207 160 -194 289 19 -442 35 133 -183 119 94 -126 -48 345 -188
1744a88K36K85n57J81M50n97J13j3R7j76N46m43m2M71k47k36L00k66j59M70k33
$$ -188 48 333 -224 -43 407 -190 -77 -90 7 -169 377 -66 -108 363 116 -120 180 -86 -245 225 -8
1765hj96J06k1j62L67R1m42M7M55p80M70K92m87J69L06m17J94l2r9K42L1k80Q8
$$ -8 -204 -98 -119 -281 86 177 -265 -218 237 -543 -73 219 -268 -99 207 -210 -16 -48 -147 95 126 -154 -66
1788f6M42j98n42M80K12n29L25j4l88K07K67m45M74J52n46M65P7m95J68M7k59
$$ -66 376 178 -364 116 328 -201 124 110 -278 -71 196 -249 225 377 -169 296 373 -122 46 93 -166
1809a66J55K93l81j17M74m94Q5L17m12K5L06r2j44Q5R3k37K28J59m49L24k7k51
$$ -166 -11 282 -99 -216 258 -236 -151 166 -246 -221 85 -7 -151 -66 27 -210 18 177 -272 52 25 -226
1831b26L37K38j74j43J17k52K69j00j43L23k38j32k8L86k86M5j4j53L3K11j19
$$ -226 111 349 175 32 149 -103 166 66 -77 246 8 -124 -152 234 -52 -7 -21 -174 -141 70 -49
1852d9j72M22j24k24J7K85k00K50j24k60J70J10k6k98M13k12j11K53j53kK9j31
$$ -49 -221 201 77 -147 -130 155 -45 205 81 -179 -9 101 75 -223 190 -22 -133 120 -33 -35 -6 -137
1874a37J1J57j02r3K81K4p4Q9j80r2L17l09N9J43Q2k69J65K57n82K20J29k98K2
$$ -137 -126 31 -71 -164 117 141 67 156 -24 -116 201 -108 -49 94 176 -93 72 329 -253 -33 96 -202 -180
1897a80K20j46l3N85m91J44q4j1L8J69k92k97L42J09k55L87k22m4o4J91l74N11
$$ -180 40 -106 -139 446 -45 99 15 4 42 211 -81 -378 -36 73 -182 205 -17 -61 -125 66 -308 203
1919B03l21j07M78p7j96r7J7o8K79P7n34J54K43j80R5N63o20l86N32j47N6K01
$$ 203 -118 -225 253 176 -20 -117 -100 -168 111 188 -346 -192 51 -129 -34 529 -91 -477 55 -92 -36 165
1941A65p6j96L37m21Q6L79p9r2j58N2M4J18p7r9N4K71k29o9K9k33M46j10j77l5
$$ 165 89 -107 230 -191 -105 274 195 103 -55 -3 41 159 82 -17 37 308 79 10 39 -194 252 142 -35 -70
1965g0J15j48j24M16k83j85K92J17m82N31k38k52M34N2k62k8L53l00K11On08M22
$$ -70 45 -103 -227 189 -94 -279 13 130 -352 179 -59 -311 123 175 -87 -115 238 -62 149 155 -353 69
1987F9R5l91J21K02k52Q8J15J17j74M5j31J63K95o62J00L40j27j89N08j69l93
$$ 69 164 -227 -106 96 -156 -68 47 164 -10 35 -96 67 362 -300 -200 140 13 -176 332 163 -230
2008b30N21l30M0J15n0k63K30M4k80J03K60j68o9K6P2J66K9j92N8Q1q1j40J25
$$ -230 291 -39 1 116 66 -197 33 77 -203 -100 160 -8 -77 -51 21 187 216 24 82 163 82 -58 67
2031F7m5L3J18l27J43O1m1l6K08m21o0N25k6n32K59O24p73l9K77k67L81J8l03
$$ 67 22 55 173 -154 -11 50 9 -27 181 -240 -300 225 199 -333 -74 550 -223 -262 15 -252 129 147 -156
2054a56L38k16j98l7L37Qk10j4Q5l43O59j74k53K12j36N6P6j92q7L02n0n3J57
$$ -156 182 -34 -232 -269 68 76 -134 -148 -63 -406 253 79 -174 38 -98 -42 34 -158 -245 57 7 -46 111
2077A11J40m46M9K49l13J60L20n83K47J58k01M7K31J22m39J43J7l9Q0Pj24J10
$$ 111 251 -195 -146 103 -210 -50 270 -313 -66 92 -109 -62 169 291 -148 -5 12 -27 53 60 -64 46
2099D6K9k30L44J6k54P7J31k24J07J0R0l71M32l52L01n9l35L40m4j8l6R4k76J62
$$ 46 75 -155 189 205 -49 28 159 -65 42 52 142 -229 203 -149 152 93 -242 98 54 36 0 94 -182 -20
2123b0K44j33k03L06l36o9M68j2l68K76m5l11R6J92j3L3l7k52K58R9j28Q8N2k69
$$ -20 224 91 -112 194 -142 -211 257 245 -123 153 108 -203 -107 85 72 105 68 -184 74 173 45 133 185 -84
2147h4o3J89l37J51L26l92MK84j80O2M6J84k03Q7J19n97M62jk09K63q7p0m5K41
$$ -84 -147 42 -295 -144 182 -210 -206 78 -102 -40 6 190 -13 74 193 -404 58 57 -152 111 24 -46 -91 150
2171A50m13N10mm38J57O2j17o6K82l24K5K59j55j22J66J13j8Q8k98m5R2K70j19
$$ 150 -263 247 243 -195 -38 24 -93 -159 123 -201 -176 83 -72 -194 -28 85 67 155 -143 -188 -96 174 55
2194E5p8L3j62O8L08j86J55m02n9Q1L69j64j40lJ17j10K37J56l16K53j60m17N96
$$ 55 -23 10 -152 -84 224 38 193 -209 -268 -187 182 18 -122 -125 -8 -118 119 275 -41 212 52 -365 231
2217B31k29p9L07l89L1J10Ql51K53J61m2J83k84j68K88J45k19K2K71k68K48k67
$$ 231 2 -77 230 -159 -128 -18 -10 -361 -108 53 11 194 -90 -258 30 175 -44 -22 249 -19 229 -38
2239c8j14J24Nj61K06K43n60K51J26k5l1k4j60K60k04K69l66J4K52p6M5nJ65k56
$$ -38 -152 -28 -23 -184 22 265 -295 -44 82 57 26 2 -158 102 -102 167 -199 -185 67 -9 36 31 196 -60
2263f0L23m60K80n6j73qP8J4J58J68n93M38M2k04M8N0j93J43K96j57m7j20o3J19
$$ -60 263 -197 83 27 -146 -154 -76 -62 96 264 -329 109 151 -53 -5 45 -148 -5 291 134 87 -33 -96 23
2287B3J00k17k58L35K14l92K13P3j12K74k85p3J65pMk15J00J55l0K52k66m6m4
$$ 23 123 -94 -352 -17 197 -195 18 91 -21 253 -32 -105 60 53 57 -158 -58 97 67 319 53 7 -37
2310c7K46k54L35l81n3J97o9j29pL29m95M75j36j72K49o0k69N63l00l49M44j83
$$ -37 209 -45 290 -91 -144 53 -16 -145 -152 177 -318 157 21 -151 98 38 -231 332 32 -317 127 -56
2332e6j34K91nn0KJ68k52L9J02j07O6R7m02oK80L6q7L34j27k69Q2j0m5J06j2k08
$$ -56 -190 101 96 46 48 216 -36 3 105 -2 64 161 -241 -247 33 69 -18 316 189 -80 2 -8 -53 53 41 -167
2358a67K86k15l3P9L11l09K2K22j38j28J36J06k01K97k02j27K05j09j12L57j71
$$ -167 119 -96 -129 -50 261 -48 -26 196 58 -70 66 172 -29 268 66 -61 144 35 -77 280 109
2379A09Q0k37j8p9K1J39k33L88j57j41K37j87M0m7J71p9k39K22k22N5P9o7R5K15
$$ 109 189 -48 -66 -145 -124 15 -218 170 13 -128 109 -78 -38 -85 86 7 -232 -10 -232 -177 -98 -165 -70 145
2403A45q5k56J91j9J4M2L1j89L09l36J29N0j36m1L59m54J41K48k48R4m6J35l14
$$ 145 60 -196 -5 -24 -10 32 63 -126 183 -153 -24 26 -110 -151 208 -246 -105 143 -105 -11 -57 78 -236
2426b36K51K40k95J9k04O2J47J72k9l56K75M6q1J18M0j85J10l5j03J65J50k51
$$ -236 15 255 -40 -21 -225 -163 -16 156 127 -229 46 92 11 129 169 -16 94 59 -44 121 271 20
2448B0O3J19k30k13L65j85K7J69l8k28J02N3jK79k60m12M52r6j98K78r2j54M37
$$ 20 83 202 -28 -241 124 -61 -34 135 97 -131 -29 24 23 302 42 -370 82 -14 -212 66 -26 -180 257
2471B57j72j49K9J32k03J46k29o4J72J40J9K8l5j31O4k53J73j07K40mj98rJ09
$$ 257 85 -64 -35 97 -106 40 -189 -253 -81 59 78 106 71 -60 4 -249 -76 -183 57 53 -145 -154 -45
2494d5n7J53k60K37Q7J17k75K76j98l53K43R8Q4j12j1k10L58lj05J58j25l67J65
$$ -45 -102 51 -209 28 115 232 -43 233 35 -318 -75 23 107 -5 -16 -226 132 129 24 182 57 -310 -145
2517a45J59m5j30J96r6R5m3K26l63J94L7qj34R8J40k06j73J39p5J33j29j20L34
$$ -145 14 -31 -161 35 -61 34 -9 217 -146 48 85 77 -57 41 181 -25 -198 -59 -134 -1 -130 -250 84
2540H4l61L11l0J0l00J29J03k96M22l29K19r9K66r3j91L52k05Q2J52l11M5L2L2
$$ 84 -277 34 4 14 -286 -157 -54 -350 72 -257 -38 -137 129 36 -155 197 -8 74 226 -85 -40 -8 24
2563B4Q1o1r0n8K78l33M8K98m05L48j79J33j22P9P1j03K59l33j19K45j24N3J61
$$ 24 105 44 -46 -104 174 -159 -111 187 -218 130 -49 84 -38 41 112 9 268 -65 -184 61 -63 -10 151
2586A51j36J2J70j26j03J25o6J66k87J95j75J73j47q7j8M11k58j10J51j0L4n4
$$ 151 15 27 197 71 -32 93 27 193 -94 101 -74 99 -48 -135 -153 258 0 -110 41 31 65 11
2608A1l0M4j17R0k2L5j21r3L52j50q4N5K62l45K93j16M5j0k0j19J76J85l89J64
$$ 11 -19 25 -92 -2 -24 11 -110 -203 149 -1 -85 -30 232 -113 180 64 109 99 79 -40 136 321 -68 96
2632I6M7j38J13j29L9k36N9J05Jj92L56Q0r7N8k05J46l07J68L4j35O6l04K52Q1
$$ 96 143 5 118 -11 28 -208 -149 -44 -43 -235 121 201 104 162 -43 103 -204 -36 -2 -137 -71 -375 -123 -42
2656d2M4M9j41J04j34J16j02K99l47J46n2J52J81L7l68o8J10M9o9oJ97k59K79
$$ -42 2 51 -90 14 -120 -4 -106 193 -154 -8 -60 92 273 310 -58 -126 -16 33 -36 -42 155 -104 175
2679A75j08R0p9o0l40L32lR3j06k4j24P4J83kJ15j98l1j0L90n79J18K18l74J88
$$ 175 67 157 78 18 -322 10 7 100 -6 -30 -154 -80 103 101 216 18 -13 -23 367 -212 -94 124 -250 -62
2703f2K10k10J17M9p7q0J26mj07K30m01K17M8k9r9l3P8L7MO0n3M2J37k6j31j15
$$ -62 148 -62 55 104 27 -53 73 69 -38 192 -209 8 56 27 -72 -105 -27 10 14 74 21 63 200 174 43 -72
2729g2j69J72K54j02j28L5M3j45J41J25k03o3J37J11j48N6J3r5j37N6L1J47j5
$$ -72 -241 -69 185 83 -45 -10 33 -112 29 154 -49 -112 25 136 -12 44 57 -38 -175 -119 -88 59 44
2752D4j21L1J45q8Q8N1o5j96K82p7j0k72KK02O6j77K58j9o1j37L4O5p0Q4n0r0
$$ 44 -77 -46 99 11 99 150 85 -111 171 94 84 -188 -186 16 82 -95 163 144 83 -54 -20 45 -25 59 9 -81
2778h1p8K43Q3J4k19RL69n58P4K76J30k68J85k13j14P7m5q3K31J06j23k0q3j50
$$ -81 -159 84 167 181 -38 -29 340 -218 -144 132 262 -6 179 -34 -148 -71 -116 -199 32 138 15 -5 -88 -238
2802b38K54J9j20P1R8n1J50r8Q2l25K22j87MK13L8j40k8L07k42k51J29k5L3K0
$$ -238 16 35 -85 -14 84 33 183 85 167 -158 64 -123 -119 94 132 -8 -36 271 29 -222 -93 -118 -85 -65
2826f5k0O0K62l84j71K25N0J71k70J45J98j97k25J61J04n7p5p8K10k8K81k35q8
$$ -65 -85 -25 237 -147 -318 -93 -43 128 -142 3 201 4 -221 -60 44 -13 -88 -166 44 16 297 62 -26
2849b6K20p6j02k9j7J7Q3N1j75%m6R6J9Q1mO0k70p8K06mK34m06J67j36Q5J26N5
$$ -26 194 118 16 -13 -30 -13 70 121 -54 -54 -100 -4 15 96 92 152 -118 -196 10 6 240 -166 1 -135 -50 76 131
2876A31k17K31l33M04j20k07k02M55N7m19J98L0J63q0O0j91J75j66J1j00K33j77
$$ 131 -86 145 -188 216 96 -111 -313 142 199 -220 -22 8 171 91 151 -40 135 -31 -20 -120 113 -64
2898f4J01J7q7k69L24J66L8j33J0j12j5n3k5J99MJ4k22P7J24j9L5j90m3J29m1
$$ -64 37 54 -33 -302 22 188 226 93 103 -9 -24 -77 -102 97 101 115 -107 -30 94 75 110 -80 -123 6 -35
2923c5k46M61r1L0J58o19M61j01p7J54R9k95r1n1J63J70J08l2j47q6J61j85K08
$$ -35 -281 180 89 119 277 -342 119 18 -59 95 194 -101 -192 -243 -80 90 198 166 19 -67 94 -91 117
2946A17P9k36J92L9l47N5J41N7o3l38P7M06kl70p6K11j16K70M0j61P2k16K77j49
$$ 117 196 -40 152 191 -156 -101 40 97 34 -304 -227 179 177 -193 -269 -58 -174 96 136 -25 47 -169 108 -41
2970d1K70k93j67K56p6j40K75j39K5R0N0l80M06Pr3k43J64j6J75n8k78q1J87J7
$$ -41 229 -64 -231 25 -51 -191 84 -55 -30 60 110 -270 136 143 50 -193 -29 -45 130 72 -206 -287 -100 -83
2994h3j14R8K87k80J76n3j9j75K40k97K28R8j50K35j96m3j37P2oM5J50rR3n5k50
$$ -83 -197 -99 188 -92 84 31 12 -163 77 -220 8 106 -44 191 -5 -48 -185 -113 -119 -74 76 67 160 105 -145
3019a45J2J6J21Q3j11p1L66k88J20j05j48K57j49O3j59l7J10J27o8K49j97p1O1
$$ -145 -133 -117 4 87 -24 -95 271 -17 103 -2 -150 107 -42 21 -138 -175 -65 62 -6 243 46 -25 36
3042C6%j57P0J54k36J81M2j96P8J43j1j20J44q9J8K13l20j86L52j05p9J48m1M
$$ 36 36 -121 -51 103 -133 48 90 -106 -28 115 104 -16 128 39 57 270 -50 -236 116 11 -68 80 39 43
3066D3K2J00k68j0J10N4k72L7O5P2k2j80M73j76J32k58Q4K21k66J24k8j54N11
$$ 43 65 165 -103 -113 -3 51 -221 -184 -119 -47 -69 -249 224 48 180 -78 6 227 -39 85 57 -97 414
3089D14l92j07K80j59j38Q8M7n9k01K37Q2k54m0j6K38N7j35k0K57j97P7Q9j63
$$ 414 22 -85 195 36 -102 -14 33 -26 -227 10 92 -162 -202 -218 20 77 -58 -78 179 -18 59 148 -15
3112a5Q9Mj04k01L73j05j08J28j79Q1K47j87Jj87K91l04J18L97k80K5j20K72r9
$$ -15 74 78 -26 -227 146 41 -67 61 -118 -37 210 23 24 -163 128 -176 -58 339 59 84 -36 236 137
3135A37j67j26O5J37j81K20J4k29P8q0J58M1M3j6m8k49K36K95k6l75M6J41j77
$$ 137 -30 -156 -91 46 -135 85 99 -130 -52 -132 26 67 110 94 46 -203 33 328 302 -73 -27 114 -63
3158f3j36J43k8J49j95R9KJ08r6j68J9L36k7l27J14k1L1j38K18k61K98J0O2j63
$$ -63 -199 -56 -84 65 -130 -31 -29 79 -17 -185 -166 170 143 -184 -70 -91 -60 -198 20 -241 57 67 129 -34
3182c4J77k88n8J97n4M2K64j96q5M8k8k41K21l8J57j4k3J52j44l00K61j9j48K11
$$ -34 143 -145 -203 -6 -60 -18 246 50 -35 13 -15 -256 -35 -73 84 70 47 199 55 -245 16 -3 -151 60
3206F0k78K15PJ32m2O1k67k6p1K47K7M6j86j32K33j5j31K97k30jK6P0j82J8K08
$$ 60 -218 -3 4 136 94 155 -112 -138 -209 38 65 111 -75 -207 26 11 -120 177 -53 -54 -28 42 -140 -122 86
3231H6j24r3J85l8k33K03K00l16K08o0j59J19RK0k3m2M0j73K66k26K53p7j69M39
$$ 86 -38 -131 54 16 -217 -14 186 -130 78 18 -141 -22 -13 7 -16 -58 -18 -191 75 -151 102 25 -144 295
3255B95l83R2m8K39m64K51q5M9J28j04L9l04L51j03J82k51J56j5p2k06L05M3k33
$$ 295 -88 4 -44 195 -269 -18 -103 -54 74 -30 9 -295 56 -47 135 -116 40 25 -47 -253 52 95 -138
3278a38J89o8mQ1j06P4j6n3N0J47l88K36j74L9K47l1k6l38L59j93K28j41O7l48
$$ -138 51 -17 -21 60 -46 28 12 -41 9 156 -232 4 -170 -131 116 85 59 -279 80 -113 115 -26 41 -307
3302c07K13N7k1K44l16J36M8R7j89K20k66K66p3k29j05J99%j40n9L26k97J09J5
$$ -307 -94 -37 -58 186 -130 6 54 151 -38 182 -84 182 109 -120 -225 -26 -26 -166 -225 101 -196 -87 -72
3325g2j37K39j32O1k43K08K04k46K29k42K02K43n31j48K84M7n1K44p2m3K6k5J39
$$ -72 -209 30 -102 -41 -284 -76 128 -118 111 -131 71 314 -217 -365 -81 -34 -85 159 87 44 70 45 184
3348A84j08j47j49M14l7l37K27L22m56J7n9R9j6J16j49J90J03j42r9K24m44P4
$$ 184 76 -71 -220 194 157 -180 47 369 -87 -70 -129 -30 -46 70 -79 111 214 72 -27 197 -247 -173
3370a73J35j7M9L2lq3O1J58j78J97j62n8J25lo8P5M4n7j36J54j84r8L95j76j08
$$ -173 -38 -55 -6 26 23 -60 1 159 -19 178 16 -42 83 80 12 87 131 74 -62 92 -92 -190 205 29 -79
3395g9J92q5J33q8l03L44j0L2k99J48K5K1L7M1k50N3Q6J26j48j39J40j61L18k61
$$ -79 113 28 161 73 -230 114 104 136 -163 -15 10 31 68 109 -141 -88 -2 124 -24 -163 -23 -184 134 -127
3419a27L2J89l09k3J73k5n1K16k21Q5NJ8QM8J57m51K46P8j30O3k08J55Q1L8N1
$$ -127 -95 94 -215 -238 -65 -90 -141 75 -146 -61 -56 -38 -30 18 175 -276 -30 48 -82 -19 -227 -72 9 47 98
3444I8K1l13J31j09NL12N7j51J3K13k40L6j60K93j26j69J71l30O14m16K97j78
$$ 98 119 -194 -63 -172 -167 145 202 51 64 277 37 73 -87 206 80 -89 82 -248 366 -50 247 69
3466F9m16K73j38L25l51M35l9J2k90L68j58J4p0l3K1mJ1k66K13Q2j63K25M5j47
$$ 69 -347 -74 -212 113 -238 197 158 170 -120 248 90 104 34 1 22 18 29 -237 -24 58 -105 120 165 18
3490A8l2o3J28m1p0NO9j03Rj7j36L59k01q4L67k39p2J18m2M6P4k93R0K43j04O8
$$ 18 -14 -77 51 10 -60 -55 14 -89 -80 -97 -233 126 -75 -159 208 -31 -103 15 -27 19 93 -200 -110 133 29 97
3516I7j03j55Q9L3p6o1L78l23J17R5M2l59L92k75L10k20j97K34k55L22k04K40
$$ 97 -6 -161 -72 -39 -115 -176 202 -121 -4 91 133 -226 166 -109 201 -19 -216 18 -237 85 -119 121
3538A21j95j73K75P4p7q4Q1Mn6p9k1J88j39J91p4r8J02M6L1o9K16k38lj24J10
$$ 121 -74 -247 28 102 25 -59 22 26 -30 -109 -130 58 -81 110 36 -62 40 86 117 48 264 26 23 -101 9
3563IL6r9J75k27O1K66l40N0N4q6P6Q9m3J39j24J54j95K5o3K27k46j01q6L72j20
$$ 9 45 -54 121 -106 -45 221 -119 -69 -15 -101 -25 64 21 160 36 190 -5 20 -43 184 -62 -163 -249 123 3
3588Cj10J55j34K47k80J49L7j72K69k4k27J08j75J97q3j72R5J67q2k90R8L97j9
$$ 3 -107 48 -86 161 -119 30 67 -105 164 140 -87 21 -154 43 -40 -212 -117 50 -32 -322 -224 173 154
3611A54j47J71j93j51J57k5k9J66j0k7q4k8L5R3k50J75p4J58j11j8J56j61J41
$$ 154 7 178 -15 -166 -9 -34 -63 103 93 66 -18 -46 -11 82 -168 7 -67 91 -20 -38 118 -43 98
3634I8R5j41l94L50j44N0j2j75L23j28K87m31L31J84m6K2k64k75K72J38or2P4
$$ 98 193 52 -342 8 -136 -86 -98 -273 50 -78 209 -222 109 293 247 269 5 -270 2 140 134 42 116
3657A16k37J52j62K08q4M4L8N0j27m4M5k81R8K14Km3KRj14R9j23M10m33j53L38
$$ 116 -121 31 -131 77 -7 37 75 125 -2 -46 -1 -282 -184 30 32 -11 -9 0 -114 -15 -138 272 -161 -314 24
3682B4r3L2J95k21j18oO0L87k04Q5%K0j07j83R0J9k2J98k37J7N8R2N8j23k14K69
$$ 24 -69 -37 158 -63 -181 -187 -127 260 56 141 141 161 54 -129 -39 -20 -42 156 -81 -64 -6 86 144 21 -193 76
3708G6l41K93l7K6Q7k4j19J34k14Q0Q0j69R1j22r3L13l01J86M2k62M34l22K50
$$ 76 -265 28 -9 17 104 80 -39 95 -119 -39 41 -128 -37 -159 -252 61 -240 -54 -12 -274 160 -162 88
3731H8o6p1J68k8m0j03L5N1j11J11j8L5Q7p7j47l2kR9j76Q2L36m48K17K65k04
$$ 88 22 -49 119 91 51 -52 -17 34 -77 34 16 51 138 61 -86 -118 -120 -21 -197 -115 221 -227 -10 255 51
3756E1r7K52k34J8M5j62o3M2K1L06j34J51l65j2K19K95j67q7k53K12j02K02P8
$$ 51 -46 206 -28 -10 35 -127 -190 -148 -127 179 45 196 -169 -181 38 333 166 79 -174 38 -64 138 216
3779B16l16K18p2j47N7m2K33o4o2j44N6j32L03p0r6R4k65L14l36K08j35J60J26
$$ 216 -100 118 46 -101 -44 -86 147 83 21 -123 -67 -199 104 34 -62 32 -233 81 -255 -47 -182 -22 104
3802A04p3P9Mk33R2L38l96L9L4KJ49o8j68Q4o4o0K1L51j15j08j74nR7j16J47j57
$$ 104 31 110 114 -119 -27 311 -85 -46 -12 -10 139 71 -97 -13 -77 -137 -116 235 120 12 -162 -167 -70 -186 -39 -196
3828a96K42j04N3l7J21m7n5J56m4p3K8K79k97Mj43k0j21K60O8l2J47k22j28L78
$$ -196 46 -58 -5 -42 79 32 -23 133 89 16 44 323 26 30 -113 -133 -254 6 74 42 189 -33 -161 217
3852B17m64L31p3Q2l89L04q0lK77j89m0R8P8j05j12M4R5P9M4k69J2L8j52Q2J24
$$ 217 -247 84 11 93 -296 8 -72 -75 202 13 -27 71 149 44 -68 -24 71 150 194 -75 -63 -25 -177 -95 29
3877B9j15Q4J9o3j09m4K95k11K93P4l47q1Q6K98j35j65p8L39m23Q1L36m9j99p7
$$ 29 -86 -2 17 -46 -155 -199 96 -115 178 252 -95 -176 -90 208 73 -92 -170 169 -254 -173 163 114 -85 -162
3901a62K41L4n1l34J54P4J08M2j92K68j68l5K22k95J15K10l68j4J60j91K76p6
$$ -162 79 113 62 -272 -118 -44 64 106 -86 182 14 -21 201 -94 21 231 -137 -151 9 -182 94 18
3923A8l4j19M98m76K25j5P0j68k8o3l5K20K0kp0r8m3j0O6j87L21k34J67K63l75
$$ 18 -16 -135 363 -113 112 97 167 -1 -29 -92 -127 93 113 111 41 -57 -100 -110 -44 -231 90 -144 23 286 -89
3948h9R5j77J32k7J06l17J05L63l20J09O4K08k54j07K80j78p7K56r4M2k61p1K15
$$ -89 6 -171 -39 -66 40 -277 -172 191 -129 -20 44 252 -2 -109 171 -7 -84 172 78 120 -141 -212 3
3971CJ5j45K14k55L18j02j6pO5k47J41J77p1J02o28L28J15oK12j73k9L7N5m1k27
$$ 3 18 -127 87 -168 150 48 32 25 90 -157 -16 161 90 192 -436 -108 7 1 213 40 11 48 103 62 -165
3996a65L88o2k84J11K19J2l98J22r1K17k9j49l9L5K22q7q0j19L13l25J66K04J72
$$ -165 223 161 -123 -12 207 219 -179 -57 -148 69 40 -109 -148 -113 109 22 -58 -177 136 -189 -23 181 353
4019C53l06p2R2k19O9K55k83J64k29K01R7J9lq8P4k70P0J67mm9n7l5J08J86k93
$$ 353 47 -25 67 -152 -83 172 -111 53 -176 25 122 141 138 50 124 -146 -76 91 87 38 -19 -54 54 240 -53
4044e3O1J0k0nJ3j3m1j46M05l79K28k9k19K59j88R4P4k16J68J76j40K7j16J24
$$ -53 8 18 -2 -7 6 -7 -48 -194 211 -168 60 31 -188 71 -117 -23 51 -165 3 179 39 66 -50 74
4068G4j10m91N18J86l06j08L10j32L6j5j42ON28l33J01q7k74M29k29R8j46k6K77
$$ 74 -36 -527 -9 177 -129 -237 73 -59 -23 -38 -180 -174 354 21 122 35 -239 190 -39 59 -87 -113 164
4091A64k43mP6j07O1L3j36O2M33j55n65M79L4k7k15L08P2k07q9ML8J14r8J58m12
$$ 164 -79 -83 -7 -114 -53 -20 -156 -94 339 184 -381 98 132 105 -110 198 270 63 -26 -22 16 130 32 190 -222
4116b22K31j45L15k71O9J45j33N7j01M6k78N02k47j80J06J38J19m21L12q8K77
$$ -222 9 -136 179 -92 -23 122 -11 46 -55 -9 -287 215 -32 -212 -106 32 151 -270 42 -46 231
4137B31k15J26j2k73J84L9q4J93n3j04J1L0j68J29n2p9M7J04j0j59N5J18J4j53
$$ 231 16 142 130 -143 41 80 -4 189 136 32 43 73 -95 34 -18 -97 -50 54 44 -115 -60 58 72 -81
4161h1J20j5k48K46j71j07J28M05k32OJ73l95J13J16J9R9k8j86j1K47m20L42J6
$$ -81 39 24 -224 22 -149 -256 -128 277 45 51 224 -171 -58 58 77 176 148 -38 -49 198 -222 120 136
4184A36L1k07L1j1M1K30l27J93j16R9j01J61k18J73j6J94m30J54J0j1J08j77J36
$$ 136 167 -40 -9 -20 21 251 -76 117 1 100 -1 160 -58 115 99 293 -137 17 27 16 124 -53 83
4207H3l7j09O8Kp4L12k48J52o2M4k07K4R8M5L0K2j50J28J2k59R0M9J38k44R1M6
$$ 83 46 -63 5 7 -67 245 -3 149 87 131 -76 -52 46 91 121 143 -7 121 133 -126 -36 13 151 -93 -2 44
4233D4J06j53J0O6k09L2M6L9j29N2K38Q6j82J59k02l7J86l57J48j68K38K7J57
$$ 44 150 -3 7 73 -136 -104 -58 -19 -148 -96 142 228 46 205 3 -34 152 -205 -57 -225 13 40 197
4256A97j95r1R8r4M7J62k46K31k36J30j69R2oJ44J73k56j87K42p5o1J39P0j30
$$ 197 2 -89 9 -85 -38 124 -122 109 -127 3 -166 -74 -80 64 237 -19 -206 36 -39 -100 39 109 -21
4279b1r6L26j63o0N1k7O7n7r0O6l5j19K14p7O0L2k76p8L53j76J41l09L63l36K57
$$ -21 -117 209 46 -14 37 10 77 20 -70 -4 -39 -158 56 -21 39 71 -205 -283 70 -106 35 -274 89 -247 10
4304A0j50J44p9J84J8k84K22j33K00k67J34p3M1J23j98L15j32j0j93K13Jjk22
$$ 10 -140 4 -75 109 127 -157 65 -68 132 -135 -1 -74 -33 90 -108 207 75 65 -128 85 86 85 -137
4327a37k7L52l37j3K01j72o2J84j31K55k11K40k78J44P9k45L04j32l01J14K29
$$ -137 -164 188 -149 -162 39 -133 -195 -11 -142 113 -98 142 -136 8 87 -158 146 14 -287 -173 56
4348E6j6n6L13k90p2K87k36p3J17j96K62l39L35n10L66O0N6k44J31J80r5J22k40
$$ 56 40 -16 297 7 -65 222 -14 -87 30 -166 96 -243 92 -418 -52 8 64 -180 -49 131 36 158 -82
4371h2o0L8K61k87K03J0j43J14N1j33J31l47K45m2r5K32n3p5J13P4j30J46k79
$$ -82 -142 -104 157 -130 73 83 -60 54 105 -28 103 -244 1 -41 -136 96 43 -32 81 155 25 171 -108
4394a08O2J52R8k89r1k1J63L6J95k87N0k05L69l38j07J33J04N7j11N8l2L5j04
$$ -108 -46 106 204 -85 -176 -197 -34 2 197 -90 -40 -245 124 -214 -321 -188 -84 -27 -138 -80 -112 -77 -181
4417a81Q7J54J01j82m6q9L33l15J59Pp8k6K80p5M6o9l31L92l57J28N8r1J62j28
$$ -181 -94 60 161 -21 -67 -156 177 -138 21 28 -50 -76 204 129 175 106 -225 167 -190 -62 -4 -95 67 -61
4441f1l6L11j53o3j58K2J44K9M5M9j20J22L6k38J48n7m8jR9m4j79N46l28n1%J21
$$ -61 -97 214 61 -2 -160 -138 6 35 80 129 9 131 167 -71 77 20 -28 -29 70 26 -153 393 65 14 14 135
4467A35j20n8J02J16k02P0k25K92j72j56M63n2j54J50k66L26l55K49j09m5J43
$$ 135 15 -43 59 175 -27 43 -182 110 -62 -218 245 193 39 189 -77 249 -106 143 34 -11 132
4488A32l77Q2K48j35n8M3k26M34k56J64L5n1k65J28K98m27L32J33j74j31K06J05
$$ 132 -245 -163 85 -50 -108 -65 -291 143 -113 51 86 35 -230 -102 196 -231 101 234 60 -71 135 240
4510B40j57j26M8LK10k24l9K04j14nj21K07j99J02J63r4q0k06k2j4K16Q6r7j09
$$ 240 83 -43 5 8 218 -6 -45 159 45 40 -81 126 -73 29 192 98 18 -188 -210 -224 -8 78 -19 -128
4534a28J11k8l7K48j19j22K02j37j80K51j82J37R9o3k56K37k67J81J68K15l67
$$ -128 -17 -45 -82 166 47 -75 127 -10 -190 61 -121 16 115 52 -204 33 -234 -53 115 330 -37
4555c7k1p9O4j80K71p7J14J40k66K06l84J81O8o4l8j68J83J09J9l2k24L08l12
$$ -37 -58 -137 -73 -253 18 -59 55 195 -71 135 -249 -68 0 -64 -102 -270 -87 22 41 9 -215 93 -219
4578b19J75q7J14N8j62J6j47J87K15j14R0J6k80J93J50L6k02m9j16k4K02j3k43
$$ -219 -44 -131 -17 41 -121 -105 -252 -65 150 36 126 142 -138 55 205 241 39 -10 -126 -150 52 39 -204
4601b04J31K58l59M9J42l3L3L8J62k46K97k20K43m99J15K45k84J47J44j8k70K75
$$ -204 -73 185 -174 -125 17 -16 17 55 217 -29 268 48 291 -208 -93 152 -132 15 159 141 -129 146
4623A46pl02j1J96K35n7j09K9mj85m0J63k1K7j77K39j16o2K7J8M3j70K88k67Q9
$$ 146 139 -163 -174 22 257 200 91 120 116 -69 -109 54 33 60 -117 122 6 -56 -29 -11 32 -138 150 -117 -28
4648b8k6M3Kj1P0j22j21L46J65k65k29m3Q6J53o3L6j69j99K74L7m1p4K95k57O6
$$ -28 -54 -11 -9 -20 50 -72 -193 153 318 53 -176 -219 -133 20 -43 -7 -176 -375 -101 -64 -105 -179 116 -141 -75
4673g5L6M7JO3p3j13J46o4K75k68J85l50Q0P0j27Q2j4k9J52j16J05J44j88o3k1
$$ -75 -39 8 9 72 -1 -114 32 -32 243 -25 160 -190 -110 -40 -167 -85 -99 -128 24 -92 13 157 -31 -94 -115
4698a15J86O3k03KRj34K30k72J57L32l82N2Q5j38o1K21Kjpk3M4P5k36J01j73J94
$$ -115 71 134 -69 -67 -58 -192 38 -234 -77 255 -127 -75 10 -128 -189 32 34 33 26 3 47 122 -114 -13 -186 8
4724Hl01L56j3j96RP1p8K34Q4j79j31K27k47J63j89J04J97KJ34m06K56J09k70
$$ 8 -293 63 50 -146 -137 -66 -144 90 174 -5 -136 91 -156 7 -182 -78 119 121 255 -151 105 214 -56
4747e6P1rqj38O5K01j58Qm0J35k35J51K3l3k7n0J54j47j70K42M8j17J4K3n5l8
$$ -56 15 6 -2 -140 -75 126 -32 -24 -64 71 -164 -13 10 -23 -50 -100 54 -93 -263 -21 27 -90 -76 -53 -108 -146
4773a46p1J81qk38K53p4J41j68P9J01j03K63l7k56P8K65n14M72j22l9P1k31K15
$$ -146 -217 -36 -44 -282 -29 -103 38 -130 -51 50 -53 210 173 -83 -5 260 -254 218 96 57 128 -103 112
4796A12k20J43L4p9p6J64o3j36J47nJ47j91p2K64k84r5L27Qm8k01L31j23P2N1
$$ 112 -108 35 69 -10 -86 78 15 -121 26 21 168 -23 -95 169 -115 -210 117 125 77 -124 207 84 156 207
4820B07l85O5l3K50j01J86k00Q5j74N0p6J43k60J18K0lJ9M55l97j4J28j75L35
$$ 207 -178 -113 -146 104 3 189 -11 74 -100 -50 -126 17 -243 -125 -105 -108 -89 366 -31 -45 83 -92 243
4843B43l52Mo5L42j62k1M5K79l01J14l70K97j60M77l55n6N3K07r8j44r6m9J97
$$ 243 -109 -105 -170 172 10 -11 34 313 12 126 -244 53 -107 370 15 -41 12 219 121 -23 -119 -168 29
4866B9M5K18l69J31k2J22j53Rm7Mj9O6j3j09J13L44m30k6J39k22J10oJ33r0j06
$$ 29 74 292 -77 54 32 154 1 10 -37 -33 -52 14 1 -108 5 349 -81 -107 32 -190 -80 -86 47 -43 -149
4891a49J43r5o6J70k74M47l56J45j05J92j86O6J83k30j52L80l46N05k33p7N4j53
$$ -149 -6 -101 -167 3 -271 176 -180 -35 -140 52 -134 -68 115 -115 -267 113 -233 272 39 -38 16 -137
4913a37J68J0j2L7K9J1l5O5k83J01J08J34j82R7j38J14j31p4n5R7J4Mk2l8K14
$$ -137 31 41 29 66 95 106 71 136 -147 -46 62 196 14 111 -27 87 -44 -118 -173 -76 -62 -58 -80 -118 96
4938I6j51q3O0L89k68L8j90J25r2l00J58J26J10m4J72k08Q7p4j45M03k66R2j20
$$ 96 -55 -138 -78 311 43 81 -109 16 -76 -376 -218 -92 18 -26 146 -62 25 -49 -194 209 -57 35 -85
4961h5R6L6q4J5L4Q0j0j26j04o8K16J68L0J02o05K12M2J2L5J97J35m83o0Q1K48
$$ -85 11 47 -37 -22 12 92 82 -44 -148 -216 0 168 198 300 -305 -93 -51 -39 -4 193 328 -155 -215 -134 114
4986A14j75P9O0l7J36j50K36l51j13L48J58k83J51KJ12j56l17K25k5p0P0J88l00
$$ 114 -61 18 78 41 177 27 263 -88 -201 147 305 22 173 175 287 131 -186 39 14 -56 14 202 -98
5009i8K09k01K05j66j32L7J00J60j14J48r7J76k43q6o0K83r1l3j14J72J40j98
$$ -98 111 -90 115 -51 -183 -146 -46 114 0 148 51 227 -16 -102 -162 121 30 -3 -117 55 195 -3
5031cM9K29m05J08R3l65J54J68j5R3k15k2J81l4k04o1J03L51k53Q3K40l61NO8
$$ -3 46 275 -130 -22 71 -294 -140 28 13 106 -109 -131 50 16 -188 -249 -146 205 -48 35 275 -86 -81 -13
5055a3M9M6M0%N3m6k07J51J83k60P5j7o0J14q7J57j79N8N5j21M78l82j72P5nL1
$$ -13 36 82 122 122 175 129 -78 73 256 -4 71 54 -6 108 21 178 -1 57 112 -9 469 87 -85 -10 -15 16
5081A6l6J11q6l8l19K30J32O8k58J37r5K14r0l9K74m74K14q7P0J53k3Rk10N9n1
$$ 16 -20 91 5 -33 -352 -122 10 78 -180 -43 -138 76 -14 -53 221 -253 -39 -126 -56 97 74 83 -127 -68 -119
5106a19L16k93J80l48L44k65J41L9M6k5k84L93m8k04J73K8Q0j18j28K05lN0m53
$$ -119 197 -96 84 -264 80 -185 -44 -5 41 16 -268 125 77 -127 46 74 154 36 -92 113 110 160 -293
5129b93L13J32r3j51J05L01k82j56j46K31K34j95j76J78j46J06K8J7qm6j3K11
$$ -293 20 152 59 -92 13 314 32 -124 -270 -39 195 0 -176 2 -144 -38 -10 7 -1 -47 -60 151
5151A51k13n5OK3j58K28J90k94%J85j49J11p3q0K90nj00O6j23o1J25N2k97K51
$$ 151 -62 -117 -111 -88 -246 -18 172 -122 -122 63 -86 25 -48 -128 162 157 57 123 0 -61 64 116 -181 70
5175G0j3nn0n8j06K70j26pL4K34j66j13K96m41L45l27J24nLR3j31L26j25j67L29
$$ 70 57 52 2 -56 -162 108 -18 -25 9 243 77 -36 260 -181 164 -163 -39 -44 -41 52 -79 247 122 -45 284
5200B84k87q1r7M67l16P9j59J68P4j81j0K01k14j54K41q7P5R9L0j57K24k08L1
$$ 284 -3 -84 -181 286 -30 49 -110 58 132 -49 -59 142 -72 -226 15 -72 3 102 132 -25 199 -9 22
5223B2J49k33j28J73Q3J4P4q0K52k27r7J79k67R5r5q0J25N4m2o2J20O8j9j96K06
$$ 22 171 -62 -190 -17 66 80 154 74 326 99 2 181 -86 9 -86 -166 -41 13 -29 -91 29 97 78 -118 88
5248H8k65K15j5j41J69j58j41M00L1l15P1J27k21K27Q1j07j94L18m8N0k04q8J8
$$ 88 -177 38 23 -118 51 -107 -248 152 183 -132 -61 66 -155 72 153 46 -148 170 122 172 -32 -120 -102
5271a02q2N2J26j24l5K24k4k6k48K14k20L53p8j75L8K67l37J73kj91K08lJ91k01
$$ -102 -184 -132 -6 -130 -165 59 35 9 -239 -25 -245 108 30 -145 -107 160 -177 -4 -6 -197 11 8 199 -2
5295bq0J9j4j39K29j70p2J84r4K55R9m15K05M7r9K63k50k72K60J85q0K1L7j86
$$ -2 -82 -63 -77 -216 13 -157 -229 -45 -139 116 215 -200 5 52 -47 216 -34 -306 -46 139 59 80 117 -69
5319f9o4K59j40J61j68L00l10J21K5j25j04K7l9J32J16l79Q7K33o3o3l6j15L08
$$ -69 -133 126 -14 147 -21 279 -31 90 115 -10 -114 -87 -126 6 122 -257 -170 63 0 -63 -99 -214 94
5342I4jN3p6j84J50J08n3nLK9k32K4mK45j06n2q9M31l04k98L13q5m4Op5m9J04
$$ 94 93 146 70 -114 36 144 91 86 89 118 -114 -90 -94 151 45 -7 -96 335 31 -267 46 -39 -83 -77 -152 -201 -97
5369i7J30K08m60J90N1j00R9pN0j6Q3j75mL7N7R3r3j62R7L2J26l7j38j1J82J60
$$ -97 33 241 -219 -29 22 -78 21 14 64 48 131 -44 -48 -11 46 139 46 -116 -19 13 139 102 -36 -47 135 295
5395B95j48j77J95k13rK87P0l99N5j29K20j4o1J52p6l7q0m8K3J09j66K58j78L5
$$ 295 147 -30 165 -48 -57 230 300 -99 -44 -173 47 33 -28 124 48 11 -69 -117 -94 15 -151 107 -71 -36
5419c6M6L3M6l0pJ10j05Mn1M2L2k67J57k7k1R2J70j62L3k15K2J80l5J30o6j2L4
$$ -36 10 43 89 59 52 162 57 61 10 52 84 -183 -26 -53 -74 18 188 26 59 -156 -134 46 11 141 75 63 97
5446I7RPl5j51P6L7M9k20L32m01J57J0j63L3K14p8J37k78L60l84qK68L6L2k9n3
$$ 97 106 113 78 -73 3 40 89 -131 201 -200 -43 -33 -196 -163 51 -27 110 -168 192 -192 -200 68 104 136 107 54
5472E4j08j96J22L1J50N5P0j94j66N8J82l6j00j2J58k2K17k29j26N2k8qP1k59
$$ 54 -54 -250 -128 -97 53 108 178 -16 -182 -124 58 22 -78 -90 68 46 263 34 -92 -40 -68 -76 -5 -264
5496b64L92j40p8m4j03J92l7J9j71L5O6k61L15J26o6R1m6j42n1J55KO9p4l2J18
$$ -264 128 -12 -90 -134 -237 -45 -82 -63 -234 -199 -133 -394 -79 47 -19 72 26 -116 -167 -12 -10 59 -15 -47 71
5521G1j15K55k06j80P6J49J1j28J06J5J9M9l08J02J58j30J68J07j35j41K88j22
$$ 71 -44 211 5 -175 -99 50 61 -67 39 54 73 122 -186 -84 74 -56 112 219 84 -57 231 109
5543A09j87J31k29N6J75J05L5k41j63J48J74p4oj9K0J29j98j09R3r1M6j13K74
$$ 109 -78 53 -176 -120 55 160 195 -46 -209 -61 113 39 33 14 34 163 -35 -144 -51 -142 -96 -209 65
5566F5p1J62k62K19k95K37k44L09j19j63J42o9P7O1n1J04k10k0J25m5J9P6J26
$$ 65 -6 156 -106 113 -182 55 -189 120 1 -162 -20 -89 -12 49 -2 102 -108 -128 -3 -48 -29 47 173
5589A73k72k1N1J82r7k3Q4k6J28k99Q1L02k46L8j22m7J79o7K9m6j00J5L16q7j43
$$ 173 -99 -120 -69 113 16 -7 77 51 179 -120 -39 263 17 55 -67 -114 65 -2 27 -19 -119 -104 212 125 -18
5614a8j30P0J34k34K69Jj77K30j92J31jk28J39j21J19q9J34J93m53j06L78J96
$$ -18 -148 -78 56 -178 91 92 -85 145 -47 84 83 -145 -6 -127 -8 -97 37 230 -223 -329 49 245
5636B45k31m2q5J36kk31J98j11J29j52J43J4o4L08m61O4p3Q7L33O7k79K68m6l6
$$ 245 14 -28 -113 23 21 -210 -12 -123 6 -146 -3 11 -53 255 -206 -142 -215 -128 205 272 -7 261 215 179
5660A79M5l43J12J3j7J73j92J19O5j45k37N01k73j0M0O3q6m6R5p7Ql8O5K9j77
$$ 179 224 -119 -7 6 -11 162 -30 89 154 9 -228 273 0 -10 30 93 7 -39 56 -21 -13 -51 14 43 -134
5685a34J24m7J18j60J57J9j94J55l5l3j68K87k98J59j31J09K12k67l3J67p8L5
$$ -134 -10 -57 61 -99 58 77 -117 38 3 -30 -198 89 -209 -50 -181 -72 140 -127 -160 7 -71 -36
5707c6Q5K80l08q0Q7N0k4J48j54m0m4O1N5j60J3J84k72L2L8j90L46k54K61j0j58
$$ -36 49 329 21 -59 28 78 54 202 48 8 -36 25 80 -80 -67 117 -155 -123 -85 -275 71 -183 78 68 -90
5732i0L02k37K14k45K5J68M9l65P5K6J72j38n2j6k5L04l2j40J27k98M12km61O
$$ -90 212 -25 189 -56 -31 137 186 -179 -104 -78 94 -44 -96 -112 -137 167 135 -5 122 -176 236 234 -227 -221
5756b21K96r2n7J86j20k5MJ34Kq7Q8k30J80l48N3L09k36K05j14M42m30N7j26M26
$$ -221 75 -17 -74 112 -8 -33 -29 105 107 20 108 -122 58 -290 -237 72 -164 41 -73 369 -61 -4 -130 296
5780B96k89J44n5l0k89N38k03O1P2J08k50k28k1q8K66ok04J09j1j3OJ59j61J30
$$ 296 7 151 96 66 -223 315 112 173 245 353 103 -125 -146 -234 32 26 -178 -69 -80 -93 -87 72 -89 41
5804D1j04J23q0L3j23R0qk2J87q2O9M5k18%lK57k73N6r8p2L22k8l15J04P9n7Q5
$$ 41 -63 60 -20 13 -110 -20 -28 -50 137 55 124 169 -49 -49 -52 205 -68 -12 -110 -182 140 112 -203 -99 -20 -77 8
5831Hp3J61j24j1oR2k94M7J61J34k00J42j51j22K24r9R9K9M1l66K56L9J64nl57
$$ 8 -65 96 -28 -39 -45 47 -247 -200 -39 95 -105 37 -114 -236 -12 -111 -12 17 58 -308 -52 -13 151 146 -211
5856b11J08K14O5k18kN3J64q4J93k64m7m1m0J45l0r0l5K26j28J49j04J16j56J03
$$ -211 -103 111 176 -42 -44 9 173 89 282 18 -29 -70 -110 35 5 -85 -120 106 -22 127 23 139 -17 86
5880H6m8Lk56J85J15l50J42J23O1p6NQ4J57j06R3j14l1K33j95k29L6J30j82R7
$$ 86 38 41 -215 -30 85 -265 -123 0 61 -15 -10 74 231 125 218 104 73 306 111 -118 -82 48 -134 -37
5904c7k8r1J0K51l52l3L73j21O9j21jK02m02L55Jq9J71j37K6J83j09q9J02j88
$$ -37 -65 -156 -146 105 -247 -280 93 -28 41 -80 -81 121 -281 74 75 -14 157 20 46 229 120 31 133 -55
5928e5J31J7J34k36kK5j45K04j69R9j14j4M31n16K46m9J00K0r5o4P1J01o7o2J08
$$ -55 76 93 227 -9 -11 14 -131 73 -96 3 -111 -125 306 -210 36 -13 87 107 12 -52 19 120 53 -9 99
5953I9j02m2Nm3k3J62Rk39O4K50k80O8J15j38j7Q9j72J78rj14J53K79k78k4n8
$$ 99 -3 -45 -40 -83 -106 56 65 -174 -110 140 -140 -72 43 -95 -112 -23 -195 -17 -26 -140 13 292 14 -10 -68
5978f8J37j60p5M28n8l10j07K53k4J16k88K85JoR1j43p9J22j62J07k8L7k21J25
$$ -68 69 -91 -166 262 204 -106 -213 40 16 132 -156 129 130 124 215 72 -7 115 -47 60 32 69 -152 -27
6002b7q5J11p1N6r7J58l8J05l2j56L15j90N4j09Q2j99j12L11j69J52P1k10K29
$$ -27 -112 -1 -72 -16 -113 45 7 112 80 -76 239 49 103 -6 76 -123 -235 76 -93 59 130 -80 149
6025A49Pk72K7J54l12J55J02N4j39K9Q3l06M0L15p3j00K5K83j32Rk7j97M32l52
$$ 149 156 -116 -89 65 -247 -92 10 64 -75 -46 37 -269 -229 86 13 -87 -62 221 89 98 71 -126 306 -46
6049d6R3p5R6l27K65J44n6Q6r9K5o2j99J76j25P0l0J19k92L9J91j03J51j36J6
$$ -46 47 -28 68 -259 6 150 94 180 81 106 44 -155 21 -104 -34 -64 55 -237 -198 -7 -110 41 -95 -79
6073g9j4K9J63o9J71k62L24j69m1j17O3K55l03J36J05l19j25L31j51K26l4r4k6
$$ -79 -93 -64 99 30 201 -61 263 94 53 -64 -1 254 -49 87 192 -127 -252 79 -72 154 120 26 0
6096@n4j69L16l07M30k46j59M81k72j33J58j70R4N3j4M8k23L69k08J61o1L4q1
$$ 0 -54 -223 93 -214 216 -30 -189 292 20 -113 45 -125 -31 22 8 56 -167 202 -6 155 94 128 47
6119D7l2K5j38J05Q0j48N9j6j1K24p8m04J74o2K13j48K29j79J22j26j3L67r9k98
$$ 47 15 40 -98 7 87 -61 -2 -18 -29 195 117 -287 -113 -175 38 -110 119 -60 62 -64 -77 290 191 -107
6143a07L60l58L1j31J56l4M4J38k14N0J38j5m4k20R6J44K5%J29k63L7J62k11K30
$$ -107 253 -105 -74 -205 -49 -83 -39 99 -115 -65 73 58 14 -206 -110 34 59 59 188 -75 -38 124 -87 143
6167A43k6q4r2K82j96q5J57j31j54J21r1J78p1L09l85R2p3R9R7p9J3L07j30j39
$$ 143 117 33 -59 223 27 -58 99 -32 -186 -65 -156 22 -49 260 -125 -33 -106 -7 90 11 24 331 201 62
6191F2j69l9P0J12j80p2m2r2M29l04L76k14J25N1J18k15j06N6J6K78r7k57rOL0
$$ 62 -107 -146 -76 36 -144 -216 -258 -350 79 -225 151 -63 62 113 231 16 -90 -34 -18 260 163 -94 -103 -97 -67
6216f7K40j72p2J16k43O8J77O4q5j67J13j69L51J86n59J56p0N8K33n9k38l3K03
$$ -67 173 1 -71 45 -198 -130 47 111 26 -141 -28 -197 154 340 -219 -63 -133 -75 158 99 -139 -172 31
6239C1j76K60k04J10p1n5m8R0J3J78j83K72j15j93m4P7J2q7M27m19L87j8m13K65
$$ 31 -145 115 -89 21 -50 -105 -153 -63 -50 128 -55 217 102 -91 -135 -58 -46 -133 294 -125 262 244 -169 96
6263I6k63J19K3r9j02J88M1l6r7J62M8j40K16j9o2kl46P4KN53o42L53m3j43J74
$$ 96 -167 -48 -25 -124 -226 -38 3 -33 -130 32 80 -60 156 137 75 73 -273 -199 -197 356 -286 67 24 -119 55
6288E5m2K11k09Q5j70M8l25K12J78L8P9k13R9P3k10J96Qk06K02P6m51L70m2rQ3
$$ 55 13 224 15 100 -70 -22 -347 -135 43 81 160 -53 46 119 -91 105 113 -93 109 185 -266 104 62 53 136
6313A36j80Q6o1J53j98P8J68N1m53L09k91J37K18k13k95L49J47k06O2j9j15J76
$$ 136 -44 42 -19 134 -64 14 182 233 -220 89 -202 -65 153 -60 -355 -6 141 -65 -3 -22 -137 39
6335C9p9J16j28q8K97k03J68j14J94k46N6n2j09O2M3J11j55J36J38k90K07r1j09
$$ 39 -40 76 -52 -140 157 -46 122 8 202 -44 12 -40 -149 -87 -44 67 -88 48 186 -104 103 12 -97
6358i7RJ29l9L19l94J73k5j70J12J67j14p1j05r0K01J97k60K56j54J66k2j60p3
$$ -97 -88 41 2 321 -73 100 75 -95 17 184 70 -1 -106 -196 5 202 -58 198 44 210 188 28 -45
6381d5qJ5j1N5k31L37p1o0mj32N2J59k70K41p0L29k74p6L03j1k96j3j14J90j72
$$ -45 -53 -38 -49 6 -225 112 41 -19 -23 -155 -103 56 -214 27 -43 286 12 -64 239 228 -68 -81 -195 -5 -177
6406a77K24j08P5M7j37K2p7K57o6k30J33J27R4k14Q8J89l43N7J60j62J57k83P
$$ -177 47 -61 14 61 -76 -54 -131 126 60 -170 -37 90 184 -30 58 247 -96 -39 121 -41 116 -167 -160
6429a60K60l7O7nk2J11k04j07k71J06P8J89j23J3J66l06L26j34M6j76N8J69j78
$$ -160 100 63 130 125 103 214 10 -97 -368 -262 -184 5 -118 -105 61 -245 81 -53 -7 -183 -125 44 -134
6452a34K41Jj96Q4L12m63j11L68k57J99M5k11J71J25n1o4J5m6J33k65n6Q7K35
$$ -134 107 108 -88 -4 308 -155 -266 102 -155 44 89 -122 49 174 123 59 74 28 161 -104 -160 -73 162
6475A62j00q1m4j18K90j68L2p8J05q4p0K52j24J47l67K65j1j2p6J10J60j64K8
$$ 162 62 -19 -63 -181 109 -59 -27 -105 0 -84 -154 98 -26 121 -246 19 8 -4 -80 30 190 26 54
6498E4j52M1J9k5r2J90K9m0k6M0p0j07L48n52L44K02j66p4J43j22p0R7n1p9K54
$$ 54 -98 -57 -38 -63 -155 35 64 24 -2 38 -32 -139 209 -343 1 203 37 -37 106 -16 -86 11 -40 -119 135
6523A35j54%P2N9k53lJ49j36K3n9L3K08k81L97k38Q7kK48l19o3P8Pmn1J94j08
$$ 135 -19 -19 53 112 -141 -144 5 -131 -108 -167 -134 74 -207 190 -48 39 37 285 -34 -97 -19 -12 -16 -67 127 19
6549A9L7r8K99l48k0l0J03J4L73n38L7P5L1L50k21N3j44K3J59j71J89k76Q7J26
$$ 19 56 -42 257 -91 -111 -141 -38 -24 349 -189 -152 -77 -46 304 83 136 -8 15 174 3 192 -84 3 129
6573A29m08N05k91j10L54l11K0K43j94J04j21P4J84l16K00p4j2k0K60l21K30p4
$$ 129 -279 226 -65 -175 179 -132 -112 131 -63 41 -80 -6 178 -138 62 -12 -24 -44 216 -105 125 51
6595E1j16J45r4p9L12nk42j11Q5k58K39j1K79l12K64j05n9J06k07O2J16P7j04
$$ 51 -65 80 -14 -93 219 214 -28 -139 -54 -312 -73 -84 195 -117 147 42 -17 89 -118 -56 60 137 33
6618C3J8p1K97j46k13lL03j61q4J63l0k60K51m64L49J04j51Q2o0K57m81L78k59
$$ 33 51 -20 277 131 -82 -85 218 57 -27 136 106 -154 97 -367 -18 86 -65 17 -43 214 -267 111 -148
6641a48J47J17k22P5J82j52L0k1J47k84J17r5J19M0J8m7j4p2K24r8j42r2L35k17
$$ -148 -1 116 -106 -31 151 -1 29 8 155 -129 -12 -107 12 52 70 23 9 -63 161 63 -79 -171 164 -53
6665e3J34k6j09K51l66J04m8Q4k6J64j11J36j17K69m87K91o4K34l18M2J58R7k40
$$ -53 81 55 -54 197 -169 -65 -113 -29 -55 109 -2 134 17 286 -201 90 26 260 -58 -16 142 239 -1
6688aJ52k84Q7k9n1J52j55J28j57J61k46K57J58k30p1P5j18K32o2O6j95o5J87
$$ -1 151 -133 -46 -75 -126 26 -129 -1 -158 3 -243 14 172 -58 -129 -54 -172 60 -2 64 -131 -196 -9
6711ip5O7p3J30j28K52k25J90N3k26L2K54k12L2j1L89l49J23j64j3j31Mj43L03
$$ -9 -84 -17 -90 40 -88 164 -61 129 182 -44 -12 242 30 62 51 440 91 214 50 37 -94 -90 -233 70
6735G0N7l79P7Q6K68l30L30l69J35P8J82j0m20K68M9j64l3J29L4J64m15K08J39
$$ 70 127 -252 -175 -89 179 -151 179 -190 -55 23 205 195 -225 43 92 -72 -105 24 58 222 -193 15 154
6758A54L9j19j17J33k6Q6m43L00R6j75j07L53j92nJ6l18L19J75j37j01l7J31L2
$$ 154 193 74 -43 90 64 150 -293 7 103 -72 -179 174 -18 -23 -7 -325 -6 169 32 -69 -106 25 57
6781E7J61k86m9Q1K11l17N8J22NJ12j06k29J79o6n1J24J17j07k31L38j04m5q9
$$ 57 218 -68 -117 -36 175 -142 -84 38 43 155 49 -180 -1 -67 -118 6 123 16 -215 123 19 -26 -115
6804a15J15k15L90j6j23k39P5P7K26k10l0K0O0n3M4k20o1K91K03r8l79M45k57
$$ -115 0 -215 175 159 36 -203 -128 -51 175 -35 -65 -45 15 -38 6 -214 -275 16 219 121 -258 187 -70
6827g0k59N16k18r5K33%k77K43k88J10K87k77M5j19L37k47P3j11P7J58l18J81
$$ -70 -329 187 -31 -126 107 107 -170 73 -215 -105 182 -95 -50 -169 168 -79 -6 -117 -40 118 -200 -19
6849a9k3K8P9p2l1k7J31l2J34j62N5M0j26J51k55P9R1m9q5R1J20L9q9q8J51J79
$$ -19 -42 -14 65 -7 -38 -65 66 34 168 6 61 101 -25 126 -129 -50 41 -8 -93 -2 118 157 68 -20 131 310
6875C10q7j91k71O1J42N8n2k7j16K81L0k94J38N6k7J14k35J66k80L05j02N3l5
$$ 310 223 32 -239 -178 -36 22 -30 -57 -173 108 138 -156 -18 38 11 125 -110 56 -224 81 -21 32 -3
6898cK32l03N5o4j30K84J09k37J30q5j64J49J05j64K56k74K62l33N3K41j94J29
$$ -3 229 -74 -19 -83 -213 71 180 -57 73 -12 -176 -27 78 -86 170 -104 158 -175 -122 119 -75 54
6920E4j25J50j89J18Rm9Q8J95j70K31l96m3Om4J77o4r2J06p1J73k36M16l44L37
$$ 54 -71 79 -110 8 17 -32 56 251 81 312 -84 -127 -121 -165 12 -52 -144 -38 -109 64 -172 244 -100 237
6944B37j77l19P5L38o0P7j61K63j20k91K53N3j07jO2j20k46K98QQ2j68K5q0M8
$$ 237 60 -259 -184 154 94 171 10 273 153 -138 115 168 61 60 122 2 -244 54 62 144 -24 1 -79 -31
6968c1K23l32J91k23J5K44r5j37Q7K80j61j59Q7L0j02m9R4k9R1LP2p5J33j17l1
$$ -31 192 -140 51 -172 -157 87 -8 -145 -58 222 61 -98 -11 19 -83 -132 -38 -67 24 27 99 24 157 40 9
6993IJ20k08J48j69R4K61m10O8J74j89k5R5Q4r3J17k28J36M0l1N3O2j02j27L42
$$ 9 129 -79 69 -100 -6 255 -155 -87 87 -102 -127 -32 52 -41 76 -152 -16 24 -7 46 108 6 -121 221
7017B21k30r6K16j95J86N3r0r6J23P0Q3m01pJ72j0p0l2L8k3K00l8R7k19P4K5J22
$$ 221 -9 -105 111 -84 102 155 65 -31 92 162 245 -156 -163 9 -1 -71 -103 -65 -88 112 74 171 -48 26 51 173
7043A73j43p2J71n1n5j52k0R8J74J2j99l5J30J43Kj19r2j91L55j70J9oJ18l49
$$ 173 30 -42 129 78 23 -129 -149 -51 123 135 -64 -99 31 174 176 57 -35 -226 129 -41 -22 -28 90 -259
7067b59L62p0j32L3lQ7l04J85J01r5J56p3j52K7J72J43j97l4O0J88j32l58M18
$$ -259 103 33 -99 -66 -69 18 -286 -101 0 -95 61 -12 -164 -137 35 178 -19 -53 7 195 63 -295 123
7090A23Rk66J15k77J55k1P8K86o5j51j7J23M4o1l59K36K21l75K15J41L9l44J89
$$ 123 132 -134 -19 -296 -141 -162 -84 202 137 -14 -31 92 136 75 -284 -48 173 -202 13 154 193 -151 38
7113C8j4Rn3q0L8J58q3K00j43j96P6N7J1J94p3k13o7l0J81j26K22j34j09J76J26
$$ 38 24 33 -20 -100 -62 96 13 213 70 -126 -50 7 18 212 139 -74 -141 -171 10 -116 106 -28 -137 39 165
7138A65Q6l09J3Oj82K77K28j28k25J76L3p2O3o4Lj29n2J33L9l5q5L4K14l58Q3
$$ 165 251 -58 -45 -39 -221 56 284 156 -69 107 140 68 131 67 70 -59 -111 22 61 26 -59 -25 189 -169 -86
7163h6q2rK41p7J3M5M4q1K03k63r2j31L36J17o1m0j69M31k14j65K03j08j65K39
$$ -86 -168 -177 64 -13 0 45 89 8 211 -52 -144 -275 61 178 117 77 -92 339 125 -40 163 55 -110 129
7187A29L36o03J27j8K81k69K36o3q8rj74J27k38K18KJ04N0K03m30j36l6M49j39
$$ 129 465 -138 -11 -29 252 -17 219 156 68 59 -115 12 -226 -8 -6 98 148 351 -79 -215 -251 198 59
7210E9j67K19k71R3lj0R2k46L36j17J68j32k66L67j01Q2k85J64p4J90J3N0o1J6
$$ 59 -108 111 -160 -67 -70 -80 12 -234 102 -15 153 21 -245 122 21 103 -182 -18 -92 98 111 161 100 116
7234A16j27n7L02l56K49Q5j50p1j19jK15n5k25J84l0J17j81o0K63l50L64j21q2
$$ 116 -11 -68 234 -122 127 212 62 -9 -128 -129 86 31 -194 -10 -40 77 -104 -164 99 -251 113 -8 -90
7257i0J58%N6o3k9j45K47j3j42K51m06K13n8L2m5k7J59J2J7K3j17OJ34k06J11
$$ -90 68 68 124 61 32 -113 134 121 -21 230 -176 37 -21 11 -34 -61 98 110 127 150 33 39 173 -33 78
7282G8j37K29p7J3k8j45N4N5J04q2j65L57l02J13k67P3J33l5k73L81l38L88n9
$$ 78 -59 170 93 106 78 -67 -13 42 146 64 -101 256 -46 67 -200 -127 6 -29 -302 79 -259 129 70
7305G0r7Q3j8p8%K02m34L17j98K39l31L80k7k72J5p8K18K83l15o0J62j5L9k28
$$ 70 -27 56 38 -40 -40 162 -272 45 -153 86 -245 135 108 -164 -149 -227 -9 274 -41 -101 61 46 85 -143
7329a43K53j54n6J35J95k72j40L17k75K12l4j8j31K20j18oJ82j82j01k00K65O3
$$ -143 110 -44 -100 35 230 -42 -182 135 -140 72 38 20 -111 109 -9 -15 167 -15 -116 -316 -51 12
7351A2Q0k49J73J55r3j16J1J20J11j67k49J87J0pO8R9kJ5l85J88K9J0K53m28M9
$$ 12 92 -157 16 171 78 -38 -27 93 204 37 -212 -25 -15 -22 46 145 143 158 -227 -39 -10 0 253 -175 -126
7376a26J67j80L8J94j85j7N7Q6o6J22j14j16J20j1K36k09J91k84K56m0j23j94
$$ -126 41 -139 -101 93 -92 -109 -52 34 -32 90 -24 -140 -20 -31 205 -4 187 -97 159 119 -4 -198
7398a98R3J98m6q5j50K78J37k41o3o8n5K23J15jj60N1j7j00N9l0n2P7j55k8L04
$$ -198 -105 93 47 -38 -188 90 227 -14 -77 -145 -200 23 138 137 -23 28 11 -89 -30 -60 -112 -35 -190 -218 86
7423H6M2j8j07j7k41K41M9j3j1j5J05k68J39l6J3lj14R1J14P3p5N4J54k87j83
$$ 86 128 110 3 -14 -255 -14 35 22 11 -4 101 -167 -28 -64 -51 -54 -168 -77 37 110 35 89 243 -44 -227
7448b27K92LJ97k95J36j21q0P5R3k56J24k7P2K7J8p0o0M4q5L08Mj99o5pK97Nn0
$$ -227 65 68 265 -30 106 -15 -95 -20 73 -183 -59 -86 -14 13 31 -39 -99 -55 -140 168 172 -27 -92 -99 198 203 153
7475A53j95Nk09L10K4L9k41P7j7O3Q6k8o6N0r9J41j40p6J04lq2k3M7K14o1r4j06
$$ 153 -42 -37 -246 64 88 127 -114 -37 -54 9 95 67 1 51 -48 93 -47 -123 -19 -22 -104 -127 -80 134 73 -21 -127
7502a27J05K13k66J12j83K06o9K4j33J11q5K67k16J22j56MK47j13J18j67J32p7
$$ -127 -22 191 -75 37 -146 60 -9 15 -118 -7 -92 175 -41 81 -75 -71 176 63 181 14 146 69
7524F9j48R4l9J50j96L10m64M63j13Qk38J20l06L66J17j01j96k6J00J1J27k75
$$ 69 -79 15 -24 126 -70 240 -224 239 126 134 -104 16 -290 76 193 92 -104 -130 -30 -19 108 -167
7546a67K20m4N0l75L41j68J90mo3K25q9K2p1j48J42j06N2L8M0q0J99k96o8J36
$$ -167 53 9 59 -316 25 -143 47 43 -20 205 116 138 67 -81 61 -45 7 45 85 5 204 -92 -160 -24
7570b4K01j96K20j99p3J51n6O8p2kp8J65l1j87Q6m3J22r1J92o5Km6n1J3K66l91
$$ -24 177 -19 201 2 -71 80 24 92 20 18 -60 105 74 -113 -27 -70 52 -39 153 88 90 44 -7 6 272 -119
7596a19J81l4%J48j86M3k85L57%j81JK14J9o9j58j17J96J02j96J22j4j23K25j27
$$ -119 62 28 28 176 -10 33 -252 105 105 -76 -75 139 158 89 -69 -186 10 112 -84 38 24 -99 126 -1
7620ak9L9N3J5o8K9j02r4L01Nj78L99n47k1q6J89q6L55l32m1N25l46J69k59p4
$$ -1 -30 9 62 77 9 38 -64 -158 143 148 -30 369 -178 -199 -285 -96 -182 173 -159 -200 325 -21 148 -111 -185
7645a85J09J62l2n2q1n5Q3J49r0J51k19J07OJ43m7j89O2j65N5p0L73l09j95K85
$$ -185 -76 86 54 2 -79 -134 -51 98 8 159 -60 47 53 196 149 -40 22 -143 -88 -158 215 -94 -289 -4
7669dm6J40k3J74k95N9P7m2k61L99mj18k63L06O8l63M7J75P7k49J58j93M8K20
$$ -4 -50 90 67 241 -54 5 82 40 -221 178 174 56 -207 99 167 -196 -149 26 103 -146 12 -181 -133 87
7693H7J2J8j76M3J09k55J70m2Q8j29j50L51j24R0m8j31K22k81K26j64J27J19q4
$$ 87 99 117 -59 -16 93 -162 8 -34 54 -75 -225 126 2 92 44 -87 135 -146 80 -84 43 162 78
7716G8m7LL9N6j31j17P8pk7j12K49j61K15j09k67J30j0M15j60pk15q8M27k26k9
$$ 78 31 34 73 129 -2 -119 -41 -48 -75 -187 62 -99 116 7 -260 -130 -140 275 115 108 -107 -195 232 6 -23
7741b3r7k0K07p4J76m5l25J34J2P4j67J09rj28K13N3k22K7K30L6l8J05pl28J68
$$ -23 -120 -140 67 -7 169 124 -201 -67 -55 19 -148 -39 -48 -176 37 90 -132 -105 125 161 123 228 221 -107 61
7766F1r6J72o2k36J70l20K97o9jM9J12mj51N9N7j4P3j33K30k32J72k64J18J66
$$ 61 -35 137 75 -161 9 -311 -14 -83 -84 -35 77 73 -78 -19 38 24 97 -36 194 -38 134 -130 -12 154
7790A54k03j81L78l01J53J03n9j2n9J00L0l7j8j23J59J2J02k40R1q3j15Q3j51
$$ 154 -49 -230 148 -153 0 103 44 32 -27 73 103 66 48 -75 84 96 198 -42 49 -34 -149 -66 -217
7813b17J72L30j56k99k5K69k90J28R2k4J15p5Q3k23J48j64M7K71l72n1K57k2J03
$$ -217 -45 285 129 -170 -195 74 -216 -88 4 -20 95 20 103 -120 28 -136 -89 182 -190 -241 16 -6 97
7836I7j80N1J3L35m83J38M8j71J62j01R2N6J21r2j3J06k88M5J8J28j93J41NO6
$$ 97 -83 -32 -19 316 -167 -29 19 -152 10 -91 1 57 178 86 73 179 -109 -64 -46 82 -111 30 35 101
7860A01O6l58J02Q1N0k84k8J17K86j03j23K7R8l3J62L4l18N05k52J6j45J06k8
$$ 101 167 -191 -89 -8 42 -242 -270 -153 133 30 -93 -66 32 -1 161 195 -123 382 130 146 1 107 79
7883G9J29l9k78K53J18j72j73J03q1k4Q2Q9L7p0j02J1J0k11M2K00k2K0K22k91
$$ 79 208 169 -109 144 262 90 -83 20 -61 -85 -3 86 123 53 -49 -38 -28 -239 -197 3 -19 1 223 -68
7907f8QQ8K5j2%m3J35j55R5mj94L24j0n9j41n7J34l8L0k61K84Oj81k0J65j26k62
$$ -68 -60 28 53 41 41 -2 133 -22 73 69 -125 199 189 130 -11 -68 66 28 58 -203 81 87 -94 -114 51 -75 -337
7934c37R7J73p5J59J10l0j33L9RJ02l05K74J6j56k2K32O6k05p7O8Rk6j12K87j60
$$ -337 -240 -67 -142 17 127 97 -36 3 12 114 -191 83 99 -57 -79 153 219 14 -63 5 14 -12 -124 163 3
7959Cj0N5j75Q4J32j99oL01l3j62j68J47J58n5P7k84J49k73J46J88j10O5M3P5
$$ 3 -7 48 -127 -43 89 -110 -116 185 152 -10 -178 -31 127 72 149 -135 14 -259 -113 75 -35 30 73 148
7983A48j06k01J73O8r2n6J55l05L39p3o0j02j65K55rMj04J88P3rl74K85j03l1
$$ 148 42 -159 14 82 -10 -66 89 -216 123 50 -10 -112 -277 -22 -31 -27 -131 57 130 121 -253 32 -71 -102
8007a02n3K12r6j76O8K0J68J83m47J23j7K25N7j49J63j75k9J2j98J71n3R4J86
$$ -102 -155 57 -39 -215 -147 -127 41 224 -223 -100 -117 108 165 16 179 4 -25 -13 -211 -40 -93 1 187
8030A87j02o3J0j79o4j0P4L69k93J03j18Q7K8j07J41j76J88m9k94J33J75p3J86
$$ 187 85 22 32 -147 -211 -221 -147 222 -71 32 -86 1 29 -78 63 -113 75 26 -268 -135 40 -33 153
8053A53j59R1q1k9J82j25P6k34L6N5j2j04J06P8R8j93l2M7J40j94o9J35J2Q3n5
$$ 153 -6 85 4 -25 157 32 108 -126 -90 -35 -47 -151 -45 33 131 -62 -94 -47 93 -101 -170 -35 -23 60 5
8078Ek11k6L14k24Q8J26R0k10J2o5J46k9k16L02j96j40K56j25J22J59n26K90o0
$$ 5 -206 -232 82 -142 -54 72 162 -48 -36 -101 45 16 -200 102 -94 -234 22 -103 19 178 -348 -58 -118
8101a18K94O6k32J09j06K3P8j0o8N4o0q8r6o7m8K78P0k17NQM8j41K82J9q0o4J14
$$ -118 176 242 10 119 13 36 114 104 36 90 30 -58 -154 -221 -269 9 79 -138 -133 -125 -77 -218 64 83 3 -61 53
8128E3k53K85n7p4m0Q6m0j13J25K69k14j10K33l14O7k06L48j85K40l7o2j91J48
$$ 53 -200 85 28 -46 -86 0 -40 -153 -28 241 27 -83 150 -164 -97 -303 45 -140 100 63 1 -190 -42
8151d2j66K45J39l39P7J29L6J03k24K16j58M2J10j83j11K09Q6j93J12P5j70j22
$$ -42 -208 37 176 -163 -86 43 79 182 -42 174 16 58 168 -15 -126 83 169 -24 88 163 -7 -129
8173a29J36J2j5K74m18M24k08o2j00J32J99m25l1K13N4j6m6j46
$$ -129 7 19 4 278 -140 284 76 14 -86 46 245 -180 -211 2 56 40 -6 -152
8191a52
$$ Imaginary data points
##PAGE= N=2
##DATA TABLE= (X++(I..I)), XYDATA
0@%%%%%%%%qJ6j6J6k4L2m0N6o6P6r8J20j44J76k07K39k80L28l79M42n11N86o72
$$ 0 0 0 0 0 0 0 0 0 -8 8 -8 8 -16 16 -24 32 -34 42 -56 64 -80 96 -111 128 -152 176 -203 239 -272 314 -358
31c58P67q72R86j115J258j413J583j769J975k202K447k716L008l325L673m054
$$ -358 409 -463 523 -592 666 -747 836 -933 1042 -1160 1287 -1429 1579 -1746 1927 -2127
47b127M473m932N431n981O591p264Q013q851R793j0863J2088j3504J5170j7158
$$ -2127 2346 -2586 2845 -3136 3455 -3809 4204 -4647 5146 -5717 6371 -7133 8037 -9121
61i121J9580k2610K6519l1783L9292n0925P1509j18587M19386J55344m67950M55709
$$ -9121 10459 -12151 14368 -17415 21877 -29048 42461 -76126 343260 498604 30654 486363
73D86363j13998j78801K11133j33539k01874J69509k17698n9078J59972k19859
$$ 486363 372365 193564 404697 271158 69284 238793 21095 -37983 121989 -97870
83i7870j38694J56940j37770q5493J22138m3088q3671O0877K4683M829M7835N6656
$$ -97870 -236564 -79624 -217394 -302887 -180749 -223837 -307508 -246631 -221948 -217119 -169284 -112628
95a12628J020P6359N0975n7504J25573J72029j62956K0768K10141j62859K433
$$ -112628 -111608 -35249 15726 -41778 83795 255824 92868 113636 323777 160918 163351
106A63351K38213j90119j08554J70173j20633l3862Q9708j99615q721O9311j82914
$$ 163351 401564 211445 102891 273064 152431 118569 208277 8662 -59 69252 -113662
117a13662M8757N7599k08357N4881N7612j52384J07235M1031j38527J04784N0525
$$ -113662 -64905 -7306 -215663 -160782 -103170 -255554 -148319 -107288 -245815 -141031 -90506
128i0506p2174J13014J6657m4969J27849N699m6963Q7685L8660n898N962j1108
$$ -90506 -162680 -49666 -33009 -77978 49871 55570 8607 96292 134952 129054 135016 123908
140A23908L6233p781m5227N0943k6237q6629J7186K739m8918k6695j5667j7373
$$ 123908 160141 152360 107133 158076 131839 45210 62396 65135 16217 -10478 -26145 -43518
152d3518n9548k6642P3924n3731p6443Q0871k5767m2760R9990k7152k8009J01379
$$ -43518 -103066 -129708 -55784 -109515 -185958 -105087 -130854 -173614 -73624 -100776 -128785 -27406
164b7406n5682R940J40683p2653q083J24528p1637k356J13582o4407L297M3052
$$ -27406 -83088 -73148 67535 -5118 -13201 111327 39690 37334 150916 86509 89806 132858
176A32858r0503N5293L8828j26911M5756M1332j47778K6885P3244j05775k1015
$$ 132858 42355 97648 136476 9565 55321 96653 -51125 -24240 49004 -56771 -77786
187g7786L8794n1475k0232L1019l181j6404o938J0538J0838J8414K4933j5327
$$ -77786 -38992 -90467 -110699 -79680 -82861 -99265 -106203 -95665 -84827 -66413 -41480 -56807
199e6807K2147L4903k4739L7643N9444m8091Q385N3210l6976K4362K7397n2240
$$ -56807 -34660 243 -24496 13147 72591 24500 32885 86095 49119 73481 100878 48638
211D8638K9461L75o9333N9979L070j02448N3039Q693r8339M2542K6118p3679J2311
$$ 48638 78099 78474 9141 69120 72190 -30258 22781 31474 -66865 -24323 1795 -71884 -59573
224e9573Q835k9722K3733q508J472K5520k9286J3402M3023j6023J7643K5433k3892
$$ -59573 -50738 -80460 -56727 -65235 -63763 -38243 -67529 -54127 -11104 -27127 -9484 15949 -7943
237g943L0684K0119j7076L5522L18l1374K8976P344k4071J5005q797j7526k975
$$ -7943 22741 42860 25784 61306 61624 30250 59226 66570 42499 57504 48707 31181 28206
250B8206j8172R408n81l8576j113Q188k9869L161J3818j3039j6474k887K4594
$$ 28206 10034 19442 18861 -19715 -20828 -12640 -42509 -39348 -25530 -38569 -55043 -57930 -33336
263c3336j877j4005L6821l272l7724N4668K1157l8621M6532K536m1817N7369Q188
$$ -33336 -35213 -49218 -12397 -15669 -53393 1275 22432 -16189 30343 32879 -8938 48431 56619
276E6619m4140N1542j1376n4574N6924k568m8299L6387j7023m4703L6313j1172
$$ 56619 12479 64021 52645 -1929 54995 52427 4128 40515 23492 -21211 15102 3930
288C930k8428K8175l2802k4460M2120j5377k8145L7883p194l7195L2608K6825
$$ 3930 -24498 3677 -29125 -53585 -11465 -26842 -54987 -17104 -24298 -61493 -28885 -2060
300b060k5638L772L0523j9840k756M3433q428j6395L0442j2855j3358M3629j8184
$$ -2060 -27698 -23926 6597 -13243 -15999 27434 19006 2611 33053 20198 6840 50469 32285
313C2285k3902L6789k4666k4925M2924j8342l0643K7778k5690j4774L2117k8612
$$ 32285 8383 45172 20506 -4419 38505 20163 -10480 17298 -8392 -23166 8951 -19661
325a9661j1347K8100l4514n997M2397k7579j2252L4346j5671r978K8434K742q482
$$ -19661 -31008 -2908 -37422 -43419 -1022 -28601 -40853 -6507 -22178 -32156 -3722 -980 -9462
338i462R258M476L259L059P412M824o752L261K749m732O021L10j2885K951k241
$$ -9462 -204 4272 7531 10590 18002 22826 16074 19335 22084 17352 23373 23683 10798 13749 11508
353A1508j0745O951k462j0582k732l919K68K818q504K627K791j3558R971R885
$$ 11508 763 7714 5252 -5330 -8062 -11981 -11713 -8895 -17399 -14772 -11981 -25539 -15568 -5683
367e683q222M008M193k723Q871N40M061J1417j4498M347J9478j6077K664K0376
$$ -5683 -13905 -9897 -5704 -8427 444 984 5045 16462 1964 6311 25789 9712 12376 32752
381C2752k3280l447K2598k0685q90J8592k5520o183K0460j8659m679J8655k0419
$$ 32752 9472 6025 28623 7938 7048 25640 120 -6063 14397 -4262 -8941 9714 -10705
394a0705q684J7590o709n828J2419o950p020J2954j57j825J1077l972q323J5519
$$ -10705 -19389 -1799 -8508 -14336 -1917 -8867 -15887 -2933 -3090 -4915 6162 2190 -6133 9386
408I386L997j2154J4859L276k0308J3253J3281k2686R053J1698k7560P655J6615
$$ 9386 13383 1229 16088 19364 -944 12309 25590 2904 11957 23655 -3905 3750 20365
421B0365k3170K261J4370k5719K226J7999j9983Q58J3332j7886n51J6715j1082
$$ 20365 -2805 -544 13826 -11893 -9667 8332 -11651 -10793 2539 -15347 -15898 817 -10265
434a0265n0J0766j0531J821J1795m683M00R820q031j400J2747k083n634P722j364
$$ -10265 -10315 451 -10080 -8259 3536 -1147 -747 9073 1042 -358 12389 10306 4672 12394 11030
449A1030j0567R512L678j1780K683L056j2372K812Q221j2122p84M949r819M6Q758
$$ 11030 463 9975 13653 1873 4556 7612 -4760 -1948 6273 -5849 -6633 -1684 -11503 -11457 -2699
464b699o492l028N849m455L21N172J92n92J138m05J441L840J361N3p14J449q11
$$ -2699 -9191 -12219 -6370 -10825 -10504 -5332 -5140 -5732 -4594 -4999 -3558 282 1643 1696 982 2431 1620
481A620J319N276l525m358L933k318l134P348m746p449N807l156n163P849j861
$$ 1620 2939 8215 4690 332 4265 1947 -1187 6161 1415 -6034 -227 -3383 -8546 -697 -2558
496b558j1123P925R26p875P827K696r485M053O578o306L436O787o561J10P158
$$ -2558 -13681 -5756 -4830 -12705 -4878 -2182 -11667 -7614 -1036 -7342 -3906 2881 -3680 -3570 3588
511C588l694J60Q246o871l147Q181l924l134Q555o182p851R718l309n929Q533
$$ 3588 -106 54 8300 1429 -1718 6463 2539 -595 7960 1778 -6073 3645 336 -5593 2940
526B940m306r553R566n28q229R394j531j0532R316L631r780P805L956j0197O013
$$ 2940 -1366 -10919 -1353 -1881 -10110 -716 -2247 -12779 -3463 168 -9612 -1807 2149 -8048 -2035
541b035O707o552K626O676p610J779P147n633J047N720o946k156P952m949l043
$$ -2035 4672 -1880 746 7422 -188 1591 8738 3105 4152 9872 2926 770 8722 3773 730
556G30O321n744n537P258j426o334N233k544o133O807m06m870M893j15o425O683
$$ 730 7051 1307 -4230 3028 1602 -4732 501 -2043 -8176 -1369 -1775 -6645 -1752 -1867 -8292 -1609
572a609L233o048L560M273n292J770O150l259l14L775k560o10M088j590j576L032
$$ -1609 1624 -4424 -864 3409 -1883 -113 6037 2778 2464 6239 3679 3069 7157 5567 3991 7023
588G023l225k002L985o75m985K891j62n741L424J923n023KK085l972J410L146
$$ 7023 3798 1796 5781 5106 121 3012 2850 -2891 533 2456 -2567 -2565 -480 -4452 -3042 104
604A04l807O34K675l352J045N518l382j772N544k098k395O001lm643L764L72l423
$$ 104 -3703 -3069 -394 -3746 -2701 2817 -565 -2337 3207 1109 -1286 4715 4712 69 3833 4205 782
621G82L443J039m423J376J196m516K931K021o297R27L889n569J37N873n997j527
$$ 782 4225 5264 841 2217 3413 -1103 1828 3849 -2448 -1521 2368 -3201 -3064 2809 -3188 -4715
637d715M948k361j510N032k913k680N219k355j371N793k220m521O575Pn399O195
$$ -4715 233 -2128 -3638 1394 -1519 -4199 1020 -1335 -2706 3087 867 -3654 2921 2928 -2471 3724
653C724P58o423L528K682m854K320K123n840J975K140m238J625L115o539M32N386
$$ 3724 4482 -1941 1587 4269 -585 1735 3858 -1982 -7 2133 -2105 -480 2635 -3904 -3472 1914
669A914m996q06N399m224k499N581j546k249M437j836k452M511m81k727M414j047
$$ 1914 -3082 -3888 1511 -2713 -5212 369 -1177 -3426 1011 -825 -3277 1234 753 -1974 2440 1393
685A393l935M651J051m486L292J661n490K149L076l486J66K109l494K92L110l542
$$ 1393 -2542 2109 3160 -1326 1966 3627 -1863 286 3362 -124 42 2151 -1343 -1051 2059 -1483
701a483N17K476m018m17M442k531k306M235j829k496L541O55k508K092M44k592
$$ -1483 -966 1510 -2508 -2925 1517 -1014 -3320 915 -914 -3410 131 786 -1722 370 814 -1778
717a778K862O69k185J854M61l049K159K600m041J012K286l226p19L484j931j920
$$ -1778 1084 1753 -432 1422 1883 -1166 993 3593 -448 564 2850 -376 -1095 2389 458 -1462
733a462K370j115j227K019n88j819K511j287k000L537j36l260K416J274l535K176
$$ -1462 908 -207 -1434 585 -3 -1822 689 -598 -2598 939 803 -2457 -41 1233 -2302 -126
749a26K787l771M86K390k292L75K519k587J93K086k381l54L625k886j733L755
$$ -126 2661 -1110 -624 1766 -526 -151 2368 -219 -26 2060 -321 -675 2950 64 -1669 2086
765B086k174k245L847p12l807L150J07k894K613O97k983J828Q54k699K640J371
$$ 2086 -88 -2333 1514 802 -3005 145 252 -2642 -29 668 -2315 -487 367 -2332 308 1679
781A679m106J971K333l491J033L151l529m64L677k453o96K666k129j071L043j985
$$ 1679 -2427 -456 1877 -1614 -581 2570 -959 -1423 2254 -199 -895 1771 -358 -1429 1614 -371
797c71o99K890k080k443L608n27k802K978J60l635K751O98k477J592J123k998
$$ -371 -1070 1820 -260 -2703 905 378 -2424 554 714 -2921 -170 528 -1949 -357 766 -2232
813b232J592J263k542J823J073l010J142K863k950K40K777k426r35K789r67j045
$$ -2232 -640 623 -1919 -96 977 -2033 -891 1972 -978 -738 2039 -387 -1322 1467 500 -545
829e45J813j344j060J761k86j446J616m94k042K097L81k104J070J098k056N54
$$ -545 1268 -76 -1136 625 339 -1107 509 15 -2027 70 451 -1653 -583 515 -1541 -987
845i87K046k056L3J480j151o0J934j593l06J954j869n31K487q40j650K387m98
$$ -987 1059 -997 -964 516 -635 -695 1239 -354 -660 1294 -575 -1106 1381 541 -1109 1278 780
862G80j797J804K98j848R88P15j769J247R56j928N56R83j899N62K065k642N48
$$ 780 -1017 787 1085 -763 225 940 -829 418 1374 -554 2 985 -914 -352 1713 -929 -381
879c81J770j750n17K524j524j284K350r52j196K276n61j706K041n06j626K399
$$ -381 1389 -361 -878 1646 122 -1162 1188 236 -960 1316 755 -951 1090 584 -1042 1357
895A357k00k516J822P24k187J328J438k633N09J609j663Q5J736j903K67J748k093
$$ 1357 1157 -1359 463 1187 -1000 328 1766 -867 -358 1251 -412 -327 1409 -494 -227 1521 -572
912e72J95J981j664r11K555j569q54K321p86j914K301l34j382J789n84j425J621
$$ -572 -377 1604 -60 -971 1584 15 -839 1482 696 -1218 1083 749 -633 1156 572 -853 768
929G68J28j900J635L17k207J398R95j954P31J023j645r0J865j472j31J445j119
$$ 768 896 -1004 631 948 -1259 139 1134 -820 -89 934 -711 -801 1064 -408 -539 906 -213
946b13n96J776j008p02J739j271o44J917n09j585J857k59j531J544K70j435O47
$$ -213 -809 967 -41 -743 996 -275 -919 998 489 -1096 761 502 -1029 515 785 -650 -3
963cN95j426P74P46j246L59Q42j265J94J058p84n50J358q86q79J472k96r81J093
$$ -3 592 -834 -60 686 -560 -201 641 -624 -430 628 -156 -706 652 -234 -1113 359 63 -918 175
982A75J39j282J255Nr95R80L2j316J325O01j711O81P46j459M69J345j368j61J239
$$ 175 314 -968 287 292 -703 277 309 -1007 318 919 -792 -111 635 -824 -355 990 -378 -539 700
1001G00r92k27J193q81n61J422j003o63J691l78j350J395Q7j504J429L80j796
$$ 700 -292 -519 674 -207 -768 654 -349 -1012 679 301 -1049 346 433 -1071 358 738 -1058
1018a058J189N17j462R54P36j609Q97R56j877N27J347j772K06J595j754j06J709
$$ -1058 131 648 -814 140 876 -733 164 1120 -757 -230 1117 -655 -449 1146 -608 -714 995
1035I95j217m12J404j056n65J511p59n22J210l89j097J499k56j653J277N23j167
$$ 995 -222 -634 770 -286 -851 660 -99 -621 589 200 -897 602 346 -1307 -30 493 -674
1052f74O94O44j724J077P01j123L84P83j108M48N89j336M10J233j285m7J089q11
$$ -674 20 664 -1060 17 718 -405 -21 762 -346 102 691 -645 -235 998 -287 -334 755 -56
1070e6n65J143n50m99R54k93o44Q05q0p74P41R4q28O89N00j254O51N17j149L59
$$ -56 -621 522 -28 -527 427 134 -510 295 215 -559 182 276 -552 137 637 -617 34 551 -598 -239
1090b39Q06j055K69Q89q43j80J064q75j96J072m23q72J145m29q86J086k1r65P80
$$ -239 567 -488 -219 670 -173 -353 711 -164 -360 712 289 -583 562 133 -753 333 312 -653 127
1109A27J77j129P39J36n74O02M00j046M04J031j360K32O26o73l42J370q51k54
$$ 127 304 -825 -86 50 -524 78 478 -568 -164 867 -493 -261 365 -308 -650 720 -131 -385
1127c85J182j066q8R92p13o80J182l02p64J064j57q29Q92m6r60R99J8q89P57J03
$$ -385 797 -269 -357 635 -78 -758 424 122 -642 422 265 -564 328 282 -678 321 339 -550 207 310
1147C10p27K38Q82j235J70P60q99L63L47k72k69Q31q17r8J069r42j59J167p78
$$ 310 -417 -179 703 -532 -362 398 -501 -138 209 -63 -332 499 -318 -416 653 -289 -448 719 -59
1166e9n13J167n40k94M92j60m63P58M8j013O50L21q47N99L81r21L21N18o71N8
$$ -59 -572 595 55 -239 253 93 -370 388 436 -577 73 394 -453 146 527 -394 -73 445 -226 -168
1186a68N79n31j84O44l15l67O84l82k51O17j80m61P89j63q27R18k66n66N95M20
$$ -168 411 -120 -304 340 25 -342 342 -40 -291 326 146 -315 474 311 -516 402 136 -430 165 585
1206E85p24O4L13l82J27K79p63M07K79l10Q2M77n74l02P79l83l38Q47n54k95O85
$$ 585 -139 -75 238 -144 -17 262 -501 -94 185 -125 -43 434 -140 -442 337 -46 -384 463 -91 -386 299
1227B99r5o46O11P4o33N54J11n95L12L45r06M58N59q43Q6P69q11J63Q92j087P6
$$ 299 204 -442 169 243 -390 164 275 -320 -8 337 -569 -111 448 -395 -309 460 -351 -188 704 -383 -307
1248c07P85n70r8M98o7m61N69l07k62N05l20k95O58j77o25P03J31r52P87L05j013
$$ -307 478 -92 -190 308 241 -220 349 42 -220 285 -35 -330 328 151 -474 229 360 -592 195 500 -513
1269e13N31N86p18j49P52r91M22M72o43R4N76p33K46L79n04K4N14o69k65P92j05
$$ -513 18 604 -114 -263 489 -502 -80 392 -251 -157 419 -314 -68 311 -193 -169 345 -324 -589 203 98
1290I8m06N40R9n08K25K31o48L54M02p67L44N45q99M49K50o57M82J50l82jN23
$$ 98 -308 232 331 -177 48 279 -369 -15 387 -380 -36 509 -390 59 309 -348 134 284 -98 -99 424
1311D24q08J63N60o59Q3N99l68k24K82N2p06P11k02j74L76J44n99L06O06q54L37
$$ 424 -384 -221 339 -320 -237 362 -6 -230 52 104 -602 109 -93 -267 109 253 -346 -40 566 -288 49
1332D9K70o66P6O33m86j41P97p56P8O25p15O1N51k59m18N60k50l65Q05l21m68
$$ 49 319 -347 -271 362 -124 -265 532 -224 -146 479 -236 -175 376 117 -301 259 9 -356 449 128 -340
1353c40M96r7p7J87J40o16L47L73p76K45L61m82L10K14l98p8K54l18J51M26l37
$$ -340 156 59 -18 169 309 -307 40 413 -363 -118 243 -239 71 285 -113 -191 63 -255 -104 322 -15
1374a5k29M47l56j24O55j64o89Q45l10l23M29k48k90O06k97l12M66J33n32L79
$$ -15 -244 203 -153 -277 378 214 -475 370 60 -263 166 -82 -372 234 -63 -375 91 224 -308 71
1394G1K96p40M53K71n39R6M67n02j0L93m20k89O75k00j71O08m54l21N79l27k53
$$ 71 367 -373 80 351 -188 -92 375 -127 -137 256 -164 -453 222 22 -149 459 5 -316 263 -64 -317
1415c17N82j00j89R0J78m83J81J34m36J77L44m43J4P11m71l07P60p84J04M64k49
$$ -317 265 165 -24 66 244 -239 -58 76 -360 -183 161 -282 -268 443 -28 -335 425 -359 -255 209 -40
1436d0j13M89m64p8N72j53p15R02l61l47K22L42k66K62k25l13N25l5k97J21M81
$$ -40 -153 336 -128 -206 366 213 -502 400 39 -308 -86 256 -10 252 27 -286 239 204 -93 28 509
1457E09r92N43K65n15lP22n09k79M65m80J32M38m46k25N17r6l63N99k64j56N22
$$ 509 -483 60 325 -190 -193 529 20 -259 206 -274 -142 296 -150 -375 142 46 -317 282 18 -138 384
1478C84k23n43N31R7o15N17j01j10K50P3l45J65M29o55nM61m10p3M82l99q3M09
$$ 384 161 -382 149 246 -369 148 47 -63 187 260 -85 80 509 -146 -151 310 -100 -173 309 -90 -173 236
1500B36m34L08J22j63j36J55K11n86N77k68j96L83J56o22L51K59p62M67J17l33
$$ 236 -198 110 232 69 -67 88 299 -287 290 22 -174 209 365 -257 94 353 -409 58 175 -158
1520a58K08K31n88L17L08n55K74K09m35J10J87J87m45L85k50l22P06j82n11O83
$$ -158 50 281 -307 10 318 -237 37 246 -189 -79 108 295 -150 235 -15 -337 369 187 -324 359
1540C59j24n40N57L3l13J0J51k60J21M57o28J41N2j43J79K34l66j9L18k75k39
$$ 359 235 -305 252 285 -28 -18 133 -127 -6 451 -177 -36 16 -127 52 286 -80 -99 219 -56 -295
1561b95O02m93N5L83k54k46N00k69J38l0n3l76N10n8n88P75k8n12K43J53k71J32
$$ -295 307 -186 -131 252 -2 -248 252 -17 121 91 38 -338 172 114 -474 301 273 -239 4 157 -114 18
1583A8K97o08J95L20k90j87N56l86j15M08k30j69L40j85k30M74k13l44K04J59
$$ 18 315 -293 -98 222 -68 -255 301 -85 -200 208 -22 -191 149 -36 -266 208 -5 -349 -145 14
1603A4l69M15k4o0J33J09m78M77q9l68J57M87n33J84J01k36k4N34n08o1L29j60
$$ 14 -355 60 36 -24 109 218 -260 217 128 -240 -83 404 -129 55 156 -80 -104 430 -78 -139 190 30
1625C0l64O92o8n39L76j50j14J92K16p20M69J01l82L21q7j7O4K49m52K38J81m89
$$ 30 -334 358 290 -249 127 -23 -137 55 271 -449 20 121 -261 60 -27 -44 20 269 -183 55 236 -253
1647b53J30L82n59K55M76m40k42N12n49J13N06l19m04N99k12l21L07L59m70L20
$$ -253 -123 259 -300 -45 431 -9 -251 261 -288 -175 331 12 -392 207 -5 -326 -19 340 -130 190
1667A90M6n54M58K9o1j01K04m42j4N41n69P6L99k46j0Q6j60K3L35k65l2M00l68
$$ 190 236 -318 140 169 108 7 211 -231 -245 296 -273 -197 202 -44 -54 32 -128 -105 230 -35 -67 333 -35
1690c5r3N18l77l99L62N4n76P18j27j67K88M2o68L84L01k16k29L06j29K0L80l78
$$ -35 -128 390 13 -386 -24 30 -546 172 45 -122 166 208 -460 -76 225 9 -220 86 -43 -23 357 -21
1712b1N0j81p1J4N01j52l52M84r8k02R8Q7j48L90l64j06K07j49k69K41K71l27
$$ -21 29 -152 -223 -209 292 140 -212 272 174 -28 70 157 9 399 35 -71 136 -13 -282 -41 230 -97
1734i7L5K31l21K54J50m84J07L88j15j51L4J6j17K48j90j93J94Kj02K01p5l41
$$ -97 -62 169 -152 102 252 -232 -125 263 148 -3 31 47 -70 178 -12 -205 -11 -9 -111 90 15 -326
1756c26L58j15j54K46N1k01L86k04k39K51K46m16J17M06n43j19O99n46J06J53
$$ -326 32 -83 -237 9 60 -141 245 41 -198 53 299 -117 0 406 -137 -256 443 -103 3 156
1776A56q7k23N81n30o0L75l55k05L57O9m29J79J89l58M66j09j44N3O6p8L50l05
$$ 156 69 -154 427 -103 -163 212 -143 -348 9 78 -351 -172 17 -341 125 16 -128 -75 -9 -87 263 -42
1798d2k13N87k27j97N4K29j73O8J2j19n5M12m05l9L10k55l27M27j20l4M87m77
$$ -42 -255 332 105 -92 -38 191 18 86 98 -21 -76 336 -69 -108 202 -53 -380 47 -73 -107 380 -97
1820i7K9K74j29j4Q8j05l98K24M86m47Q9K08m02n5L14j33J76q8j23k42O50m13
$$ -97 -68 206 77 63 151 46 -352 -128 358 -89 0 208 -194 -249 65 -68 108 20 -103 -345 305 -108
1842a08J23K49l50j17J13K05j91J57k69PK29jk89J93L69m82L5L21m95K35K09j37
$$ -108 15 264 -86 -203 -90 115 -76 81 -188 -181 48 47 -242 -49 320 -162 -127 194 -301 -66 143 6
1864Fj87K96l12k08M75k38O3L15j99pj14L2j28N63k06l47M69j61m86K49K67k17
$$ 6 -181 115 -197 -405 70 -168 -105 210 11 4 -110 -78 -206 357 151 -196 273 112 -374 -125 142 -75
1886g5L57k61k74Q6L81m23K44J50l19J4K96j97M5Kj07q2L35k50l7J29m5K14j49
$$ -75 282 21 -253 -167 214 -209 35 185 -134 -120 176 -21 24 26 -81 -163 172 -78 -115 14 -31 183 34
1909C4k3k28L99k42k18K19R5k12J57n7o4R4qj37O5J94k66N9M23o4k64o5K63m16
$$ 34 11 -217 182 -60 -278 -59 36 -176 -19 -76 -140 -46 -54 -191 -126 68 -198 -139 284 220 -44 -109 154 -262
1933b62O54k40j00L47m09l34M33J30j89k1Q4l67K05K43j05J21r4l26J51J61j68
$$ -262 392 152 52 399 -10 -344 89 219 30 9 93 -274 -69 174 69 190 96 -230 -79 82 -86
1954h6K5P0k05J36K10k55r3N08l90k3J94j81q4K73L6l77L40n0j2j51J07l83K47
$$ -86 -61 9 -196 -60 150 -105 -198 310 -80 -103 91 -90 -174 99 135 -242 98 48 36 -115 -8 -391 -144
1977a44lP4l2K65n23M31oJ2J60N5l91J7L20k39J98k28M3j82L31k06N5j54K52j48
$$ -144 -147 -73 -105 160 -363 68 62 74 234 289 -102 -85 235 -4 194 -34 9 -173 158 -48 7 -147 105 -43
2001d3J20k63J89q0R6p2P9K13j67Q3N0l88J0L71l08J17J21j90NO4J6k12M34k50
$$ -43 77 -186 3 -77 19 -53 26 239 72 155 205 -183 -173 198 -110 7 128 -62 -57 7 23 -189 245 -5
2025el1O5J15l80L82j23r4J19r8r5K94Q1l06J51Q9l64L42M2m94K72J90j60q3J86
$$ -5 -36 29 144 -236 146 23 -71 48 -50 -145 149 230 -76 75 164 -200 142 184 -310 -38 152 -8 -91 95
2049I5l2k40L96m8m6M3j84J84J1P1m95J51j0K8j5J07j78L66j28m17N12k23j42
$$ 95 63 -177 219 171 125 168 -16 168 179 250 -245 -94 -104 -76 -91 16 -162 204 76 -341 171 -52 -194
2072a94K73m7j72J54p6j80J49K05k3j92K92j01k22P6J12n0J88j86j83M25k83K25
$$ -194 79 32 -140 14 -62 -242 -93 112 89 -103 189 88 -134 -58 54 4 192 6 -177 248 -35 190
2094A90j28J77j67j56K87k25O8j3j07J84r2O5N8nj92O7J15m3q4K72r1k55J98q6
$$ 190 62 239 72 -84 203 -22 46 33 -74 110 18 83 141 136 -56 11 126 83 -1 271 180 -75 123 37
2118C7k53L03j15r6k2J96l9q7J23l4K0on8J14o9l4L6j54m5K50L9k40k6K85k99
$$ 37 -216 87 -28 -124 -146 50 11 -76 47 13 33 27 -31 83 14 -20 16 -138 -183 67 106 -134 -160 125 -174
2143a74j3L99m53J71J36j86J18K33mn47K43j35J23K39r3j0K65o0m68J65l5Q4L8
$$ -174 -187 212 -241 -70 66 -120 -2 231 227 -320 -77 -212 -89 150 57 47 312 252 -216 -51 -86 -2 36
2166C6K44m10J52J54m79K41M70l70J10Q9l39J23R6Mj71K17J43m70P4n5K19r1K56
$$ 36 280 -130 22 176 -303 -62 408 38 148 237 -102 21 117 121 -50 167 310 -160 -86 -141 78 -13 243
2189B43k51j03J18O1j07j16M4K0K46l20K56j51l39L63J01j24p0J49n7o7K68l10
$$ 243 -8 -111 7 68 -39 -155 -111 -91 155 -165 91 -60 -399 -36 65 -59 -129 20 -37 -104 164 -146
2211a46j16L49p0j3K71l13Lj66K0K23Q7O2l89M1J29n3J22n1J5k1P6j02k43L09
$$ -146 -262 87 17 4 275 -38 -35 -201 -181 42 129 191 -198 -157 -28 -81 41 -10 5 -16 60 -42 -285 24
2235B4O3k40L27k92PK12k69l3M24l46k24M97k78n1J0J58k5R7P6k57J95l24M00
$$ 24 87 -153 174 -118 -111 101 -168 -201 223 -123 -347 150 -128 -179 -169 -11 -36 61 137 -120 75 -249 151
2258A51k3k36J09m5J86j10m8J6J10Q2o8p8m4K83l03%L09j00l66J63j12L8K02L3
$$ 151 128 -108 1 -44 142 32 -16 0 110 192 124 46 2 285 -18 -18 291 191 -175 -12 -124 -86 116 149
2282A49m6p9J97k10K4K7p4j50J68j25o0K09j68J20R7j40j69L52k8K08k38N5k77
$$ 149 103 24 221 11 35 62 -12 -162 6 -119 -179 30 -138 -18 79 -61 -230 122 94 302 64 119 -158
2305a58K79j75j64K53J70j99N8J30m26K82n2O9j74J40P7n13M25k02J14N8j05J35
$$ -158 121 -54 -218 35 205 6 64 194 -232 50 -2 67 -107 33 110 -403 22 -180 -66 -8 -113 22
2327B2Q6k6j3J32k45N4rj69K01K16j79J72j57m1q1R9L5N5N6k99p4L62r1N4j38
$$ 22 108 82 69 201 -44 10 1 -168 33 249 70 242 85 44 -37 62 97 152 208 -91 -165 197 106 160 22
2352B2K31j59l20J95j2L1L23l60J8j2K07l70K59j36M3k22K16k18L89K6l71K14
$$ 22 253 94 -226 -31 -43 -12 311 -49 -31 -43 164 -206 53 -83 -40 -262 -46 -264 125 151 -220 -6
2374fJ10j15J55P5o83K79O2p7K13M2j57p0N9N7m7Q5P7j80K38j92p1K57q9k19L37
$$ -6 104 -11 144 219 -464 -185 -123 -200 13 55 -102 -172 -113 -56 -103 -18 59 -121 117 -75 -146 111 22 -197 140
2399A40k34n8J67J18m37M06n8j63P0J43J83k02r0j45K30R4k88P5k9N0k0J57l06
$$ 140 -94 -152 15 133 -304 102 44 -119 -49 94 277 75 -15 -160 70 164 -124 -49 -78 -28 -48 109 -197
2422a97J45K34r1L4j21J0K30k71p3n4K30n3j58m4J09J7J32K39n37K12Qpr4L05
$$ -197 -52 182 91 125 4 14 244 -27 -100 -154 76 23 -135 -179 -70 -53 79 318 -219 -7 1 -6 -100 205
2446B05j31R4j18r2J01O1j01J85j56j56k07L94J3j45L50n64J52L49j32k12%K08
$$ 205 74 168 50 -42 59 120 19 204 48 -108 -315 79 92 -53 297 -267 -115 234 102 -110 -110 98
2468I8k40L9L04l25J40N0j34K42k46oJ8P6m3j9J75k17K05l17J40n4Q9P1l65O13
$$ 98 -142 -103 201 -124 16 66 -68 174 -72 -78 -60 16 -27 -46 129 -88 117 -200 -60 -114 -25 46 -319 294
2492B94k87m3K40j05l7J2j47J30j31K14l18K04l9J8j05K88l47J40L35l66j4K33
$$ 294 7 -36 204 99 62 74 -73 57 -74 140 -178 26 -13 5 -100 188 -159 -19 316 -50 -64 169
2514A69k80J74M8j16qk9J62j42j06P7K94j34j10j64J99O3k82M3J69j58J33J28
$$ 169 -111 63 111 -5 -13 -42 120 -22 -128 -51 243 109 -1 -165 34 97 -185 -142 27 -131 2 130
2536A30k82k6R0OJ55K22l02n8M2J52j75K01k32l9M5K08j15j39K47k30K21p4N7
$$ 130 -152 -178 -88 -82 73 295 -7 -65 -23 129 -46 155 -77 -116 -71 137 22 -117 130 -100 121 47 104
2559A04O8j57k00J97L01m35k6L14O3l69L13k53J11k8j79J61K9Q3k72K48lK9O5
$$ 104 172 15 -185 12 313 -122 -148 166 229 -140 173 -80 31 3 -176 -15 14 97 -175 73 70 99 164
2582A64j80k5l0J05P8K8Q1n4l20K70l46R8M78m52R8R5j21J2P4j66L5J29p4j2M96
$$ 164 -16 -41 -71 34 112 140 221 167 -153 117 -229 -131 347 -105 -7 88 -33 -21 53 -113 -78 51 -23 -35 461
2607D61l96l22K89p3j68K81o5m9J73j80j15J20J92j32j75M2J25j15K86j88p6Q5
$$ 461 65 -257 32 -41 -209 72 7 -42 131 -49 -164 -44 148 16 -159 -117 8 -107 179 -9 -85 0
2629@k40J70J81q6j88L07j9l5j99m0J61j26K06j99QK10j38j52j06K84M1l7Q4j22
$$ 0 -240 -70 111 25 -163 144 125 90 -109 -149 12 -114 92 -107 -99 111 -27 -179 -285 -1 40 3 87 -35
2653c5Kj63k05M29m0j01L08k85P8J06J20k76J23q7R1M5k62O6L89l68%j19J64j82
$$ -35 -33 -196 -401 28 -12 -113 195 -90 -12 94 214 -62 61 -26 65 110 -152 -86 303 -65 -65 -184 -20 -202
2677b02J72K19m33L42K29l18m8P4r9O3J93q2o4J11j42r2J26j15r1J20J25j13J40
$$ -202 -30 189 -244 98 327 9 -39 35 -64 -1 192 110 46 157 15 -77 49 -66 -157 -37 88 -25 115
2700A15k06K44k71L04l58L48l26J92q3J58k15K5J45k22J05K85l95K10J38k17J09
$$ 115 -91 153 -118 186 -172 176 -150 42 -41 117 -98 -73 72 -150 -45 240 -155 55 193 -24 85
2721H5o4M5j04K80l53J80n5k10Q4J25n8J73j5m9j55l3J54j8P0r9K01j76K67m15
$$ 85 21 66 -38 242 -111 69 14 -196 -112 13 -45 128 113 64 -91 -124 30 12 82 -17 184 8 275 -140
2745a40J64J25k90K31P1j21r2rJ67L7j88j81J32J55n9K0J07j74L3Lk9j17J13J24
$$ -140 24 149 -141 90 161 40 -52 -61 106 143 -45 -226 -94 61 2 22 129 -45 -12 -9 -38 -155 -42 82
2769H2l54L91m6n6J8J44m40L18L9p8N2j32Q4j18K29m4rm3J07j86lQ5j4l22L35
$$ 82 -272 119 73 17 35 179 -261 57 96 18 70 -62 22 -96 133 89 80 37 144 -42 -45 40 26 -296 39
2794C9o5k82M15L0jj91j31J26J72k15K49j39Rr6L50k63P2j82L7L07Kj42q7o6j46
$$ 39 -26 -308 107 137 136 -55 -186 -60 112 -103 146 7 16 -80 270 7 79 -103 -66 241 243 101 14 -52 -198
2819a98J28J34j80P1J37Pj43%k9M88k53k12j03R7K06j42Q8r2j30J52K36j18o3
$$ -198 -70 64 -116 -45 92 99 -44 -44 -73 415 162 -50 -153 -56 150 8 96 4 -126 26 262 144 81
2842H1k24M71k59p7J30j61j37J29M1l57L27P4k06J02O7J87j36j50K11nj99L99
$$ 81 -143 328 69 -8 122 -39 -176 -47 -6 -363 -36 38 -168 -66 1 188 52 -98 113 108 -91 308
2864C08j25m7j80J50j41N0J9K06k44N2n8j39M55k27j55L5J70k36l2K09j72J56
$$ 308 183 136 -44 106 -35 15 34 240 -4 48 -10 -149 306 79 -76 -41 129 -107 -139 70 -102 54
2886E4j56J27j98M22k93m6J57l10L62K3K5j12J27k43k2R3L6k95M32k0m86K67M5
$$ 54 -102 25 -173 249 -44 -90 67 -243 119 142 167 55 182 -61 -83 10 46 -249 183 163 -323 -56 -11
2909a1j00N0O3j33J53k32K45k10J26J29j64J38k93L45k59J00q6K83k41o9K1l4
$$ -11 -111 -61 2 -131 22 -210 35 -175 -49 80 -84 54 -239 106 -153 -53 -139 144 -97 -166 -145 -179
2931a79K93P5k2p9k25J31J15n4R5j9k73j78K27K92l00l1J54j5L7k19L01J01k21
$$ -179 114 189 167 88 -137 -6 109 55 150 131 -142 -320 -93 199 -101 -132 22 7 44 -175 126 227 6
2954Fr1k12L49K5k83J19J72l01K15n7J26M0J76j29p9J18n4k38K90k34j61K49j13
$$ 6 -85 -297 52 77 -206 -87 85 -216 -1 -58 68 108 284 155 76 194 140 -98 192 -42 -203 46 -67
2977f7j63J53j7m4k2J06N3n0J02q1o9L9J92Jo2k64LL22kj78j79L87j63L5j20r8
$$ -67 -230 -77 -94 -138 -160 -54 -1 -51 51 -30 -99 -60 132 133 71 -193 -190 132 130 -48 -227 160 -3 32 -88 -186
3003a86Q4P5p7J83J9j30J51o1j09K18j16L3j84J19J14k37m5J06k09J01J20r3j56
$$ -186 -102 -27 -104 79 98 -32 119 58 -51 167 51 84 -100 19 133 -104 -149 -43 -252 -151 -31 -124 -280
3026b80K31k54M37j51n5J51L4l45K66j54O1K09R2j83R3k18l0J89j41J13m17L27
$$ -280 -49 -303 134 -17 -72 79 113 -232 34 -120 -59 150 242 59 152 -66 -96 93 -48 65 -352 -25
3048b5r2J7k7Q2j61M66l03j29K28P2j19q7M3K45m21L15j31LK14j42j11L2J73k49
$$ -25 -117 -100 -127 -45 -206 260 -43 -172 56 128 9 -78 -35 210 -211 104 -27 -24 190 48 -63 -31 142 -107
3072a07k19M90k9n8j94j00J10N5J9J19N7n2j42l6J15j04L20l89M28Nk48Q8o4j15
$$ -107 -326 164 135 77 -117 -217 -107 -52 -33 86 143 91 -51 -87 28 -76 244 -145 283 288 40 128 64 -51
3096e1Q3k0MJ01k2o5J52k55J59k35J46n3J6J75Lr1pK1l1oL6m0J28l03nLL62k55
$$ -51 32 12 16 117 95 30 182 -73 86 -149 -3 -56 -40 135 138 47 40 61 30 24 60 20 148 -155 -160 -157 205 -50
3124e0JJ45K2k39j9J14J20j61K4R8K08l23M2J3M0l8J14N4k24l1Pj74K60m6N0K8
$$ -50 -49 96 118 -121 -140 -26 94 -67 -43 55 263 -60 -18 -5 35 -3 111 165 -59 -90 -83 -257 3 -43 7 35
3150C5N3q5J95j93R6m9j52O1j77M3j03K04J50j72j49L29k98M88o5l48K13O6j5
$$ 35 88 3 198 5 101 52 -100 -39 -216 -173 -276 -72 78 -94 -243 86 -212 276 211 -137 76 142 127
3173A27l01J83P9J88k71J27k76kK76j14j8J10j50m7K4PJ28q6J50j8O8m6m8p0j03
$$ 127 -174 9 88 276 5 132 -144 -146 130 16 -2 108 -42 -89 -65 -58 70 -16 134 116 184 138 90 20 -83
3198h3J60k68L14j1n6Nq0L50n83P7J88m5J97j87M9Q2M0l45K76nk45J08l7J88n7
$$ -83 77 -191 123 112 56 61 -19 331 -252 -175 13 -32 165 -22 27 109 149 -196 80 75 -170 -62 -99 89 32
3223C2l9%r7k1PM3J28p5j46M4j38L53j23J96k2j44j18J88o1M1J25l1j67q3pJ62
$$ 32 -7 -7 -104 -125 -118 -75 53 -22 -168 -124 -262 91 -32 164 142 -2 -120 68 7 48 173 142 -25 -108 -115 47
3249D7K06l87K03n9j12NQ5q8K7J25n3r7M16m23K0K43j79k1J17k7J00k29Q1n6K63
$$ 47 253 -134 69 10 -102 -97 -12 -100 -73 52 -1 -98 318 -105 -85 158 -21 -42 75 48 148 -81 0 -56 207
3274B07j15j18r1J72j30l1J72lk68J91R7j38K17j28j62P1k9l0N1M7qM7j38J91
$$ 207 92 -26 -117 55 -75 -106 66 63 -205 -14 83 -55 162 34 -128 -57 -86 -116 -65 -18 -26 21 -117 74
3298G4J02k12K82k02m5o3j22L38k44J7K68l27L99m03J13K48k11J11r4Q1r9J61
$$ 74 176 -36 246 44 -1 -64 -186 152 -92 -75 193 -134 265 -138 -25 223 12 123 29 110 11 172
3320A72j14r0k5K20j29J56o1J11j91o4j43P7J50j49J35p2PKJ88q1M9k73K56r6
$$ 172 58 -32 -57 163 34 190 129 240 49 -15 -158 -81 69 -80 55 -17 -10 -8 180 99 148 -125 131 35
3344C5n0j18J10J19Q8k2k82J20K5M5k31K39k01K13j67j4K77k77p3L02r2m0K52
$$ 35 -15 -133 -23 96 184 162 -120 0 25 70 -161 78 -123 90 -77 -91 186 -91 -164 138 46 6 258
3367B58k16o9J34j44N5j1O4j71L8K06k17m6J80K5j35M5p1L08l95J24Q6j5K1k48
$$ 258 42 -27 107 -37 18 7 71 -100 -62 144 -73 -119 61 86 -49 -4 -75 233 -162 -38 48 33 54 -194
3391a94K24mj13m2R0J71j48L06k73J64k95j5L4J19P9k1P3j36J0J79k08j82M00
$$ -194 30 26 -87 -129 -39 132 -16 290 17 181 -114 -129 -95 24 103 82 155 19 29 208 0 -182 218
3414B18k05j8n3L33j07j70j87K68j13J5k43K54M22m65j9kq6L74M3l78K47R8k06
$$ 218 13 -5 -58 275 168 -2 -189 79 -34 -19 -262 -8 414 -51 -70 -72 -158 216 259 -119 128 226 20
3437B0J18o6l6k02P2K17k05R4k03K24p9l9p3K82k25K99k97J25K1j09P1j7J82k7
$$ 20 138 72 36 -166 -94 123 -82 12 -191 33 -46 -85 -158 124 -101 198 -99 26 47 -62 9 -8 174 147
3461A47k72J6L95j10j56J27J79q5l31k63L24p7K33j89L31k74MN5Jl1J68k25N6
$$ 147 -125 -109 286 176 20 147 326 241 -90 -353 -29 -106 127 -62 269 -5 -1 54 55 24 192 -33 23
3484B3l8R5j83jo6L54q1J08k85R1Q6Kj17J74k60J92K60o21K55N0o0K66l01j1J59
$$ 23 -15 80 -103 -104 -170 184 103 211 -74 17 103 105 -12 162 -98 94 354 -267 -12 38 -22 244 -57 -68 91
3509I1k70K87k46K09p0J87k41Q0M2m6n4l3K02nq5p7l3N0NR8j26m6q2K25q5j04
$$ 91 -179 108 -138 71 1 188 -53 27 69 23 -31 -64 138 133 48 -29 -62 -12 -7 91 -35 -81 -163 62 -23 -127
3535a27JJ14M4L3k50j0K42j20J01j11L3P4J4J40j10J2l9j32J49j13J39q7J8J87
$$ -127 -126 -12 32 65 -185 -195 47 -73 28 -83 -50 24 38 178 68 80 41 -91 58 -55 84 -3 15 202
3559B02l32oJ00R7Rk39P6j34J33L23J19j77j84q2P7k09J57J00k7l1M09l33m3l9
$$ 202 -130 -136 -36 61 70 -169 -93 -227 -94 229 348 171 -13 -95 -18 -227 -70 30 3 -28 381 48 5 -34
3583c4J97j08j33J55N5j26K13o8o0o9p9K53j48q6j8q3J19q2O3J30k47j0J35J90
$$ -34 163 55 -78 77 132 6 219 151 91 22 -57 196 48 -38 -56 -139 -20 -102 -39 91 -156 -166 -31 159
3607A59k85K81m5j6J3j85Q2K5j85N0kJ04p6J02J44l78J70K26j64j39l7K79P7n8
$$ 159 -126 155 110 94 107 -78 4 29 -156 -106 -108 -4 -80 22 166 -212 -42 184 20 -119 -156 123 200 142
3631A42q7k38J68j21J34j03O3Kj14J76R8k23M9K73k59K75l33j10R1l6K32oJ01
$$ 142 55 -183 -15 -136 -2 -105 -42 -40 -154 22 120 -103 -54 219 -40 235 -98 -208 -117 -153 79 73 174
3654A74P8j60j83J40n8r2J74RQ4j00j31J7K0R1R7j66j09J97j52J4J10o9P0pj9
$$ 174 252 92 -91 49 -9 -101 73 82 166 66 -65 -48 -28 63 160 -6 -115 82 -70 -56 54 -15 55 48 29
3679B9N0J16m29K89k17P2L2J55k63M29k49j57q8J67n4R7k75J41J24M7J71j83J27
$$ 29 79 195 -234 55 -162 -90 -58 97 -166 263 14 -143 -231 -64 -118 -21 -296 -155 -31 16 187 4 131
3702A31j45p0J86k21J69Q4l13O0Oq6J05K27j43K18j93J01k28O9P6k47L20l41M75
$$ 131 -14 -84 102 -119 50 134 -179 -119 -113 -199 -94 133 -10 208 15 116 -112 -43 33 -214 106 -235 240
3725B40j00Kj79J23j06J25k20M8Q1R9k02K33O9k33J2J67J79l47k8j26J24J12l3
$$ 240 140 142 -37 86 -20 105 -115 -67 14 113 -89 144 213 -20 -8 159 338 -9 -37 -163 -39 73 40
3748D0M1n0O9J00J11j60K5k67J00K1k1R1O9l73J74R7p3M4K92j62k02O3m9k00Q9
$$ 40 81 31 100 200 311 151 176 -91 9 30 9 100 169 -204 -30 67 -6 38 330 168 -34 29 -20 -220 -131
3773a31k4O9J61J44k24L84j85k17O5J91l52R1n6O9K05k14P0j4k85P3m8K58J30
$$ -131 -155 -86 75 219 -5 379 194 -23 42 233 -119 -28 -84 -15 190 -24 46 32 -253 -180 -228 30 160
3796A60k84M3J03Mk16K0q0K71J72k14j40J05J17K59l33J01l23M13k25j11L98r6
$$ 160 -124 -81 22 26 -190 -170 -250 21 193 -21 -161 -56 61 320 -13 88 -235 178 -47 -158 240 144
3818A44k68J2K36l24M0M8K09o0m5N0k53K91j22%M0o8J61P5k20j3K62l36q0L07
$$ 144 -124 -112 124 -200 -160 -112 97 37 -8 42 -211 80 -42 -42 -2 -70 91 166 -54 -67 195 -141 -221 86
3842H6k0kJ60j50j85K19j52p2J14J74j17mj02j18J7J50J14q4j26K42L4k94K52
$$ 86 66 64 224 74 -111 108 -44 -116 -2 172 55 51 -51 -169 -152 -2 112 28 -98 144 178 -116 136
3865A36j97K6Q8l28M63j72K16k57J16o3J4q6K5o2J9J5l3K23j71l7o3N4J13Qo7
$$ 136 -61 -35 53 -275 188 16 232 -25 91 28 42 -44 -19 -81 -62 -47 -80 143 -28 -65 -128 -74 39 47 -20
3890b0o8J73l59J97j25K24q9r7L04j71N5k0N6j01Q5r1K76k72L4J01j58r4O4P6
$$ -20 -88 85 -274 -77 -202 22 -67 -164 140 -31 24 4 60 -41 44 -47 229 -43 -9 92 -66 -160 -96 -20
3914b0j2P2J25j64J31K12q2j08p0l06J00j6OL23n8j90K44m0j64K14l74K63j64
$$ -20 -32 40 165 1 132 344 262 154 84 -222 -122 -138 -132 191 133 -57 187 147 -17 197 -177 86 -78
3937g8J40rN0k13RJ01M2L1k7K11l07J6k39K11j02K0K05l9j8J3j81p5L53j76p2
$$ -78 62 53 103 -110 -101 0 42 73 46 257 -50 -34 -273 -62 -164 -144 61 22 4 17 -164 -239 114 -62 -134
3962a34K53k20K11J03P1j46k53Mm4L49J1k65K31k88L88j25j15k26L21Ol72M59
$$ -134 119 -101 110 213 284 138 -115 -111 -155 194 205 -60 171 -117 271 146 31 -195 126 132 -240 219
3984B19m77K43K5N4j0j99O7Q8l06M49k18J49k49J41J74n0o8mJ92m72J53L12j63
$$ 219 -258 -15 10 64 54 -145 -78 10 -296 153 -65 84 -165 -24 150 100 32 28 220 -252 -99 213 50
4007E0o7KQ5l59M47j86l5J78%q8l0J02m07K25jQ1j49J23P2P5j42k6n1K09j26r6
$$ 50 -17 -15 70 -289 158 -28 -63 115 115 27 -3 99 -308 -83 -84 -3 -152 -29 43 118 -24 -50 -101 108 -18 -114
4033a14J35m6M3p3J10j27N9J17Mk06K53q9j78J28O2q4r9K08j09m1j0j08L11k26
$$ -114 21 -25 18 -55 55 -72 -13 104 108 -98 155 66 -112 16 78 -6 -105 103 -6 -47 -57 -165 146 -80
4057h0m4K21k07K21J24m74M74m39J1O5K22p2m9j06j05L79k19l6N0k2MK58j89N9
$$ -80 -124 97 -110 111 235 -239 235 -204 -193 -128 94 22 -27 -133 -238 141 -78 -114 -64 -86 -82 176 -13 46
4081D6r2p4l8Q4L70m42J01J21j48J67J08j26Rk52L78k02k6j40K23p4P1Q0j43K5
$$ 46 -46 -120 -158 -74 296 -146 -45 76 -72 95 203 77 86 -166 212 10 -16 -156 67 -7 64 144 1 26
4105B6K19k34Q2K64m80J19j08N6J32q6j1Kq1N4Q1M5L3k95M45l14n0J62p4j69J16
$$ 26 245 11 93 357 -123 -4 -112 -56 76 -10 -21 -19 -100 -46 35 80 113 -182 263 -51 -101 61 -13 -182 -66
4130f6N6l5K48l06J1L3k22L82j24J35j46Rr6J91L6j27qk1Q3Q9j77K27k7o3k10
$$ -66 -10 -45 203 -103 -92 -59 -281 101 -23 112 -34 -25 -121 70 106 -21 -29 -50 33 122 -55 172 145 82 -128
4155a28L07j93J17j9j72N3J28j06MJ98l2k16K88j69M4j71j1K24l04J2j31L31k22
$$ -128 179 -14 103 84 -88 -35 93 -13 -9 189 157 -59 229 60 104 -67 -78 146 -158 -146 -277 54 -168
4178a68l2L88k34j1K24j33j17J93k51P7o4L08l66M41L5l62K56j03Q0j5O1k1j54
$$ -168 -200 188 -46 -57 167 34 -83 110 -141 -64 -128 180 -186 255 290 -72 184 81 161 146 207 186 32
4201C2j72J91l0J95m39M15M0j90N2k6m6j92J95j01M2N8R6q0p1Q1k23J67J50j99
$$ 32 -140 51 21 216 -223 192 232 42 94 68 22 -170 25 -76 -34 24 120 40 -31 50 -173 -6 144 -55
4225e5Q8l6J84l58M6J60j47M5M7k37M44l72J75Q0j71K16j43K6l9K26j99J40j33
$$ -55 33 -3 181 -177 -131 29 -118 -73 -26 -263 181 -191 -16 64 -107 109 -34 -8 -47 179 -20 120 -13
4248a3j36j21L01J72k41P2j21o7M20j95m66L88Pp2J10K05j81J43k94K38l88M05
$$ -13 -149 -270 31 203 -38 34 -87 -154 266 71 -395 -7 0 -72 38 243 62 205 -89 149 -239 166
4270A66j50K88nj88r0o5j1k4r8Q6ko7K2j53K77j44J37J83j39q2J2O3k18M00n0
$$ 166 16 304 299 111 21 -44 -55 -79 -177 -91 -93 -160 -138 -291 -14 -158 -21 162 23 -59 -47 16 -202 198 148
4295A48q7L7r4r2J64Rj64J06J3J23k62K99l22l1J55m5K7J64k77l5N3J49l8J17
$$ 148 61 98 4 -88 76 85 -79 27 40 163 -99 200 -122 -153 2 -43 -16 148 -129 -164 -111 38 0 117
4319A17j46m9o3M00k55n7K49n4k41O4q5Q5j3L45j97j56N1m0K44j45j79R0k88J28
$$ 117 -29 -78 -141 259 4 -53 196 142 -99 -35 -120 -35 -48 297 100 -56 -5 -45 199 54 -125 -35 -323 -195
4343a95L80j25Pr6o5J10q8L19m10J3M02j4j13j07j43N1M13k12J3Kj70K37m05J35
$$ -195 185 60 67 -29 -94 16 -72 247 -163 -150 252 238 125 18 -125 -74 339 127 140 142 -28 209 -196 -61
4367f1k4J50j02J16K13l61Q3j52O2jJ89k38M32m09J91k06P5n4J9m9O6k47K07Q3
$$ -61 -85 65 -37 79 292 -69 14 -138 -76 -77 112 -126 306 -103 88 -118 -43 -97 -78 -127 -61 -308 -101 -18
4391a8j3J1J66r0J04k91M03k40M7j65J77m6k81j8J54O1KJ95j50O7n9j49J80j4
$$ -18 -31 -20 146 56 160 -131 272 32 79 -86 91 45 -236 -254 -100 -39 -37 158 8 75 16 -133 47 33
4415C3K0K4j7l44L52l4j20L42k21k69K02j45K30K0p8j7P8j02P0p3J26n5kl6K43
$$ 33 53 77 60 -284 68 34 -86 256 35 -234 -32 -177 53 73 -5 -22 56 -46 24 -49 77 22 20 -16 227
4440B27R8m33K04Q1r5k74K38l2N5q7j56J08J75l43K16k30K47j70L45Q6l09j30
$$ 227 325 -108 96 177 82 -192 46 14 69 -18 -174 -66 109 -234 -18 -248 -1 -171 174 260 -49 -179
4462a79K62M2J40k4k85J82rj91Q0J3m6n9k48K12R5J90j66k3k29K16k82O02k17
$$ -179 83 125 265 241 -44 138 129 -62 18 31 -15 -74 -322 -110 -15 175 9 -14 -243 -27 -309 293 76
4485G6j7j25j08P9J52J8j84O6k50L42k53L40Q7j22p1m52L70P0k08K55J02k59M9
$$ 76 59 -66 -174 -95 57 75 -109 -43 -293 49 -204 136 223 101 30 -422 -52 18 -190 65 167 -92 -43
4508d3j0j27K93k77J10K16j78o4k9J82k27Q2N6O9m1m2rJ27p9J9n6QL6l3J17q5
$$ -43 -53 -180 113 -164 -54 162 -16 -80 -109 73 -154 -72 -16 53 12 -30 -39 88 9 28 -28 -20 16 -17 100 15
4534A5j32m8M66m32j40K79j54K15m7K09n13L68o4P6k1j23j99M93l49PJ78Jn2Q
$$ 15 -117 -165 301 -131 -271 8 -146 69 22 231 -282 86 22 98 77 -46 -245 248 -101 -94 84 85 33 41
4558D1l3j23J56K42k57q2N5J54j30j2l40M45m5j2j01J78o1J5n6k52J95N8k14K45
$$ 41 8 -115 41 283 26 -56 -1 153 23 11 -329 116 71 59 -42 136 75 90 34 -218 -23 35 -179 66
4582F6j10M8j01m8P1K87k43J2J8N0L3r0j21J93j09KL5Q8l02K30Q9J38j12p6o7
$$ 66 -44 4 -97 -145 -74 213 -30 -18 0 50 83 -7 -128 65 -44 -42 -7 81 -221 9 98 236 124 48 -19
4607a9K44l35J32k3j71O4k18K46O0k65L29j82Q6L80n56R0K68k08l10L71J72j47
$$ -19 225 -110 22 -1 -172 -108 -326 -80 -20 -285 44 -138 -52 328 -228 -138 130 -78 -388 -17 155 8
4629HPk0Q7k83K33p1K56k85k33J86J04J23j58K22j91K9J37k4l87L82j19j44R3
$$ 8 15 -5 82 -201 32 -39 217 -68 -301 -115 -11 112 -46 176 -15 14 151 127 -260 122 3 -141 -48
4652d8J23j43J0J35m5n5klO4j57K71K1K5k57Q7q1J17j96L42k53n0K85q4q7J9L5
$$ -48 75 -68 -58 77 32 -23 -25 -28 36 -121 150 171 196 -61 26 -55 62 -134 208 -45 -95 190 106 19 38 73
4678G3K42l13J6j00K65l34Q8N2J30j39k7J14j1Q3L0l83K99n8m15N38rq3k79K62
$$ 73 315 2 18 -82 183 -151 -63 -11 119 -20 -47 67 56 139 169 -214 85 27 -388 150 141 58 -221 41
4702D1l5K04J8j63n0r3pJ22Q7N2k34J47l04K39l5j06J61K48l07k35N24l07J5o4
$$ 41 6 210 228 65 15 -78 -85 37 124 176 -58 89 -215 24 -11 -117 44 292 -15 -250 274 -33 -18 -82
4726h2P8K59m11M2K34j16o5r4J65L5j09O0j0j07J70M0m10J21K79j51J52j25P6
$$ -82 -4 255 -156 -114 120 4 -61 -155 10 45 -64 -4 -14 -121 49 89 -321 -200 79 -72 80 -45 31
4749C1l2J17j97R6j16k09K54J28k3j23J76j22j63M3o6K30J02j19r0M4R0j67M26
$$ 31 -1 116 -81 15 -101 -310 -56 72 49 -74 102 -20 -183 -140 -206 24 126 7 -83 -39 51 -116 310
4772C10k78q7k2J26j37M7mQ9j25M00l83n7J44oj56K16l2k86J54K6J49j4j75m3
$$ 310 32 -55 -77 49 -88 -41 -45 44 -81 319 -64 -121 23 17 -139 77 45 -241 -87 -61 88 74 -101 -144
4796a44j17L52k47P2P7N7J2j1q1L4J19q9o9j4j1K68j69k17J22K8PK48l58J0K49
$$ -144 -261 91 -156 -84 -7 50 62 51 -30 4 123 34 -35 -49 -60 208 39 -178 -56 -28 -21 227 -131 -121 128
4821A28m03M32k65L75l50J23J30k26k46K57K43k10Mk30L51M9j13l08K00J13k03
$$ 128 -275 157 -108 267 -83 40 170 -56 -302 -45 198 -12 -8 -238 113 162 49 -259 -59 54 -149
4842a49J91K6kjP0n5K0k35M9L3j54L26k37K9O6k12K37M9K3q9K7J33l48L29j2j97
$$ -149 42 68 66 65 135 80 100 -135 -86 -53 -207 119 -118 -89 -23 -235 2 51 74 -15 12 145 -203 126 114 -83
4868h3J42o1m0J54L8L5j19j64K3n5J59M9k32m7J90k70K59j28O5N4J54j08O2J0
$$ -83 59 -2 -42 112 150 185 66 -98 -75 -130 29 78 -154 -201 -11 -281 -22 -150 -85 -31 123 15 77 87
4892H7K0n3q9K10N7n64N09k13Q3k79J17K75k57NRQJ53J67l68J18J28j8P6l2L5
$$ 87 107 54 -35 175 232 -332 177 -36 47 -232 -115 160 -97 -92 -83 -75 78 245 -123 -5 123 105 181 149 184
4917A84k14J0M1p7J00r0k8L18m07K55J0Ll34K83J09l53J09J15N1r2j17o5J81K04
$$ 184 -30 -20 21 -56 44 -46 -74 244 -163 92 102 105 -229 54 163 -190 -81 34 85 -7 -124 -189 -8 196
4941A96k42j22r8N04r8k43K46l70J63L71k8n01J79j15J39j35O0O4K8J88M3l32
$$ 196 -46 -168 -266 238 140 -103 143 -227 -64 307 279 -222 -43 -158 -19 -154 -94 -30 -2 186 229 -103
4963a03J58k6j08J2RJ40l37K0J89rk20J23o2L9J84j53K65j50k33K41j30L63l05
$$ -103 55 29 -79 -67 -58 82 -255 -235 -46 -55 -275 -152 -214 -175 9 -144 121 -29 -262 -21 -151 212 -93
4986i3J02j7J11k94J90K31j88m22M34p5J85l19J42j66K45j10l5L9R0r6J68k04
$$ -93 9 -8 103 -191 -1 230 42 -380 54 -21 164 -155 -13 -179 66 -44 -79 -40 50 -46 122 -82
5008h2Q7j23P5j5K37j75L44j07j71lk42J43j8r2j20R8J54L63l83j77L82J11l97
$$ -82 5 -118 -43 -58 179 4 348 241 70 67 -175 -32 -50 -142 -262 -164 -10 353 -30 -207 175 286 -111
5031a11K38k41o4K34j90K22J0J03k18o6J71j58L35k99q1J71l25L35j43o4q8K32
$$ -111 127 -114 -178 56 -134 88 98 201 -17 -83 88 -70 265 -34 -115 56 -269 66 -77 -141 -229 3
5053Cj29J17j56J34J01k4j7M4m8J22k22K5J34j19o4L52o8J03m09J86j91J14J6
$$ 3 -126 -9 -165 -31 70 46 29 73 25 147 -75 -50 84 -35 -99 253 185 288 -121 65 -126 -12 4
5076DJ57RP8l03K13k54J09j63J25r4j12K64j4o2j01K26l16J61J32l12J02L44l08
$$ 4 161 170 248 -55 158 -96 13 -150 -25 -119 -231 33 19 -43 -144 82 -234 -73 59 -253 -151 193 -115
5099a15K54k1j85J0j34k5L09q2q7j85K56R7j7j69K47K9j04K7r9q0J33J3m2N8N
$$ -115 139 118 -67 -57 -191 -216 93 11 -76 -261 -5 92 75 -94 153 182 78 105 6 -74 59 72 30 88 93
5124I3j0K8m09L18j27J39q0K10q3j04o1k34O82m66j11K04Q2k36K53k2R9j92K30
$$ 93 83 111 -298 20 -107 32 -48 162 79 -25 -86 -320 362 -104 -215 -11 71 -165 88 66 165 -27 203
5147B03o8L4j62N0j15J80k33kJ49k24J86J31J45m14J50O4l5j47R9M3j02J92m4
$$ 203 135 169 7 57 -58 122 -111 -113 36 -188 -2 129 274 -140 10 74 39 -108 -9 34 -68 124 80
5170H0J12j21J57k40LJ00j98L2N1o8K5K95k02J77l52P5k7J60N0M0j10J37m6k92
$$ 80 192 71 228 -12 -9 91 -107 -75 -24 -92 -67 228 26 203 -149 -74 -101 59 109 149 39 176 130 -162
5194a62OJ45O4q1J91j54j38K78o8jm15K49K53j00p8nj34K89ol63%J20K8Qn7j35
$$ -162 -156 -11 53 -28 163 9 -129 149 81 80 -335 -86 167 67 -11 -16 -150 139 133 -230 -230 -110 -82 -74 -131 -266
5220b66K53J70j47q7J86K8j85p9J96K15k06M2j04j4qk2J27l34K15r8o3K23M2J7
$$ -266 -13 157 10 -77 109 137 -48 -127 69 284 78 120 16 2 -6 -28 99 -235 -20 -118 -181 42 84 101
5244A01O4K6j30J41k71Kq8P7q6J57j4OP0M5j4M6k06M1J41K68k50o7R5m69L05J2
$$ 101 165 191 61 202 -69 -67 -155 -78 -164 -7 -21 -15 55 100 86 132 -74 -33 108 376 126 59 154 -315 -10 2
5270BR7j58n6R7P7Lj30j9K88k25J08Q8r4j49J89j82K36j55j51L8l7K41n5O2k59
$$ 2 99 -59 -115 -18 59 62 -68 -87 201 -24 84 172 78 -71 118 -64 172 17 -134 -96 -133 108 53 115 -144
5295a44K86j97K8QQr8J10J32l4j36N0k7P6q4M9N7J56r1j44k61K40K59j16O0k30
$$ -144 142 -55 -27 -19 -11 -109 1 133 99 -37 13 -14 62 -22 27 84 240 149 5 -256 -16 243 127 187 -43
5320d3J44j34j38K05L5k7r8K50k65k23L61L69m28N3j21J98k22P9O6j14J68r2N
$$ -43 101 -33 -171 34 69 42 -56 194 -71 -294 67 436 8 61 -60 138 -84 -5 61 -53 115 23 28
5343B8R8L3j24K86n8K2l59J40q0Q8K9L9p9j84L75k88J74k56K03N5k41M7o9J26
$$ 28 126 159 35 321 263 285 -74 66 -14 74 103 142 63 -121 254 -34 140 -116 87 142 -99 -52 -121 5
5367EJ29R1j46o1j43J30j7J14M5k9J33l17Kj16J05J18L3j27j9l3K65Mrm3m7j38
$$ 5 134 225 79 18 -125 5 -12 102 147 118 251 -66 -64 -180 -75 43 76 -51 -70 -103 162 166 157 114 67 -71
5393g1j95N70l10Q6M8m3n8R6j67p5M59o33M03k12j3J1J93j45k03L18k7Q3p5o6
$$ -71 -266 304 -6 80 128 85 27 123 -44 -119 340 -293 110 -102 -115 -104 89 -56 -259 59 32 115 40 -26
5417b6J71k0k19J8J9JP9l5R9n0n5J59m53M55Ml2k33J55K72m23J86j04J41l6l1
$$ -26 145 125 -94 -76 -57 -56 23 -12 87 37 -18 141 -312 143 147 115 -118 37 309 -114 72 -32 109 73 42
5442D2J42j99L6N5L2j34K1j08O4j38J08Q0j91K96j1j64J10j56J69R2j83p2M2K33
$$ 42 184 -15 21 76 108 -26 -5 -113 -49 -187 -79 1 -190 106 95 -69 41 -115 54 146 -37 -109 -67 166
5466A66l54j17M62J16j74o1j01k4rO0N0k94L83q8j31L30n25M18j51K66j36j04
$$ 166 -188 -305 157 273 99 38 -63 -87 -96 -36 14 -280 103 15 -116 214 -311 107 -44 222 86 -18
5488a8J24j02j58M38k70N3M7j16l2k73K58q4J41p3O3n6r1J52J77J27j48n24M71
$$ -18 106 4 -154 284 14 67 114 -2 -34 -307 -49 -133 8 -65 -2 -58 -149 3 180 307 159 -365 106
5511A06P0p1n1k8J04k97J29p0k2L11j62P9K0k18J95j78L18n07J10J27K3Pr9K15
$$ 106 176 105 54 26 130 -167 -38 -108 -130 181 19 98 118 -100 95 -83 235 -272 -162 -35 -12 -5 -104 111
5535A11J4j57j02K99R0m48L21P4l04K07R6j70m9L5J53j16j76K6p0K32n5j73J70
$$ 111 125 -32 -134 165 255 -193 128 202 -102 105 201 31 -18 17 170 54 -122 -96 -166 66 11 -162 8
5558Hm2J52j51K25l3j84MJ09j58K12k97K4L05k21J68j26K30j19j90J95j29j17
$$ 8 -34 118 -33 192 159 -25 -21 88 -70 142 -155 -131 174 -47 121 -5 225 106 -84 111 -18 -135
5580a35K88l93L81p9j58J44q7K6J75j09Q2j12j15P8r1N5J65p9j8L53n60J09K77
$$ -135 153 -240 141 62 -96 48 -39 -13 162 53 135 23 -92 -14 -105 -50 115 36 18 371 -189 -80 197
5603A97l91N9q5M64o3j99K16k84J9N8j71J30J11j96J11j99K84L5k34J10O5j72
$$ 197 -194 -135 -220 244 181 -18 198 -86 -67 -9 -180 -50 61 -135 -24 -223 61 96 -138 -28 37 -135
5625a35L12k14Q4j20M5J73m5J9j80P4l3K13l30K63l46M47n64M68k08M5L2N1p0
$$ -135 177 -37 47 -73 -28 145 100 119 -61 13 -20 193 -137 126 -220 227 -337 131 -77 -32 0 51 -19
5648a9J04q1K3j04JQ9K35j33J5J7m09K55o0K03m51N04j42P5r8m9P6k47N2K74Q
$$ -19 85 4 27 -77 -76 13 248 115 130 147 -262 -7 -67 136 -315 189 47 122 24 -25 51 -196 -144 130 138
5673A38j30r8K15k51K11Jk28J83N0l42K53j50J34K19j87ql44L08J31j74P7J14
$$ 138 8 -90 125 -126 85 86 -142 41 91 -251 2 -148 -14 205 18 10 -334 -26 105 -69 8 122
5695A22l4l5j30K92k47k15J50Q9n2j37K34l3m5K14l32K94j24l4J9J89q1r5K03
$$ 122 88 53 -77 215 -32 -247 -97 -8 -60 -197 37 4 -41 173 -159 135 11 -23 -4 185 104 9 212
5718B12m26J14K24l8j42R2j7j55O0j81J04J06N8l07L15j50J43k63K55MM4k68J46
$$ 212 -214 -100 124 86 -56 36 19 -136 -76 -257 -153 -47 11 -296 19 -131 12 -251 4 8 52 -216 -70
5741g0p4K61k45Q6j04RK09N9l0l16M45m71M13M7k13o8q2K30P6o6J01j78q2J32
$$ -70 -144 117 -128 -42 -146 -137 72 131 101 -215 230 -241 172 219 6 -62 -144 86 162 96 197 19 -63 69
5765F9j54O4np2J59p4j04K91k84P0L59l01j20q7J40J44l22J64L14l94J73j77l3
$$ 69 -85 -21 -26 -98 61 -13 -117 174 -110 -40 319 18 -102 -189 -49 95 -227 -63 251 -143 30 -147 -180
5788a80L75j82M8O8k71J82l3P0J6j3M2j55n1J9P9k50J76k89M48j15m1r2J31J11
$$ -180 195 13 61 129 -142 40 7 77 93 80 122 -33 -84 -65 14 -236 -60 -349 99 -16 -57 -149 -18 93
5812I3j51K07j67J12n3n0M1%k6k90K97Kn9KK4j60J65N4J2K05l89K16j40k46L57
$$ 93 -58 149 -18 94 41 -9 32 32 6 -284 13 15 -44 -42 -18 -178 -13 41 53 258 -131 85 -55 -301 56
5837E6n4J98k83j88L18J11k32L3l7K89k08Q2p7n2NL0Jj03L9J58j25k1r3R9K04
$$ 56 2 200 -83 -271 47 158 -74 -41 -78 211 3 85 8 -44 -39 -9 -8 -111 -72 86 -39 -60 -153 -54 150
5862A50L4n8K1l14JN4J13m7J83j27J11Lj70R0m7L9J21o2j90J47l1l56M95k50J27
$$ 150 184 126 147 -167 -166 -112 1 -46 137 10 121 124 -46 44 -3 36 157 95 -95 52 21 -335 160 -90 37
5887C7q6r9L28k01l2J17k40J60l2j29p3L32J07l71K16Jj64L73m43J73K19q7l9
$$ 37 -49 -148 180 -21 -53 64 -176 -16 -48 -177 -250 82 189 -182 34 35 -129 244 -199 -26 193 106 67
5910F7k35o5L10p5p1o8J52j84K24j03k48M82l13J28J10l07K54M4n2k28J8J11N0
$$ 67 -168 -233 77 2 -69 -137 15 -169 55 -48 -296 186 -127 1 111 -196 58 102 50 -178 -160 -49 1
5933Aj26K60j43N1J61k37K8k07M58j75k6Lk51K26N0j53O2K8k05j16L75J1k37Q6
$$ 1 -125 135 -8 43 204 -33 -5 -212 246 71 45 48 -203 23 73 -80 -18 10 -195 -311 64 75 -162 -76
5957g6J05K1l30L50P9k20J5R5Oj17K30m23L01J2M5l2K2M9j4k97P4J02Q2O7l39
$$ -76 29 50 -280 70 149 -71 -56 39 45 -72 158 -265 36 48 93 61 83 132 118 -179 -105 -3 79 146 -193
5982a93J24M6qJ54j26rr9J50n1J48k22J92j29J43Nm18K88J68l03q5J78Q3J75l19
$$ -193 -69 -23 -31 123 -3 -12 -111 39 -12 136 -86 106 -23 120 125 -293 -5 163 -140 -225 -47 36 211 -108
6006a08K56l19J43l87L76J14m1J8k8J05k18n8P6K10j82K1M9J32N7l73J90k44Q2
$$ -108 148 -171 -28 -415 -39 75 34 52 24 129 -89 -147 -71 139 -43 -22 27 159 216 -157 33 -211 -129
6029a29K54j45k4K51k67nK74n6l0Ok39q5l2N26m15L53l03k7K34j53J7j4q8K31
$$ -129 125 -20 -44 207 -60 -65 209 153 123 129 -110 -195 -227 299 -116 237 -66 -93 141 -12 5 -9 -97 134
$$ [...]
8191F6
##END NTUPLES=NMR FID
##END=
