##TITLE=1H_CA-8759-3x
 DMSO, 8 sc, 
 24.9.2020
##JCAMPDX= 6.0         $$ Bruker NMR JCAMP-DX V2.0
##DATA TYPE= NMR FID
##DATA CLASS= NTUPLES
##ORIGIN= UXNMR, Bruker Analytische Messtechnik GmbH
##OWNER= root
$$ XWIN-NMR		Version 3.5
$$ Thu Sep 24 09:57:27 2020 Russian Standard Time (UT+4h)  she@DPX200
##.OBSERVE FREQUENCY= 200.1315066352
##.OBSERVE NUCLEUS= ^1H
##.DELAY= (6, 6)
##.ACQUISITION MODE= SIMULTANEOUS
##.ACQUISITION SCHEME= undefined
##.AVERAGES= 8
##.DIGITISER RES= 18
##SPECTROMETER/DATA SYSTEM= spect
##.PULSE SEQUENCE= zg30
##.SOLVENT NAME= CDCl3
##.SHIFT REFERENCE= (INTERNAL, CDCl3, 0, 15.7039)
##AUDIT TRAIL= $$ (NUMBER, WHEN, WHO, WHERE, WHAT)
$$ ##TITLE= Audit trail, XWIN-NMR		Version 3.5
$$ ##JCAMPDX= 5.01
$$ ##ORIGIN= Bruker BioSpin GmbH
$$ ##OWNER= she
$$ F:/spectra/data/she/nmr/H-F/1/audita.txt
$$ ##AUDIT TRAIL=  $$ (NUMBER, WHEN, WHO, WHERE, WHAT)
(   1,<2020-09-24 09:56:31.06 +0400>,<she>,<DPX200>,
      <created by zg, POWCHK disabled, PULCHK disabled
       configuration hash MD5:
       00 E9 B6 7A A2 85 ED C7 34 08 36 98 17 FE 4E 26
       data hash MD5: 16K
       49 9F 63 F9 37 8E B2 68 CC AA E2 71 1D 31 B4 E6>)
$$ ##END=
$$ 
$$ hash MD5
$$ 13 51 74 C0 2D 56 9F 08 25 20 CD 7D 94 5F E4 A3
##$RELAX= 
##$RELAX= 
##$RELAX= 
##$RELAX= 
##$RELAX= 
##$RELAX= 
$$ Bruker specific parameters
$$ --------------------------
##$DU= <F:/spectra>
##$EXPNO= 1
##$NAME= <H-F>
##$PROCNO= 1
##$TYPE= <nmr>
##$USER= <she>
##$AMP= (0..31)
100 100 100 100 100 100 100 100 100 100 100 100 100 100 100 100 100 100 
100 100 100 100 100 100 100 100 100 100 100 100 100 100 
##$AQSEQ= 0
##$AQ_mod= 1
##$AUNM= <au_zg>
##$AUTOPOS= <>
##$BF1= 200.13
##$BF2= 200.13
##$BF3= 200.13
##$BF4= 200.13
##$BF5= 200.13
##$BF6= 200.13
##$BF7= 200.13
##$BF8= 200.13
##$BYTORDA= 1
##$CFDGTYP= 0
##$CFRGTYP= 5
##$CHEMSTR= <none>
##$CNST= (0..31)
1 1 145 1 1 1 1 1 1 1 1 1 1 1 1 1 1 1 1 1 1 1 1 1 1 1 1 1 1 1 1 1 
##$CPDPRG= <>
##$CPDPRG1= <>
##$CPDPRG2= <>
##$CPDPRG3= <>
##$CPDPRG4= <mlev>
##$CPDPRG5= <mlev>
##$CPDPRG6= <mlev>
##$CPDPRG7= <mlev>
##$CPDPRG8= <mlev>
##$CPDPRGB= <>
##$CPDPRGT= <>
##$D= (0..31)
0 1.2 0 0 0 0 0 0 0 0.06 0 0.03 0 0 0 0 0.0002 0 0 0 0 0 0 0 0 0 0 0 0 
0 0 0 
##$DATE= 1600926990
##$DBL= (0..7)
120 120 120 120 120 120 120 120 
##$DBP= (0..7)
150 150 150 150 150 150 150 150 
##$DBP07= 0
##$DBPNAM0= <>
##$DBPNAM1= <>
##$DBPNAM2= <>
##$DBPNAM3= <>
##$DBPNAM4= <>
##$DBPNAM5= <>
##$DBPNAM6= <>
##$DBPNAM7= <>
##$DBPOAL= (0..7)
0.5 0.5 0.5 0.5 0.5 0.5 0.5 0.5 
##$DBPOFFS= (0..7)
0 0 0 0 0 0 0 0 
##$DE= 6
##$DECBNUC= <off>
##$DECIM= 32
##$DECNUC= <off>
##$DECSTAT= 4
##$DIGMOD= 1
##$DIGTYP= 9
##$DL= (0..7)
0 120 120 120 120 120 120 120 
##$DP= (0..7)
150 150 150 150 150 150 150 150 
##$DP07= 0
##$DPNAME0= <>
##$DPNAME1= <>
##$DPNAME2= <>
##$DPNAME3= <>
##$DPNAME4= <>
##$DPNAME5= <>
##$DPNAME6= <>
##$DPNAME7= <>
##$DPOAL= (0..7)
0.5 0.5 0.5 0.5 0.5 0.5 0.5 0.5 
##$DPOFFS= (0..7)
0 0 0 0 0 0 0 0 
##$DQDMODE= 0
##$DR= 18
##$DS= 0
##$DSLIST= <SSSSSSSSSSSSSSS>
$$ [...]
##$SUBNAM2= <"">
##$SUBNAM3= <"">
##$SUBNAM4= <"">
##$SUBNAM5= <"">
##$SUBNAM6= <"">
##$SUBNAM7= <"">
##$SUBNAM8= <"">
##$SUBNAM9= <"">
##$SW= 16.880792210976
##$SWIBOX= (0..15)
0 0 2 0 0 0 0 0 0 0 0 0 0 0 0 0 
##$SW_h= 3378.37837837838
##$TD= 16384
##$TD0= 1
##$TE= 0
##$TE2= 300
##$TE3= 300
##$TEG= 300
##$TL= (0..7)
0 120 120 120 120 120 120 120 
##$TP= (0..7)
150 150 150 150 150 150 150 150 
##$TP07= 0
##$TPNAME0= <>
##$TPNAME1= <>
##$TPNAME2= <>
##$TPNAME3= <>
##$TPNAME4= <>
##$TPNAME5= <>
##$TPNAME6= <>
##$TPNAME7= <>
##$TPOAL= (0..7)
0.5 0.5 0.5 0.5 0.5 0.5 0.5 0.5 
##$TPOFFS= (0..7)
0 0 0 0 0 0 0 0 
##$TUNHIN= 0
##$TUNHOUT= 0
##$TUNXOUT= 0
##$USERA1= <user>
##$USERA2= <user>
##$USERA3= <user>
##$USERA4= <user>
##$USERA5= <user>
##$V9= 5
##$VALIST= <valist>
##$VCLIST= <CCCCCCCCCCCCCCC>
##$VD= 0
##$VDLIST= <DDDDDDDDDDDDDDD>
##$VPLIST= <PPPPPPPPPPPPPPP>
##$VTLIST= <TTTTTTTTTTTTTTT>
##$WBST= 1024
##$WBSW= 4
##$XGAIN= (0..3)
0 0 0 0 
##$XL= 0
##$YL= 0
##$YMAX_a= 442638
##$YMIN_a= -466342
##$ZGOPTNS= <>
##$ZL1= 120
##$ZL2= 120
##$ZL3= 120
##$ZL4= 120
##$ABSF1= 10
##$ABSF2= 0
##$ABSG= 5
##$ABSL= 3
##$ALPHA= 0
##$AQORDER= 0
##$ASSFAC= 0
##$ASSFACI= 0
##$ASSFACX= 0
##$ASSWID= 0
##$AUNMP= <proc_1d>
##$AZFE= 0.1
##$AZFW= 0.1
##$BCFW= 1
##$BC_mod= 2
##$BYTORDP= 1
##$COROFFS= 0
##$CY= 11.3945322036743
##$DATMOD= 1
##$DC= 2
##$DFILT= <>
##$DTYPP= 0
##$F1P= 16.9975609425685
##$F2P= -3.02152046262296
##$FCOR= 0.5
##$FTSIZE= 0
##$FT_mod= 4
##$GAMMA= 1
##$GB= 0.15
##$INTBC= 1
##$INTSCL= 1
##$ISEN= 128
##$LB= 0.24
##$LEV0= 0
##$LPBIN= 0
##$MAXI= 10000
##$MC2= 0
##$MEAN= 0
##$ME_mod= 0
##$MI= 1.114404
##$NCOEF= 0
##$NC_proc= 0
##$NLEV= 6
##$NOISF1= 3.799351
##$NOISF2= 2.8
##$NSP= 1
##$NTH_PI= 0
##$NZP= 0
##$OFFSET= 15.70392
##$PC= 1
##$PHC0= -9969.438
##$PHC1= 8.4009
##$PH_mod= 1
##$PKNL= yes
##$PPARMOD= 0
##$PSCAL= 0
##$PSIGN= 0
##$REVERSE= no
##$SF= 200.130013532006
##$SI= 16384
##$SIGF1= 3
##$SIGF2= 2
##$SINO= 400
##$SIOLD= 16384
##$SREGLST= <1H.CDCl3>
##$SSB= 0
##$STSI= 0
##$STSR= 0
##$SW_p= 3612.71676300578
##$SYMM= 0
##$S_DEV= 0
##$TDeff= 0
##$TDoff= 0
##$TI= <>
##$TILT= no
##$TM1= 0
##$TM2= 0
##$TOPLEV= 0
##$USERP1= <user>
##$USERP2= <user>
##$USERP3= <user>
##$USERP4= <user>
##$USERP5= <user>
##$WDW= 1
##$XDIM= 8192
##$YMAX_p= 0
##$YMIN_p= 0
$$ End of Bruker specific parameters
$$ ---------------------------------
##NTUPLES= NMR FID
##VAR_NAME=  TIME,          FID/REAL,        FID/IMAG
##SYMBOL=    X,             R,               I
##VAR_TYPE=  INDEPENDENT,   DEPENDENT,       DEPENDENT
##VAR_FORM=  AFFN,          ASDF,            ASDF
##VAR_DIM=   8192,          8192,            8192
##UNITS=     SECONDS,       ARBITRARY UNITS, ARBITRARY UNITS
##FACTOR=    0.000296,      1,               1
##FIRST=     0,             0,               0
##LAST=      2.424536,      0,               0
##MIN=       0,             -466342,         0
##MAX=       2.424536,      442638,          0
$$ Real data points
##PAGE= N=1
##DATA TABLE= (X++(R..R)), XYDATA
$$ [...]
1869D40j458R50R42q03l83j06N97O22j008p36J198P39j387n94J456J26q67l6r
1888c17N29K70j321M08J292m53j219M60R49l51p99R0O21M27p33q53J418M45j343
1907d80k91Q81K64j88n97m2J216r2j676P38J014l60j015M38P53k36o74l8N52N97
1927G64o12j057R33R39j383k85R79N9j52p97L97O84m5j106K32J052J00j384L27
1946c55P26j2m39o03O57R55r47j145J569O43j214n31P73M69j77n56m08J225R7
1965G27j345jJ454k94j104K75O26M3l51p55M69J083q14p08J071M07p54m23L46
1984d8L52M9q78r0J323j56j221J83J080k88o73J23L4N68j75j015O17R64o31j047
2004i29J225N01n26p75M35L10Lp26j25J200k63r32J52R61j03p69J5M92L87l16
$$ plain form
1869 440 -1018 -68 874 71 -312 -418 179 801 -207 -943 255 994 -393 -987 469 595 -272 -308 -317
1888 -317 212 482 -839 -431 861 408 -811 -351 598 247 -552 -462 159 586 -147 -1000 418 863 -480
1907 -480 -771 110 374 186 -411 -453 763 671 -1005 -267 747 387 -628 -190 563 327 -347 -385 167 764
1927 764 152 -905 28 967 -416 -701 278 337 185 -612 -215 469 424 -682 -450 602 702 -682 -355
1946 -355 371 359 -80 -683 -26 929 -18 -1163 406 1049 -165 -696 77 546 369 -187 -595 630 727
1965 727 -618 -619 835 541 -563 -288 338 381 30 -725 -256 827 13 -695 376 783 29 -394 -48
1984 -48 304 353 -525 -615 708 552 -669 -486 594 306 -367 -244 -210 358 183 -832 -215 749 118 -929
2004 -929 296 797 271 -504 -69 241 244 -482 -607 593 330 -602 -450 511 408 -361 -346 146 533 217
2024B17r36N15R03r24n01P58J16q0j14k31M13N23q40m34J277j91j209J69R97k18
2044B10l53p1Q2Q13m60q11M01P90m33j023R59M09k28m25k68O17M26r67m73J424
2064F19P9j036n6P97j46m01l74J26J128m75r67N64P62m73o84K38N84J66o37m75
2084f61P26O91r67n40J155K47j261K91M38K51l57k77J36O25l62p97N83O94m04
2103B11l80M5M05K14o88m79R86L77j090l40J029O4m36n4K40J05J06q32L0J088
2123F01m74p97O33N29k35o71K16JM28j73n46M81P40j109m26J009K76n82m5l26
2143d70Q41K9r53L37Q29l15r56N07P25l94m54L1M00M31o08o30O41M41p99j52Q88
2164C69L29j007j03L49M84j9q89p5J128k91q66K00O90k57k13p9j7O75n69m57P66
$$ plain form
2024 217 -719 -204 699 -225 -726 32 148 68 -46 -277 136 659 -181 -615 662 471 -738 -569 428 210
2044 210 -143 -214 -132 681 221 -590 -189 601 168 -855 104 513 285 -140 -408 209 635 -332 -805 619
2064 619 698 -338 -394 403 257 -144 -518 -392 736 261 -706 -142 620 147 -537 -299 285 451 -186 -661
2084 -661 65 756 -211 -751 404 651 -610 -319 119 370 13 -264 -128 497 135 -662 -79 615 211
2103 211 -169 -124 281 495 -193 -672 314 691 -399 -739 290 354 -82 -136 104 209 315 -517 -487 601
2123 601 127 -670 -37 492 257 -414 -198 -197 231 58 -488 -7 733 -376 -802 207 483 -99 -144 -470
2143 -470 371 400 -553 -216 613 298 -658 -151 574 180 -274 -243 157 588 -20 -650 -9 432 -367 -519 369
2164 369 698 -309 -412 -63 421 402 -487 -562 566 275 -591 -391 299 42 -171 -250 -267 408 -161 -618 148
2185A48M58q70k61O72J50q0l65K38N22j37q87r7R83l73o50N19M81k44m65q6J93
2206a51M64m58m03Q63J77p30j49N40M1k94j91L84M08r5j051K80R25l93l55k1M99
2227B90j98m2n11P92L53p16l50K43N05l55j00K62J25m1l79j98N87L06j136K51
2247c12R00l94m40K46K73j14j71m54K16O88n96j45K57M07l61k13K83J39L6m42
2267a97o8O75k33m94K62L87l95l9RJ81J84j62n64L54O25o97l34M47M86n14k15
2288c02K92K69p0k62j14O50j13o57j7L68o7j01j56M17L5r6j86K3O80p85Q5J34
2310B7J49k2l15J90N0k8j65k24N93N4p10K93L75j17j63j69L42K48o31j32M75M38
2332E58n02j50Q7R4ok62P2K01K40n77j7M14P7n04K68o5K79j95qp8K85k19l45L34
$$ plain form
2185 148 606 -264 -525 147 297 217 -148 90 612 475 -412 -509 474 101 -549 -30 451 207 -258 -344 -151
2206 -151 313 -145 -548 315 492 -238 -387 153 194 -100 -291 93 501 406 -645 -365 560 167 -188 -209 290
2227 290 92 50 -461 331 684 -32 -382 -139 366 11 -89 173 298 257 -122 -320 267 573 -563 -312
2247 -312 588 194 -246 0 273 159 -12 -466 -250 438 -158 -303 -46 361 0 -213 70 209 245 -197
2267 -197 -265 410 177 -317 -55 332 -63 -102 -93 88 272 110 -454 -100 525 -172 -506 -59 427 -87 -302
2288 -302 -10 259 189 -73 -187 463 350 -307 -324 44 -23 -124 -280 137 172 76 -110 -87 593 -192 -107 27
2310 27 176 154 -161 29 79 51 -114 -338 255 309 -401 -108 267 150 -13 -182 160 408 -223 -355 120 558
2332 558 56 -94 -7 87 81 -181 -109 92 332 -245 -262 152 229 -275 -7 -72 207 12 4 -74 211 -8 -353 -19
2356a9L20l67k05J63L3J97j52j04L96Mn33j54N87j8k2j31J02j67K99p48N13P2
2378F6L1j32J69K97l84l20M1L67L5k89j87N63J40p14P5K92l8m2O0m4K37j45l06
2401b28K19L45l62jn3L08l85N9L17j18Mp3k86N70J03o48k29N91j04j08j25m5M86
2424B37j67k47O9K44Lm18M14K82j25l16k00K44J21o5l42N13%l81J11J22J63l58
2446i6O7r0J39L6k22J1L03N7m38K00k1N3Q3Qo1K72l14m43M26K35m89J22O9L18
2470B25m64K16q7K21%k40K8M06j20n09J41L42K9j96l70K87N07n63k16M39M44p66
2492b46j3K30J73l26O4RM76q2l12P5M17m11r7m6PJ52p5k12Q0L31n26J39K48k3
2516C2j16Nop8J60n2j5L79j59l41kL74j65l8R2k29K54j52q3J45K42m02k67M43
$$ plain form
2356 -19 301 -66 -271 -108 -75 122 -30 -134 262 266 -267 -421 166 148 126 -5 97 -70 229 -519 -6 66
2378 66 97 -35 134 431 47 -273 -232 135 170 -119 -306 257 397 -317 -242 50 12 -30 30 -14 223 78 -228
2401 -228 -9 336 -26 -27 -80 228 -157 -98 219 101 105 32 -254 316 419 -229 -458 133 29 -79 -204 -249 237
2424 237 70 -177 -108 136 139 -279 135 417 292 -24 -224 20 141 76 -266 247 247 -134 -23 99 262 -96
2446 -96 -29 -119 20 56 -166 -155 148 205 -233 -33 -54 -1 82 90 29 301 -13 -456 -30 205 -284 -162 -93 225
2470 225 -239 -23 -110 111 111 -129 -101 305 185 -324 -183 159 188 -8 -378 -91 416 -147 -363 76 520 -246
2492 -246 -259 -29 144 -182 -118 -109 367 285 -27 48 465 54 -43 -89 -82 70 -5 -217 -137 194 -332 -193 55 32
2516 32 -84 -79 -85 -163 -3 -55 -70 309 150 -191 -193 181 16 -22 70 -159 95 -57 -140 5 247 -155 -422 21
2540B1L13m87JL0M50k09k45K2L75k91k28K10K33k52j79J23K78k85N9m6J89K51
2562C33m07J20K02L1k92j98K9L50J30m81j0O15m61o5o2K82m8j2p6J83R3k08l85
2585c37M59J21j42N0j59J23L9n0l83N78j58m71J07K81k26J74q3J03J66l32n7K73
2607G6J85k63j77K44K03m51J80O1j40m3O6J17J29j01k05m6L14j06K8J10j81KJ43
2630A45j98L6J20j50k79M47L8k11J41j44J80Q7k00r3K97q3k68m9L78k09m4N1J09
2653A01J9j79j62K24J31k64lJ85N7k03l0o6j9K88j46J21Q6j19m8P9L08l76j51
2676a67J71J22N5K8n44M20N8j91j67J95J28O4l06J35m2N8j11j12J87J11j37O1
2698A6L2L1j98J25j00L02k86O3O5P7j85k04M93j60Q5p6k94O20j33m29l1K87J3
$$ plain form
2540 21 334 -153 -152 -122 328 119 -126 -104 271 -20 -248 -38 195 -57 -236 -113 165 -120 -61 -107 82 333
2562 333 -74 46 248 279 -13 -211 -182 168 298 -183 -193 422 -39 -104 -166 116 68 56 -20 163 256 48 -337
2585 -337 122 243 101 151 -8 115 154 104 -279 299 141 -330 -223 58 -168 6 -77 26 192 -140 -197 76
2607 76 261 -2 -179 65 268 -183 -3 58 -82 -125 -59 58 187 86 -119 -165 149 43 71 181 0 2 145
2630 145 -53 -17 103 -47 -326 121 159 -52 89 -55 125 212 12 -81 216 133 -135 -184 194 -15 -59 -8 101
2653 101 120 -59 -221 3 134 -130 -133 52 109 -94 -124 -190 -209 79 -67 54 140 21 -27 52 360 -16 -167
2676 -167 4 126 181 209 -335 85 143 -48 -215 -20 108 172 -134 1 -41 17 -94 -206 -19 92 -45 16
2698 16 48 79 -119 6 -94 208 -78 -15 50 127 -58 -262 231 71 156 80 -214 406 273 -156 -187 100 113
2721A13k23L72l60K13R3l54K2K80k3l20m0L29p1k48K57p0n7Q0J5j81K31k08R4
2744e6K90k48l00K52L43j98J07k39N5J24J3l50P5K07j49j80K45o2N0Rl04M54n1
2767H7k92K6K47m5L6j04J0L1K11l32J8K12j36k48L25k6j10m3J05j07L6j57P3M36
2791B53k4j95j79J81J26k35J76j6K3p2j00J06L8N7j99K6K05m04j2J83J16L3j8
2814F9j38K10j84l36J87M09l09K3J06j54K10J12m59K35K35j41l25K79R9Q8k57
2835d1M5O1l0j47J04K20k17K1n2l1k3Q8q6J26K24l42j06J75J98l03R3J03o3J19
2859A36l28K24L3L3r4j67R0K02j69o6k9J50j16m2J79L13l94J9J48J95l65Q3L9
2882G4o4j04n8K08j7J6L4q9J82j73j05r3J58OQ5l25n4K46j01L37k44K00j16Kj26
$$ plain form
2721 113 -110 262 -98 115 208 -146 -124 156 133 -187 -227 102 31 -217 40 -30 -87 -7 8 -173 58 -150 -56
2744 -56 234 -14 -314 -62 281 83 190 -49 6 130 143 -207 -132 75 -74 -254 -9 -71 -21 -12 -316 138 87
2767 87 -205 -179 68 23 59 -45 -35 -4 207 -125 -107 105 -31 -279 46 20 -90 -133 -28 -135 -99 -256 -183 253
2791 253 229 34 -145 36 162 -73 103 87 110 38 -62 44 82 139 -60 -34 171 -233 -245 -62 54 87 69
2814 69 -69 141 -43 -379 -192 217 -92 -69 37 -117 93 205 -254 -19 216 75 -250 29 128 216 -41
2835 -41 4 65 35 -112 -8 212 -5 16 -36 -67 -90 -2 -88 38 262 -80 -186 -11 187 -116 -23 80 17 136
2859 136 -192 32 65 98 4 -163 -73 129 -40 -106 -135 15 -101 -143 36 349 -45 -26 122 317 -48 35 74
2882 74 10 -94 -152 56 39 55 89 0 182 9 -96 -189 -31 -25 60 -265 -319 -73 -174 163 -81 119 3 5 -121
2907a21K75l42J59K20q5k37N3q6L54n2j99J12Q6j70J51j31j76L56l0r6p1J20J79
2930B69l28k14K53j6k3L9N9L7j72k3L60j72k13J12p5J71K9l46K92n0J47j19j3
2953Dj19J38Q1k29O3R9r9N3J02j59k2j11J73Q9O1o2j20Q7K27n85M41p1j13K01
2977A29j39k4J50j00J29j56j2J4J04p4k04L14n1J97m48N3n7K14L0j15k49K92J01
3000I8q7P4j79P1Nj59K38N2j83k0o1J44p4J72q6j03l6k16M66l14N29m07J14K79
3024C17j95j37k7K90l83K40M2k08L42k96j12p0J07J0l08N94R4k84m5j71O2K96
3046A58k07j84L48jr7k6j75K34P8p8J68j54m2j72Q5J26q0qK43j68K3j81l5J75
3070C0k20NL31L1m33J45M0J29j56M60l41q0R5j23J6J86J40l67L12l35L4K13k31
$$ plain form
2907 -121 154 -188 -29 191 106 -131 -78 -164 190 138 -61 51 137 -33 118 -13 -189 167 137 41 -30 90 269
2930 269 -59 -273 -20 -36 -59 -20 39 76 -96 -119 241 69 -144 -32 -107 64 93 -253 39 -11 136 17 4
2953 4 -115 23 104 -125 -62 37 -62 -9 93 -66 -88 -199 -26 63 124 62 -58 29 256 -329 112 41 -72 129
2977 129 -10 -34 116 16 145 -11 -23 -9 95 21 -183 131 80 277 -171 -118 -175 39 69 -46 -295 -3 98
3000 98 11 85 -94 -23 -18 -177 61 113 -70 -90 -151 -7 -81 91 5 -98 -134 -350 116 -198 331 -76 38 317
3024 317 122 -15 -42 248 -135 105 147 -61 281 -15 -127 -197 -90 -80 -388 206 300 16 -29 -200 -138 158
3046 158 -49 -233 115 114 17 -9 -184 50 128 50 218 64 22 -150 -65 61 -19 -27 216 48 71 -110 -145 30
3070 30 -190 -185 146 177 -256 -111 -71 58 -98 362 21 -59 36 -87 -71 115 255 -112 200 -135 -101 112 -119
3093a19p6M06k89k0j8O7R3kk26K55j08J78j73J65p6l36K35n5J62k58J78q2L37
3116B38K3m86J13L04J31o28K97L89n28J56j12P4j06M2J2L47j12K2j72L93k91k37
3138a31K4N7q2k1j05N6K79k97j82L42L28m4j46q3j94J24Q3j99L34J13n19M03j16
3161B4J49j11k86L33l58N46l29k25M92p5k97K18l2r0L4M4l2J85k74L2K9K15j26
3184F6k77M10k41J17j75p0L15J61n64J49j9L36k17N4J76k49j15k30O05k28p5l29
3206d00M33J18m20L29M7j33K18k63j06K83J96m61J4K70l26l5J27M5O8J59k45J82
3228A00M7l4l04J73J05o4l0J03n6J47j08j96K64M9k01j19M74l47j55q0L81k28
3250g9J54l4n5j26P5j78Q3K85l0J3l43J84J06j23o1K78J53j16k22j42J40r9L21
$$ plain form
3093 -119 -195 211 -78 -98 -116 -49 44 42 -184 71 -37 141 -32 133 57 -279 -44 -99 63 -195 -17 -99 238
3116 238 261 -225 -112 192 323 -305 -8 381 -147 9 -103 -29 -135 -93 -81 266 154 176 4 397 106 -131
3138 -131 -107 -50 -132 -153 -258 -202 77 -220 -402 -60 268 224 78 -5 -199 -75 8 -191 143 256 -263 140 24
3161 24 173 62 -224 109 -249 297 -32 -257 235 160 -137 81 49 -41 -7 37 5 190 -84 -52 -23 192 66
3184 66 -211 199 -42 75 -100 -170 145 306 -258 -109 -128 208 -9 45 221 -28 -143 -373 232 4 -71 -400
3206 -400 33 151 -269 60 107 -26 192 -71 -177 106 302 -159 -145 125 -201 -236 -109 -64 4 163 -82 100
3228 100 147 113 -191 -18 87 23 -7 96 40 187 79 -117 147 196 -5 -124 350 3 -152 -232 149 -79
3250 -79 75 41 -14 -140 -65 -243 -160 125 95 108 -235 -51 55 -68 -129 149 302 186 -36 -178 -38 -137 184
3273A84p3K0J28m15K51j83J8l18K90L02k83M8R3M9K41n36J69P7J31m54J79K91
3295B09j17l33K14o4J45N8k33N4J60m7l05K51j79K73k07J41r5J6M69m66R4K69
3317C07m81K44J58k21P8j75RK32j31l88L02K31j90j07N0K70j94Ok27K90P0l05
3339a72K92J61j97j19Q2j7k8j13j99K45K60j99q0J75J73k16j62q1J84N5p0o0l1
3362a17M66l92j47K07O2l71K33K10k39M0m6p1K56mk55rM92l78L35m84Q0J40l5
3385b7k06K83L67o44Q8J22J70k24j03p5K39M7k55P7K69J27n55jO85k32j15j55
3407a18K09JJ82l61J14L53n41k76M86m1L4J11l49K93l0k8l35J70J22l97K31K12
3429D2k29J63j08j8M03p1n88M31K48m00j52L62j02J23r2o8p7K45j41k37K78P3
$$ plain form
3273 184 111 131 259 -156 95 -88 -70 -388 -98 204 -79 -31 62 111 352 -184 -15 62 193 -261 -82 209
3295 209 92 -241 -27 -91 54 112 -121 -67 93 46 -259 -8 -187 86 -121 20 -75 -59 410 -56 38 307
3317 307 -174 70 228 7 85 -90 -81 151 20 -368 -66 165 -25 -132 -82 188 -6 0 -227 63 133 -172
3339 -172 120 281 84 -35 47 30 2 -111 -310 -65 195 -4 -84 91 264 48 -114 -195 -11 44 -26 -86 -117
3362 -117 349 -43 -190 17 79 -292 -59 151 -88 -48 -94 -165 91 87 -168 -177 315 -63 272 -212 -132 8 -27
3385 -27 -233 50 417 -227 -139 -17 153 -71 -174 -249 -10 37 -218 -141 128 255 -300 -301 384 152 37 -118
3407 -118 91 92 274 -87 27 380 -161 -437 49 8 42 153 -196 97 67 39 -296 -126 -4 -401 -170 42
3429 42 -187 -24 -132 -150 253 182 -406 25 273 -127 -279 83 -19 104 12 -56 -133 112 -29 -266 12 85
3451H5l41J47J06J04r9l6j30K79l8mO3L1j79l00M62j65k11J80J13J48l9l03j9
3474a46L59j8n73N88k10QJ14j10k18L62j03m29L28J81p4j50K56l76K46p4k25K89
3496B5J79k55OJ96q4L0J9QP1j53l02J74L35l81j12L08J57k83j21K87j19J13j93
3519i5p9L10J46l33k53K54M6j43K02k17J76J91m49L2M42l56J05J90j86k5j66J74
3541c4P6o2J0l16N08J3l70J67L3O2j99K21j39J95R4m04k5M40l12p8M7O2j64J68
3565gR3l04L15M6j61P2J88m60j11M88j30J09l70K95j98L56k83o9L36l53N3L43
3587B48j44j71K41j20k6K52m63k31N40J14k88k1K51j89jP6j73K44L05n38J25J49
3609A80j77q4J02jj9M4j85K4K31l4k84K22K88p16M99J3k34J6j7j05M20k10k77
$$ plain form
3451 85 -256 -109 -3 101 2 -34 -164 115 77 73 136 167 -12 -312 150 -15 -226 -46 67 215 176 -127 -146
3474 -146 213 195 -378 210 0 8 122 12 -206 156 53 -376 -48 133 59 -91 165 -211 35 -39 -264 25
3496 25 204 -51 -45 151 67 97 116 124 195 42 -260 -86 249 -132 -244 64 221 -62 -183 104 -15 98 -95
3519 -95 -174 136 282 -51 -304 -50 -4 -147 55 -162 14 205 -244 -212 230 -126 -21 169 -17 -42 -208 -34
3541 -34 42 -20 -10 -326 182 195 -175 -8 25 87 -112 109 -30 165 259 -145 -170 270 -42 -120 -73 -11 -175 -7
3565 -7 86 -218 97 143 -18 54 242 -218 -329 159 29 138 -232 63 -135 221 -62 -131 205 -148 -95 248
3587 248 104 -67 174 54 28 280 -183 -414 126 240 -48 -69 182 -7 -8 68 -105 139 444 -94 31 180
3609 180 3 -81 21 20 1 45 -140 -116 115 81 -203 19 307 -409 90 103 -131 -115 -132 -237 183 -27 -304
3632c04n1M54q7j01j08M2L50n2m67J52L82k14k53J32M1j08m3K5M5K20j42M0Q9
3655D2O1m70L56J98k04lQ1j8K6pn5k90P17l12m81M21j64J75r8j99J37K13o2j11
3679d7K52o9n78M99j2j56J84J70m76N80j35l88j1K73N4m76M18qj42O2P6J21J7
3702B08m48oK99K32n05J49J01j73L3n5K60p6K39k35J5jn9l72M96m2j0k25M0R0
3726d5L67j65l35M85k17l14R6L34j51k2q6j25L31Qj72p1K71k04J2Q4p0j16K64
3749A59k07N9L14m07m8K62j77p2k8K69k16L68l50m6K42L8k21k35O44m17N7R8k20
3772a34J2k1j1L84k7k79K1K62j62J14O1j71J3K04m92Q5L87q9m31M12r4j04p0o1
3796a91M83j34p6j13J33J68m63K6L80j86l3J09k26J71R9m02q6P42j97m10j49N26
$$ plain form
3632 -304 -355 99 12 -89 -197 -155 195 143 -324 -172 210 -4 -257 -125 -84 -192 -235 -210 -165 55 -87 -47 42
3655 42 103 -367 -11 187 -17 -20 61 43 69 62 7 -283 434 122 -359 62 -102 73 -25 -224 -87 126 64 -47
3679 -47 205 136 -442 57 45 -111 73 243 -233 347 212 -176 -187 86 140 -336 82 74 -68 -6 70 191 208
3702 208 -240 -246 53 285 -220 -71 30 -143 -110 -165 95 19 258 23 38 37 -22 -394 102 60 50 -175 -135 -45
3726 -45 322 157 -178 307 90 -224 -128 206 55 33 -53 -178 153 161 -11 -82 189 -15 -3 81 11 -105 159
3749 159 -48 11 325 -82 -130 132 -45 -117 -145 124 -92 276 -74 -120 122 160 -61 -296 348 -69 -12 86 -134
3772 -134 -122 -143 -154 230 203 -76 -55 207 45 159 220 49 62 266 -226 -141 246 157 -274 138 44 -60 -130 -191
3796 -191 292 158 82 -31 102 270 -193 -167 213 27 -6 103 -123 48 147 -255 -341 401 204 -206 -355 171
3818A71N9j92j43k18L34j81l1M12K3l03k8K33k35j5J39k81M21j2l11j60N45j70
3840E7l66L56jJ80k56N7j11L12k18j58L17l3m09J71N1q9R3J40k06j79L72j73J2
3863h1L91m27J4K63k6P9o0j22k22M91l00k27L83j05J46Q3l60j72K08N9j09J42
3885D8P8m36J01L50k6j51K18k40M2j00%j66M77j44m00K10K13l0J45j59r9K84k85
3908g0J44J02N0m66L29j05p5J1L5j16L96p5n56K72L42q3m22L30o1mN9j23r3K81
3932A02R4l21J40Q2l39J64K37K6l2j56q7P7nj98J67k4l7Q9J31j77K04Q4l00M9
3956c0M09j91m22L66j34l83K68O8p6l2K09j01K06K4m17O4J51J32l18M07Q7j32
3978A55M4k93M3J71k05K21m4J13j84j67K43R1Q3m19K28J21k10k10L04L4j36j19
$$ plain form
3818 171 230 38 -105 -323 11 -170 -201 211 234 -69 -97 136 -99 -114 25 -256 165 153 -158 -318 227 57
3840 57 -309 47 46 226 -30 27 -84 228 10 -148 169 136 -273 -102 -51 -140 -47 93 -113 -292 80 -93 -81
3863 -81 310 -117 -103 160 134 213 153 31 -191 300 0 -227 156 51 197 280 -80 -252 -44 15 -94 48
3885 48 126 -310 -209 141 115 -36 182 -58 -16 -116 -116 -282 195 51 -349 -139 74 44 189 30 -69 215 -70
3908 -70 74 176 226 -240 89 -16 -91 -80 -45 -161 235 160 -396 -124 218 135 -287 43 -18 -22 37 -86 -179 102
3932 102 196 -125 15 97 -242 -78 159 185 153 -3 -90 -13 -18 -216 -49 -73 -110 -21 110 -67 137 221 -79 -30
3956 -30 379 188 -234 132 -2 -385 -117 -49 -125 -157 52 -49 157 181 -236 -172 -21 111 -207 200 287 155
3978 155 199 -94 -51 120 -85 136 92 205 21 -146 97 188 271 -148 80 201 -9 -219 85 119 -17 -136
4000a36J22l04L22j74m1M2M91m82o9N91l31r5j8J6j1m2j37j6M13r2m33N59k11
4023c6m5O6K10j35L0k06k60L43K80k88JK56k31J14n5K6j2L1n5k05K03m7Q9j87
4047a13K29k73K71O2m01N07k37k12J68K8k93J04M54j29k1j32n5L12j89q4k36L63
4069A23J06l28J72J32l29J99m9p2J34J92n10N04j57n00K39J73J51k16n8J66j38
4090f6K09j98k51L72p5R7k29K20j57N3j01L9K44J74m24k5M09n07R4L21r4q9j70
4113a54n4L24lp2n7J38Rk05k5K04P9J24l60r6M45k57o4L20j72l1K7j78q3K12j4
4138E7j92R2m6m0K84R2O9m76K65N6n1K57o33L45m7J08k48J28Rp4r9N48n37J95
4162F2O6n11N01K15n12k6K79k61J46J11P8K74l14l72L65K66l70k18J77j1q8J57
$$ plain form
4000 -136 -14 -318 4 -170 -211 -169 322 -160 -229 362 31 -64 -82 -66 -77 -119 -256 -272 141 49 -384 175 -36
4023 -36 -81 -15 195 60 90 -116 -376 -33 247 -41 -40 216 -15 99 44 70 58 89 34 -171 32 -15 74 -113
4047 -113 116 -157 114 176 -225 282 45 -167 1 29 -264 -160 294 165 144 12 -43 269 80 -4 -240 123
4069 123 229 -99 73 205 -124 75 26 -46 88 280 -230 274 117 -383 -144 29 180 -36 -94 72 -66
4090 -66 143 -55 -306 66 -9 88 -141 79 -78 -25 -126 -87 157 331 -93 -118 291 -216 -122 199 105 16 -154
4113 -154 -208 116 113 41 -16 122 131 -74 -99 105 184 308 -52 -148 297 40 -24 296 124 93 120 -58 -141 71 57
4138 57 -135 -43 -89 -129 155 247 316 -160 105 161 110 367 -266 79 32 140 -108 20 29 -45 -144 404 -133 62
4162 62 128 -383 118 333 -179 -205 74 -187 -41 70 148 422 108 -264 101 367 -3 -221 -44 -55 -143 14
4184A4m8p0K34j14n1L7j18j42L58j4MJ9j74j48N20k06k85O1J69j23K1M0L8N2q3
4209iR9J46q3j15O4j78J98j41j62K37j65N6Q2j51K37J66l03Q0k02J37J72k30Q4
4232A9M4q0l17M26j02l71K10K34K2k55M30q0Jj06j89n5L21p5r0j00K65l06K31
4255G7Q2j75j7K94l71P2J59k9k68L18k6q0j16L15n23J38J06j36M40j47l6j2N4
4278A19k15pJ19j17L9J49R9n4Q9l22M8K23k84j4m7L05l01L14j71j59J56Q3p0j79
4302a97R0J06k49M07l42J00K45k75L78p3k3j73J48j84M5q0K76j77N1l9K8K12K5
4325B99m06L12m8j26p3k20J05J59pk93L03J80j46j08K1P3j67J59LN1l1j48k07
4348c15O09k58j62J62J71n14J82K2K02j4R4l95K4L30m90J86M1K3j12J97P9j80
$$ plain form
4184 14 -34 -104 130 16 -35 2 -116 -258 100 86 90 109 -65 -213 307 101 -184 -123 46 -77 -56 -16 22 74 -9
4209 -9 90 236 153 38 102 -76 122 -19 -181 56 -109 -53 29 -122 115 281 -22 58 -144 -7 165 -65 19
4232 19 63 -17 -334 92 -10 -381 -171 63 85 -170 260 180 181 75 -114 -169 152 77 -13 -113 152 -154 77
4255 77 159 -16 -33 261 -110 -38 121 92 -176 142 116 36 -80 235 -288 -150 -44 -180 260 113 77 65 119
4278 119 -96 -103 16 -101 -62 87 186 132 221 -101 -53 170 -114 -128 -175 130 -171 143 -28 -187 -31 52 -18 -197
4302 -197 -107 -1 -250 157 -185 -85 160 -115 263 190 167 -6 142 -42 3 -77 199 22 73 34 62 274 299
4325 299 -107 205 157 31 -42 -262 -157 2 -5 -298 5 185 39 -69 -48 25 -142 17 20 71 40 -108 -315
4348 -315 294 36 -126 36 207 -307 -125 -103 99 85 179 -216 -192 138 -352 -166 -125 -102 -214 -17 62 -118
4370a18K02k94J2K52j35R3J18j56J78jm3l82M68k91j52K04L97k35J79j67m36M46
4392A39p6k43K91J0K9k01K73K2n37J67Q4M2J9J36p1j35L1ON3j25n2K95k66L5N2
4417b2m9k8l7Q3q3P1J11J63k08m7R8M9rn7k81M37k66j21K47J18k77k9L66j55j41
4442f7k3j31J64L40n96L42j67K43M6j39q1N5O9k85L05K4K43n30N01q1k84J48l50
4465b54L43J08k33k64M27J53l47PJ87j17rk4m29M21K28k41k5L13k16N2k37P8j21
4488b00L42k91K48p8j53r7L2L18l04R4K12j95J0N7k06L8L16l28J17Pj04Q3K10
4511A28k23J85l0j84J19j6P5m1kJ20m80N11k17jo5K54l73M43j06P9j77L57m70
4534a14P3m6N6J51q5J17l72J91k34P1L43N4l94K6K2K08J1j65N7K67j55j76ON2
$$ plain form
4370 -118 84 -210 -198 54 -81 12 130 -26 152 151 108 -274 194 -97 -249 -45 352 117 296 129 -307 139
4392 139 63 -180 111 121 150 -51 222 244 -293 -126 -42 0 19 155 84 -51 -20 -14 39 -86 -138 157 -109 -74 -22
4417 -22 -71 -99 -136 -53 -136 -65 46 209 1 -46 52 101 92 35 -246 191 -75 -196 51 169 -108 -137 229 74 -67
4442 -67 -90 -221 -57 283 -313 29 -138 105 151 12 -69 -14 55 -230 75 99 342 -188 313 232 -52 96 -254
4465 -254 89 197 -36 -300 127 280 -67 -60 127 10 1 -23 -452 -31 197 -44 -69 244 28 80 -157 -79 -200
4488 -200 142 -149 99 21 -132 -229 -197 121 -183 -89 123 -72 -62 -5 -211 -173 143 -185 -68 -61 -165 -82 128
4511 128 -95 90 60 -124 -5 -21 54 13 11 131 -349 162 -55 -56 -121 133 -240 203 97 176 -1 356 -114
4534 -114 -41 -87 -31 120 35 152 -220 -29 -263 -192 151 205 -189 -163 -141 67 78 -87 -30 237 82 -94 -88 -36
4558c6J54J36l53R0R5j81j17K40Q7j75K17k22n8P7N6K2l3M4r8R3q7j12J68j76
4582a69K54j54P8J14p1l4Om05L18K30r4j04N9m3Q3N9k82K21r9J31n6J30r0J7j88
4607h9J94o0K7j03l36N65m06K01J45K73m41O3K0l7M3J93j19m2k8k3p7J16j08L31
4631C02k74n5k02L48j47r0J98j17j14p0K02j4L6K3J81k45Kj10J27K04k32j67J99
4654a5J30j36K3R1q9j01L25m95J35J33k5n2lJ95k30J30J67k57J29q0j05K05o9
4677Fm3K0L86l76M5k51J27K20lK04n31M33l80L10o7l27K01j24K14P4j02k51J24
4700i1J63l17K06J31k58J90O7j82J41J29j05k44M66l92j7J23j30K43j32J36J32
4721B59L1k20j02J39j41o0J90J30k23j1K6j44P4K84k95O9J46j35K69o3k45O4j32
$$ plain form
4558 -36 118 254 -99 -9 86 -95 -212 28 115 -60 157 -65 -123 -46 10 32 -1 43 -55 38 -49 -161 7 -169
4582 -169 85 -69 9 123 52 18 24 -381 -63 167 73 -31 28 -15 68 127 -155 66 -33 98 42 172 82 99 -89
4607 -89 105 45 72 -31 -367 198 -208 -7 138 411 -30 33 53 16 59 252 133 91 63 40 -37 79 -29 302
4631 302 28 -27 -229 119 -28 -118 80 -37 -151 -221 -19 -33 3 26 207 -38 -36 -146 -19 185 -47 -214 -15
4654 -15 115 -21 2 93 4 -97 228 -267 -132 1 -24 -76 -79 116 -114 16 183 -74 55 -25 -130 75 6
4677 6 -37 -17 369 -7 38 -213 -86 134 131 335 -196 237 -143 167 100 -227 -26 -150 64 138 36 -215 -91
4700 -91 72 -245 -39 92 -166 24 91 -91 50 179 74 -170 296 -96 -113 10 -120 123 -9 127 259
4721 259 290 70 -32 107 -34 -94 96 226 3 -8 18 -126 -52 232 -63 6 152 17 286 223 -22 42 -90
4744i0K66N2j61m8j97J90O1j29m8L3n8l8N6J28O1l02J58p3o7L40M7p8k28J42O5
4769H2j23oJ74k06r3R8J25j60p0K36r1P2k92J82N9M50m23j09K87k64j98L26j33
4792g7k2J29k20L27n1K6q1K09l38m3J55J67k26J32k58N0K96K6k74m2k8K34l68
4815b77L09m5lp8n9l8M13m08K19j95J57k49N10j52n7K45l28L3Oo3j7O2k88J54
4839a49K20j7P9r9m1K1j36L66l13L1k00K06k14M34k5j83P8P1j72J2P4N9l6L0p4
4864B2j58M3k6P2K73l49J99J12k50m2KQ6l39L84j99J23J48n9l4L07l15j58qK17
4888E1O5N7j7j48j59RJ68J89j90q2k30L55n2J4Q0m03K93j80K05J18r1j2j04L21
4912B57m75N7LK92l70J90j50K27L6k3q3L8J18j98K78k05M1K4J50l4j46M1K1j00
$$ plain form
4744 -90 176 228 67 19 -178 12 73 -56 -104 -71 -129 -167 -111 17 78 -224 -66 -139 -206 134 181 103 -125 17 82
4769 82 -41 -47 127 -79 -172 -74 51 -109 -179 57 -34 38 -254 -72 -13 437 14 -95 192 -72 -270 56 -77
4792 -77 -99 30 -190 137 86 112 31 240 -98 -141 14 181 -45 87 -171 -121 175 201 -73 -115 -143 91 -277
4815 -277 32 -13 -16 -94 -153 -191 222 -186 33 -162 -5 -254 256 104 47 292 -36 -3 3 -60 -77 -15 -303 -149
4839 -149 71 54 133 34 -7 14 -122 244 -69 -38 -238 -32 -246 188 163 -20 58 129 -43 -31 43 102 66 96 22
4864 22 -136 -93 -119 -47 226 -123 76 188 -62 -104 -102 -16 -355 29 -170 -47 101 42 8 315 0 -158 -166 51
4888 51 116 173 156 8 -151 -142 26 215 25 -57 -287 68 16 30 110 -293 0 -180 25 143 52 40 -64 257
4912 257 -218 -161 -158 134 -236 -46 -196 31 67 44 -39 -1 117 -81 197 -8 33 57 207 173 27 68 89 -11
4936a1j01K77j36J06j63N0q4J70k09K94K0l45O2jK46m7k00RL19j29j45oJ58p1
4960F3L1Q9l22K78Qj6j05L5Q2k54L87l15l13J85K40j5k3oj33M8o9J71k84J95J17
4985G4j59L48k55o5P1j18J92mp0j96P4L4J7o8J61k03K17J5J53k76r4O4J93j67
5009f2J78j2l38K23m8J27k34J97k1Rl1K7o9K6n3R1R0j66K29l72J01l1J9j15M04
5034A69j91J30k97K49l0J46k09K27K32n10J9o8j35L80k8N0J72m63O3R7n4j45K30
5057C4p4o7N4j03Q6j22r9K70J39j60JJ04j41l0l5L63R9k87N1J29j97n7k7o1N5
5082g5K24n7j29K18j19l6p8O7j00K6R0k8P6M5k7LM6l84J31N9J4K26l52K76K0j39
5108ck8R3J5j28j4J84j85J53j92J91j20L30j38j14o3l1J09m32N49J2k27K17k97
$$ plain form
4936 -11 -112 165 29 135 -28 22 -62 108 -101 193 213 -132 -70 -71 175 128 -72 -63 256 127 -18 -24 134 63
4960 63 94 183 -139 139 147 131 26 61 143 -111 276 -39 -352 -167 73 58 35 29 -104 -56 -125 46 -238 -43 74
4985 74 -85 263 8 -57 14 -104 88 84 14 -182 -108 -74 -57 -125 36 -167 50 65 218 -58 -152 -88 105 -62
5009 -62 116 104 -234 -11 -59 68 -166 31 10 19 -12 15 -54 -28 -81 10 100 -66 163 -209 -108 -139 -120 -235 169
5034 169 -22 108 -189 60 30 176 -33 194 426 -84 -65 -133 -268 112 84 134 306 -157 -94 3 -51 -196 34
5057 34 -40 -107 -53 -156 -70 -192 -291 -21 118 -42 -41 63 -78 -108 -143 220 319 32 83 212 15 -42 -69 -130 -75
5082 -75 149 92 -37 181 62 26 -52 15 -85 -59 31 3 79 124 97 100 146 -238 -107 -48 -34 192 -160 116 136 -3
5108 -3 -31 62 77 -51 -65 119 -66 87 -105 86 -34 296 158 44 -19 -50 59 -373 176 188 -39 178 -119
5131a19j0J44k35K23J37n6l42K86k8O4M0m7M2r3J28K2k37m4j3K72N4j41r8J73
5155A22j42K57k06n6L5j10J71j15j44J65O4j40O7j53M49o45M46j31J79L7KP1j51
5178G2p7J04L6k20K91k19J42q3k07Q7J56O7l33K41O4n2j22L0J94m91M03l32L49
5201A00l6j0Q1j24J54j52j16p5MQ5J04m1J24k89L22j61k7p9P4J62j37J00k6p8
5225d1j17p9K35LK24l52K62j03k54L28r0q5m9J96j37k11J5L36j32nJ68k72R7q
5249g1n4O7L49m02L05j99j9Jj59L91j58j59J24J40k66J99j28j39M7K95q6Pm01
5272c16L97k11j2J32r1j58q0M59j02K08l80M4R7r0N0N6j16r2r2M58L9j09k05L43
5296B29k03j85K60q4K29l40n3M4K19k8q8K67l87J49O6n8k2J1j6L1j52q8M4J02
$$ plain form
5131 -119 -129 15 -220 3 140 84 -258 28 0 64 104 57 99 6 134 156 -81 -125 -138 134 188 47 -51 122
5155 122 -20 237 31 -25 10 -100 71 -44 -188 -23 41 -99 -32 -185 264 -381 65 -66 113 150 152 223 72
5178 72 -5 99 135 -85 206 -13 129 46 -161 -74 82 149 -184 57 121 69 -53 -23 171 -320 83 -249 100
5201 100 64 54 135 11 165 13 -103 -178 -174 -89 15 -26 98 -191 131 -30 -57 -136 -62 100 -37 63 37 -41
5225 -41 -158 -237 -2 1 225 -127 135 32 -222 106 16 -69 -118 78 -59 -270 -255 81 -51 -56 112 -160 -63 -71
5249 -71 -125 -58 291 -111 194 -5 -24 -23 -182 209 51 -108 16 156 -110 89 -39 -178 -131 164 78 85 -316
5272 -316 81 -130 -142 -10 -101 -259 -339 120 18 226 -154 -110 -13 -103 -53 3 -113 -205 -297 161 200 91 -114 229
5296 229 26 -159 101 17 246 -94 -147 -103 116 88 0 267 -120 29 95 37 15 26 10 41 -111 -199 -155 -53
5320e3J87P5q7j56j48J05J16j30K40l68K93k57L37J6%k19qJ54n8j26M2Rl5K5o6
5345a12j9K50O9k92J48O1m6L1j06k39K44J75n3R2J48m25K28k9k47R8J52r0k52
5368b14J97q6pJ0K46rp3J01j75J68j2P8j07l4j78K21p7L1l9M17n10J89j70j37
5392a70L00j59J42o7j12J27k37J87m6J12j2r1q3k7R0n8k5k6J99n2J15r1K66m58
5416a76K07k60K34J33nk46O7N4K00l01L09o8K8k09n5P3k11K67J26m31K11Kk12
5439b63J83K36R3k33q9K45k61R5K22l54P7L0k9L45l76J20J30k09j13J95l7r7j8
5462a08J3j17J39J25j93K27k14K07j51j2j40J01J70R8k05P9R8l43K53j42r6L33
5484A22j04n0L5O7j9r4J64k39J14R0j01o2J33Rm4J51q3K11k77k32L35k28k0K23
$$ plain form
5320 -53 134 209 122 -34 -182 -77 39 -91 149 -219 74 -183 154 170 170 -49 -57 97 39 -87 -45 -36 -71 -46 -112
5345 -112 -131 119 188 -104 44 105 59 90 -16 -255 -11 164 111 203 351 -74 154 125 -122 -24 128 38 -214
5368 -214 -17 -103 -110 -100 146 137 64 165 -10 158 146 224 117 83 -95 126 49 80 41 458 -52 137 -33 -170
5392 -170 130 -29 113 46 -66 61 -176 11 -35 77 65 -26 -109 -136 -46 -104 -129 -155 44 -8 107 16 282 -176
5416 -176 31 -229 5 138 133 -113 -46 8 208 -93 216 148 176 -33 -88 -15 -226 41 167 -264 -53 -51 -263
5439 -263 -80 156 249 16 -73 172 -89 6 228 -126 -49 -19 -48 297 -79 41 171 -38 -151 44 7 -90 -108
5462 -108 -95 -212 -73 52 -141 86 -128 79 -72 -84 -224 -123 47 145 -60 19 117 -226 27 -115 -211 122
5484 122 18 -32 3 70 51 -43 121 -118 -4 86 -15 -77 56 65 21 172 89 300 23 -209 126 -102 -122 101
5508A01j05j46J10K54q7j95J16J17j38J21j58J62m0J41p8r0p7N3J04k30j12J55
5530b2l8K0J46p1M6k9j73K58k35J43J7L6j59oP7R2k80p9J59J33j43j11K73l27
5554b73J34L99m21K4Q5K0PJ08j72K24n5j80n0K04R5Kk21J2J31j89LJ64R2j73j18
5579a48J74M4L9N5l04K84m0j46P7mm5O1j49l4K39p8L7r6R%j89K80r4OJ34j02J04
5606A14j62l5J34j16K28k32J3n2j4P8M2n9L2P1j43K92k91l3J36r9l3K40k59m9
5630a97L46k14JJ84j68j8J80j47k1m8Q3P8p8L5K07n06N43l17j9K06oJ43l39J77
5654A05j92N8J88l27J56n6Q5M03m42K66l20Q3j61K45j64J01l1l0N8J28J0j35j31
5677a03%K90l15J61p1R5p5J4Q2J9j97j10M08j80K17k25k54L4K22k29K91k34J76
$$ plain form
5508 101 -4 -150 -40 214 127 -68 48 165 27 148 -10 152 112 253 175 85 8 61 165 -65 -177 -22
5530 -22 -60 -40 106 35 81 52 -121 137 -98 45 62 98 -61 -67 10 102 -178 -257 -98 35 -108 -219 54 -273
5554 -273 -139 260 -161 -137 -52 -32 -25 83 -89 135 80 -100 -150 54 149 151 -70 -58 73 -116 -113 51 143 -30 -148
5579 -148 26 70 109 164 -140 144 104 -42 35 31 -14 47 -102 -136 103 25 62 -34 -25 -25 -214 66 -28 -22 112 10 114
5606 114 -48 -83 51 -65 163 -69 -56 -108 -122 -44 -2 -61 -29 42 -101 191 -100 -133 3 -96 -129 111 -148 -197
5630 -197 149 -65 -64 120 -48 -66 114 -33 -54 -102 -19 59 -19 16 223 -283 260 -57 -76 130 124 267 -72 105
5654 105 -87 -29 159 -168 -12 -68 17 420 -22 244 -76 7 -154 91 -73 28 -3 -33 25 153 163 28 -103
5677 -103 -103 187 -128 33 -38 57 -18 -4 78 97 -100 -210 198 18 235 10 -244 -210 12 -217 74 -160 16
5700A6P6O2j6j51J3P5K2J82k55j44J34N8K6k04J18k53L8OJ72J34O5p5j78J68J64
5725B53j98J00j22j01j52K25J67n1k21J34nj36J29J63j07p7M0R4j82J52P5m21
5747b41K63p4J09k30K22J6j33J67k27K95R1j67k99J94P4Q0J05j85m6j3J38l4k11
5770a06N36l87j19Q5J8l09O54l19J87l74J03J86l12K02j85J37qK4K23o9j53P5
5792H9n0j00Q6k9J28j88J55m3j93K42l34%K45J02q7J34q7k3L6j6m54L22K01l92
5816b56J34L07k57J94q5l45L01j89L23j86J68k55J69j70j5J32R7j48J5l9j75J17
5838a63K01j54L69n06J85nJ8J08k36L0O5O8k62L52j48K89k32k6K40p6j48J38J14
5861B21k18l7rk22M26j32j05O1Q7j51j8J04J98p9J06j63k02K01k14J21K12l38
$$ plain form
5700 16 92 154 138 -13 0 75 97 279 24 -120 14 72 98 -106 12 -241 -203 -197 -25 109 174 99 -79 89 253
5725 253 55 155 33 -68 -220 5 172 121 -100 34 29 -107 22 185 78 1 41 135 -47 105 180 -241
5747 -241 22 -52 57 -173 49 65 -68 99 -128 167 258 91 -208 -14 60 140 245 60 14 1 139 105 -106
5770 -106 430 43 -76 9 27 -282 372 53 240 -134 -31 155 -157 45 -140 -3 -11 13 236 167 14 89
5792 89 39 -61 25 -4 124 -64 91 48 -145 97 -237 -237 8 110 23 157 70 47 83 67 -387 -65 136 -256
5816 -256 -122 185 -72 122 37 -308 -7 -196 127 -59 109 -146 23 -147 -162 -30 67 -81 -66 -105 -280 -163
5838 -163 38 -116 253 -253 -68 -73 -55 53 -183 -153 -88 -20 -282 70 -78 211 -21 -47 193 117 -31 107 221
5861 221 3 -34 -43 -265 161 29 -76 -15 72 -79 -97 7 205 126 232 69 -133 68 -146 -25 187 -151
5883a51j43M19o8J4M3k21J46j39Q9j05J90j48n7K74p3l34Q1L65k75r2M59L0n86
5906b82l0J34k5L38j88j38K35M4q2q3K35j8k9M2k7M2j75l6o4L35j89q9p7k6N2
5931a01k34M71j19j57R3Q4k30M9K55j59L40l65O9K1j91L71j02Lj80J95R3m97M70
5954A79j67N2j27P2j43J10J26j52Q4R3j88M9k9K51o0p1oL5JO9k20j26J92k34J18
5979i2RK27k19K79j31L4j49p5L5k7J35K75k78k69K29K08l4k33lQJ87m1j12Oo6
6004i7L4K20k74K24k55K90k86J58r9r1K09J4k43M9oM53k93J25l67J84K7J6J58
6027A50k34K48k02Q6R6q4Oj54J11r5J44j39q1K29j02o4L72k49k63J41K68k09K13
6050A88j15j63O0J28k1m8j6m2J38J4Rl9Q8j64R8o1l00n6R0J05k2N2j56O35k47
$$ plain form
5883 -151 -294 125 57 71 114 -107 39 -100 -11 -116 74 -74 -131 143 70 -264 -183 182 -93 -185 274 304 -282
5906 -282 -312 -178 -203 135 -53 -191 44 88 6 -77 158 140 111 153 126 168 -7 -43 -107 228 39 -50 -127 -153 -101
5931 -101 -335 136 17 -140 -47 37 -193 -144 111 -48 292 -73 -4 17 -174 197 95 98 -82 113 206 -291 179
5954 179 12 64 -63 9 -134 -24 102 -50 34 127 -61 -12 -41 210 150 79 73 108 109 178 -42 -168 24 -210 -92
5979 -92 -83 144 -75 204 73 107 -42 -117 -82 -109 26 301 23 -246 -17 191 157 -76 -79 -71 116 75 -37 -31 -97
6004 -97 -63 157 -117 107 -148 142 -144 14 -85 -176 33 47 -196 -147 -153 300 7 132 -235 -51 -24 -8 150
6027 150 -84 164 -38 48 144 60 66 -88 23 -72 72 -67 -148 81 -21 -85 287 38 -225 -84 184 -25 188
6050 188 73 -90 -30 98 77 29 13 -29 109 123 132 93 181 17 115 54 -246 -302 -212 -107 -129 -77 -233 402 155
6075A55j16p1p1K04l82L62k63N8P7L6j94J35p8L23k08k0pj80J14p7K52m9Qj91
6099a83L10j20l18N05L1m45K19J17j44O0N9r0P7k05K83J1Q7n01J97O1q4J43Q4
6122A54L4k79J97r4m9k4q0k5J86j66K29j39o0K24j56MJ83p5p7JL03l11K3K9l1
6147AN7r3J34l08J46M2r5J42J96k00J20Lo5K80o11K98K2k16J80j85P3J12k75K79
6171C7JK5Q3j71P4J32l68L46j27j85J39m1N1Ko4p9PP3P7l22M09q3p4k65L53j27
6197i7M4J15J03j66K78k11L9L2q2P2M7q0J3j56J45j67p5O33o92J4K23J82k35M2
6221B1k5o7K4J1j76N2J4J03K88k07R2l05K10QJ10J29n05N3M08l69J17J73P7j56
6245H0k14j1L4Q3k39K49J72j48j87L04k14j08J60n6K04l5j12k31L61k86M58j16
$$ plain form
6075 155 39 -32 -103 101 -281 81 -182 -124 -47 -11 -205 -70 -148 175 -33 -53 -60 -240 -126 -203 49 0 8 -183
6099 -183 127 7 -311 194 225 -220 -1 116 -28 32 91 1 78 -127 156 167 254 -247 -50 11 -73 70 154
6122 154 188 -91 106 12 -37 -61 -141 -166 20 -146 83 -56 -116 108 -48 -44 139 64 -13 -12 291 -20 3 32 1
6147 1 58 -35 99 -209 -63 -21 -116 26 222 22 142 145 80 360 -251 47 69 -147 33 -152 -79 33 -242 37
6171 37 38 63 146 -25 49 181 -187 159 32 -153 -14 -55 -4 -2 -66 -145 -138 -65 12 -310 99 16 -58 -323 30 -97
6197 -97 -53 62 165 -1 277 66 105 137 55 127 174 94 107 -49 96 -71 -146 487 -205 -191 32 214 -21 21
6221 21 -4 -71 -47 -36 -212 -160 -146 -43 245 38 130 -175 35 43 153 282 -223 -170 238 -131 -14 159 236 80
6245 80 -134 -145 -111 -28 -267 -18 154 6 -181 123 -91 -199 -39 -95 109 74 -38 -269 92 -194 264 148
6267A48rJ58m77L4k04L75j87J65j71n8N52l50q7J7p2K66j59k03K81p0J05p4o6
6290h6k66N06j85J29l44J03L35k32j9j51J32J72m5j40K60l07R7k29Q5K0J40j00
6312a25N5J34M2L6r5L3nQ9j19N6j11J07QJ19l14J02o4K68j35n5k8O4r7L9N2j14
6338e8k8R5p3Pj2J24j10j79JK21J38Rj13K06k88j54K23J69j43J12J71k32K7R9
6362B12j6l15M6J34j40j97L82j41k06kK76L7JL7j90O4J82k35J52k26r5K35J6m8
6386c7J37j21o0J25J6k55J79Q8R4J11k24N0j70K09j99N6k1J12j77J11J04L2l24
6409a64K57l1RO2l18L05l12J79l28K49M1l0O9N8l7n9qj1L04l62p7L21l51N32j42
6434A56l06N06m37jJ24k1J55k63K31j84M5K56k14j22K41l11M4L20l92Q3J73j68
$$ plain form
6267 148 139 297 -180 -146 -350 25 -162 3 -168 -226 326 -24 -111 -94 -166 100 -59 -262 19 -51 54 -20 -86
6290 -86 -352 154 -31 98 -246 -143 192 -40 -59 -210 -78 94 49 -91 169 -138 -41 -270 -185 -165 -25 -125
6312 -125 -70 64 106 142 47 80 75 164 45 101 -10 97 105 224 -90 12 -52 216 81 26 -2 62 -35 4 56 -58
6338 -58 -86 9 -64 -57 -69 55 -55 -234 -233 -12 126 135 22 228 -60 -214 9 178 35 147 318 86 113 212
6362 212 196 -119 -73 61 -79 -276 106 -35 -241 -243 33 70 71 108 -82 -18 164 -71 81 -145 -240 -5 11 -37
6386 -37 100 -21 -81 44 60 -195 -16 72 166 277 53 103 -67 142 -57 -1 -22 90 -87 24 128 160 -164
6409 -164 93 62 71 133 -185 120 -192 -13 -341 -92 -51 -81 -12 46 9 -50 -58 -69 235 -127 -204 117 -234 298 156
6434 156 -150 356 -81 -82 42 21 176 -87 144 -40 5 261 47 -75 166 -145 -101 219 -173 -90 83 -85
6456h5J02J98l13K89k87K17Jj50n1J48m5j8K28k83J97k56K22l9K9n7j15J50j54
6479g2O7J6J13P1l33K21J45j77O1o2m2L8NNj7R6q7l01K97j44p4J7K1L04j58J20
6505A30k38J49L3j8k53R3rJ99j62K17k90Q6M0m0K0N0k13J90R7k33M02j97J7j55
6529h5rJ47K04k02j0J79l19O7N0K09l34l6J11K6qk11L14j5Rk0k50L49j01M0j69
6554f4R5n5J35P7k56K2n1K2OK48j77J44k39J89q7J73j76L9m7K77l0n13K19J05
6578E6J24k61K6J84j60K63m52J52J61J27k25K9l4K4J77l91J94L2M7N9p5l13J24
6601a32J20J06J5k30J38k44J80P5R5j91p4L8J68m55K15L65j09p9n2J5n2rJ16J21
6625A40m3n0j25J58K1M2j45K01k38J90l89K53j44L43j78j05J39j05J51J11Rj34
$$ plain form
6456 -85 17 215 -98 191 -96 121 122 -28 -79 69 24 6 234 -49 148 -108 114 75 104 47 -68 82 -72
6479 -72 -5 11 124 195 -138 83 228 51 112 50 8 46 51 56 39 135 48 -253 44 -100 -174 -157 -136 168 10 130
6505 130 -108 41 74 56 -197 -104 -113 86 -76 141 -149 -63 -23 -63 -43 7 -206 -16 81 -152 250 53 70 -85
6529 -85 -94 53 257 55 45 224 -95 -28 22 231 -103 -139 -28 -2 -10 -221 93 78 87 67 -183 166 65 105 -64
6554 -64 31 -24 111 188 -68 -46 -97 -75 -69 179 2 146 -93 96 9 182 6 45 -2 275 245 -268 -49 56
6578 56 180 -81 -55 129 -31 232 -220 -68 93 220 -5 24 -10 14 191 -200 -6 26 73 132 57 -256 -132
6601 -132 -12 94 109 -121 17 -227 -47 28 123 -68 -142 -104 64 -391 -176 189 80 1 -51 -36 -88 -97 19 140
6625 140 97 47 -78 80 101 143 -2 199 -39 151 -238 15 -129 214 36 -69 70 -35 116 227 236 102
6647A02j48j99K42K90l36p7J3J98k93L54p9r8J23j59m7J49Q2j01M2j72j02K18
6669BK43l42k5J62L0j56J91J09n45N08q2r5j42J87k41L34R6j35J86k23q2Nr0P7
6693b8J55q6l01L08l4O1k35J16m0K25k6j8j25j62K65o3O5q3l04L62J38k10J09
6716H9j34mm0J68j67L36k39q1J68k19J59j82J00l4Q1j22Q2J75k57LJ61L3j69p8
6740a71Q5r9J68j67J94j02L5Q7J7l44M60k09lK07l97P5K26p8j85L12j35P4m6p0
6764f6r6J57K2o2j50K43r3K3J75l29J30j04k6K01J46j98J65r0j63J38l62M00j40
6787g9O3r1O3p1NN9O5Pj06J56J2Q4j50K29j94k18K00j52J5J46k17J31J57O9k64
6812h1K64k11QL21k46k12Q7J4J92M1p0J8K0n2k21J73J00p4j4j06j30L39q4l8j3
$$ plain form
6647 102 -46 -245 -3 287 -49 -126 -113 85 -208 146 67 -31 92 -67 -114 35 117 16 58 -114 -216 2
6669 2 245 -97 -122 40 70 -86 105 214 -331 177 95 0 -142 45 -196 138 234 99 285 62 -20 -15 -105 -28
6693 -28 127 41 -260 48 14 75 -160 -44 -84 141 115 97 -28 -190 75 12 77 -6 -310 52 190 -20 89
6716 89 -45 -49 -89 79 -88 248 9 -72 96 -123 36 -146 -46 -80 1 -121 -39 136 -121 -118 43 76 -93 -171
6740 -171 -86 -185 -17 -184 10 -92 -57 30 47 -297 163 -46 -49 158 -239 -164 62 -16 -201 111 -24 50 4 -66
6764 -66 -162 -5 17 -45 -195 48 -45 -22 153 -176 -46 -150 -176 25 171 -27 138 48 -115 23 -339 61 -79
6787 -79 -16 -107 -44 -115 -110 -51 14 21 -85 71 83 167 17 246 52 -166 34 -118 -103 43 -174 -43 114 183 -81
6812 -81 183 -28 -20 301 55 -157 -70 -56 136 177 107 125 145 93 -128 45 145 71 57 -49 -179 160 76 38 25
6837B5K70k72q5M5J53L1P4k39j99K94j36k81L46r3J13o5p8O4n2K15M5M0l07K45
6861A53l31L4P9K14l11K39j36j09L06k05p4K39j07J5j56L53j72k74L63P4j46M
6883E2l95K81O9l22M76j83N1J4O5m8r0R6k61M47j78j19K8j03K45k13L2q9N9J00
6907A4k85K47k20K36p8K4J62O3j23l3p2M5L2o2J73k81K25l41L08j77J95n6j07
6930a11J46L24m09o3K28m9j81K62k65J81q1rJ90k20j26J32N3k47K60j19k1J42
6952A7J01o9J24l97K33r6K54k61J64K7Lj45j88K96J7j38qJ60j00k10K17j04J16
6975A3K27m91N12k09K22m69K52j52j4L10r6k40L4o3K56J1j36n6Q4j96m0K50M2
6998E1K65m33l9J96J61j17o0J28l93J14L51k14o4K7j45Q5kJ39j16m0K34k95L64
$$ plain form
6837 25 295 23 -62 -17 136 167 241 2 -197 97 -39 -320 26 -67 46 -19 -97 -33 -85 130 175 215 -92 153
6861 153 -178 -144 -65 149 -162 77 -59 -168 138 -67 -141 98 -9 6 -150 203 31 -243 120 194 48 52
6883 52 -343 -62 7 -315 161 -22 29 43 108 60 -30 66 -195 252 74 -45 -17 -120 125 -88 -56 -145 -86 14
6907 14 -271 -24 -244 -8 -86 -62 100 163 40 7 -65 -20 12 -50 123 -158 67 -274 34 -143 52 -4 -111
6930 -111 35 359 -50 -113 115 66 -115 147 -118 63 -18 -27 163 -57 -183 -51 2 -245 15 -104 -125 17
6952 17 118 49 173 -224 9 -87 167 -94 70 97 100 -45 -233 63 80 -58 -66 94 -6 -216 1 -103 13
6975 13 240 -251 261 52 274 -195 57 -95 -109 201 105 -135 -101 -164 92 103 -33 -89 -5 -201 -241 9 51
6998 51 316 -117 -156 40 201 84 24 152 -241 -127 224 10 -54 -27 -172 -87 -89 50 -66 -106 128 -167 197
7021A97j35M1j86K75j52j42K0K4m9p1l6%M47k59O1p0K90l31R0K08k66jOp1K5J58
7047G3o6j23J63mK4j38J58LM2K7p4k65K78k75J89J24j88J73j08J04j08K02j85
7070B6J50k54J10k85L05j00M8K11j61q8l6N1J86o8l05L12j1j72l7m6M7J16l09
7093c10M20q6qO7j94Q1J07M3l87P2L09r5q3j42J19K24o8j33j8R2p1j44J16N8J75
7118A44p3o3j67L38j33j41K31k67R6J69j5j48J77k28j69K27J35l81L68n2K0q5
7140a7P9j99R9j15J10J05n3j32J06rj77mK94j66j2j2m9K60k35n5L01j56j03K60
7164A20m2K8k32K88l07J32J9j48J36k39L95j96N2n4J0p5M6j63J02N5K17k24J52
7187G2m3O9k48K29p3J51k29L8K38j50J4k6k24K68j12l7L20l33KL1L9Q5L9j05m7
$$ plain form
7021 197 62 103 -83 192 40 -102 -82 -58 -107 -178 -214 -214 233 -26 35 -35 255 -76 14 222 -44 -45 -39 -110 -85 73
7047 73 7 -116 47 43 67 -71 87 90 132 159 85 -180 98 -177 12 136 -52 121 13 117 9 211 26
7070 26 176 -78 32 -253 52 -48 0 211 50 -38 -74 -23 163 95 -210 102 91 -81 -118 -164 -117 -1 -310
7093 -310 110 24 16 83 -111 -30 77 120 -267 -195 114 19 -64 -206 -87 137 69 -64 -82 10 -61 -205 -89 -31 144
7118 144 71 8 -159 179 46 -95 136 -131 -35 134 119 -29 148 -80 -249 -22 113 -268 100 48 68 -17
7140 -17 62 -137 -38 -153 -43 62 9 -123 -17 -26 -203 -207 87 -79 -91 -103 -152 108 -127 -182 119 -37 -140 120
7164 120 78 106 -126 162 -145 -13 6 -142 -6 -245 150 -46 6 -48 -38 -113 -67 -230 -128 -73 144 -80 72
7187 72 29 98 -150 79 6 157 -72 -34 204 54 68 42 -182 86 -26 -63 257 -76 -74 -43 -4 81 120 15 -32
7212c2j50K33m7J7L8o9L2j60o6NJ52J84r4k5n6K3r8L75l36j83L38m6j7J77j93
7237Bp4j2J38J22j55J71j90R8j64M2J00M8j88K19j46jk07K91q5n4O2J03j44M9
7261B5q6m3K16k6j98K74R4k92l30L30L45o16L26M6l07K40k6Q6q9l9J5K0K59l02
7285g8L58l81J19j85R1K34P7l09J96j7k69L15j17j07ok1J9l9K20p2J05j84k0J8
7309e3M4j08K24j56J06K44m35j31N55k73k4j74K27o7j0Q0j35K46j55J31j63j62
7331a89L01j60Q4j16K02j36J62k05K1J0n4J64k1J18j78r8J88L6j18J01N5j68J46
7354A45k9J10k76K91m14P9K32j31j37j36K95r5M7l1J29R8m11L27OM1m03L38q4
7377ik30L59p9k15K8K44k48J27n5L16k47j62K64p9K1K76m93J79K86n75L27r7L4
$$ plain form
7212 -32 -182 51 4 21 59 -10 22 -138 -204 -199 -47 137 43 18 -38 -15 -113 262 -74 -257 81 35 18 195 2
7237 2 -72 -84 54 176 21 192 2 100 -64 -22 78 126 -62 157 11 10 -197 94 9 -45 17 120 -24 25
7261 25 -61 -104 112 86 -112 162 256 -36 -366 -36 309 -307 19 65 -242 -2 -28 58 -31 -70 -55 -35 224 -78
7285 -78 280 -101 18 -167 -76 158 235 -74 122 105 -164 151 34 -73 -79 -100 -81 -120 100 28 133 -51 -71 -53
7309 -53 -9 -117 107 -49 57 301 -134 -265 290 17 -7 -181 46 -21 -31 49 -86 160 5 136 -27 -189
7331 -189 112 -48 36 -80 122 -14 148 -57 -36 -26 -80 84 63 181 3 -95 93 129 11 112 167 -1 145
7354 145 116 226 -50 241 -173 -94 138 7 -130 -266 29 -66 -19 -50 79 177 -234 93 99 140 -263 75 -9
7377 -9 -239 120 41 -174 -146 98 -150 -23 -78 238 -9 -171 93 14 35 311 -182 -3 283 -292 35 -62 -28
7400b8o7j53K76J90l63r2K55j55L45k72J65k68N4J05Q6k96L46l35N6N9J17k08
7422a83o1K76j05J84j57K22l05J56J1o6J29j1q3Jp2o1Q9j01M0J62k29K5P8k04
7446b65L54n6p9j84M11L4j90J75k17P1K2r5j47j7K24L8rM5M3Rj98q5J65k9J2J1
7472D3n9l0j44Q9L8J70o0Q3l27m7K42j82L02j14Mr6n9L5P5K02k95J89K02r5k95
7497a29K16p4k43L60j63J95m01J78j5O7k63J28K54k2L2N5jl53K99l46J60J60j01
7520gn9j5m1p1K02o1o2K08k00J32R8j90R7J51k63O0K2R5n5k35L84k72J79p5K10
7545B32j72j67K42k22J51q2J8J53k00r5K73r9j10L3J94n2m0j4K7N1k75K98K8k72
7569a00L88l74J89k51K48l6l8N2m20K34J57R3k03R5j8j04J10P9k74K63j16K06
$$ plain form
7400 -28 -95 -248 28 218 -145 -237 18 -137 208 -64 101 -167 -113 -8 78 -218 128 -207 -151 -92 25 -183
7422 -183 -244 32 -73 111 -46 176 -129 27 38 -28 101 90 7 8 -64 -125 -36 -137 -97 65 -164 -139 -61 -265
7446 -265 89 33 -46 -230 181 215 25 200 -17 54 76 -19 -166 -183 41 79 70 115 158 167 -31 -116 49 20 32 43
7472 43 -16 -46 -190 -101 -63 107 47 130 -197 -244 -2 -184 118 4 8 -88 -147 -112 -37 165 -130 59 261 166 -129
7497 -129 87 13 -230 130 -33 162 -239 -61 -76 -9 -272 -144 110 88 120 175 174 -179 120 -226 -66 94 -7
7520 -7 -66 -81 -122 -193 9 -52 -114 94 -106 26 124 -66 31 182 -81 -21 1 96 41 -194 190 -82 97 22 232
7545 232 60 -107 135 -87 64 -18 0 153 -47 -142 131 32 -78 -45 149 97 57 43 70 121 -154 144 172 -100
7569 -100 288 -86 103 -148 100 64 26 78 -342 -108 49 142 -61 34 16 -88 22 101 -173 90 -26 180
7591A80Mk44J69ok22L3Q4N3j82j19K22J41k45K50l5j04J64oj53K1J1k3O2k55L22
7616A22j41J94k22K8j18K79k60M6n1K96j47J25j93o4L10m57J69RJ18j3K04k93
7638e9j13R2J67j35K42m6k23J52j91L95j15M2k52p0K93j6k21L8k34J19J27J0L5
7661C7K56k36j30K15l25K99j94KJ57j22N9J04j50J66j06J03k63L45k32J41k30
7682a04K27J34k02k74K99j07j28K11l50L10ko7J81J4j47J33k37P3n0J36j12j11
7704a73K31j07j04R6J30j54N5k26J09k9M34l43J54k68Mk1J5Q9J13J27j19N6O9
7727A38k64P1K38k87J69l43L37O7L4j34l3L8J28q8o4q7j20k7M01k07OM2j39J26
7751Bl3L05n15N49m21K42j89J56r3j21L53p9k05j95Q0K17k01L80r1j46J24j00
$$ plain form
7591 180 184 -60 109 103 -119 -86 -2 51 -131 -250 -28 113 -132 118 83 -21 143 137 -16 5 16 -7 55 -200 122
7616 122 -19 175 -47 -19 -137 142 -118 -72 -123 173 26 151 -42 -106 204 -253 -84 -75 43 30 234 -59
7638 -59 -172 -80 87 -48 194 148 -75 77 -114 281 166 208 -44 -114 179 163 -58 -20 -254 -135 -8 2 37
7661 37 293 57 -73 142 -183 116 -78 -76 81 -41 18 122 -28 138 32 135 -128 217 -15 126 -104
7682 -104 123 257 55 -219 80 -27 -155 56 -294 16 14 -53 128 142 -5 128 -109 -36 -86 50 -62 -173
7704 -173 58 -49 -153 -57 73 -81 -26 -252 -143 -172 262 -81 73 -195 -191 -212 -197 -108 5 132 13 69 138
7727 138 -126 -55 183 -104 65 -278 59 126 160 26 -7 31 159 71 7 -80 -200 -227 174 -33 -27 15 -124 2
7751 2 -31 274 -241 308 -113 129 -60 96 3 -118 235 156 -49 -244 -164 53 -148 232 141 -5 119 19
7773A9o2L3j03L20l80P3K62m3j40n3nJ54j14qO1j22K31j87J97k09j26L26j65M0
7797aq0Q7J10n8pj20K54l12j91K74pK1%l95L59N8R0O5j12P7k80J27n0j9K19k90
7823a81o5J78l0K63l17L03j68%J3l8m7R2QJ68k25j82J07M8N4k27J15Q7J2k03L45
7848A10j14J11j91Q0j51K23j7p6rk60M49o3j71K73k80R6O6kmr0l5K32j43j88J65
7873A1j8j68K93p8j31K12k04J9l2j6JN7L13m14J58j80M4L31j41L7p6j57J37Q0
7897G8j43K54k36O0O7R7k24j30J93r9P5q2L9J1j58J31k56M13j51M6j52J23n3K64
7921A67j98m1J51k52K60n8j91K39Qj57J63j48K52k35j78J3M58j34k38K31j2mj90
7944i4J30J86j74J76l60j06K83j68J32J16J80j66j83k09N30k41N0k37J56R2lJ8
$$ plain form
7773 19 -43 -10 -113 207 -173 -100 162 119 -21 -74 -79 75 -39 -47 14 -108 123 -64 133 -76 -202 124 -41 -1
7797 -1 -81 6 116 58 51 -69 185 -127 -318 -44 -51 -30 -30 -425 -66 -8 82 147 35 112 -168 -41 -91 -110 109 -181
7823 -181 -246 -68 -98 165 -152 151 -17 -17 -4 -42 -89 3 11 179 -46 -228 -121 -73 -19 -246 -131 -44 -32 -235 110
7848 110 -4 107 -84 -4 -155 68 51 -25 -34 -294 155 92 -79 194 -86 10 76 74 70 -20 -55 177 34 -154 11
7873 11 -7 -175 118 40 -91 121 -83 -64 -96 -112 -111 -54 259 -155 3 -177 -133 198 57 94 18 -139 -2 78
7897 78 -65 189 -47 13 80 177 -47 -177 16 -83 -8 -90 -51 -40 -198 -67 -323 90 -61 -15 -167 -44 -97 167
7921 167 -31 -72 79 -173 87 29 -162 77 85 -72 91 -57 195 -40 -218 -205 253 119 -119 112 100 96 -94
7944 -94 36 222 48 224 -136 -242 41 -127 5 121 301 135 -48 -257 273 32 82 -155 1 93 90 108
7966A08j90OJ19O4n7M9j28J92p3N4j51j30M9J37l2J4j44J35k6k94K93rJ23l08
7990a99K34KK40j83j70J2P5j55j3R8j87J50J15J1J78q5jj08o4J83j34O4q7O6L8
8015H0q6k09K95k6r5K54k77m9K68j47r8J82J06l5r3Nj42L1jO8J46k53NpJ12j86
8041a52nP3R0j14J41N6NJ70j62j29n8J50k60Q2J76j32j30J90J18l0JK1j34j22
8065a55K27l3j24j7J82r4K9j80O2K94k7l67K13j78L6R0j9k3R2Jj16N3J79p7j3
8090C5lK37l07L6p2L3j21J3m4K02j10L20r7m68M15m6P0o0P0j25j20o2K07OM5j3
8116D1MK87l80K78k49J1o9J76o5q0n8kN1J90l1N2k34L27l48M7L7K38j12j45J29
8141I5J07k74l2J2Q9o8J94q9K25p8J22n16K68o6O8Kj36K07k10J16J9M5k65K22
$$ plain form
7966 108 -82 -76 43 107 50 99 -29 163 90 144 -7 -137 -88 49 17 31 -113 22 -4 -298 -5 -14 109 -199
7990 -199 35 37 277 94 -76 -64 11 -144 -157 -59 -246 -96 19 30 208 123 122 14 -50 133 -1 63 -24 42 80
8015 80 -6 -215 80 54 -41 213 -64 -113 155 8 -90 92 198 163 70 75 -67 -36 -37 31 177 -76 -71 -78 34 -152
8041 -152 -157 -84 6 -108 33 89 94 264 102 -27 -85 65 -195 -113 63 -69 -199 -9 109 79 80 101 -33 -155
8065 -155 72 39 -85 -102 80 -14 15 -165 -103 191 164 -203 10 -168 -132 -42 -61 -84 8 9 -107 -54 125 48 35
8090 35 32 269 -38 -2 -74 -41 -162 -149 -193 9 -101 219 122 -346 69 23 93 33 103 -22 -142 -204 3 9 54 41
8116 41 45 332 -48 230 -19 -8 -77 99 34 -46 -104 -106 -55 135 104 156 -78 249 -99 -52 -15 223 111 -34 95
8141 95 202 -72 -104 -92 -3 -71 123 34 259 181 303 -213 55 -11 57 59 -77 130 -80 36 55 100 -165 57
8165E7q8P7M0j24k42L87l45M40k74K03J07k56j62L32Q7l20J52k87L1kK40j37J85
8188A01L9J0j19
$$ plain form
8165 57 -31 46 86 -38 -280 107 -238 202 -72 131 238 -18 -180 152 239 -81 71 -216 -185 -187 53 -84 101
8188 101 140 150 31
8191C1
$$ Imaginary data points
##PAGE= N=2
##DATA TABLE= (X++(I..I)), XYDATA
0@%%%%%%%Qj6J6j6J6k4L2m0N6o4P7j01J20j44J76k08K40k80L31l87M47n14N92
30C17o80P74q77R96j124J264j422J595j784J989k216K464k732L024l347L700m083
47b142M503m964N468o020O632p310Q064q908R857j0934J2170j3601J5280j7291
61i196J9744k2811K6776l2123L9759n1601P2540j20156M13974J6973q20221M88213
73B1871K32462j63341n9484j46891J23902L39322m45819j85703M83615L4600l32935
84i8401j9515Q2492J61318K958k70610J6996L03271p0631k84481O7122L02867
95A93386o2765k59584O924J84527J14937j22522k75721K15178L34848l89867k01812
106b62471M46959J7535k83064J0247L8006J61753N4110l57682O3030L40895j78374
$$ plain form
0 0 0 0 0 0 0 0 0 8 -8 8 -8 8 -16 16 -24 32 -32 45 -56 64 -80 96 -112 128 -152 179 -208 239 -275 317
30 317 -363 411 -466 530 -594 670 -752 843 -941 1048 -1168 1296 -1436 1588 -1759 1941 -2142
47 -2142 2361 -2603 2865 -3155 3477 -3833 4231 -4677 5180 -5754 6416 -7185 8095 -9196
61 -9196 10548 -12263 14513 -17610 22149 -29452 43088 -77068 336906 353879 -466342 21871
73 21871 254333 90992 31508 -115383 8519 347841 -97978 -283681 199934 234534 -98401
84 -98401 -117916 -35424 125894 128852 -141758 -124762 178509 107878 -176603 -109481 193386
95 193386 130621 -128963 -122039 62488 177425 54903 -220818 -5640 329208 -60659 -262471
106 -262471 184488 202023 -81041 -70794 -32788 128965 183075 -174607 -111577 229318 50944
117E0944j71286J10208N6173R1189j41838k19661L20280J50620l65265k4452K38262
128I5174J6773r7037j48042P6993K77892j62255k86241J83379K21209j08211j94616
139a24982J6206K14556J366k35080L6760J95762l1490j51466l6488J45692R7726
150A28562j41090j20851J03013J34955l7166j95881L4280K71279j15437k60108
160a98444J71965J71929j08937r5388n0742J34135J51775k50853r3849K90010
170A21601k9169k08361N6212P9627N8182m7032j99455J22215K09956j82018j13327
181a31569J41640L0037k6357n2408n9097J51501O5642k11983m6768K14071N1294
192A26003j89272o5596J70641O5427j55680n0984J12535P7304p8102j41586Q1834
$$ plain form
117 50944 -120342 -10134 46039 137228 -4610 -224271 96009 246629 -118636 -143088 95174
128 95174 111947 14910 -133132 -56139 221753 59498 -226743 -43364 177845 69634 -124982
139 -124982 -108776 105780 107146 -127934 -91174 104588 73098 -78368 -114856 30836 128562
150 128562 -12528 -133379 -30366 104589 67423 -128458 -94178 177101 61664 -198444
160 -198444 -26479 145450 36513 -58875 -109617 24518 176293 -74560 -168409 121601
170 121601 92432 -115929 -59717 19910 78092 31060 -168395 -46180 163776 -18242 -131569
181 -131569 10071 40108 13751 -38657 -97754 53747 119389 -92594 -139362 74709 126003
192 126003 -63269 -128865 41776 107203 -48477 -99461 13074 90378 12276 -129310 -47476
203d7476J79799j07341j56146J04228R3074l9038q2753l1391J42451M1359j94572
214i7806m326J74919j0656q7526m6748L6039J33938o2657j60424J16657J32762
225A24172j22320j03466P0966J33123k8128j85145L9721J77586o1917j17186L8585
236c4009O0132L0976p6490r3014J39686R1908j66102o3855J29777N2584o2736
247H857p7206K9344J15059l8183j24383M6108J28972l0802j34922O587J40363
258F9794J3739j28009k6769J00970N7266j03630q1824J40238O8453j62484k9027
269h1283J20977N096k5670n3727m0761J38742J9354j85553M8873J55184q3705
280A7527p9613L0946M6786O0302p9129j04200J30466Q7382j44003m4347J07338
$$ plain form
203 -47476 132323 24982 -131164 -26936 66138 27100 -55653 -87044 55407 96766 -97806
214 -97806 -102132 72787 62131 -25395 -72143 -36104 97834 35177 -125247 -8590 124172
225 124172 1852 -101614 -30648 102475 74347 -110798 -71077 106509 44592 -72594 -34009
236 -34009 26123 57099 -19391 -112405 27281 119189 -46913 -110768 19009 71593 8857
247 8857 -68349 -39005 76054 37871 -86512 -40404 88568 57766 -77156 -70569 69794
258 69794 83533 -44476 -71245 29725 86991 -16639 -98463 41775 110228 -52256 -81283
269 -81283 39694 44790 19120 -34607 -75368 63374 82728 -102825 -53952 101232 17527
280 17527 -62086 -31140 15646 75948 -3181 -107381 23085 110467 -33536 -77883 29455
291B9455L9172o2942p4672M4106J10647m3086j30314M5352J24532m5047j11313
302g4110M0506R0402l0178o3619j1999N6172O6518p5810j00261J07459Q9486j16327
314b1761m9946Q0919M1443l5045p4322J7381J19630l0035j31079M4988J00033
325F2206k2221p3500j8689P9659M0750j06939l4905J16974J7920r2653l2379N9671
337d106O3372m8792q1984M9810P6488m7042o1559K4837P0816J173r8355r370J18073
350E3361J0485j14374o440R0591J6101o9929k9680O2568M3096n7202o4087N6668
362h842Q2871n6355r2447N7557P9924n0970n5502K0264N0825J3053p5009k9875
374f4506J05623J9132j09301j539P2640J3314l3781n0032K7225Q8531n3998r5773
$$ plain form
291 29455 68627 5685 -68987 -24881 85766 42680 -87634 -42282 82250 37203 -74110
302 -74110 -33604 56798 26620 -36999 -48998 7174 73692 -2118 -102379 5080 94566 -21761
314 -21761 -71707 9212 50655 15610 -58712 -41331 78299 48264 -82815 -37827 62206
325 62206 39985 -33515 -52204 27455 68205 -38734 -73639 43335 61255 -31398 -63777 -4106
337 -4106 59266 10474 -71510 -21700 54788 7746 -53813 -28976 41840 43013 -55342 -64712 53361
350 53361 63846 -50528 -56968 33623 49724 -20205 -49885 12683 55779 -1423 -65510 -8842
362 -8842 74029 17674 -74773 -17216 62708 11738 -43764 -23500 27325 40378 -34631 -64506
374 -64506 41117 60249 -49052 -50591 22049 35363 1582 -48450 -21225 67306 13308 -82465
386h2465Q5001P1343p6479m7031L9598M3743K485o1146k3128Q4321J7598r2816
398c8976q805Q9562N676p4492j4521N3703L5236l9243n4991L4196P2231m4532
410A5044p2063N2991N9046m0393n1173J1601N6797J8311p7467k5287R1985J0275
422D9667q4425K76O4721O589m5408l2485M0273N6550m4214o3747M1870O1842l5378
435A6131n8030K6792N9189j9876o2077J4202N9738K830n9392j8680O0797L0047
447E1671o2399l0583O1574K6368n0784l2988M0305M5355l2760n8791K7684O3866
459D8518k6295o0329J9916N4468j3386n0646J774M9794J4957n4987k8699N9365
471A4450L7004o2805l3458N8497K3561m1931k4477K3288L9159j0193o2635J2425
$$ plain form
386 -82465 2536 73879 -2600 -49631 -10033 33710 36195 -24951 -48079 36242 53840 -38976
398 -38976 -47781 41781 47457 -27035 -41556 12147 47383 8140 -46851 -12655 59576 15044
410 15044 -57019 -4028 55018 14625 -36548 -24947 31850 50161 -27306 -52593 39392 49667
422 49667 -34758 -34482 30239 36828 -8580 -41065 -792 55758 11544 -52203 -10333 51509 16131
435 16131 -41899 -15107 44082 24206 -37871 -23669 36069 38899 -20493 -39173 21624 51671
447 51671 -10728 -41311 20263 46631 -4153 -37141 3164 48519 15759 -43032 -15348 48518
459 48518 22223 -38106 -18190 36278 22892 -27754 -25980 23814 38771 -16216 -44915 14450
471 14450 51454 -11351 -44809 13688 37249 -4682 -29159 -5871 33288 23095 -39540 -27115
483b7115P4461k1623o6286K1766M9034r650l7490j2873M2182K9834n7379l3706
495d8845O3550K9183n7749k2700L8565K4802j9789l7044J3341N1565j3844o2702
507d1667K0532O2551k0562n1140J0736L8358O624l2364k6375L9871L4439n1823
519a0820l3754N4578K7616m6835k5427K6592L3095j3894m5293J0580N2779j3847
531A5370n5229J7023M8784r679m2354l199L8825J7556l6780k6578M0513K9229
543C3481m0040k8611M0397K8390l3134k9010K0569L6699r869m3838K543M9808
555B7385k911n2818N089M7373l030m2654n283L5113J7168l3103k7284L2960L0734
568B8739l3135l1161L3043K8534k6785k7783J5927L3118m152l8926l771M7166
$$ plain form
483 -27115 47346 25723 -40563 -18797 30237 20587 -16903 -29776 12406 42240 -15139 -48845
495 -48845 14705 43888 -13861 -36561 2004 26806 7017 -30027 -16686 34879 21035 -41667
507 -41667 -21135 41416 20854 -30286 -19550 18808 25432 -6932 -33307 6564 41003 -10820
519 -10820 -44574 10004 37620 -9215 -34642 -8050 25045 11151 -34142 -23562 29217 15370
531 15370 -39859 -22836 25948 16269 -26085 -29284 9541 27097 -9683 -36261 4252 33481
543 33481 -6559 -35170 5227 33617 483 -28527 -7958 28741 18872 -24966 -22423 27385
555 27385 24474 -28344 -23255 24118 21088 -21566 -26849 8264 25432 -7671 -34955 -1995 28739
568 28739 -4396 -35557 -2514 26020 -765 -28548 -12621 20497 16345 -22581 -26352 20814
580B0814M202m7132q47M2482K351l4827q300K7414K2983k6818l4386L0503L7200
593C5639l3598l2906L1353K4492k0971k4383Q063K9716K636l9410o929M5814L883
606B3399m2060j927L3383N044k3569j5085K0101K8407k3294l5974K7247L6460
618C2132k8019l0099K1878K4058r642k5896m3L2616N975m1260m871M3002J941
631B1772l5296m082K5940R088j7457j9541J6428K8684k0458l1970K2354L1364
643B6826k0695k6059J1500K4238r94k7088n416L2472Q176l8209o010L7136N411
656B1288l1477q275K3115J3452j6169k2048J5801K6920j7916k8048J8382K6919
668B1944j5299k3075O175K2989K590k4889r100K8997J0914l2245r385L0691R809
$$ plain form
580 20814 25016 -22116 -22963 19519 21870 -12957 -21257 6157 29140 2322 -32064 -1561 35639
593 35639 2041 -30865 488 24980 4009 -20374 -12311 17405 20041 -19369 -26298 19516 23399
606 23399 -18661 -20588 12795 17839 -5730 -20815 -714 27693 4399 -31575 -4328 32132
618 32132 4113 -25986 -4108 19950 10308 -15588 -15631 16985 22960 -18300 -23171 19831 21772
631 21772 -13524 -17606 8334 17422 -35 -19576 -3148 25536 5078 -26892 -4538 26826
643 26826 6131 -19928 -8428 15810 14816 -12272 -17688 14784 22960 -15249 -21259 15877 21288
656 21288 -10189 -18464 4651 18103 1934 -20114 -4313 22607 4691 -23357 -4975 21944
668 21944 6645 -16430 -10255 12734 15324 -9565 -18665 10332 21246 -10999 -20384 10307 20116
681B0116k6664j1824J9490J6918j3725k4028J3018K7719j4476k8503J6057K5199
693A9297j3060k1227M914J9798M195k1443j0946K5436J2203k7691r893K5664R379
706A6626k0512j1219J3030J8387q253k6465Q883K9364j0736k8699J2588K3466
718A6460r135j9582O30J9456P394k1991j3224K6356J2105k6436q383K1322P989
731A2961j4551j1081P593J9447n287k6288O666K7621q209k4431P835J8864j957
744I183j6635n150J8500J1534k2664j4202K5961J1531k3131r247J7212R018j0154
757A756j3398N438J9897n284k3910O295K4071o877j9533L626J5167K899j4228
770d081q751J6503J3194k0325j3672K1550J1813j8191j1343J3152J1867p360j5709
$$ plain form
681 20116 -6548 -18372 1118 18036 4311 -19717 -6699 21020 6544 -21959 -5902 19297
693 19297 6237 -14990 -10076 9722 13917 -7526 -18472 6964 19167 -8524 -18417 7247 16626
706 16626 -3886 -15105 -2075 16312 8059 -18406 -9523 19841 9105 -19594 -7006 16460
718 16460 7325 -12257 -11627 7829 15223 -6768 -19992 6364 18469 -7967 -16350 4972 12961
731 12961 -1590 -12671 -5078 14369 9082 -17206 -10540 17081 8872 -15559 -7724 11140 9183
744 9183 -7452 -12602 5898 17432 -5232 -19434 6527 18058 -5073 -14320 2892 11910 1756
757 1756 -11642 -6204 13693 8409 -15501 -9206 14865 7988 -11545 -7919 7248 10147 -4081
770 -4081 -12832 3671 16865 -3460 -17132 4418 16231 -1960 -13303 -151 11716 4356 -11353
783a1353M535J9932m634k1918M923K1461m673j7505R37J4306M119j2761q952J3197
797A614J3082j6251j3065J6498J2129j3621j1814R028J2728l677j6174J603J9570
810A1650j809k1172K601K0364l087j6584j72J2954N067j1455j0112J1814J3541
823A3600j4784j2512J4760J0769j1739r259N575J1339J16j5591j843J8960J024
836A0415k0277J468J7563j386j2828l085J0395Q456j0282j3143J2661J3512j4186
849g17j1261J2469R125q882q191K422J1361J444j5602k085J7606O99j7011J057
863g566J2845P00q775o270Q495J1091r020j4254J1851J3083j1890j0218R227Q826
877H125m971r656N66J2854J177j5221j276J5331R71j4172p45J0290L397q251o663
$$ plain form
783 -11353 -6818 13114 8480 -13438 -8515 12946 8273 -9232 -8295 6011 10130 -2631 -11583 1614
797 1614 14696 -1555 -14620 1878 14007 386 -11428 -2400 10328 6651 -9523 -7920 11650
810 11650 9841 -11331 -8730 11634 8547 -8037 -8209 4745 9812 -1643 -11755 59 13600
823 13600 -1184 -13696 1064 11833 94 -9165 -3590 7749 7865 -7726 -9569 9391 10415
836 10415 -9862 -8394 9169 7783 -5045 -8130 2265 10721 439 -12704 -43 13469 -717
849 -717 -11978 491 9616 734 -7457 -5035 6326 7770 -7832 -9917 7689 8388 -8623 -7566
863 -7566 5279 5979 -2796 -9066 -571 10520 1500 -12754 -903 12180 290 -9928 -701 8125
877 8125 3154 -6502 -5936 6918 8095 -7126 -8402 6929 7900 -6272 -7017 3273 6670 -1581 -8244
892h244O912J0520p614j2918R390J1764q499j0153N832R195k177j0083j011J2606
906E520K174j4198k226J4371K072j2336j619Q860L880o800p068N911J0247o559
920B229j1642P203J1160o514j0049M692P824m29q224l190J0899M358j2952l947
934h582J3654K234j0984k298O909N347n091q199M311J1150o287j1129P211R527
948G773n780p738K690O546K106q246m620J0670M549j1931l248J1378J895q091
962b047l204M638O446l302r505L672J1533n701j0631O531Q146m194o665M39O681
977B837L406q988m300J0392L546j0494k150Q185K704n209n083L791P064k659r391
992f349L201J0308m450q726L682P408k165o256q58O526L880q416m587R129M196
$$ plain form
892 -8244 -1332 9188 1574 -11344 -1954 9810 1311 -8842 -3010 6185 4008 -6075 -7086 5520
906 5520 7694 -6504 -8730 5641 7713 -4623 -6242 2618 6498 -302 -7370 -1459 8788 2229
920 2229 -9413 -2210 8950 2436 -7613 -2921 4903 4474 -3750 -6940 3959 8317 -4635 -8582
934 -8582 5072 7306 -3678 -5976 933 6280 1189 -7010 -2699 8451 2164 -8965 -1754 7773
948 7773 1993 -5745 -3055 3491 5597 -2649 -7269 3401 7950 -3981 -7229 4149 6044 -2047
962 -2047 -5251 -613 5833 2531 -6974 -3302 8231 2530 -8101 -1570 6576 2382 -4283 -3844 2837
977 2837 6243 -2745 -7045 3347 6893 -3601 -5751 2434 5138 -71 -5154 -1363 5701 3042 -6349
992 -6349 -3148 7160 2710 -6016 -2334 5074 2909 -3347 -4205 2321 6201 -2215 -6802 2327 6523
1007F523r037k749O829K717l867n017K898O700j930q962L006Q643l075p479K227
1022b573O366n35n462k416O280M124p215m771Q041M511q338k880N982L018l355
1037G77m388J411O664j238q875K191Q702k690p058K195M848O26m712l076N690
1052A067M483o807m893P714L704o583l051M108L732j738n291O70P485j337q452
1067e189K262P666k373n765J180L841J802m080m141N296M943o538m305O794K785
1082D178m915k629K513L766o63o048O73P274j108p402J830O206j017m863o50L999
1098A144K581m065m088N048M483n985l575N429K431l312l079J446M336k68n697
1113c171J76O378o92o205Q44N370n56l791j077L384L238m017m078M434M192m702
$$ plain form
1007 6523 -2514 -5263 1566 4283 416 -4601 -1703 4997 3067 -5895 -2889 5754 2679 -4800 -2573
1022 -2573 3793 3258 -2204 -4620 1660 5784 -1431 -6202 1839 6350 -1988 -4868 1114 4132 777
1037 777 -3611 -2200 4464 3226 -5649 -3458 5244 2554 -4504 -2309 2539 3165 -1547 -4623 1067
1052 1067 5550 -1257 -6150 1564 5268 -1315 -4366 -258 3474 1736 -3555 -2885 4600 3263 -5189
1067 -5189 -2927 4739 2366 -3399 -2219 1622 3424 -656 -4797 499 5442 -1096 -5401 1393 4178
1082 4178 -737 -3366 -853 2913 2250 -3798 -3125 4149 3041 -4361 -2531 3675 2658 -2205 -2855 1144
1098 1144 3725 -340 -4428 620 5103 -882 -4457 972 3403 91 -2988 -1542 2794 2526 -3171
1113 -3171 -2995 3383 2691 -3514 -2670 2700 2144 -1647 -2724 660 3898 -119 -4197 237 4429 -273
1129b73l624M238L038l005l055J312M002M36n935j09O243m89n592Q83L867J72
1145B109l186j697K984L296l205m515M117M458m603l067L349K400j496l177J19
1160b114M238P78n572k40N941o96m757L51L473O96k256k359K158L839l197m009
1176c726L722L773m009k229J904K365m21l121m19L982P66n303K69M717j21m161
1192b012L28K538J338k136k640K382L575l084l454L256K826k827k172J320K575
1207A813k16l312n00M049N81m886N03L792L23l397m52J994J895k105k643K310
1223b51L190k724k956K753K298j911k268Q43K456K03k949q11L932K73l813j31
1239a866L432R7k494p81J744J935k028k757J892L617k747k696K337K213j606j760
$$ plain form
1129 -273 -3897 341 3379 374 -2681 -1369 2633 3069 -2866 -2975 3268 2779 -2813 -1930 1937 2109
1145 2109 -1077 -2774 210 3506 301 -4214 -97 4361 -242 -3309 40 2440 944 -2233 -2114
1160 -2114 2124 2902 -2670 -2910 3031 2335 -2422 -2071 1402 2098 -158 -2517 -359 3480 283 -3726
1176 -3726 -4 3769 -240 -2469 -565 1800 1379 -1742 -2161 1821 2587 -2716 -2447 2270 2149 -2012
1192 -2012 -1684 854 2192 56 -2584 -202 3373 289 -3165 91 2917 90 -2082 -762 1813
1207 1813 1597 -1715 -2215 1834 2415 -2471 -1968 1824 2147 -1250 -1702 292 2187 82 -2561 -251
1223 -251 2939 215 -2741 12 2310 399 -1869 -1026 1430 1633 -1316 -2127 1805 2078 -1735 -1866
1239 -1866 1566 1663 -831 -1612 132 2067 39 -2718 -826 2791 44 -2652 -315 1898 292 -1468
1255a468L65K074Q87l128j190M090M18l602l17L189O8j947j106J411K485j865
1271C64k670J751L124k209k798K322J650p86j980J15K151J012l077j095L590M59
1287A923l139l47K553L37j575j285J144K541j748k747K252K336j925k052J424
1302c08J705o74k181K54K067Q26k844m59K584M79k738J3J877P16j128j732J093
1319d50K560j705k505J896K149j564k035J181J708k64j774o46K397P49k765o44
1335a712K900O27k637n47J590J045j044j730J016K242j300k617J939J985j503
1350B54j451P19J215M49j805n95K258O81k849n28K738K45j838n28J104R65m79
1367E55k220J161K335j522k310J670J868j289j256M79J232M57j760r57K700M93
$$ plain form
1255 -1468 -1103 971 1858 -1270 -2460 1630 2048 -1554 -1871 1318 1386 -561 -1667 -256 2229 364
1271 364 -2306 -555 2569 360 -2438 -116 1534 748 -1232 -1117 1034 2046 -1031 -2126 1464 1923
1287 1923 -1216 -1563 990 1327 -248 -1533 -389 2152 404 -2343 -91 2245 320 -1732 -308
1302 -308 1397 723 -1458 -1204 863 1689 -1155 -1614 970 1449 -1289 -1276 601 1317 189 -1543 -450
1319 -450 2110 405 -2100 -204 1945 381 -1654 -473 1235 971 -803 -1449 948 1697 -1068 -1712
1335 -1712 1188 1815 -822 -1369 221 1266 222 -1508 -492 1750 450 -2167 -228 1757 254
1350 254 -1197 -478 737 1186 -619 -1214 1044 1725 -1124 -1652 1086 1331 -507 -1035 69 1034 555
1367 555 -1665 -504 1831 309 -2001 -331 1537 248 -1008 -529 703 1160 -600 -1557 1143 1636
1383A636k593l82K282P5j520n70P59J602q82j932J012K280j577j904J898J050
1399A234q53j173K13J347M15k033o51K575L94k479m5K117j52j400o59R38J712
1416A500j006k227J344K088j499j598J171J342p93j136Q8J117J005k502l61K345
1432H78M38k146j35J450M37j007j005O01J958p89k118J294J746j301j627J001
1448c25J204l47j160l24J489P74j864r70K345J65j632j70J185M50p19j358P90
1465d67J800p28k156J289J710j117j279M16J157J33j480p11K089O29j893q63K277
1482H06K25j770o9J001Q25o92j627O70K066j106j589J151J487r65j099K55J075
1499F44L72j590o66J856N97k073k05J776J84j397k36M88J180o16j552Q13J740
$$ plain form
1383 1636 -957 -1339 943 1018 -502 -1072 -313 1289 407 -1525 -513 1767 190 -1714 184 1234
1399 1234 381 -792 -579 768 1183 -850 -1501 1074 1468 -1011 -1056 1061 909 -491 -1150 -212 1500
1416 1500 494 -1733 -389 1699 200 -1398 -227 1115 322 -814 -726 391 1396 -1106 -1467 878
1432 878 1316 -830 -965 485 922 -85 -1090 -489 1469 680 -1438 -144 1602 301 -1326 -325
1448 -325 879 532 -628 -952 537 1311 -553 -1523 822 987 -645 -815 370 820 101 -1257 -467
1465 -467 1333 605 -1551 -262 1448 331 -948 -532 625 758 -722 -1433 656 1285 -608 -1471 806
1482 806 1031 -739 -808 193 1018 326 -1301 -631 1435 329 -1260 -109 1378 413 -686 -431 644
1499 644 1016 -574 -1240 616 1213 -860 -1065 711 895 -502 -738 -250 930 314 -1238 -425 1315
1516A315j333j538J393J641j282r99J02J129M08j579l15J771M36j588n79J598
1532E80K11j170l70N45J211n06j733P57J779q63j483Q26R69k48j366Q3J280P51
1550A253j796q60K029L82j417o82J550K26q28o08M63J161l24j946J035J775r13
1567E00j663Q91J084k34r38l40J167P05j667q46J738Q85j697m17J248K34m42j032
1585h24M66J441o89j781J011J693j260j037N28R44R1p92o84J295R13j607p77J671
1603F02M89j624o9R26L72n49p02k5J600k40j707N72J497q31j144M43N82N17j036
1622c27q17J397R68j949l37J397N66j122l81N69O09p8j234n0J750k46k121R16
1640d90J512n28j116J87P64N17r34q56J330Q64j721l56J230N52j000o19O53Q04
$$ plain form
1516 1315 -18 -1556 -163 1478 196 -803 -701 428 836 -743 -1058 713 1149 -439 -1018 580
1532 580 791 -379 -749 -204 1007 501 -1232 -475 1304 441 -1042 -216 753 505 -861 -778 502 1253
1550 1253 -543 -1403 626 1008 -409 -1091 459 685 -143 -751 -288 873 549 -1397 -362 1413 500
1567 500 -1163 -272 812 578 -360 -700 467 1172 -495 -1341 397 1282 -415 -832 416 650 208 -824
1585 -824 -358 1083 394 -1387 -376 1317 57 -980 -452 492 583 -209 -893 402 1315 -292 -1069 602
1603 602 1091 -533 -602 324 696 147 -555 -580 1020 780 -927 -355 1142 311 -833 -390 192 709 -327
1622 -327 -1144 253 1221 -728 -1065 332 898 -224 -605 -36 573 495 -739 -789 961 715 -1406 -490
1640 -490 1022 494 -622 -435 329 846 -88 -944 386 1250 -471 -827 403 955 -45 -664 -11 793
1658G93k94j277J62J515n26j497O90J204l56r34k52J093O01j224q17J661N25j349
1676b82p64J245N51r27l97J35J342k47j319l0J797m12j677M22Q93K07q19n28J239
1695D29N10j234o65J379Q83j694m40P91M70j70o92P6J086Q7j750K11J760l79j574
1714i16O35P60J22p74m67N56J077r20j379J424R05j411m54J124L97l03o50j78
1732d52J059m5j379Q1J674m55j243L40L23O85o35q34J026R58j284r17J279P67
1750I48j146m18O34L79q9o68l09J462J45j806PJ520p3j028J59N83K33o04o71N81
1770a61J438j483j074J326P91p02p29L22O91J75j214l8J357j04j364j9J346j50
1788D08q01k82O93P85n27j503R47J538j315r53J144O62p23m32K38N20L6q05n70
$$ plain form
1658 793 499 -778 -616 899 373 -1124 -434 770 414 -520 -772 321 922 -302 -1119 542 1067 -282
1676 -282 -1046 199 750 -177 -574 -439 903 656 -663 -693 1104 692 -985 -563 330 537 -282 -810 429
1695 429 939 -295 -960 419 1302 -392 -832 -41 429 259 -433 -357 729 816 -934 -723 1037 658 -916
1714 -916 -281 479 601 -173 -640 -84 993 73 -1306 118 1023 -388 -842 282 679 376 -274 -452
1732 -452 607 562 -817 -736 938 483 -760 -420 -97 588 -47 -881 145 1103 -181 -1098 181 948
1750 948 -198 -616 18 397 308 -360 -669 793 938 -868 -861 659 586 -442 -283 300 533 -71 -742 -161
1770 -161 1277 -206 -1280 46 837 135 -594 -272 419 594 -620 -658 699 595 -769 -788 558 408
1788 408 -393 -675 18 803 276 -1227 -280 1258 -57 -1010 134 796 73 -359 -121 399 435 -370 -940
1807i40J519K21j401PJ216j84q18j42L98J022q62r14O70J197q20q94P47Q34n61
1826B95p74r4P08O70j163n62J559Q7j384O6Q63J75k95p80J77J212k89j455Q53
1845a31J486j128j163P94P19l62o63j52N33J020j393l47J388K77j226j59N00M55
1863D48l22p74L09J340n04j328O44J081q33q67N85N11O3l29q82R73Q41j596m43
1882a083J657K65r37m54Q87J07L7q99k56J631n62j232O27R94o25n07n6N60L28
1901D82p30n45R19Q37j244p03J433J19p04l36K44O34K55j393N6J659m95j281M70
1920c23J118n83n36M3M41O06p68q92J091P96j310l38Q69L87o64k20K4R17p6j228
1940f46K8J588n76r94J66R75m74m36j09M63P46o51j207J412Q11j275o71Q64K05
$$ plain form
1807 -940 579 800 -601 -594 622 438 -380 -522 -124 898 36 -878 -208 989 169 -725 22 856 295
1826 295 -479 -573 135 805 -358 -920 639 726 -658 -592 271 446 151 -629 -452 760 471 -984 -131
1845 -131 1355 227 -936 -142 577 215 -448 -600 -67 953 -440 -787 601 878 -348 -507 -7 448
1863 448 126 -648 -339 1001 497 -831 -187 894 61 -806 -221 290 353 24 -858 115 956 -640 -1083
1882 -1083 574 839 -98 -552 335 442 479 -420 -676 955 393 -839 -212 782 157 -350 -406 154 482
1901 482 -248 -793 126 963 -281 -984 449 568 -136 -472 -228 406 661 -732 -676 983 488 -793 -323
1920 -323 795 212 -324 -281 160 766 -2 -894 197 993 -317 -655 214 601 -63 -283 -259 658 582 -646
1940 -646 -618 970 394 -600 -434 541 67 -369 -478 -15 731 80 -1127 285 1096 -179 -850 14 219
1959B19k92k16j38Q77K32j108k43J389Q6j762K74J155k40k75m75N15N17l43r29
1978g57P37P91j068k96N42L82p3p65L5J112Q2j348L05J189k06j029N2K67L56j66
1998A42o68M02P78k90j514J267O08p89l76J48Q03j85n32m25R86M42j152l60J183
2017D68j59o75J62M28J90m09o91M26J036n64j181P84N60l38m78K85M76J61o54
2036a73m53J158j5j080M11M32J75p53k5M14M19k56j057O85J229j039n23M08M90
2055D47m57m69J35L32O38j013j84J111K58j098k36Q71k1l93j90O8Q58m20o37K01
2075a99R93q94l65L43M21l20j96jK07N53o45m77R64K72j125K9Q29k9j85p33M31
2096a27P02n91n89N23Q09p02m65J66O79L6n63p19J014J82p21k22R43m6o32J05
$$ plain form
1959 219 -73 -289 -427 450 682 -426 -669 720 806 -956 -682 473 233 -42 -517 -2 515 172 -757
1978 -757 -20 771 -297 -593 -51 331 258 -507 -472 640 722 -626 -321 868 662 -367 -315 -48 308 142
1998 142 -526 -124 654 364 -1150 117 725 -64 -440 -292 511 326 -206 -631 355 797 -355 -715 468
2017 468 309 -366 -204 224 414 5 -686 -260 776 212 -969 -185 375 37 -441 -156 320 481 -173
2036 -173 -626 532 517 -563 -152 280 455 -298 -323 91 510 254 -803 -118 1111 72 -451 -43 447
2055 447 -10 -479 -344 -12 626 -387 -571 540 798 -300 -536 335 314 -79 -269 -201 657 237 -400 -199
2075 -199 794 -100 -465 -122 299 -21 -217 -218 -11 542 -103 -580 384 656 -469 -440 389 360 175 -558 -127
2096 -127 575 -16 -605 -82 727 25 -440 -274 405 441 -122 -841 173 355 -366 -588 355 309 -323 -218
2116b18K72K76j62m80j07P09K94j018K73O75m17m32K68M34k6l85l55O13L56n70
2136@m66R28r0p39k2M66K50j41m08j34Q46j81j007M16P21m37j86J15K85J80l13
2157H3p87Q20M78p03m26Q77J09p76q5J28O86k98k22m68J057N4j007L79L85k55
2177B9l24K07L10Q3n34l48O40O99r85k10O72R9j62n28L7N53r4p38N9J090l26o39
2199d10L07O80l68n68K65R2L93n16n27J069J96r53l17P41J67k95q3j8N53k93l91
2220b76r1P46k70l16r9O16j90l76j34N35L65n92k97L82N82o55j94M90k4r4l05
2241a97k18O02L2n60j3Q99m35l68J15N21j56m50N0L05L82l67o01N88M7k96j04
2262b24J98P9L84p10J00N23P5q80n3Q39k76k97j87M74o4o9n8R1M83n15l01O17
$$ plain form
2116 -218 54 330 168 -312 -419 290 584 -434 -161 514 97 -335 -67 367 341 -44 -399 214 570 0
2136 0 -466 462 372 -367 -389 77 327 186 -222 -356 490 309 -698 -282 439 2 -184 -69 216 396 83
2157 83 -704 116 594 -109 -535 342 451 -325 -410 -282 404 106 -116 -584 473 527 -480 -101 284 29
2177 29 -295 -88 222 305 -229 -577 63 762 -223 -433 239 338 176 -352 -315 238 144 -594 -535 555 229 -410
2199 -410 -103 577 209 -359 -94 -2 391 -125 -652 417 613 -340 -657 84 251 -44 -127 -145 408 115 -276
2220 -276 -367 379 109 -207 -306 310 120 -256 -390 145 510 -82 -379 3 585 -70 -264 226 202 108 -197
2241 -197 -415 187 219 -341 -354 545 110 -258 -143 378 222 -228 -178 127 509 142 -459 129 176 -120 -224
2262 -224 -26 53 437 -273 -173 350 425 -455 -508 331 55 -242 -429 45 -19 -88 -146 -55 428 -87 -388 229
2284B29j1k48j80J16K99l7l13m33N95K62n18j60P39k35l25J70O9Q1l1n00L40M00
2306C09l01m36O83j02m04jK24lK68n33P4N15p4o76L91K60J54l94k07L69J29N8
2328C03p16K96N47m33k36J95J9L7j73p8M92k30j02l9J75K36m83j92O14J4k72J4
2350a2M2L14k99l17J61N79o35oK01J92k08k72n8K98J78m31J98L91o2l45j4p0M07
2373B32j11n60L67K45j14l48M64K20n66K4N2K88j20l5l79L23J71k91k81N56O9
2394B06k22RJ17P0k83j00P1L49P6n50M35K34n00l07N36j69L47l67o3K42K30o69
2416c08m4Q33l00l51J40rj01M17j94l5L8P3l95J57J17l0j51K5K2K52j49k65K74
2439A6J88m12N5N73l53p8j5j90M92p2l83P2K03k02J5K41J4l57M4k5j42J70K77
$$ plain form
2284 229 218 -30 -210 -94 205 168 -145 -578 17 279 -239 -399 340 105 -220 -50 19 100 69 -431 -91 309
2306 309 8 -428 255 153 -251 -252 -28 -31 237 -296 -222 293 219 -457 -66 194 348 -46 -253 116 245 303
2328 303 -413 -117 430 -3 -239 -44 -25 12 -161 -239 253 23 -79 -118 57 293 -190 -382 232 246 -26 -12
2350 -12 30 344 45 -272 -111 468 -167 -173 28 220 12 -260 -318 -20 158 -273 -75 316 254 -91 -105 -175 232
2373 232 121 -439 -72 173 59 -289 175 395 -171 -147 -95 193 73 38 -341 -18 153 -138 -419 137 206
2394 206 -16 -7 110 180 -103 -203 -132 217 293 -257 178 412 -88 -395 141 -28 319 -48 -111 131 361 -308
2416 -308 -352 481 181 -170 -30 -39 -140 277 83 48 86 159 -236 -79 38 8 -143 -118 -96 156 7 -258 16
2439 16 204 -208 -153 420 67 -11 -26 -216 276 204 -179 -107 96 -106 -91 150 164 -193 -149 -174 -316 -146 131
2462A31m05M82o6l01m5L54p3k41n0JN69l32m44M18K93j34k78N2J0R1Pr5j7L54
2486B81l87k70M42o3j97J55o9m6J09k15J48M12j75k20J91J18j03l91K09K47M3
2507B19l39P6Q4J36p0m68N08O7j22J6r4J45J6m08J41K30J8j88j11N56k30m36K73
2530A9K94j87l69K0J65J93k54J52J4N5l03j13J94J51m8k50M2N82k23m35L23K65
2552B87l39n2J28nJ98l6k95J35J13k89J04j3L28n08J38R2L3O3J1k49L58Q4l82
2575i6o0J24J53k5j98J07L79o63L30j39M15l15j49L6K23j22k78M27K26j80l27
2596a32m7L15j16l29L09j10P9nJ27k3j3l45L32J00J79m57J13J98j54RQ9k64M6
2619i9J25n8K46q9j77k05O9K64k06K89l58J82j13n3j94O86k15k31J30J42k83M3
$$ plain form
2462 131 -274 208 142 -159 -204 150 77 -164 -214 -213 356 24 -420 -2 291 157 -121 -69 -59 32 39 -56 -73 281
2486 281 -106 -376 66 3 -194 -39 -108 -154 -45 -260 -112 300 125 -95 96 214 111 -280 -71 176 219
2507 219 -120 -44 40 176 106 -362 146 213 91 107 13 158 174 -234 -93 137 155 -33 -144 412 182 -254 19
2530 19 313 126 -243 -223 -58 135 -119 33 47 102 -201 -314 -120 31 -17 -267 -225 357 134 -301 22 287
2552 287 -52 -104 24 19 217 181 -114 21 134 -155 -51 -64 264 -244 -106 -14 19 82 93 -156 202 286 -96
2575 -96 -156 -32 121 96 -102 5 384 -279 51 -88 327 12 -137 -101 122 0 -278 149 375 195 -132
2596 -132 -179 136 20 -309 0 -110 -31 -36 91 68 55 -290 42 142 321 -136 -23 175 21 30 119 -145 -99
2619 -99 26 -32 214 125 -52 -257 -188 76 -130 159 -199 -17 -130 -183 -377 309 94 -137 -7 135 -148 -105
2641a05K51k27J07j19J78j24J97O9l07K72j54Q5j35J12J3J65k41j10J40K89j78
2662A78n07L22K26k19j94K95l3J02j23j8K97l14q7J98o8j73j00k6J70K49k89j1
2684a25K82q5k6m5r8J14q8K02L5J72k11k99K37P0n9j43j40J86J89n6k46K81l6
2707A11j87j30K86J12J8l15jL28j11p1j75K00k4k71K20K60l05j02%L9J68Rk17
2730a58Q0L97l03k02L80J39m49rK1J79j64K82m37M00j9l61K57M8j04r0J39j60
2752a34L26l48J17K49nk46o6K23j04k7OL6J06j23k71J47K39k69o5P2J14R9k87
2775b11O5L38k01K52l89K42j2k89K33j34J34k84J81j82L64k4q0n4P0q2LP2n7n1
2799i6K55l66j02N23j66j19J26j18j69R6J49n9K07j27q4NJ47j93R9K93j87m2k11
$$ plain form
2641 -105 146 -81 26 -93 85 -39 158 227 -80 192 38 123 -12 100 113 278 37 -73 67 356 178
2662 178 -329 -7 219 0 -194 101 68 170 47 29 326 12 -75 123 55 -118 -218 -244 -74 175 -114 -125
2684 -125 157 72 46 1 -97 17 -71 131 166 338 127 -172 65 135 76 -67 -207 -21 168 112 -134 147 111
2707 111 -76 -206 80 192 210 -105 -106 222 111 40 -135 65 41 -230 -10 250 -55 -157 -157 -118 50 59 -158
2730 -158 -78 319 16 -186 194 333 -116 -125 -104 75 -89 193 -244 156 137 -224 33 81 -23 -113 26 -134
2752 -134 192 -156 -39 210 205 -41 -107 116 12 -15 -9 27 133 10 -261 -114 125 -144 -209 -137 -23 76 -211
2775 -211 -146 192 -9 243 -146 96 84 -205 28 -106 28 -256 -75 -257 107 83 3 -51 19 -63 -60 12 -45 -96
2799 -96 159 -207 -309 214 48 -71 55 -63 -232 -136 13 -46 161 34 -50 -45 102 -91 8 301 114 72 -139
2822a39K47K8j82O6m7J46r1k12Q2J17Q6j56j01J03M7p2q7L89Ml10pJ02J82k66
2846g1L2M8J01j12J01k33J93k04q5K93N0J44l04M7j25K94j51p0n5J07L0J00N1
2869A81j91m7O7j53L13j56o1J92j10j58O9J42n2j74L4M5J32J10l01j4K21P0j77
2892a8R6k3k19K85lj51K99j64r0j64J68M0j43K34j01K24j19k16L85k29k97J37
2914f9K00l3k46K28j82J85K37k39j29j30J36K68k63R3j63J80l39R9L3R6m5J23
2936D0P2k04J63j80L88m74M1L90k58k01K70j85K17j79k62J44P3K82J5m9q6Qj13
2959h8K17j21j9N3Q1j48J77j98R9J19o0r8j45K58k63l7R3N0Qj10R4J63l15j8p5
2984b83M6L18r6K9j13r5L56l00k3K6K29J58j84m0r4J06j29N1P2j20l8J35J42k49
$$ plain form
2822 -139 108 136 -46 20 -27 119 28 -184 -102 15 101 -55 -156 -53 -6 -78 -165 224 228 -82 -89 13 195 -71
2846 -71 -39 9 110 -2 99 -134 59 -145 -230 63 113 257 -47 0 -125 169 18 -52 -107 0 30 130 181
2869 181 -10 -57 10 -143 170 14 -47 145 35 -123 -54 88 36 -138 -104 -59 73 183 -118 -132 89 159 -18
2892 -18 78 55 -164 121 118 -33 266 102 12 -152 16 56 -87 147 46 270 151 -65 320 91 -206 -69
2914 -69 131 98 -148 80 -102 83 320 81 -48 -178 -42 226 -37 56 -107 73 -266 -167 -134 -38 -83 40
2936 40 112 -92 71 -109 279 -195 -154 236 -22 -223 47 -138 79 -100 -362 -218 -145 137 152 103 17 25 -88
2959 -88 129 8 -11 42 123 -25 152 -46 53 172 112 14 -131 127 -136 -173 -80 -30 -22 -132 -38 125 -190 -208 -283
2984 -283 -237 81 -15 14 -99 -194 162 -138 -161 -135 94 252 68 28 -66 40 -89 -38 34 -86 -124 11 153 -96
3008i6J8j46K07J65l35K17p7K07L2k73N0lK36k98J22J18j39k6J61Qk25R2j20j64
3032b69M27k65L08j48j12J01K0J27o8j20k02j8M66n3l33J31Q8N7k89O6k8L49k94
3055e9J67lk01K17l61J94J56m41M09j24K37k35L7J20k33p2J45n1J74j41J59nj53
3078f4j74L4P5J34j32N1P8k64J56m5K53R7k33j8J04L7j40j07J60N4Q3k43p7O1
3102a20L26k19o5p4L83j90l2K6p0K8PJ60l03m6j5K09J53j36j08l2K40k66K9K93
3126A78k88K10N5l96K3K79M5k00K92j4l74K82L2K0j09M8k90J07R0J08k79M3J53
3149A5k97L00J60m6l29M75k19l5k34J20J93M3j73R0m7L02qj80l41L57p3l37K50
3172a4J83J23k98rJK58k23J22M9l73L89n01K30O1j73L03j37P1K87m08k30J16K00
$$ plain form
3008 -96 -78 -224 -17 148 -187 30 -47 160 192 -81 -31 -34 202 -96 26 144 5 -21 140 148 -77 15 -105 -269
3032 -269 158 -107 201 53 -59 42 62 189 121 1 -201 -219 247 194 -139 -8 80 137 -152 -86 -114 235 -59
3055 -59 108 105 -96 121 -240 -46 110 -331 78 -46 191 -44 -7 113 -120 -192 -47 -98 76 -65 94 89 -64
3078 -64 -238 -204 -129 5 -127 -76 2 -262 -106 -151 102 199 -34 -52 52 89 -51 -158 2 56 139 -104 -181 -120
3102 -120 206 -13 -78 -152 231 41 9 35 -35 -7 0 160 -143 -189 -204 5 158 22 -86 -118 122 -144 -115 178
3126 178 -110 100 155 -241 -218 61 106 -94 198 184 -190 92 124 144 35 83 -207 -100 -10 98 -181 -138 15
3149 15 -282 18 178 132 -197 278 59 24 -210 -90 103 146 -27 63 16 318 310 130 -211 146 73 -264 -14
3172 -14 169 292 -6 -15 -14 244 21 143 192 -181 208 -293 -63 -2 -175 128 -9 62 349 -59 -289 -173 27
3195B7k24K60nj38m4Q2m8K28j36k18J11K32r7q2J5j23M25k94N5k1K43m95J69J65
3219H7l12m5L46j33N4ok30K91J23O2l23L9K54k71j34L00J21j50j59L6L02j50k68
3242a66J15L12m7l86J81K65l24Pk4l8K38n8l56N5L04J19j83J32j07ML4k36NJ54
3266@k67M60j99R8Q5j49J80j13k1k68K0K28J39n57M75n5j30j63k6K01J45m7j50
3289a14J08J75k81L26j87J1r4L49k10j64K55l61O8P09n79j48K10j1L5k15J35p1
3311e4K69k6o09M42K31m45J7L14Nl27L16j27r9K42k68K8K40j12k59Q6K50J09j12
3334A11k73L42j58K4k76N59j83k62J63J72l35L31k77QJ44j03k92J21O1K55k73
3355a41K01oJ05Kj78J2K33r8m62L98P2j51q4J1J14L82k38j70J10j04j29J53O4
$$ plain form
3195 27 -197 63 58 -80 -124 -42 -90 138 2 -216 -105 127 30 -52 -37 -160 265 -29 26 5 248 -247 -78 87
3219 87 -225 -270 76 -57 -3 -9 -239 52 175 237 -86 -47 207 -64 -198 102 223 73 -86 -50 252 102 -166
3242 -166 -51 261 214 -172 9 274 -50 -43 -67 -105 133 75 -281 -226 78 197 14 146 39 43 77 -159 -154 0
3266 0 -267 193 -6 92 177 28 208 95 74 -194 -174 54 193 -364 111 56 -74 -237 -263 -62 83 36 -114
3289 -114 -6 169 -112 214 27 38 -56 293 83 -81 174 -187 -119 590 11 -137 73 62 97 -118 17 -54
3311 -54 215 189 -420 22 253 -192 -175 139 144 -183 133 6 -93 149 -119 -91 149 37 -222 -136 114 223 111
3334 111 -162 180 22 46 -230 329 146 -116 47 219 -116 215 -62 -54 90 -13 -305 -184 -123 132 -141
3355 -141 60 54 159 161 -17 -5 228 130 -332 66 138 -13 -97 -86 28 410 172 2 112 8 -121 32 96
3378I6j6l49K95O6m4k11qJ67m2J02k23J57L94m21n3J64r3l0k07N8K90J64l23j01
3402a68K82L8k44l3P7J89j60m19L17K26k54k05L54K74m01pJ32O3lp4j75K71k11
3425a31j72K4L23j79L28m77K26K84l71j09L79O0j76j47Q2n6R8J08r5J40j63N9
3447C5m53L95k7k57M58j0o3P6m87M99P5k55j14J16J61k14J48L4j6k22J02RL8J88
3471B16l00k08L64j0j10J3J19j13J57k90m2M17l24k18O24j43k41j3J4K05l6j25
3493d4j66M02J19l11j82K25Q3k55Q8J78k80K09j52r4L55j66k54K43L68k93j11
3514c8Q2k4J36j77r1qK97l00k17M86m6N8l35qP6L64m55j52O94k76l43J2L55k18
3538a28M9J48j7j65K08m63N72O4n3l30j2K47j91J44J7K8k06j18QJ36J26k32L7
$$ plain form
3378 96 80 -269 26 92 48 -163 -171 -4 -46 56 -167 -10 384 -37 -90 74 -19 -49 -256 -198 92 256 -67 -168
3402 -168 114 152 -92 -125 -48 141 -19 -438 -121 105 -149 -354 0 274 -127 -134 -2 61 58 -16 -191 80 -131
3425 -131 -303 -279 44 -135 193 -284 -58 226 -145 -254 125 185 9 -138 -56 -112 -14 94 -1 139 -24 35
3447 35 -418 -23 -50 -307 151 141 78 154 -333 166 241 -14 -128 -12 149 -65 83 117 101 -121 -19 -10 28 216
3471 216 -84 -292 72 62 -48 -35 84 -29 128 -162 -204 213 -111 -329 295 152 -89 -102 -88 117 81 -44
3493 -44 -210 192 311 0 -182 43 126 -129 -41 137 -143 66 -86 -180 175 9 -245 -2 366 73 -38
3514 -38 44 20 156 -21 -112 -120 177 -123 -340 146 100 158 -177 -185 -109 255 -200 -352 342 66 -277 -265 90 -128
3538 -128 -79 69 52 -113 95 -368 204 268 215 -115 -127 120 -71 73 90 118 -88 -206 -198 -62 64 -168 -131
3561a31J89j45J73j28j1K08K1k86J00J76j77L5p0J4J7R0k55L47Om35J24M99l04
3584E7j60K21k84K88k38m9k56N36k57j12L60K7k22J01JN4j67L5k24K64K67l05
3606f3J05K19k96P9o9P5j44J22k7k45L14rk41M75J9m00J79j14o6J04j02k97L55
3629b7M6j32j03M64j17k30K46j46K24m0m18L63p7J34l38J81L06m02q4K34j05K72
3651B51l34k30K33Q6j88j34O41j34k56j06J98k0K33k74k34M62k02k66L80J03M0
3672B49l39nJ0J44j9j18R7J06l53j56O60l90Q3N8J24K6m1l0j06J71k98R8N0J07
3696A28k76J5J1K03nj48n3K10r9n7j25L53m3k50J20J35j05L2L4M4J05r5l34K00
3720@r8j05J58Q3o3J39R6l64L13j21j0j11K72l66J05n1L0K65k49k30L70J63k55
$$ plain form
3561 -131 58 -87 86 -42 -53 155 176 -110 -10 166 -11 24 -46 -32 -15 75 -180 167 173 -262 -138 361 57
3584 57 -103 118 -166 122 -116 -165 -421 115 -142 -254 106 133 -89 12 13 67 -100 -65 -289 -25 242 -63
3606 -63 42 261 -35 44 -25 50 -94 28 1 -244 70 61 -180 295 314 -86 93 -21 -87 17 -85 -382 -27
3629 -27 19 -113 -216 248 131 -99 147 1 225 185 -233 130 53 187 -151 30 336 -66 -150 84 -21 251
3651 251 -83 -313 -80 6 -182 -316 325 191 -65 -171 27 7 240 -34 -268 194 -8 -274 106 209 249
3672 249 -90 -95 -85 59 40 -78 19 125 -228 -384 276 -114 -31 27 151 177 136 106 0 171 -127 -29 21 128
3696 128 -148 -133 -122 81 76 -72 -125 85 -14 -71 -196 157 114 -136 -16 119 14 46 80 124 229 134 -200 0
3720 0 -98 -203 -45 38 -25 114 210 -154 159 38 28 -83 189 -177 -72 -123 -93 172 -77 -307 63 226 -29
3743b9k86K36P9k22L24l43K49J77p5j36J71r1j44P6jJ47P0k59l18M98r4k03o2
3766b36L95l63J92N6J84l83J71j42K27K42k59k82N61m09k07K93Q3J57k33k18J8
3787a53L15N1m21K44L18m49M8O8k0k7q2j63J74M83n83j98L91L5j83K53l24L77
3809A54J11l33r4K62j08j73K24Q2J2r7nj34K99k66j00K70J5j66k12K91N2k78K77
3832H3k12J78J04l81J34K58J05m08K37n8k97J60K95k82L10o7m39K40L32o09J21
3853a96M25m43M3K16k14K35P1k94j10O34l86l09M81l06K41k02l0N3K28l8l12J28
3875h5J75j85J2J91p9k7k01k89M77K53l44RL39l86K21k57L78j06k0l19N4M67l6
3898B42l15N3O8j22K03l7j80J02n2o0K58ll67j30N48L4l06j8K27j64J62k14J53
$$ plain form
3743 -29 -315 -79 0 -222 102 -241 8 185 110 -26 145 54 -90 -14 -15 132 202 -57 -375 123 29 -174 -236
3766 -236 159 -204 -12 44 228 -155 16 -126 101 343 84 -198 363 -46 -253 40 123 280 47 -171 -153
3787 -153 162 213 -208 36 354 -95 -47 21 1 -26 -108 -271 -97 386 -197 -395 -4 31 -152 101 -223 154
3809 154 265 -68 -162 100 -8 -181 43 125 137 40 35 -99 200 -66 -166 104 119 -47 -259 32 84 -194 83
3832 83 -129 49 153 -228 -94 164 269 -139 98 40 -257 -97 198 -84 226 159 -280 -40 292 -317 -196
3853 -196 229 -214 -171 45 -169 66 137 -157 -267 367 -19 -328 153 -153 88 -114 -144 -91 137 99 -213 -85
3875 -85 90 -95 -83 108 29 2 -199 -488 -11 242 -102 -93 246 -140 81 -176 202 96 76 -243 -189 278 242
3898 242 -73 -20 48 -74 129 92 -88 14 -38 -98 160 157 -210 -340 208 242 -64 -82 145 -19 143 -71 82
3921H2J16j20n9l2K80k22j2J22pRj80k78L21J21k25J89k5J3p1L4j6K36j95j11
3945c0j80N10k76l24K16L8J52j38j74j5L87k39j46M23j90l37J43l3J10o0O3O7
3967c3K97l06J36o7K69k63kR5j77n1K18j04k25L20j47Q9RK46l65j55K12j30J69
3990C5P8k37M18j63j52j60K06J04l88L60j69o0L41l34o4M76j96l92K97j30k61
4011c91K98L40J23l73J13l19L08J11m64L38K50k96n4J1q3L06k13k02J79K99m41
4032a60J04k1K95l50J70k8K0K61l98k69M09K46k91r3M19j53l95K05j26J89k8j18
4054a12R9L80k57l49N49j62k00K48j68l37L72j95J0K87l3k63K84P7j75k59l2N0
4076a86L04J70n47N49k92K44l77J88m8OR4k11P3K28m18L65m5P3n05K81O9J2op5
$$ plain form
3921 82 198 78 19 -13 267 45 33 155 148 157 -23 -301 20 141 -84 105 80 93 22 56 40 276 81 -30
3945 -30 -210 300 24 -300 -84 -46 106 -32 -206 -221 166 -73 -219 204 14 -323 -180 -213 -103 -163 -100 -33
3967 -33 264 -42 94 27 296 33 31 126 -51 -102 116 12 -213 107 -40 49 58 304 -61 -216 -4 -134 35
3990 35 113 -124 294 131 -21 -181 25 129 -259 101 -68 -128 213 -121 -185 291 95 -297 0 -130 -391
4011 -391 -93 247 370 -3 110 -209 99 210 -254 84 334 38 -16 -5 -88 218 5 -197 -18 281 -160
4032 -160 -56 -77 218 -132 38 10 30 291 -107 -376 33 279 -12 -105 314 161 -234 -29 -155 34 6 -112
4054 -112 -13 367 110 -239 310 148 -52 196 28 -309 63 -132 -122 165 132 -131 153 230 55 -204 -236 -186
4076 -186 118 288 -259 290 -2 242 -135 53 5 11 105 -106 -33 195 -223 142 97 170 -335 -54 15 27 21 -54
4100e4L7Q2K48q30M99K75k98J08m2o8J19r4j36m5L26k26k05K81j71Q9OK05m7j13
4124e4J77j68J86J70l84J02O3l23J64J00J2K3r0R4j13p9J74m11M62p1k59L62m32
4147b95J69J13k19L38O5k94Qn8K27l41K48K18L7k29p0j12K87J2k26j13M67j44
4169H8k61K5K61j59K89l01m2K85k02k09K01M6k11J12K10j04J15j04l35L87m9L
4191D5M3Mq0n6J89m4o8J44k76k9J11j22j56K62P3k81K60K77j47J50k54l7k6K40
4215B22k87j82M73k84r6L08k59K35P4j1j58N4N6l93L08Oj76L79k18o9K15l25N0
4238g8K59l41L6L7J82p3k3p4k25K47J26q1k65M72k15J16k56L85l84j6J57o6K21
4261A41J7k74L6J36j10j4J62n9L8P8M4k91J07O1k70K18L9q9J32k46K4L29j57O6
$$ plain form
4100 -54 -17 65 313 -517 -18 257 -41 67 25 -43 76 -18 -154 -199 127 -99 -304 -23 -194 -105 -99 106 59 -54
4124 -54 123 -45 141 311 -73 29 92 -231 -67 33 45 68 -22 72 -41 -120 54 -357 105 34 -225 137 -295
4147 -295 -126 -13 -232 106 171 -123 -115 -173 54 -287 -39 179 216 -13 -83 -195 92 104 -122 -235 232 88
4169 88 -173 -148 113 -46 243 -58 -100 185 -17 -226 -25 21 -190 -78 132 28 143 39 -296 91 42 45
4191 45 88 92 12 -44 145 101 33 177 -99 -128 -17 -139 -295 -33 40 -241 19 296 149 299 45 8 -18 222
4215 222 -65 -247 226 -58 -154 154 -105 130 204 193 35 89 145 -248 60 66 -110 269 51 -18 197 -128 -78
4238 -78 181 -160 -124 -87 95 22 -1 -75 -300 -53 73 -8 -273 199 -16 100 -156 229 -155 -171 -14 -80 141
4261 141 158 -116 -80 56 -54 -68 94 35 73 151 195 -96 11 72 -198 20 59 -30 102 -144 -120 209 52 118
4285A18J19j85Q7P8j32q8J70n0j91K65j34m1n2M8j26L4K88k72R0N4j85l4K07l43
4309b75K47K90j63j57Q6P6j60K6Q4l05N61m21l9L72m24R0R6N0K0j73R3o4o8Q0
4333g8j64J87J44o3J14PK2k33J47N0l03L93k08J26j7l9o1p5J89m61L51l6J39j18
4357A3N2p7r3J74r9m2K37j52j45K42r1N3J65k03j16K17n2l43J88jM1N9m2J31l3
4382H3k33J32J04J15l91K77o5j91Q9Q5K9l0P0Rj47P8k6K2K08k24O5N5q5l7O8j05
4408d5j43j1M13l46J99J54m10J09LJ7K09Q8k24J26k6j85k35M89j71j83M52m16
4430a36J30M2k01l1K88j04r5J40j86J06m4k28K35K54K6l41j59L83j73J55N4n7
4452E8q7P0p6K18j9j97N3l3K37l46M3J47j15O2j12n2J36J69k63j90L34M5j98J50
$$ plain form
4285 118 237 52 139 217 85 -3 167 117 -74 191 57 16 -36 12 -114 -80 208 -64 26 80 -105 -139 68 -275
4309 -275 -28 262 99 -58 28 104 -56 -30 54 -251 310 -111 -150 222 -202 -112 -16 34 54 -119 -26 -90 -158 -78
4333 -78 -242 -55 89 26 140 147 169 -64 83 133 -170 223 15 141 124 85 24 -51 138 -323 28 -8 131 13
4357 13 65 -12 -105 69 -30 -72 165 13 -132 110 19 72 237 34 -82 135 83 -260 -72 -73 -32 27 -15 116 83
4382 83 -150 -18 86 201 -190 87 22 -169 -80 5 34 4 74 83 -64 14 -12 10 218 -6 59 114 29 -8 60 -45
4408 -45 -188 -199 214 -132 67 221 -189 -80 -77 -60 149 237 13 139 113 -72 -307 182 11 -172 280 -136
4430 -136 -6 36 -165 -196 92 -12 -107 33 -153 -47 -91 -319 -84 170 196 -145 -304 79 -94 61 115 58
4452 58 -29 41 -35 183 164 -33 20 -13 224 -122 -79 68 -47 15 -97 -149 -13 156 -107 -297 37 82 -116 34
4476C4l12M38j83k1j76L67n1m5P1L0k96J30q6J56J69l43O8j23M57j75n0m0J17
4499A36qJ20l81L49j63j93j34L34j30k11K78L3R4L9j32n1J0J30l40O09J22r07
4521c96K27K11J84j14Q5Kj95J4k22J67J49j96L4J12k57j9M18l50L08k52N9k90
4543c21K26K17n07M60k36J28K02l2l60R8J03k30J71R0k3k00J74J46k73K55j42
4564e4L9L1qn2J07N6j58N1j10P6K13k9k33J23J42l13J64J61k22J03k87K70m0j98
4588a68r3J10J63j13K23J19l42J56j09rR2O6j1j15J6r5j9L89k16l6J15k16o2J40
4612a5j66J90k0M13m68j83M79m05K13M1j24J98j6k17J28k65L73k94K46rj64Q0
4634A5j9k23J30m2J2p5M05l35K93k08K84k00N2q2p1R3o9n0J74j17K4L74m91J38
$$ plain form
4476 34 -278 160 -23 -44 -220 147 96 51 122 152 -144 -14 -100 56 225 -118 -50 -173 284 109 59 19 136
4499 136 128 248 -133 216 53 -140 -274 60 -70 -281 -3 30 124 163 31 -20 -10 120 -220 389 511 -396
4521 -396 -169 42 226 112 197 199 4 18 -204 -37 112 -84 -50 62 -195 -214 204 -146 162 -90 -31 -321
4543 -321 -95 122 -385 75 -161 -33 169 137 -223 -125 -22 -252 -81 9 -14 -214 -40 106 -167 88 -54
4564 -54 -15 16 8 -44 63 119 -39 12 -98 -22 191 162 -71 52 194 -119 45 206 -16 87 -200 70 30 -168
4588 -168 -261 -151 12 -101 122 241 -101 55 -54 -63 29 95 84 -31 -15 -110 -129 260 44 8 123 -93 -155 -15
4612 -15 -181 9 -11 402 -66 -249 230 -175 38 79 -45 153 137 -80 48 -217 156 -138 108 99 -65 15
4634 15 -4 -227 -97 -139 -127 -202 203 -132 161 -47 237 37 89 7 -64 29 -40 -90 84 -33 -9 365 -126 12
4658A2M0L7j45M7j69NK09J3j87K15l5m9K8M3k92J22K95j67j20L27l4j23k52L36
4682A56k70JJ52p3J67k69J77k19L15k60J81M1k97J03R4o4J21r9m3k7N6J28k01
4705a30J09Q8q8j6j8m8J48K18k75L1j43P2J41j33j45m4K24r6R2M8r0O4J72J1l4
4730A58l08J20K09l01K34j01K3j4q2Rj11J84L4l01K76qJ8o6l7k8K22N0j80j19
4754a19K44j55j8j49N5q1J02K19k9n2j09l0J61J74n17M20j33LJ40k02K77k54J67
4777A14j71J06j28J78l37L70j49k78L61q7J79l85J98MJ83j10k2N0k4j06j72J02
4799a24K72r5P0j74J53j40j24j21P0L72k1j58J65k57J84l7J9j58kJ37j2o4K42
4822A97k67J42P9l80J42K80k32L3k99K83J73n7j62r5J32J39j96J57k27J26R5M
$$ plain form
4658 12 52 89 -56 -9 -178 -173 36 49 -138 77 42 -7 21 64 -228 -106 189 22 -98 229 195 72 -180 156
4682 156 -114 -113 39 -34 133 -136 41 -178 137 -123 58 99 -198 -95 -1 -65 56 -43 -86 -113 -57 71 -130
4705 -130 -21 67 -21 -37 -55 -103 45 263 -12 19 -124 -52 89 -44 -189 -233 -9 -105 -13 35 -55 9 181 192 158
4730 158 -150 -30 179 -122 112 11 34 20 -62 -53 -164 20 54 -247 29 21 39 -27 -64 -92 130 180 0 -119
4754 -119 125 -30 -48 -197 -142 -223 -121 98 69 17 -92 -122 39 213 -304 116 -17 -14 126 -76 201 -53 114
4777 114 -57 49 -79 99 -238 132 -17 -295 66 -21 158 -227 -29 -25 158 48 26 76 52 -54 -226 -124
4799 -124 148 53 123 -51 102 -38 -162 -283 -213 159 138 -20 145 -112 72 35 54 -104 -106 31 19 -45 197
4822 197 -70 72 151 -229 -87 193 -39 -6 -305 -22 151 94 -68 -163 -31 108 -88 69 -158 -32 63 67
4844F7j39J59j76J52P1q2p0L8j30R2K01j69L2j92L67j98J68j04q6K25l64j51L24
4867C5mo8k29L47p4k6o3L24k74M24k24k19m6J80O4p2jk38L63k62j55K9K60j08
4891c7K08p3q0q0K89k39j15L72j07k8p3j22K36j18j23m0K71j94R2j1Rk30R2J95
4915I4k79N6J79k30K03K50k26m5k1r7M7J37q7P8J46n10L82J26k82P1R8j47J51
4938I4n8Nj20N3K8L0R7L8k11P2R1j62J13k98Q1J26J21k82J36l2K77m85K82r2N7
4963c9K06k83M8J67J16j95K44l56J02m5K5L5j61r7J59k8M6jJ61p9j07n5J56N6
4987G5o6kl0j24M7k87N46j25j65N5J15L4k66K93Q7l08J60r9m8k5Oj2J75K10j98
5012D8j27J88j86K16j16k40Q2m9Q6k0N8L24j10j12J29j95m5J91j54M5j22K56l41
$$ plain form
4844 67 -72 87 -89 63 134 52 -18 20 -110 -18 183 14 46 -146 221 23 191 87 1 226 -138 -289 35
4867 35 31 -37 -266 81 7 -19 -82 242 -32 392 168 -51 -97 83 147 75 74 -164 199 -63 -218 -189 71 -37
4891 -37 171 98 18 -62 227 -12 -127 245 138 110 37 -85 151 33 -90 -130 141 -53 39 28 37 -193 -101 94
4915 94 -185 -129 50 -180 23 273 47 2 -19 -116 -69 68 -19 59 205 -305 77 203 -79 -8 90 -57 94
4938 94 36 41 -79 -26 2 32 129 167 -44 28 119 -43 70 -228 -147 -21 100 -182 -46 -78 199 -286 -4 -96 -39
4963 -39 167 -116 -68 99 215 20 264 -92 10 -35 -10 25 -136 -233 -74 -102 -56 -57 104 25 -82 -137 19 75
4987 75 9 7 -23 -147 -100 -387 159 34 -131 -76 39 73 -193 100 187 -121 39 -60 -108 -133 -127 -139 36 246 48
5012 48 -79 109 -77 139 23 -217 -135 -184 -98 -118 -60 264 154 42 171 -24 -69 122 -32 13 -109 147 -194
5035a94K05j34K3K72k85J03K2N2l59K85N8J09q9j72L7R5n5o1N8m1J53o7M3j16
5059e8Q9K11m23J07R8J8p6l2N6p5j74K38J26l2j47m1J77j16J03P2j30R1K16l55
5083e7K2j7M03n34K94q2L5o5K12l16K28l83L50J04j4j41j22J87P6k02J20j7p1
5106A0k9k35K69N8Kk91K21m1mJ12J23k18k13L28k58R2J12J56j58q7K49l19K91
5129A70l15J21J17J7j04J31m9m6k36R2J99l57O8J17J96l04J88J66m44K49M1k59
5151b42J63j48J73P1o4q2J17k48M26k73K03qj42J88m1n1q5P8j81J12p8M1j18M38
5175B49m19J36Q1J62j24j14j44K36j45M0J86j11o3K01m8%j90lN7J77l89N45l02
5198A8q6nJ80j53j69Q0J7o6J38L5P8r8l2J28J98k18k69P5N6J58j84J74p0j65K38
$$ plain form
5035 -194 11 -123 -100 172 -113 -10 12 64 -295 -10 48 157 68 -104 -67 28 -27 -88 -30 -71 82 15 58 -58
5059 -58 31 242 -181 -74 24 42 -34 -66 -10 -85 -259 -21 105 73 -74 -115 62 -54 49 121 -9 82 298 -57
5083 -57 -35 -52 351 -183 111 29 64 -1 211 -105 123 -260 90 194 180 39 -83 104 180 -22 98 81 10
5106 10 -19 -254 15 73 75 -216 5 -36 -40 72 195 -23 -236 92 -166 -74 38 194 36 -51 198 -121 170
5129 170 -145 -24 93 110 6 137 88 42 -194 -102 97 -260 -192 -75 121 -183 5 171 -273 -24 17 -242
5151 -242 -79 -227 -54 17 -47 -129 -12 -260 166 -107 96 88 -54 134 93 42 -43 35 -146 -34 -112 -71 -189 249
5175 249 -170 -34 47 209 85 -29 -173 63 -82 -42 144 33 -30 171 123 123 -67 -70 -13 164 -225 320 18
5198 18 -68 -73 107 -46 -215 -135 -118 -184 -46 -11 67 -31 -63 65 263 45 -224 -149 -93 65 -119 55 -15 -180 58
5223E8o1j06K03j88r8K52o5j57n4J39q2J36j6J51j82N2L7J25R7l09L94k77P9k44
5247a16J86j74J53N5k27J48l49L81M9J5K0k93M50q0n6k3k04J6L22k43j15L79k62
5270C2k81K04O4j53O8k3J24pl7J69K1l04K22j8j38j9K6J63J1k32N4kj09K60k75
5295a80Q3J84j36j61M16m60M61j50J09k63M1J05o6l8m1J53J10j89l76M33j45K18
5317A08j37L6k02O6J05k2r8J31N1n9J43j96L44l16J07m1N5j6r1K05M1j49L8l9
5341F4O5j00n2J18j27j05J50j14J06J5p0j00J48J48k69m2J65J80k57R4n6J3J00
5364G4m3k06K02j15K95l56J13J03k4P5p8j35J75Q8k88R6J41j62L5r8J35L8j74
5387a09q3J06LJ14k78L12r2J39m1j64K47r5m6RJ07k27J20J61k67J40P0j46L5m7
$$ plain form
5223 58 -3 -109 94 -94 -192 60 -5 -162 -216 -77 -159 -23 -39 112 -70 -18 19 144 241 -68 326 49 128 -116
5247 -116 70 -104 49 104 -123 25 -324 57 106 121 141 -152 298 218 162 139 -65 -49 273 30 -85 294 32
5270 32 -249 -45 19 -134 -66 -89 35 28 -9 160 181 -123 99 81 -57 -76 -50 113 124 -108 -54 -56 -165 95 -180
5295 -180 -97 87 -49 -210 206 -254 207 57 166 -97 -56 49 -17 -55 -96 57 167 -22 -398 35 -110 108
5317 108 -29 7 -195 -129 -24 -46 -144 -13 38 -21 122 -74 270 -46 61 20 75 59 -32 173 214 65 103 64
5341 64 129 29 -23 95 -32 -137 13 -101 5 20 -50 -150 -2 146 -123 -165 0 180 -77 17 -39 -26 74
5364 74 31 -175 27 -88 207 -149 -36 67 43 118 40 -95 80 168 -120 -24 117 -45 -10 -108 27 65 -109
5387 -109 -192 -86 -83 31 -247 65 -27 112 71 -93 154 59 13 22 129 -98 22 183 -84 56 126 -20 15 -32
5411c2j52J00LJ83j71K0J56r8Mj70L55j75N9J95k94rM9J15n23N14L9lm08L06k60
5436a97L53l01J01J84j56j74K12J27j23K8K6nk32l4J94qQJ01k18K9k5K19q2j50
5460a23j3J01J78j5j62j89J72L1J12m0o6K8R9r0L8K4Q2k79L08l00K37r8k54K21
5484Bl1j71K50j60K3N6j21P5J59j93p9K87J45n7q6j38o2J88n9k26L18l06l6K72
5508E0J8q9J28j18k0j24j19K93j10J79l3j50J59k03K13K1j40M7q4jN0o3j9K88
$$ plain form
5411 -32 -184 -84 -81 102 -69 -49 107 9 13 -157 198 23 82 277 -17 -26 23 138 -385 129 168 165 -243 63 -197
5436 -197 156 -145 -44 140 -16 -190 22 149 26 54 80 75 -157 -191 3 -5 3 104 -114 -85 -110 109 27 -123
5460 -123 -136 -35 143 128 -34 -223 -51 -20 92 52 -14 14 113 23 61 85 167 -112 196 -104 133 35 -219 2
5484 2 -29 -200 50 -110 -87 -31 -152 -77 82 -111 -190 97 242 185 99 -39 -101 87 28 -198 120 -186 -222 50
5508 50 68 -21 107 -11 -31 -155 -274 19 -91 88 55 -95 64 -139 74 95 -45 2 -82 -83 -33 -96 -115 173
$$ [...]
8191A83
##END NTUPLES=NMR FID
##END=
