##TITLE=1H_CA-8759-3
 CDCl3, 8 sc, 
 23.9.2020
##JCAMPDX= 6.0         $$ Bruker NMR JCAMP-DX V2.0
##DATA TYPE= NMR FID
##DATA CLASS= NTUPLES
##ORIGIN= UXNMR, Bruker Analytische Messtechnik GmbH
##OWNER= root
$$ XWIN-NMR		Version 3.5
$$ Wed Sep 23 09:55:58 2020 Russian Standard Time (UT+4h)  she@DPX200
##.OBSERVE FREQUENCY= 200.1315066352
##.OBSERVE NUCLEUS= ^1H
##.DELAY= (6, 6)
##.ACQUISITION MODE= SIMULTANEOUS
##.ACQUISITION SCHEME= undefined
##.AVERAGES= 8
##.DIGITISER RES= 18
##SPECTROMETER/DATA SYSTEM= spect
##.PULSE SEQUENCE= zg30
##.SOLVENT NAME= CDCl3
##.SHIFT REFERENCE= (INTERNAL, CDCl3, 0, 15.7039)
##AUDIT TRAIL= $$ (NUMBER, WHEN, WHO, WHERE, WHAT)
$$ ##TITLE= Audit trail, XWIN-NMR		Version 3.5
$$ ##JCAMPDX= 5.01
$$ ##ORIGIN= Bruker BioSpin GmbH
$$ ##OWNER= she
$$ F:/spectra/data/she/nmr/H-F/1/audita.txt
$$ ##AUDIT TRAIL=  $$ (NUMBER, WHEN, WHO, WHERE, WHAT)
(   1,<2020-09-23 09:55:00.39 +0400>,<she>,<DPX200>,
      <created by zg, POWCHK disabled, PULCHK disabled
       configuration hash MD5:
       00 E9 B6 7A A2 85 ED C7 34 08 36 98 17 FE 4E 26
       data hash MD5: 16K
       CC 8D 5F 2F 75 01 F7 2B D0 03 C5 83 A4 46 6B 89>)
$$ ##END=
$$ 
$$ hash MD5
$$ 17 EC B9 25 F6 D2 0B 94 A7 50 0C EE 71 83 F4 35
##$RELAX= 
##$RELAX= 
##$RELAX= 
##$RELAX= 
##$RELAX= 
##$RELAX= 
$$ Bruker specific parameters
$$ --------------------------
##$DU= <F:/spectra>
##$EXPNO= 1
##$NAME= <H-F>
##$PROCNO= 1
##$TYPE= <nmr>
##$USER= <she>
##$AMP= (0..31)
100 100 100 100 100 100 100 100 100 100 100 100 100 100 100 100 100 100 
100 100 100 100 100 100 100 100 100 100 100 100 100 100 
##$AQSEQ= 0
##$AQ_mod= 1
##$AUNM= <au_zg>
##$AUTOPOS= <>
##$BF1= 200.13
##$BF2= 200.13
##$BF3= 200.13
##$BF4= 200.13
##$BF5= 200.13
##$BF6= 200.13
##$BF7= 200.13
##$BF8= 200.13
##$BYTORDA= 1
##$CFDGTYP= 0
##$CFRGTYP= 5
##$CHEMSTR= <none>
##$CNST= (0..31)
1 1 145 1 1 1 1 1 1 1 1 1 1 1 1 1 1 1 1 1 1 1 1 1 1 1 1 1 1 1 1 1 
##$CPDPRG= <>
##$CPDPRG1= <>
##$CPDPRG2= <>
##$CPDPRG3= <>
##$CPDPRG4= <mlev>
##$CPDPRG5= <mlev>
##$CPDPRG6= <mlev>
##$CPDPRG7= <mlev>
##$CPDPRG8= <mlev>
##$CPDPRGB= <>
##$CPDPRGT= <>
##$D= (0..31)
0 1.2 0 0 0 0 0 0 0 0.06 0 0.03 0 0 0 0 0.0002 0 0 0 0 0 0 0 0 0 0 0 0 
0 0 0 
##$DATE= 1600840499
##$DBL= (0..7)
120 120 120 120 120 120 120 120 
##$DBP= (0..7)
150 150 150 150 150 150 150 150 
##$DBP07= 0
##$DBPNAM0= <>
##$DBPNAM1= <>
##$DBPNAM2= <>
##$DBPNAM3= <>
##$DBPNAM4= <>
##$DBPNAM5= <>
##$DBPNAM6= <>
##$DBPNAM7= <>
##$DBPOAL= (0..7)
0.5 0.5 0.5 0.5 0.5 0.5 0.5 0.5 
##$DBPOFFS= (0..7)
0 0 0 0 0 0 0 0 
##$DE= 6
##$DECBNUC= <off>
##$DECIM= 32
##$DECNUC= <off>
##$DECSTAT= 4
##$DIGMOD= 1
##$DIGTYP= 9
##$DL= (0..7)
0 120 120 120 120 120 120 120 
##$DP= (0..7)
150 150 150 150 150 150 150 150 
##$DP07= 0
##$DPNAME0= <>
##$DPNAME1= <>
##$DPNAME2= <>
##$DPNAME3= <>
##$DPNAME4= <>
##$DPNAME5= <>
##$DPNAME6= <>
##$DPNAME7= <>
##$DPOAL= (0..7)
0.5 0.5 0.5 0.5 0.5 0.5 0.5 0.5 
##$DPOFFS= (0..7)
0 0 0 0 0 0 0 0 
##$DQDMODE= 0
##$DR= 18
##$DS= 0
##$DSLIST= <SSSSSSSSSSSSSSS>
$$ [...]
##$SUBNAM2= <"">
##$SUBNAM3= <"">
##$SUBNAM4= <"">
##$SUBNAM5= <"">
##$SUBNAM6= <"">
##$SUBNAM7= <"">
##$SUBNAM8= <"">
##$SUBNAM9= <"">
##$SW= 16.880792210976
##$SWIBOX= (0..15)
0 0 2 0 0 0 0 0 0 0 0 0 0 0 0 0 
##$SW_h= 3378.37837837838
##$TD= 16384
##$TD0= 1
##$TE= 0
##$TE2= 300
##$TE3= 300
##$TEG= 300
##$TL= (0..7)
0 120 120 120 120 120 120 120 
##$TP= (0..7)
150 150 150 150 150 150 150 150 
##$TP07= 0
##$TPNAME0= <>
##$TPNAME1= <>
##$TPNAME2= <>
##$TPNAME3= <>
##$TPNAME4= <>
##$TPNAME5= <>
##$TPNAME6= <>
##$TPNAME7= <>
##$TPOAL= (0..7)
0.5 0.5 0.5 0.5 0.5 0.5 0.5 0.5 
##$TPOFFS= (0..7)
0 0 0 0 0 0 0 0 
##$TUNHIN= 0
##$TUNHOUT= 0
##$TUNXOUT= 0
##$USERA1= <user>
##$USERA2= <user>
##$USERA3= <user>
##$USERA4= <user>
##$USERA5= <user>
##$V9= 5
##$VALIST= <valist>
##$VCLIST= <CCCCCCCCCCCCCCC>
##$VD= 0
##$VDLIST= <DDDDDDDDDDDDDDD>
##$VPLIST= <PPPPPPPPPPPPPPP>
##$VTLIST= <TTTTTTTTTTTTTTT>
##$WBST= 1024
##$WBSW= 4
##$XGAIN= (0..3)
0 0 0 0 
##$XL= 0
##$YL= 0
##$YMAX_a= 313246
##$YMIN_a= -282223
##$ZGOPTNS= <>
##$ZL1= 120
##$ZL2= 120
##$ZL3= 120
##$ZL4= 120
##$ABSF1= 10
##$ABSF2= 0
##$ABSG= 5
##$ABSL= 3
##$ALPHA= 0
##$AQORDER= 0
##$ASSFAC= 0
##$ASSFACI= 0
##$ASSFACX= 0
##$ASSWID= 0
##$AUNMP= <proc_1d>
##$AZFE= 0.1
##$AZFW= 0.1
##$BCFW= 1
##$BC_mod= 2
##$BYTORDP= 1
##$COROFFS= 0
##$CY= 11.3945322036743
##$DATMOD= 1
##$DC= 2
##$DFILT= <>
##$DTYPP= 0
##$F1P= 16.9975609425685
##$F2P= -3.02152046262296
##$FCOR= 0.5
##$FTSIZE= 0
##$FT_mod= 4
##$GAMMA= 1
##$GB= 0.15
##$INTBC= 1
##$INTSCL= 1
##$ISEN= 128
##$LB= 0.24
##$LEV0= 0
##$LPBIN= 0
##$MAXI= 10000
##$MC2= 0
##$MEAN= 0
##$ME_mod= 0
##$MI= 1.114404
##$NCOEF= 0
##$NC_proc= 0
##$NLEV= 6
##$NOISF1= 3.799351
##$NOISF2= 2.8
##$NSP= 1
##$NTH_PI= 0
##$NZP= 0
##$OFFSET= 15.70392
##$PC= 1
##$PHC0= -9976.312
##$PHC1= 20.6009
##$PH_mod= 1
##$PKNL= yes
##$PPARMOD= 0
##$PSCAL= 0
##$PSIGN= 0
##$REVERSE= no
##$SF= 200.130013532006
##$SI= 16384
##$SIGF1= 3
##$SIGF2= 2
##$SINO= 400
##$SIOLD= 16384
##$SREGLST= <1H.CDCl3>
##$SSB= 0
##$STSI= 0
##$STSR= 0
##$SW_p= 3612.71676300578
##$SYMM= 0
##$S_DEV= 0
##$TDeff= 0
##$TDoff= 0
##$TI= <>
##$TILT= no
##$TM1= 0
##$TM2= 0
##$TOPLEV= 0
##$USERP1= <user>
##$USERP2= <user>
##$USERP3= <user>
##$USERP4= <user>
##$USERP5= <user>
##$WDW= 1
##$XDIM= 8192
##$YMAX_p= 0
##$YMIN_p= 0
$$ End of Bruker specific parameters
$$ ---------------------------------
##NTUPLES= NMR FID
##VAR_NAME=  TIME,          FID/REAL,        FID/IMAG
##SYMBOL=    X,             R,               I
##VAR_TYPE=  INDEPENDENT,   DEPENDENT,       DEPENDENT
##VAR_FORM=  AFFN,          ASDF,            ASDF
##VAR_DIM=   8192,          8192,            8192
##UNITS=     SECONDS,       ARBITRARY UNITS, ARBITRARY UNITS
##FACTOR=    0.000296,      1,               1
##FIRST=     0,             0,               0
##LAST=      2.424536,      0,               0
##MIN=       0,             -282223,         0
##MAX=       2.424536,      313246,          0
$$ Real data points
##PAGE= N=1
##DATA TABLE= (X++(R..R)), XYDATA
$$ [...]
$$ plain form
1740 -225 301 216 145 -347 193 -166 134 126 247 -263 -416 138 54 117 176 166 -349 131 510 -25 -204 -100 66
1763 66 -264 173 25 229 -273 169 262 -78 360 -131 -143 -2 320 211 -369 8 -238 -107 32 230 -306
1784 -306 -276 296 -224 128 130 36 -564 -173 175 -31 -104 -393 103 -120 55 287 163 -434 122 263 -584 -102
1806 -102 -164 -2 -345 414 360 -120 -119 -19 269 -120 527 -37 -285 -176 304 244 -238 147 -177 121 60 340
1828 340 -117 -234 184 -224 -52 276 144 -298 -140 185 -93 13 -114 240 -398 287 195 -65 -213 -44
1848 -44 -50 -202 293 -108 -352 -237 -3 -148 94 103 -134 75 -285 249 -137 -94 -295 -88 23 -168 457 -275
1870 -275 -1 124 256 58 -68 -104 -240 -26 128 311 -155 -56 -160 90 265 232 419 -247 130 300 -62
1891 -62 210 -19 97 -139 582 -28 -71 -194 211 28 -194 28 -181 12 -488 74 -70 -94 234 -216 -135
$$ packed form
1740b25N26q5p1m92N40l59L00qJ21n10j53N54q4O3N9j0n15M80L79n35j79J04J66
1763F6l30M37j48K04n02M42R3l40M38m91j2J41L22j09n80L77k46J31J39J98n36
1784c06L0N72n20L52Kr4o00L91L48k06p3k89M96k23J75K32j24n97N56J41q47M82
1806a02o2J62l43P59n4m80JJ00K88l89O47n64k48J09M80o0m82L85l24K98o1K80
1828C40m57j17M18m08J72L28j32m42J58L25k78J06j27L54o38O85r2k60j48J69
1848d4oj52M95m01k44J15K34j45K42Rk37K09l60N34l86M3k01K07J11j91O25p32
1870b75K74J25J32j98j26l6j36K14J54J83m66R9j04K50J75l3J87o66L77J70l62
1891f2K72k29J16k36P21o10m3j23M05j83k22K22k09J93n00N62j44k4L28m50Q1
$$ plain form
1912 -135 144 92 -323 -2 -243 -206 -51 77 -198 -419 220 -39 213 -165 -174 -21 -465 173 -361 -325 -258 -172
1934 -172 -268 -317 -68 -214 -322 -417 181 -104 58 -16 -47 -252 24 201 95 25 5 272 151 106 204 -104 154
1957 154 -61 170 -214 119 8 229 291 145 253 -301 288 -155 23 29 178 -2 -361 220 -160 -226 -343
1978 -343 98 -312 -161 298 -47 36 -250 -141 -378 185 164 -208 -327 -336 211 78 -192 -128 -26 -283 284 208
2000 208 -277 123 24 -115 48 113 -90 -267 7 -11 290 -44 211 -302 115 310 196 215 -155 112 23 181
2022 181 -100 318 -337 -63 78 -76 102 -120 -210 -231 36 159 -39 -205 -28 302 32 64 58 -211 86 246
2044 246 -145 -140 15 -256 -153 -231 298 -277 -302 241 -176 155 256 113 10 108 190 253 11 -80 105 -111 60
2067 60 314 -151 52 78 194 -164 97 116 7 -192 58 -58 -142 78 105 -36 -116 -67 124 -30 -209 -14
$$ packed form
1912a35K79n2m15L21k41L7J55J28k75k21O39k59K52l78rJ53m44O38n34L6O7Q6
1934a72r6m9K49j46j08r5N98k85J62p4l1k05K76J77j06p0k0K67j21m5R8l08K58
1957A54k15K31l84L33j11K21O2j46J08n54N89m43J78OJ49j80l59N81l80o6j17
1978c43M41m10J51M59l45Q3k86J09k37N63k1l72j19rN47j33k70O4J02k57N67p6
2000B08m85M00r9j39J63O5k03j77K74j8L01l34K55n13M17J95j14J9l70K67q9J58
2022A81k81M18o55K74J41j54J78k22r0k1K67J23j98j66J77L30k70L2ok69K97J60
2044B46l91NJ55k71J03p8N29n75k5N43m17L31J01j43j03R8Q2O3k42r1J85k16J71
2067F0K54m65K03K6J16l58K61J9j09j99K50j16q4K20K7j41q0M9J91j54j79J95
$$ plain form
2089 -14 100 -119 204 -294 -57 -43 -82 -4 70 -150 -55 -159 -134 172 -292 -32 41 -199 32 -43 33 -422 324
2112 324 105 41 29 68 -108 -256 261 73 250 -13 -2 130 81 362 47 151 -135 356 28 32 322 -188
2134 -188 145 -152 384 59 216 68 70 206 -9 230 -144 -65 92 164 159 1053 -105 -7 36 -26 -2 -93 182
2157 182 -119 48 -179 -19 -290 -143 11 -58 157 -126 35 -267 -147 219 -110 22 -149 67 -19 77 -60
2178 -60 -217 6 155 186 -45 56 83 38 315 391 119 -368 115 86 -51 -178 -2 129 65 234 26 -60 -93
2201 -93 136 11 120 10 86 -138 -14 37 -24 116 -82 49 -67 -313 268 -313 -67 -69 -305 97 97 -85 -206
2224 -206 59 -185 99 -149 116 31 -372 -52 -108 -51 -46 29 -375 112 -39 46 -21 28 130 -269 16 148 3
2247 3 -115 -19 143 -110 14 100 10 -155 -78 273 -103 22 -38 75 74 165 170 55 93 220 202 -21 206 54 40
$$ packed form
2089a4J14k19L23m98K37J4l9P8P4k20R5j04K5L06m64K60P3k40K31p5P6m55P46
2112C24k19o4j2L9j76j48N17j88J77k63J1J32m9K81l15J04k86M91l28MK90n10
2134a88L33k97N36l25J57j48KJ36k15K39l74P9J57P2nQ94j158R8M3o2K4r1K75
2157A82l01J67k27J60k71J47J54o9K15k83J61l02J20L66l29J32j71K16q6R6j37
2178f0j57K23J49L1k31J01K7m5K77P6k72m87M83k9j37j27J76J31o4J69k08q6l3
2201i3K29j25J09j10P6k24J24N1o1J40j98J31j16k46N81n81K46kk36M02%j82j21
2224b06K65k44K84k48K65q5m03L20n6N7NP5m04M87j51Q5o7M9J02l99K85J32j45
2247Cj18R6J62k53J24Q6r0j65P7L51l76J25o0J13jR1Nj15L8J27j8k23K27j52j4
$$ plain form
2272 40 -242 373 256 -191 -28 64 199 -61 16 -119 -31 44 -28 -31 -42 126 -132 -32 -39 -99 -227 -146 -93 179 168
2297 168 85 29 24 -104 97 -36 -20 -23 -205 -138 -12 -69 -131 -38 123 -53 -86 199 65 9 -20 316 122 -73 -34
2322 -34 141 218 -70 181 41 -29 372 -33 236 209 182 -208 80 27 20 43 -269 334 -283 72 -12 -226 -105
2345 -105 -33 -3 15 -128 -153 -284 2 -53 117 -6 -278 -71 -75 -96 34 -118 14 26 -96 183 -128 65 -220
2368 -220 -251 -105 258 69 -22 -165 -195 -177 39 3 -223 -92 -28 -121 177 -200 -179 -112 119 35 53 38 -157 37
2392 37 -161 172 64 -246 -14 -80 109 -166 15 58 41 220 74 -79 38 -92 18 23 203 326 -271 -111
2414 -111 31 167 -43 -65 -43 -135 162 29 -41 -42 58 -248 204 393 23 -66 -24 -83 -47 126 -127 -72 -123 45
2438 45 92 -86 -17 258 -73 -135 61 73 62 -133 -186 64 -170 -146 190 -133 -61 -61 109 -128 252 117 125 3
$$ packed form
2272D0k82O15j17m47J63R2J35k60P7j35Q8P5p2lj1J68k58J00po0j28Q1N3K72j1
2297A68q3n6nj28K01j33J6lj82O7J26n7o2R3J61j76l3K85j34n6k9L36j94j95L9
2322c4J75P7k88K51j40p0M01m05K69k7k7l90K88n3pK3l12O03o17L55q4k14J21
2345a05P2L0J8j43k5j31K86n5J70j23k72K07mk1J30j52J32J2j22K79l11J93k85
2368b20l1J46L63j89r1j43l0J8K16l6k26J31O4r3K98l77K1O7K31q4J8j5j95J94
2392C7j98L33j08l10K32o6J89k75J81M3j7J79j46j53J17j30J10NJ80J23n97J60
2414a11J42J36k10k2K2r2K97j33p0jJ00l06M52J89l70q9M2n9L6J73k53N5n1J68
2438D5M7j78O9K75l31o2J96J2j1j95n3K50k34K4L36l23P2%J70k37L80j35Qj22
$$ plain form
2462 3 -15 -21 -202 61 150 -134 191 340 273 -244 -24 170 -60 102 144 -57 -34 113 -58 -41 -229 132 121 -109
2486 -109 -48 -26 -142 -161 133 93 18 22 -45 69 26 106 -32 -67 -245 69 131 94 -38 -134 -62 157 -13 -130 -35
2511 -35 -120 -32 -227 56 66 -101 199 -241 -35 18 -77 -54 36 102 61 37 -1 -119 -43 -29 -19 -101 -163 31 303 -145
2537 -145 -33 -142 -37 -162 193 -12 59 95 196 336 40 296 -112 -128 21 114 151 -147 271 0 103 64
2559 64 -39 51 23 162 -73 56 187 36 119 -140 12 -153 -63 -71 -67 -50 300 -2 -53 -204 -27 -170 -128 39
2583 39 29 116 -15 22 141 52 227 141 253 17 -75 278 -53 92 164 65 -42 220 -87 -67 -104 -29 153 -97
2607 -97 -216 -252 257 -93 -145 83 -65 17 -46 -29 71 -102 13 133 -67 170 82 -133 79 -313 110 -27
2629 -27 -179 107 -159 67 50 231 143 -104 8 -74 223 105 71 -81 148 137 99 115 -36 -176 24 73 87
$$ packed form
2462Cj8oj81K63Q9k84L25J49o7n17K20J94k30J62M2k01K3J47j71J7j88L61j1k30
2486a09O1K2j16j9K94m0p5Mo7J14m3Q0j38l5j78L14O2l7j32r6P2K19j70j17R5
2511c5q5Q8j95K83J0j67L00m40K06N3r5K3R0O6m1k4l8j18P6J4J0q2o2J94K72m48
2537a45J12j09J05j25L55k05P1L6J01J40k96K56m08j6J49R3L7k98M18k71J03l9
2559F4j03R0k8J39k35J29J31j51Q3k59J52j65R0qMJ7L50l02n1j51J77j43M2J67
2583C9j0Q7j31L7J19q9J75q6J12k36r2L53l31J45P2r9j07K62l07K0l7P5J82k50
2607i7j19l6N09l50n2K28j48Q2o3J7J00j73J15J20k00K37q8k15K12l92M23j37
2629b7j52K86k66K26j7J81q8k47J12q2K97j18l4j52K29j1l8J6j51j40K00M9J4
$$ plain form
2652 87 335 53 162 -71 -99 69 113 134 155 135 6 145 -50 18 42 -59 9 -136 22 -52 -126 -94 -35 12 -74
2677 -74 -96 47 -165 22 60 29 39 -112 -82 60 -17 19 -232 170 105 78 168 -122 226 -107 218 -186 239 54
2701 54 32 288 -60 187 125 -190 -100 211 46 46 200 38 135 56 103 213 -59 -327 110 -33 -91 108 -197
2724 -197 113 -98 -24 -34 -86 -94 121 -27 -251 133 -136 -150 -57 -77 271 -60 104 -24 -24 83 -112 242 -49
2747 -49 340 183 191 -121 270 44 25 281 100 -69 -121 514 -294 6 193 217 142 24 64 -199 20 120 43
2770 43 -133 18 -236 89 94 -96 -110 -152 9 -208 187 82 5 -80 -175 -326 -78 192 119 -119 19 -287 241
2793 241 -186 58 81 125 250 59 -104 -72 119 145 106 -24 85 -108 -51 158 186 89 113 34 49 -364 -74 114
2817 114 211 304 0 65 251 64 -161 123 62 174 96 23 12 3 -30 13 195 124 260 -104 36 -276 149 -79
$$ packed form
2652H7K48k82J09k33k8J68M4K1K1k0j29J39j95O8K4j01O8j45J58p4p4L2N9M7q6
2677g4k2J43k12J87L8l1J0j51L0J42p7L6k51M02o5k7R0k90L48l33L25m04M25j85
2701E4k2K56l48K47o2l15R0L11j65%J54j62R7p9M7J10k72k68M37j43n8J99l05
2724a97L10k11P4j0n2qK15j48k24L84k69j4R3k0L48l31J64j28%J07j95L54k91
2747d9L89j57Ql12L91k26j9K56j81j69n2O35q08L00J87K4p5j18M0k63K19J00p7
2770D3j76J51k54L25Nj90j4m2J61k17L95j05p7q5r5j51K48K70p3k38J38l06N28
2793B41m27K44K3M4J25j91j63L2J91K6l9j30J09j93N7K09K8r7K4p9J5m13K90J88
2817A14R7R3l04O5J86j87k25K84o1J12p8p3j1rl3M3J82p1J36l64J40l12M25k28
$$ plain form
2841 -79 112 -14 -145 45 174 -147 158 180 94 116 -72 -91 -38 -81 -107 -274 -87 21 104 110 -39 114 -133 82
2865 82 5 -107 -172 13 101 -3 -71 216 -132 -125 -52 89 -8 130 72 -186 -202 188 -261 -97 213 -7 -22 -179
2889 -179 109 124 107 -42 10 -13 278 58 106 -188 149 145 -219 201 -139 -84 -145 69 -2 128 189 -133 -122 -42
2913 -42 0 93 54 -60 -113 -118 -91 -59 -163 0 -41 187 125 178 42 -162 32 57 -60 46 208 -40 -7 163 66
2938 66 91 135 20 121 -21 -237 -221 -49 166 134 13 -184 -123 22 8 -100 -87 -112 238 71 75 47 -32 246
2962 246 100 -90 68 208 -73 185 -236 94 -135 67 -96 -227 174 -138 75 215 -293 -20 -229 132
2982 132 69 84 -167 -322 68 64 -37 -288 19 -251 145 -97 -40 128 -15 -29 -93 -58 26 21 -133 -108 38 19
3006 19 -138 17 288 12 130 -132 -54 27 -84 233 162 120 116 129 -4 -134 -152 -322 -166 -101 38 43 -264 180
$$ packed form
2841g9J91j26j31J90J29l21L05K2q6K2j88j9N3m3k6j67J87J08Q3Oj49J53k47K15
2865H2p7j12o5J85Q8j04o8K87l48PP3J41r7J38n8k58j6L90m49J64L10k20j5j57
2889a79K88J5j7j49N2k3K91k20M8k94L37ml64M20l40N5o1K14p1J30O1l22J1Q0
2913d2M2R3l9j14n3nK7L2j04J63m1K28o2N3j36k04J94K5j17J06J62k48L3J70r7
2938F6K5M4j15J01j42k16J6J72K15l2j21j97O1J45j4j08J3k5L50j67Mk8p9K78
2962B46j46j90J58J40k81K58m21L30k29K02j63j31M01l12K13J40n08K73k09L61
2982A32o3J5k51j55L90mj01k51L07k70L96k42N7J68j43j4o4L5Q4nj54K5J46j9
3006A9j57J55K71k76J18k62P8Q1j11L17p1m2mJ3j33j30j8j70J56O5J39Nl07M44
$$ plain form
3030 180 290 -197 79 130 23 48 92 24 -26 -62 66 161 -177 172 214 -169 80 228 26 152 77 -14 -120
3053 -120 -103 -249 93 -26 -135 143 -230 82 -160 168 51 -16 -153 -78 78 -52 78 -146 60 -67 61
3074 61 163 -13 117 32 -44 28 -103 219 -45 138 97 314 74 41 245 265 -144 230 7 195 44 220
3096 220 63 -37 215 215 30 -55 104 -86 -99 -68 10 35 -49 212 19 -145 34 -61 9 -107 256 -94 -49 -72
3120 -72 212 -116 36 -11 -21 38 -154 38 -126 -244 -200 -171 -77 -108 -162 8 22 -78 -276 142 -223 -43 82
3143 82 5 51 14 -155 -99 -149 -80 -223 165 106 -239 -155 -121 -152 127 96 46 108 33 85 66 120 -204 -300 85 44 -218
3170 -218 495 123 212 -181 -168 -115 101 211 305 -115 -25 281 -243 44 307 -110 -135 94 -5 26 -137 116 -148
3193 -148 -231 -24 67 -83 -18 -62 -33 89 -28 -74 22 -83 -273 85 23 38 -163 -81 190 63 -300 3 -52 -281
$$ packed form
3030A80J10m87K76N1j07K5M4o8n0l6J28R5l38L49M2l83K49J48k02J26p5r1j06
3053a20J7j46L42j19j09K78l73L12k42L28j17o7j37P5J56j30J30k24K06j27J28
3074F1J02j76J30q5p6P2j31L22k64J83m1K17k40l3K04K0m09L74k23J88j51J76
3096B20j57j00K52%j85q5J59j90j3L1P8K5q4K61j93j64J79r5P0j16L63l50M5k3
3120g2K84l28J52m7j0N9j92J92j64j18M4K9R4l1n4J70J4j00j98M18l65J80J25
3143H2p7M6l7j69N6n0O9j43L88n9l45Q4L4l1K79l1n0O2p5N2j9N4l24r6L85m1k62
3170b18P13l72Q9l93J3N3K16J10R4m20R0L06n24K87K63m17k5K29r9L1j63K53k64
3193a48q3K07R1j50O5m4K9J22j17m6R6j05j90L58o2J5k01Q2K71j27l63L03n5k29
$$ plain form
3217 -281 -139 37 2 226 -82 -126 106 -85 244 -322 -90 -191 219 201 128 19 -81 8 123 -200 92 -136
3239 -136 -316 -13 16 102 204 -160 130 60 -89 -274 22 -271 -18 58 19 -228 77 110 -97 -23 104 62 -39
3262 -39 140 5 -193 -58 -112 -77 180 8 -40 -46 52 243 -34 231 -149 -2 -99 38 226 -183 11 -70 -14
3285 -14 108 25 225 105 -66 77 16 67 254 37 -14 -157 -35 -5 151 -236 -144 -138 -203 -54 93 -133 317
3308 317 -123 -81 86 -71 40 -99 293 224 -48 127 -59 -155 -34 -48 49 -4 170 -155 -131 7 197 -163
3330 -163 -98 123 30 30 33 -10 84 26 -141 -44 95 276 -30 -253 -83 -65 -242 -178 184 -13 43 -227 45 180
3354 180 -94 -20 -76 46 -213 199 38 37 232 157 99 36 -22 226 9 -95 133 94 17 130 45 -87 15 -84
3378 -84 -25 -75 162 264 27 126 -120 85 71 -154 -277 -187 -25 137 102 -197 -56 43 -69 -22 -76 3 36 -43
$$ packed form
3217b81J42J76l5K24l08m4K32j91L29n66K32j01M10j8p3j09j00Q9J15l23K92k28
3239a36j80L03K9Q6J02l64K90p0j49j85K96k93K53P6l9k47L05L3k07P4J27m2j01
3262c9J79j35j98J35n4L5K57j72m8oR8J91k77K65l80J47r7J37J88m09J94q1N6
3285a4J22q3K00j20j71J43o1N1J87k17n1j43J22L0J56l87R2Oo5J49J47k26M50
3308C17m40M2J67j57J11j39L92o9k72J75j86r6J21j4R7n3J74l25K4J38J90l60
3330a63O5K21r3%Lm3R4n8j67R7J39J81l06k23J70J8j77O4L62j97N6k70K72J35
3354A80k74P4n6J22k59M12j61jJ95p5n8o3n8K48k17j04K28l9p7J13q5j32J02r9
3378h4N9n0K37J02k37R9k46K05j4k25j23R0J62J62l5k99J41R9j12M7n4P9L3p9
$$ plain form
3402 -43 82 -172 156 21 7 -53 -60 175 15 -171 -317 -109 -11 44 -74 -68 33 24 -115 235 100 -55 -120 -125 22
3427 22 -71 207 -28 8 -119 27 -100 37 -132 143 56 -26 174 -128 176 173 210 73 74 -88 -47 88 -35 -275
3451 -275 99 342 71 36 150 11 -24 5 -71 -61 55 -135 32 85 -228 96 -184 7 -110 2 29 139
3473 139 221 24 5 228 154 -4 -143 240 228 152 -3 87 140 -106 -214 14 -51 71 100 -211 -121 42 100 -218
3497 -218 -97 124 53 -47 188 26 -11 156 -8 180 -80 -203 349 79 -56 64 -196 69 -53 -37 -153
3518 -153 5 -85 -136 44 -12 37 34 11 78 -87 65 -52 -108 -17 -59 149 87 77 -34 306 -11 -20 -46 -96 -132 -63
3544 -63 -45 236 -104 -78 96 -139 142 35 5 -163 166 110 18 74 -166 96 -64 -87 64 125 10 45 53 161
3568 161 33 -104 -10 -250 93 -132 102 -127 48 38 203 -6 -109 -148 73 -161 -227 -260 53 -24 -121 -80 -87
$$ packed form
3402d3J25k54L28j35j4o0pK35j60j86j46K08R8N5j18OJ01rj39L50j35j55o5nJ47
3427B2r3K78k35L6j27J46j27J37j69K75q7q2K00l02L04lL7j37Jj62M1J35j23k40
3451b75L74K43k71l5J14j39l5K9p6J0J16j90J67N3l13L24k80J91j17J12K7J10
3473A39Q2j97j9K23p4j58j39L83j2p6j55R0N3k46j08K28o5J22K9l11R0J63N8l18
3497b18J21K21p1j00K35j62l7J67j64J88k60j23N52k70j35J20k60K65j22J6j16
3518a53J58r0n1J80n6M9lk3O7j65J52j17n6R1m2K08o2j0j11L40l17rk6n0l6O9
3544f3J8K81l40K6J74k35K81j07l0j68L29n6r2N6k40K62j60k3J51O1j15L5QJ08
3568A61j28j37R4k40L43k25K34k29J75j0J65k09j03l9K21k34o6l3L13p7r7M1p
$$ plain form
3591 -87 129 -180 42 115 25 -114 78 105 163 46 -49 -54 -60 6 74 39 75 5 -42 195 -118 -193 108 -99 10 -167
3617 -167 -62 -16 75 9 -63 -164 234 36 55 -99 -93 159 -101 115 -58 -106 -9 201 94 211 83 -43 221
3640 221 100 14 175 17 -17 -31 -300 220 40 137 12 16 87 115 -11 -157 -95 -104 -107 50 -132 10 181 285
3664 285 -117 -18 -49 -89 115 258 -81 -189 -38 266 161 46 -58 83 110 99 -172 -3 275 219 -212 -133
3686 -133 6 -69 10 80 -4 -194 28 125 -74 191 4 19 -291 -25 -90 -22 66 -105 19 36 -9 -101 -220 -79
3710 -79 -22 -15 -206 92 96 31 -260 -169 20 -62 -55 -84 37 76 126 -126 24 -55 110 62 66 -83 -107 -149 95 -175 -193
3737 -193 19 -20 55 105 73 -139 -121 145 -2 75 19 -23 217 128 200 -92 195 21 100 79 -41 299 211 -39
3761 -39 85 -128 -23 -88 226 -128 106 -219 -95 231 82 30 -59 233 47 55 -103 7 -14 136 -29 -107 -253
$$ packed form
3591h7K16l09K22P3r0j39J92K7N8j17r5noO6O8l5L6p0m7K37l13p5L01k07J09j77
3617a67J05M6R1o6p2j01L98j98J9j54OK52k60K16j73m8R7K10j07J17j28j26K64
3640B21j21q6J61j58l4j4k69N20j80R7j25MP1K8j26j46O2rlJ57j82J42J71J04
3664B85m02R9l1m0K04J43l39j08J51L04j05j15j04J41K7j1k71J69K78n6m31P9
3686a33J39p5P9P0q4j90K22R7j99K65j87J5l10K66o5O8Q8j71J24J7m5r2j19J41
3710g9N7Pj91K98Mo5k91R1J89q2Pk9J21L9N0k52J50p9J65m8Mj49k4m2K44k70j8
3737a93K12l9P5N0l2k12J8K66j47P7n6m2K40q9P2k92K87j74P9k1j20L40q8k50
3761c9J24k13J05o5L14l54K34l25J24L26j49n2q9K92j86Qj58J10k1J50j65p8j46
$$ plain form
3784 -253 -34 -107 -50 -159 8 129 -26 -156 156 36 -54 -49 6 120 171 -94 58 131 93 -82 -43 48 -23 98
3808 98 -301 13 -84 22 66 248 -63 -4 74 82 -23 -174 -191 216 -145 -85 -86 -112 40 157 101 -67 59 -59
3832 -59 -116 36 -32 4 -33 -251 144 200 238 -29 173 184 30 -139 -116 -29 -376 132 58 -77 -10 106 136 -91
3856 -91 91 2 -54 -92 -5 17 115 -63 61 -197 -128 177 65 -203 -212 42 75 -18 70 92 151 86 54 -68 95 51
3882 51 -193 -31 45 65 -124 90 92 108 -143 74 6 -16 208 206 105 161 -90 -22 -351 -110 -15 41 -17 279 65
3907 65 6 37 -47 5 29 -26 -11 113 -16 -189 69 -168 46 125 123 -38 -26 52 -39 221 314 -1 -41 62 -180
3932 -180 -204 231 -89 177 61 163 -197 -7 280 192 -14 -165 -129 -85 19 -182 -35 -12 65 32 148 -97
3954 -97 -67 -12 92 -43 8 66 349 103 3 -82 187 -120 6 373 -115 -233 9 126 -280 141 -195 -24
$$ packed form
3784b53K19p3N7j09J67J21j55j30L12j20r0NN5J14N1k65J52P3l8j75L9R1p1J21
3808I8l99L14r7J06M4J82l11N9P8Qj05j51j7M07l61O0jk6J52J17n6j68J26j18
3832e9n7J52o8L6l7k18L95N6L8k67K02J1j54j69K3Q7l47N08p4j35O7J16L0k27
3856i1J82q9n6l8Q7K2R8j78J24k58O9L05j12k68rK54L3r3Q8K2N9o5l2j22J63m4
3882E1k44J62P6K0j89K14KJ6k51K17o8k2K24kj01N6k51O8l29K41R5N6n8K96k14
3907F5n9L1q4N2K4n5J5J24j29j73K58k37K14P9kj61J2P8r1K60R3l15m0J03k42
3932a80k4M35l20K66j16J02l60J90K87q8k06j51L6M4J04k01J47K3P7l3J16k45
3954i7L0N5J04j35N1N8K83k46j00q5K69l07J26L67m88j18K42J17m06M21l36J71
$$ plain form
3976 -24 12 -227 -59 168 24 45 105 -34 97 55 27 -236 -238 114 92 -117 133 120 -113 -51 5 283 -65 219
4000 219 146 97 -116 145 166 67 -133 -85 93 -241 82 169 -135 107 5 -281 -31 -78 -118 -65 49 109 100 -133
4024 -133 269 42 -85 40 124 114 38 42 104 77 34 -76 -59 -28 -7 92 -80 157 30 -17 -139 239 -47 53
4048 53 -90 176 24 121 101 -445 50 -68 -51 119 150 34 154 -71 44 87 217 -89 82 81 -27 168 -157
4071 -157 90 93 -69 -166 74 13 -205 -290 -112 -4 16 271 48 -126 54 -55 -24 -5 -287 -194 -90 -31 -108 136
4095 136 127 203 -158 -194 -198 -68 -170 -221 -114 32 -128 -73 106 -131 23 90 41 -340 100 140 -61 129 -99 -41
4119 -41 -27 15 139 -65 122 -72 83 -137 -77 -73 -24 -23 162 -119 74 -70 3 10 -67 122 16 74 -148 2 -16
4144 -16 -121 90 -37 80 -148 -153 0 60 115 -95 -160 -219 256 117 10 -324 -53 47 -122 -30 -24 -118 101 -111
$$ packed form
3976b4L6k39J68K27j44K1O0j39J31m2k8k63kL52k2k09K50j3k33O2N6K78l48K84
4000B19p3m9k13K61K1r9k00M8J78l34L23Q7l04K42j02k86K50m7m0N3J14O0rk33
4024a33M02k27j27J25Q4j0p6MO2k7m3j10J7L1K1R9j72K37j27m7j22L78k86J00
4048E3j43K66j52R7k0n46M95j18J7J70L1j16J20k25J15M3J30l06J71jj08J95l25
4071a57K47Lj62r7K40o1k18q5J78J08K0K55k23j74J80j09L1J9k82R3J04N9p7K44
4095A36rP6l61l6mJ30j02n1J07J46j60N5J79k37J54O7m9l81M40M0k01J90k28N8
4119d1J4M2J24k04J87j94J55k20O0MM9JJ85k81J93j44P3Pp7J89j06N8k22J50j8
4144a6j05K11j27J17k28nJ53O0N5k10o5n9M75j39j07l34K71J00j69R2Or4K19k12
$$ plain form
4168 -111 101 113 31 71 -244 -187 -149 -136 196 53 -94 -84 -12 -205 -175 -182 -95 32 121 -23 -161 67 56 -267 114
4193 114 68 61 235 -211 157 43 -8 26 -30 61 -93 40 80 76 -98 -15 26 -241 -42 90 198 -113 84 -125
4217 -125 29 31 136 36 -97 -63 -199 82 132 43 161 115 93 62 124 48 205 177 63 -170 109 85 203 -106
4241 -106 57 -17 -34 30 214 -187 -52 -28 -13 65 91 229 140 142 -181 108 97 -29 -1 199 -205 -65 -65 -11 85
4266 85 -187 95 -95 -95 310 -35 -53 109 300 114 62 -61 132 -87 -29 -84 -59 124 -192 73 -151 -52 -45 -107
4290 -107 -195 24 -54 34 -157 133 141 0 114 121 75 33 -119 189 164 -101 154 171 -32 -103 56 219 259 155
4314 155 -25 -7 29 50 37 101 -38 -46 89 -93 28 -32 -50 -55 242 247 -319 99 -102 142 -40 -5 132 90 146
4339 146 -117 -154 61 37 4 -270 -51 -214 -40 185 -128 58 21 -25 249 101 111 -62 245 102 -69 30
$$ packed form
4168a11K12J2q2M0l15N7L8J3L32j43j47J0P2j93L0pQ7J27Q9j44j38K28j1l23L81
4193A14m6pJ74m46L68j14n1L4n6R1j54J33M0mj74Q3M1k67J99J32J08l11J97k09
4217a25J54KJ05j00j33L4j36K81N0q9J18m6k2l1O2p6J57k8j14k33K79k4J18l09
4241a06J63p4j7O4J84m01J35K4J5P8K6J38q9Kl23K89j1j26K8K00m04J40%N4R6
4266H5k72K82j90%M05l45j8J62J91j86n2j23J93k19N8n5K5J83l16K65k24R9Po2
4290a07q8K19p8Q8j91K90Qj41J14Pm6m2j52L08k5k65K55J7k03p1J59J63M0j04
4314A55j80J8L6K1j3O4j39qJ35j82J21o0j8nK97Nn66M18k01K44j82L5J37m2N6
4339A46k63l7K15k4l3k74K19j63J74K25l13J86l7m6K74j48J0j73L07j43j71R9
$$ plain form
4361 30 -207 -104 -171 98 134 -193 -5 -41 29 113 54 -97 -10 -117 232 133 -161 -48 -189 124 -51 258 69
4384 69 -164 -74 -27 -49 -115 -118 0 27 78 -180 -183 -354 216 145 -179 -55 -48 -64 135 50 27 126 207 91 109 78 6
4411 6 -63 -244 -175 87 34 -137 46 194 -193 95 3 -167 117 -116 -129 -23 -32 54 -23 -115 20 73 -129 97
4435 97 -99 26 -154 12 113 -65 15 -51 17 117 33 71 22 -162 -114 -125 -74 42 20 59 -46 -132 71 -87
4459 -87 -118 54 -87 -29 88 174 -93 -137 -87 -56 -70 155 -47 -270 -77 37 -132 4 0 366 -84 8 145 -279
4483 -279 -108 -234 105 141 -75 198 5 -63 54 86 254 -74 -270 -51 174 98 -279 165 21 1 188 -277
4505 -277 86 -128 51 -178 -8 -212 76 18 -105 75 164 -94 -25 188 154 53 -222 -69 35 -126 240
4526 240 -46 -62 -27 -146 76 -25 8 14 -12 310 -198 184 54 -11 16 -197 6 -32 2 144 24 -112 -151 -114
$$ packed form
4361C0k37J03o7K69L6l27J88l6P0Q4n9j51Q7j07L49r9k94J13j41L13j75L09j89
4384F9k33R0M7k2o6lJ18K7N1k58lj71N70p1l24J24Pj6J99q5k3R9Q1j16J8l1p2
4411Fo9j81O9K62n3j71J83J48l87K88r2j70K84k33j3J06rQ6p7r2J35N3k02K26
4435I7j96J25j80J66J01j78Q0o6O8J00q4L8m9j84M8j1N1J16k2L9j05q6K03j58
4459h7l1J72j41N8J17Q6k67m4N0L1j4K25k02k23J93J14j69J36mL66m50R2J37m24
4483b79J71j26L39L6k16K73j93o8J17L2J68l28j96K19K25p6l77M44j44k0J87m65
4505b77L63k14J79k29J70k04K88n8j23J80Q9k58O9K13l4j01k75J53J04j61L66
4526B40k86j6L5j19K22j01L3Ok6L22n08L82j30o5K7k13K03l8L4J42j20j36l9L7
$$ plain form
4550 -114 -41 -74 -175 52 205 137 112 -32 -51 39 -52 158 70 4 91 -128 -6 -116 -104 -121 -115 45 -4 172 -469
4575 -469 -139 103 270 171 -73 93 38 117 -19 -162 -42 -195 37 30 162 6 54 -144 64 -37 -19 -29 4
4598 4 -128 -2 91 111 66 60 15 174 2 132 157 -11 -113 27 -48 112 192 124 -63 -73 -238 -57 -140 -154 58
4623 58 1 -213 136 75 217 122 202 -44 15 -31 -35 161 -143 -112 -229 209 122 -28 83 -371 -39 147 55 -23
4647 -23 68 18 22 -137 75 271 -243 -79 -59 215 -113 -53 34 -103 36 99 25 -47 127 -364 -236 64 -95 -166
4671 -166 -7 -222 52 -245 -29 12 -112 -136 106 209 -35 -18 -70 115 -10 6 135 7 -31 154 49 -92
4693 -92 -5 148 246 126 -39 -132 -164 -154 3 13 167 42 -34 -22 91 -71 1 -154 275 9 -87 -66 -137 110
4717 110 97 50 -80 19 -26 -93 100 66 188 71 -99 122 62 146 -240 -135 97 -14 283 -136 14 -122 150
$$ packed form
4550a14P3l3j01K27J53o8k5j44j9R0r1K10q8o6Q7k19J22j10J2j7OJ60m9J76o41
4575d69L30K42J67r9k44J66n5P9j36j43J20j53K32pJ32j56M8j98K08j01J8j0L3
4598Dj32J26R3K0m5om5J59j72J30K5j68j02J40p5J60Q0o8j87j0j65J81q3j4K12
4623E8n7k14L49o1J42r5Q0k46N9m6mJ96l04L1j17M38q7j50J11m54L32J86r2p8
4647b3R1n0Mj59K12J96n14J64K0K74l28O0Q7j37J39O3p4p2J74m91J28L00j59p1
4671a66J59k15K74k97K16M1j24k4K42J03k44J7n2J85j25J6J29j28l8J85j05j41
4693i2Q7J53R8j20j65r3l2J0J57J0J54j25p6J2J13j62P2j55M29k66r6K1p1K47
4717A10j3m7j30R9m5o7J93l4J22j17j70K21o0Q4l86J05K32j11K97m19J50j36K72
$$ plain form
4740 150 17 25 154 -160 -151 -17 68 -26 16 128 74 133 82 43 130 89 -13 90 89 471 -55 275 -44 262 -155
4765 -155 137 -134 160 12 -182 49 -53 313 -137 50 29 264 -48 137 30 -46 -81 102 -142 -78 -178
4786 -178 -90 81 -24 -154 9 13 -13 2 115 -17 -167 118 29 23 -125 0 -299 18 -74 75 139 132 -226 153
4810 153 -19 42 -40 63 -119 -1 213 31 46 -170 -264 -7 51 21 19 29 -108 6 88 -3 4 19 50 -10 -92 -152
4836 -152 123 89 119 77 61 19 248 57 106 -41 178 35 -72 295 168 267 57 -30 -65 224 -4 31 1 -221
4860 -221 -4 25 -4 109 -120 -56 52 -85 -47 -8 23 -114 -41 50 200 -148 107 -88 -119 -57 -194 83 74 -17
4884 -17 119 -55 -146 58 139 -181 275 -138 -11 110 -147 -80 -85 -124 -5 279 -16 -64 -12 4 -160 20 -130
4907 -130 -67 -23 180 9 121 -41 -23 268 -207 90 -101 -83 174 -44 61 -78 151 63 53 382 -4 -95
$$ packed form
4740A50j33QJ29l14RJ34Q5r4M2J12n4N9n1l9Q7m1j02J03jL82n26L30l19L06m17
4765a55K92k71K94j48j94K31j02L66m50J87k1K35l12J85j07p6l5J83k44O4j00
4786a78Q8J71j05j30J63Mk6J5J13j32j50K85q9oj48J25k99L17r2J49O4pl58L79
4810A53j72O1q2J03j82J18K14j82J5k16r4K57N8l0kJ0j37J14Q2r1PJ5L1o0q2o0
4836a52K75l4L0m2j6m2K29j91M9j47K19j43j07L67j27R9k10q7l5K89k28L5l0k22
4860b21K17K9k9J13k29O4J08j37L8L9L1j37P3R1J50l48K55j95l1O2j37K77rr1
4884a7J36j74r1K04Q1l20M56m13J27J21k57O7nl9J19K84k95m8N2J6j64J80j50
4907a30O3M4K03j71J12j62J8K91m75K97j91J8K57k18J05j39K29q8j0L29l86r1
$$ plain form
4929 -95 -183 71 24 -46 -2 154 118 50 167 -122 -206 -164 27 -111 -35 -100 -46 79 112 -155 -40 38 -150 -42 -44
4954 -44 160 -97 -36 -14 -53 -19 22 244 -174 19 124 115 3 24 -12 15 64 23 -102 -21 43 26 -131 -39 -10 38
4980 38 -106 99 194 47 -50 57 -31 -258 -89 -113 -132 52 -126 -189 101 146 126 -74 116 -86 137 81 115 -2
5004 -2 160 147 -107 -7 206 15 -131 -179 114 49 260 -36 -108 -177 228 -51 -18 -11 40 -76 143 -61 -118 57
5028 57 96 142 -152 -15 83 220 -178 -161 53 4 -47 -9 -217 35 47 -7 124 91 -31 -16 -27 -5 24 -37 104
5053 104 -137 255 109 38 -150 -282 62 169 94 -46 -292 13 -89 -58 13 -105 379 -215 72 -29 -10 -132
5075 -132 -68 336 -62 -36 112 -67 138 -49 -114 -27 -142 158 -36 194 53 44 36 67 92 368 83 -29 96
5098 96 -288 96 -71 12 -30 -111 112 -124 30 312 -46 -54 -90 -72 -59 -55 44 116 52 157 -35 263 181 119 -2
$$ packed form
4929i5q8K54m7p0M4J56l6o8J17k89q4M2J91j38P6o5N4J25L3k67J15P8j88J08k
4954d4K04k57O1K2l9L4M1K22m18J93J05rj12K1l6K7M9m1j25Q1O4j7j57R2K9M8
4980C8j44K05R5j47r7J07q8k27J69k4j9J84j78o3K90M5k0k00J90k02K23n6L4j17
5004bJ62j3k54J00K13j91j46m8K93o5K11k96p2o9M05k79L3PN1j16K19k04n7J75
5028E7L9M6k94J37R8J37l98J7K14m9n1L8k08K52J2n4J31l3j22J5j1K2K9o1J41
5053A04k41L92j46p1j88j32L44J07p5j40k46L05j02L1P1j18M84n94K87j01J9j22
5075a32O4M04l98K6J48j79K05j87o5Q7j15L00j94K30j41rqL1K5K76k85j12J25
5098I6l84L84j67Q3m2q1K23k36J54K82l58ql6J8J3MR9P2o4J05j92K98q2o2j21
$$ plain form
5123 -2 -249 -48 -40 291 -112 128 -128 -48 301 -7 152 -20 -213 10 -27 -34 -76 44 -7 -27 78 -68 -21 42
5147 42 70 162 95 -98 -398 -189 -211 -129 37 -110 170 -60 115 147 -54 188 159 149 -89 53 -44 109 -27
5170 -27 -108 -153 -139 -43 34 -171 59 52 -44 -92 0 -130 -189 -123 173 168 62 -177 -66 78 186 -60 -66 -98 -88 -100 -109
5197 -109 147 -84 -88 -17 -166 -175 -3 -140 21 61 -42 -123 5 67 -17 61 -51 32 -70 -196 -14 146 0 -122
5221 -122 16 153 -201 -128 22 -128 122 -62 56 -164 -235 189 -241 -55 -85 125 47 -194 -122 137 284 -202
5243 -202 44 77 129 -57 -181 -163 17 89 -83 -5 -313 39 194 -40 54 -121 -77 67 -49 9 -282 -40 72
5266 72 14 112 -34 199 -143 -19 -107 -25 3 54 -68 -36 114 178 -306 -127 57 -124 267 386 63 148 284
5289 284 -194 78 -143 111 -107 218 -39 -45 -168 4 108 -134 76 52 180 -57 -27 -10 -5 154 145 61 -76
$$ packed form
5123bk47K01QL31m03K40k56Q0L49l08J59j72j93K23l7pm2J20n1k0J05j46M7O3
5147D2K8R2o7j93l00K09k2Q2J66j47K80k30J75L2k01K42k9j0k38J42r7J53j36
5170b7q1m5J4R6P7k05K30pr6m8R2j30n9O6K96nj06k39J11J44J08k46ol2J0j2r
5197a09K56k31mP1j49rJ72j37J61M0j03q1J28O2q4P8j12Q3j02j26J82J60j46j22
5221a22J38J37l54P3J50j50K50j84J18k20p1M24m30J86l0K10p8k41P2K59J47m86
5243b02K46L3N2j86j24J8J80P2j72P8l08L52J55k34R4j75M4J44j16N8k91K42J12
5266G2n8R8j46K33l42J24q8Q2K8N1j22L2J50O4m84J79J84j81L91J19l23Q5J36
5289B84m78K72k21K54k18L25k57oj23J72J04k42K10k4J28k37L0J7NJ59rq4j37
$$ plain form
5312 -76 75 84 282 -191 -35 129 -149 118 -67 58 -98 -96 -208 -80 -134 -116 76 -202 -93 -99 163 147 -58
5335 -58 91 121 154 191 56 -49 -90 -145 34 52 -156 -14 -88 273 -106 208 -81 -42 17 -224 60 -72 238
5358 238 37 72 -40 1 -1 -202 -87 -73 231 117 -54 -75 239 20 4 54 -51 78 -52 -266 -197 52 -111
5381 -111 -24 -76 -35 -52 -5 -25 -45 -14 175 -34 3 120 -86 5 -12 -132 -39 -19 59 169 -5 105 10 -75 -66 227
5407 227 80 66 -20 -36 74 -14 -53 -116 -269 257 -1 -179 39 -18 30 35 -109 217 -124 -139 0 -93 -82 -12 129
5432 129 -144 115 -108 -138 -182 121 -107 -93 94 -42 159 -46 102 -67 -245 410 110 51 -115 -132 -134 95
5454 95 45 -123 -312 142 -259 -87 -130 125 100 -51 -6 104 -117 204 16 198 -140 179 69 296 25 17
5476 17 -255 -12 -124 -54 44 -202 118 -33 -148 49 43 -291 45 160 118 -16 -36 17 210 67 231 -132 -147
$$ packed form
5312g6J51RJ98m73J56J64k78K67j85J25j56Kj12J28n4J8J92k78J09oK62j6k05
5335e8J49L0L3L7j35j05m1n5J79J8k08J42p4L61l79L14k89L9N9k41K84j32L10
5358B38k01L5j12M1kk01J15J4L04j14j71k1L14k19j6N0j05J29j30k14O9K49j63
5381a11Q7n2M1j7M7k0k0L1J89k09L7J17k06R1j7j20R3K0P8J10j74J10r5q5RK93
5407B27j47j4q6j6J10q8l9o3j53N26k58j78K18n7M8Nj44L26l41j5J39r3J1P0J41
5432A29k73K59k23l0m4L03k28J4J87j36K01k05J48j69j78O55l00n9j66j7kK29
5454I5n0j68j89M54m01J72m3K55k5j51M5J10k21L21j88J82l38L19j10K27k71q
5476A7k72K43j12P0R8k46L20j51j15J97ol34L36J15m2j34k0N3J93j43J64l63j5
$$ plain form
5499 -147 75 290 154 73 -59 54 -69 48 116 -42 119 -50 -173 335 103 11 -7 78 -151 187 -63 99
5521 99 146 114 195 65 -89 73 18 -53 -79 237 -206 164 -90 -25 83 101 72 -70 -25 -279 -218 2 9 30 -14
5546 -14 145 11 33 226 139 -127 -49 -94 79 -141 140 99 -101 -131 -59 97 182 -241 242 160 86 -32 -74 -33
5570 -33 173 27 262 -93 197 -135 200 -95 16 99 -31 70 -38 126 160 97 48 49 -68 -25 -96 155 173
5593 173 41 -93 247 -22 -271 -141 -19 57 299 -69 132 112 112 97 38 14 8 -57 -15 60 -117 -110 -129 -233 59
5618 59 112 -147 115 -271 -63 -68 -219 122 -41 -189 -18 -93 -90 51 -56 25 66 -114 -39 33 -75 -113 45 -222
5642 -222 -124 15 74 144 -115 96 -49 -400 107 140 164 3 -21 57 -104 -13 -79 129 197 -160 102 101 35 -153
5666 -153 209 141 -12 -222 -153 56 -38 -13 -217 -143 234 42 -181 -4 87 -8 -319 -68 -193 158 77 -166 8
$$ packed form
5499a47K22K15j36q1j32J13j23J17O8j58J61j69j23N08k32r2j8Q5k29L38k50J62
5521I9M7l2Q1j30j54J62n5p1k6L16m43L70k54O5J08J8k9j42M5k54O1K20PK1m4
5546a4J59j34K2J93q7k66P8m5J73k20K81m1k00l0P2J56Q5m23M83q2p4j18m2M1
5570c3K06j46K35l55K90l32L35k95J11Q3j30J01j08J64L4o3m9Jj17M3p1K51J8
5593A73j32j34L40k69k49J30J22P6K42l68K01k0%j5n9k4oo5M2P5j77Pj9j04K92
5618E9N3k59K62l86K08nj51L41j63j48J71p5LJ41j07Q1M1j80P5P2j08l8J58k67
5642b22R8J39N9P0k59K11j45l51N07L3K4j61k4P8j61R1o6K08O8l57K62jo6j88
5666a53L62o8j53k10O9K09r4K5k04P4L77j92k23J77R1r5l11K51j25L51q1k43J74
$$ plain form
5689 8 111 163 -57 34 -114 18 13 -69 -99 9 -142 -82 -121 -111 -63 118 194 22 -73 17 -5 165 -26 -7 -13 178
5715 178 155 -296 -222 -13 278 -70 -77 247 63 -293 122 154 40 -18 155 180 -16 145 7 -68 216 85 -146
5738 -146 32 7 157 -105 191 222 134 -85 -46 -138 77 71 -73 -83 112 186 51 -85 -154 -171 64 -21 121 68
5762 68 -71 -23 -128 -81 85 95 218 122 103 212 -130 285 -53 274 126 13 149 -109 150 -220 139 -138
5784 -138 45 -258 -24 39 190 15 -165 110 -176 97 -161 43 -34 93 -106 98 -28 -173 58 -37 163
5805 163 221 39 102 52 -96 125 68 59 68 26 15 9 54 -198 43 180 85 182 128 -21 169 -64 101 85 245 -97
5831 -97 25 30 0 190 -131 138 -71 -112 -109 -156 116 -48 -47 -231 145 -152 76 -95 -38 -19 7 57 -242 -181 -79
5856 -79 2 -19 17 -35 -28 158 -9 14 176 52 -56 -15 -146 -138 -76 -102 233 -102 -39 10 -128 237 13 -102 62
$$ packed form
5689HJ03N2k20R1j48J32nq2l0J08j51O0l9J0M8J81P6j72r5R0k2J70j91J9oJ91
5715A78k3m51P4K09K91l48pL24j84l56M15L2j14n8J73K5j96J61j38p5K84j31k31
5738a46J78k5J50k62K96L1q8k19L9r2K15oj44j0J95P4j35j36o9j7K35q5J42n3
5762F8j39M8j05M7J66J0J23r6j9J09l42M15l38L27j48j13J36k58K59l70L59k77
5784a38J83l03K34O3J51j75j80K75k86K73k58K04p7J27j99K04j26j45K31r5K00
5805A63N8j82O3n0j48K21n7rRm2j1oM5k52K41J37r5R7n4j49J90k33J65j6J60l42
5831i7J22Nl0J90l21K69k09m1Lm7K72j64Jj84L76k97K28j71N7J9K6N0k99O1J02
5856g9Q1k1L6n2PJ86j67K3J62j24j08M1j31QO2k6L35l35O3M9j38L65k24j15J64
$$ plain form
5881 62 -214 -6 5 -15 -60 224 176 -47 -18 45 -153 -355 -128 59 148 -240 87 -427 114 145 81 -104 -90 -91
5905 -91 247 -106 -29 -2 -37 10 168 23 -108 -272 -18 -50 -84 -106 54 12 -53 121 -27 -32 -58 -74 -364 -96 -102
5930 -102 -348 -78 88 -80 98 303 6 44 4 -18 171 -6 -45 88 1 -114 -22 122 171 -183 66 -182
5952 -182 -19 37 -12 -165 28 9 -181 190 62 9 -187 120 -37 -52 3 85 -158 32 74 -1 131 94 90 334
5976 334 145 -34 11 51 193 102 117 -178 23 16 233 -82 10 196 123 -67 -86 158 160 -287 -57 124 -66 50
6000 50 157 -125 148 -24 -51 -162 -131 -111 21 -297 -136 -125 133 -28 40 -247 47 89 -211 52 -195 -15
6022 -15 -412 72 290 -71 104 168 -5 -206 30 185 64 105 91 49 169 26 -123 -270 131 -162 -218 -10
6044 -10 3 79 33 44 -37 210 -54 189 12 119 -19 128 -133 212 -167 -241 -270 16 93 -115 185 -84 -76 -283
$$ packed form
5881F2k76K08J1k0m5K84m8k23K9O3j98k02K27J87Q9l88L27n14N41L1o4j85J4j
5905i1L38l53P7K7l5M7J58j45j31j64K54l2l4k2J60m2o5J74j48nk6j6k90K68o
5930a02k46K70J66j68J78K05k97L8m0k2J89j77l9J33q7j15R2J44M9l54K49k48
5952a82J63N6m9j53J93j9j90L71j28n3j96L07j57j5N5Q2k43J90M2p5J32l7mK44
5976C34j89j79M5M0J42r1J5k95K01pK17l15R2J86p3j90j9K44Km47K30J81j90J16
6000E0J07k82K73j72k7j11L1K0J32l18J61J1K58j61O8k87K94M2l00K63k47J80
6022a5l97M84K18l61J75O4j73k01K36J55j21M1j4m2J20j43j49j47M01k93n6K08
6044a0J3P6m6J1q1K47k64K43j77J07j38J47k61L45l79p4k9K86P7k08L00k69Qk07
$$ plain form
6068 -283 -2 82 129 -176 -189 -55 -128 -44 32 200 130 22 -310 -170 18 10 225 141 -86 -102 -8 6 -179 44
6092 44 -204 73 33 -36 -107 -87 -218 224 133 -29 -143 34 -34 13 -130 46 404 128 -59 87 24 -142 91
6115 91 -79 -186 31 35 172 108 146 -217 -69 -75 54 97 -44 -33 -201 -64 133 155 -113 -90 8 94 -52 -55 -13
6140 -13 -174 78 25 -128 -223 209 106 -260 54 -48 -115 67 -39 -47 60 11 -114 -125 73 -97 75 138 172
6163 172 161 -211 -73 147 77 21 7 45 186 -10 -167 -156 140 -60 174 -173 15 77 134 -192 236 37 116
6186 116 0 145 -74 -19 -97 -41 -24 70 -70 -42 -52 121 193 46 -15 -253 -70 283 97 93 -223 -50 68 -150
6210 -150 -87 211 -210 277 -116 -100 -138 -115 73 102 122 49 254 -40 90 8 42 -37 -67 64 70 269 -173 -40
6234 -40 125 -133 0 33 -72 -130 -208 28 68 51 190 74 -7 1 133 117 -159 16 57 -165 226 77 -7 -49
$$ packed form
6068b83K81Q4M7l05j3J34p3Q4P6J68p0j08l32J40J88qK15q4k27j6R4J4j85K23
6092D4k48K77m0o9p1K0j31M42r1j62j14J77o8M7j43J76L58k76j87J46o3j66K33
6115I1j70j07K17MJ37o4L8l63J48oJ29M3j41J1j68J37J97K2k68K3R8Q6j46lM2
6140a3j61K52n3j53r5M32j03l66L14j02o7J82j06qJ07m9j25j1J98j70J72O3L4
6163A72j1l72J38K20p0n6j4L8J41j96j57J1K96k00K34l47J88O2N7l26M28j99P9
6186A16j16J45k19N5p8N6J7R4j40K8j0J73P2j47o1k38J83L53j86ml16J73J18k18
6210a50O3K98m21M87l93J6l8K3J88K9K0p3K05k94J30q2L4p9l0J31OJ99m42J33
6234d0J65k58J33L3j05n8p8K36M0j7J39j16q1QJ32j6k76J75M1k22L91j49q4m2
$$ plain form
6258 -49 36 -189 184 129 269 -1 -112 -33 -87 164 -93 -149 154 -4 -49 55 -84 -43 106 102 197 -42 125 -25
6282 -25 -74 126 -177 141 34 -17 -121 72 -62 33 -33 -64 -44 -158 -87 243 -29 -59 -129 -215 37 -108 12 -23
6306 -23 -98 118 36 56 -154 -130 194 -101 -110 126 -30 28 -204 111 80 23 -120 167 -136 -45 85 -5 115 7
6330 7 -57 -83 -17 37 158 -84 192 -141 -38 50 -161 -301 -89 -2 22 44 70 27 15 185 111 84 2 68 -89 16
6356 16 -23 -46 -185 8 30 -173 -41 -173 -62 161 -46 179 136 169 104 138 133 -10 48 -50 -161 59 200 39
6380 39 21 207 -128 -60 101 79 108 129 187 -61 62 -151 127 -93 -71 135 -117 150 -28 -299 -364 -167 -59
6403 -59 -18 -247 -73 -4 -95 67 46 -108 171 4 -6 25 43 0 -133 64 39 71 -274 -199 76 -24 18 -36 68
6428 68 164 34 160 70 8 -30 -199 -152 -16 110 83 -3 -104 163 -157 -107 248 -159 -141 -134 124 248 95 -44
$$ packed form
6258d9Q5k25L73n5J40k70j11P9n4K51k57n6L03j58m5J04j39M1J49mR5k39J67j50
6282b5m9K00l03L18j07n1j04J93j34R5o6l1K0j14P1L30k72l0p0q6K52j45J20l5
6306b3p5K16q2K0k10K4L24k95rK36j56N8k32L15l1n7j43K87l03R1J30r0J20j08
6330Go4k6O6N4J21k42K76l33J03Q8k11j40K12Q7K4K2K6m3j2J70p4k7q2O6j57J05
6356A6l9k3j39J93K2k03J32j32J11K23k07K25m3L3o5L4nj43N8r8j11K20J41j61
6380C9j8J86l35O8J61k2K9K1N8k48J23k13K78k20K2K06k52K67j78k71o5J97J08
6403e9M1k29J74O9r1J62k1j54K79j67j0L1J8m3j33J97k5L2l45P5K75j00M2n4J04
6428F8R6j30J26r0o2l8j69M7J36J26k7q6j01K67l20N0L55m07J8PK58J24j53j39
$$ plain form
6452 -44 54 82 143 -198 -58 -56 53 103 -16 -161 164 78 286 139 81 -33 -105 211 -247 -57 -53 -112 -44 -9 -72
6477 -72 171 134 114 208 135 148 51 57 50 -50 131 -206 23 -211 57 -59 138 32 15 -20 26 -89 252 11 90
6502 90 -65 177 16 195 5 -123 16 217 307 -153 188 33 -168 131 -3 -96 115 -11 171 213 -202
6523 -202 275 -329 41 -229 59 -224 82 34 -81 122 -121 -31 6 90 109 6 28 97 63 9 149 79 -62
6546 -62 37 58 -140 22 -32 38 118 -93 76 77 85 -51 183 -170 -80 1 -49 -387 234 -56 125 83 -166 -40 31
6571 31 -56 -249 145 122 61 -31 110 -125 -94 -117 22 162 184 139 -143 -260 -135 50 -169 80 70 -179 79
6594 79 135 -13 208 3 -116 -165 86 -108 -104 61 2 49 96 -207 68 38 -153 96 -92 124 213 -71 3 86
6618 86 -121 -58 32 -12 15 63 -189 -80 33 74 32 102 -80 53 11 -137 -83 -266 -76 36 -15 69 119 153 -57
$$ packed form
6452d4R8K8O1l41J40KJ09N0j19j45L25q6K08j47n8j14p2L16m58J90Mn9O8L5o3
6477g2K43l7k0R4p3J3r7Opj00J81l37K29k34K68j16J97j06j7l5M6j15L41k41P9
6502I0j55K42j61J79j90j28J39K01R0m60L41j55k01K99j34r3K11j26J82M2m15
6523b02M77o04L70k70K88k83L06m8j15K03k43R0L7Q4J9j03K2O9l4n4J40p0j41
6546f2R9K1j98J62n4P0Q0k11J69JQj36K34l53R0Q1n0l38O21k90J81m2k49J26P1
6571C1q7j93L94k3o1r2J41k35L1k3J39J40K2m5k82j17J25J85k19K49j0k49K58
6594G9N6j48K21k05j19m9K51j94MJ65n9M7M7l03K75l0j91K49j88K16Q9k84P4Q3
6618H6k07O3R0m4K7M8k52J09J13M1m2P0j82J33m2j48N4j83J90J12n1Q4N0L4k10
$$ plain form
6643 -57 176 30 -13 -138 45 -20 -73 -48 -166 25 -100 118 21 -52 51 -121 -227 -18 -190 -70 20 159 1
6666 1 16 139 -104 -169 -17 125 50 186 21 208 99 289 -72 82 95 -202 130 162 280 207 -61 -150 13
6689 13 24 -5 160 76 -195 213 -29 -43 102 87 96 154 -323 54 154 -6 -240 76 163 183 59 108 79 -63
6713 -63 118 22 -84 106 161 -19 -162 58 10 104 -58 -51 18 -167 -49 -155 -96 24 282 204 -141 143 89 63
6737 63 -63 29 -195 36 -71 61 142 35 -107 67 -99 6 16 149 -114 81 107 -24 -103 -203 20 73
6759 73 -243 63 153 -182 106 -204 94 34 131 33 119 81 -75 17 23 -132 -29 123 -55 276 -89 -2 0 -131
6783 -131 145 -82 62 65 51 107 -31 -112 20 -81 -42 8 204 -118 -187 -114 153 16 -61 5 -169 -73 -170 -71 99
6808 99 75 10 96 -26 3 -120 28 -13 11 -204 -18 -18 92 -188 118 -54 150 63 37 12 272 -263 25 -199
$$ packed form
6643e7K33j46m3j25J83o5n3K5j18J91j25K18r7p3J03j72j06K09j72J20R0J39j58
6666AJ5J23k43o5J52J42p5J36j65J87j09J90l61J54J3k97L32L2J18p3k68q9J63
6689A3J1k9J65q4k71M08k42j4J45j5RN8m77L77J00j60k34L16Q7K0j24M9k9j42
6713f3J81r6j06J90N5j80j43K20m8R4j62PO9j85J18j06N9J20K58p8l45K84n4k6
6737F3j26R2k24K31j07J32Q1j07j42J74j66J05J0J33k63J95K6j31p9j00K23N3
6759G3l16L06R0l35K88l10K98o0R7r8Q6l8j56R2Oj55J03J52j78L31l65Q7Kj31
6783a31K76k27J44Lj4N6j38q1J32j01L9N0J96l22o9P3K67j37p7O6j74R6r7R9J70
6808I9k4o5Q6j22K9j23J48m1K4k15J86%J10k80L06j72K04q7k6k5K60n35K88k24
$$ plain form
6832 -199 -4 141 42 -45 92 141 118 -92 65 -75 -95 62 71 201 -215 97 10 130 -167 -27 72 129 149 146
6856 146 128 96 -175 3 181 -283 7 -121 55 -26 1 169 84 -16 63 -91 169 48 133 -257 73 -49
6878 -49 -121 -118 -4 13 -84 -159 110 26 -362 5 32 -94 -36 -88 92 444 -329 58 71 153 -146 70 -143 31
6902 31 10 -24 175 57 171 36 102 -8 -195 127 28 -62 70 249 -8 105 -71 -192 117 -102 -236 125
6924 125 37 -23 106 -83 -92 106 49 -15 -179 -8 -145 -97 -119 75 -12 -74 77 -40 17 -87 -39 161 30 -192
6948 -192 142 -227 -311 -100 -46 -100 203 38 -101 45 -186 40 291 252 -96 177 113 -60 2 -53 19 60 -218
6971 -218 54 155 166 -48 94 -51 -36 111 3 -21 -60 29 -51 -189 117 -39 -30 -284 -143 -154 69 -2 -63 -198
6995 -198 231 112 8 316 -52 -127 -255 63 -45 292 -102 -31 -5 29 237 -97 -160 153 -248 -42 34 -139
$$ packed form
6832a99J95J45r9q7J37M9k3k10J57j40k0J57RJ30m16L12q7J20k97J40R9N7K0l
6856A46j8l2k71J78J78m64K90j28J76q1K7J68q5j00P9j54K60j21Q5l90L30j22
6878d9p2LJ14J7r7p5K69q4l88L67K7j26N8n2J80L52p73L87J3Q2k99K16k13J74
6902C1k1l4J99j18J14j35O6j10j87L22r9r0J32J79k57J13j76j21L09k19j34L61
6924A25q8o0J29j89rJ98n7o4j64J71j37M8k2J94q7o2J51j17N7j04M8K00j31k22
6948a92L34l69q4K11N4n4L03j65j39J46k31K26K51l9l48K73o4j73O2n5P2M1k78
6971b18K72J01J1k14J42j45J5J47j08k4l9Q9q0j38L06j56Rk54J41j1K23p1o1j35
6995a98M29j19j04L08l68p5j28L18j08L37l94P1K6L4K08l34o3L13m01K06P6j73
$$ plain form
7017 -139 97 -75 56 -90 -169 -81 -48 -86 -87 -8 -73 73 189 -75 73 170 -33 139 41 8 -145 -350 106 -148
7041 -148 -38 -20 21 54 2 -15 152 -244 -77 -14 -55 114 159 -241 -105 -137 -54 -141 -44 24 4 -33 -84 197 16
7066 16 148 104 -27 127 130 78 118 22 83 94 -220 -223 55 -85 -275 -71 -233 83 56 69 -134 -30 142 70 17
7091 17 19 -187 106 64 92 26 56 149 72 -52 -18 -160 -36 117 -106 -69 72 22 159 -64 -13 0 -27 -73 -290
7116 -290 76 -44 26 -70 47 -71 -37 48 127 105 -44 56 96 230 93 35 28 -140 -16 -47 193 127 247 29
7140 29 -29 42 141 -20 -5 -127 169 10 -8 -175 -9 106 -76 73 -216 194 55 187 0 -146 20 156
7162 156 -31 30 257 -15 -22 156 39 115 31 -96 57 12 -154 -57 49 68 56 43 0 -9 147 56 -156 81 30
7187 30 70 -191 142 127 -218 -128 -157 -22 7 -41 71 -114 33 -307 -108 65 -231 -140 -163 120 -82 6 70 -43
$$ packed form
7017a39K36j72J31j46p9Q8L3l8jP9o5J46J16k64J48R7k03J72r8l3j53k05M56k54
7041a48J10J8M1L3n2j7J67l96J67O3m1J69M5m00J36l2Q3q7R7O8k0l7n1K81j81
7066A6J32m4j31J54Ln2M0r6O1J1l14lK78j40j90K04j62L16k7J3k03J04J72p2n3
7091A7Kk06K93m2K8o6L0R3p7j24L4j42J24J53k23L7J41n0J37k23N1J3k7m6k17
7116b90L66j20P0r6J17j18L4Q5P9k2j49J00M0J34j37n8pj68J24l1K40o6J20k18
7140B9n8P1R9j61J5j22K96j59j8j67J66J15j82J49k89M10j39J32j87j46J66J36
7162A56j87O1K27k72pJ78j17P6q4j27J53m5j66R7J06J9j2j3m3rJ56r1k12K37n1
7187C0M0k61L33j5l45R0k9J35K9m8J12j85J47l40J99J73k96R1k3K83k02Q8O4j13
$$ plain form
7211 -43 -121 -307 -219 -273 -67 -92 -334 10 44 -249 109 -23 3 -78 138 8 150 64 -206 -140 -69 -45 16 93 -85
7236 -85 -163 -147 29 -110 -36 -2 -41 -6 93 -24 -17 -296 13 5 -49 -41 -38 81 96 100 -54 46 -100 93 25 156 -250
7263 -250 42 67 -112 154 22 -86 13 249 -51 129 161 -277 -44 -11 77 -236 -82 69 -119 -51 207 33
7285 33 -201 21 79 -4 -149 -164 -180 -158 -69 58 140 69 -297 160 -191 -87 -21 -198 104 141 -132 91 189 -35
7309 -35 81 57 -17 71 -65 123 -155 35 0 -18 4 -35 121 79 228 -76 -130 0 55 -98 -195 -71 -70 84 -104
7334 -104 51 34 116 197 -146 42 -10 -37 -188 -17 122 -89 -93 -50 -96 -56 95 125 -1 -121 -124 -93 93 -124 90
7359 90 225 53 8 41 -68 77 153 110 74 202 -79 143 -173 -38 -9 -149 -78 -1 86 176 -4 -248 187 -106
7383 -106 10 -103 115 174 266 7 -65 -4 -117 122 7 115 105 165 -165 -208 26 77 -133 0 -344 26 -224
$$ packed form
7211d3p8j86Q8n4K06k5k42L44L4k93L58j32K6q1K16j30J42q6k70O6P1K4O1P7j78
7236h5p8J6J76j39P4L4l9L5R9j17Pk79L09qn4QLJ19J5Mj54J00j46J93o8J31m06
7263b50K92K5j79K66j32j08R9K36l00J80L2m38K33L3Q8l13J54J51j88O8K58j74
7285C3k34K22N8q3j45j5j6K2Q9J27Q2p1l66M57l51J04O6j77L02L7k73K23R8k24
7309c5J16k4p4Q8j36J88k78J90l5j8K2l9J56m2J49l04n4J30N5j53r7J24JJ54j88
7334a04J55j7Q2Q1l43J88n2k7j51J71J39k11mM3m6M0J51L0j26j20lL1J86k17K14
7359I0J35j72m5L3j09J45P6m3l6J28k81K22l16J35K9j40P1P7Q7R0j80k44M35k93
7383a06J16j13K18N9R2k59p2O1j13K39j15J08j0O0l30m3K34N1k10J33l44L70k50
$$ plain form
7406 -224 -80 -111 -1 82 -79 -1 -149 -25 -178 -118 24 84 138 7 -67 50 -17 275 -21 96 10 -340 160
7429 160 0 -75 -132 -160 -187 -35 38 118 196 -32 -156 -155 -3 -19 188 57 249 24 -26 -129 -96 19 159 -218
7453 -218 -102 -25 3 94 -43 115 -16 28 145 -41 118 -29 19 198 -191 98 -3 77 35 39 -365 -158 -141
7476 -141 -83 45 -174 50 157 29 -250 -118 117 45 -157 -1 92 148 -5 62 164 76 -108 -78 47 405
7498 405 7 81 98 219 202 -82 -6 91 -59 -3 -110 22 -207 -107 61 -6 -45 78 5 23 150 58 139 -39
7522 -39 -11 -78 -2 -58 -98 81 71 49 -27 101 31 -60 99 188 25 -39 190 -48 237 -25 225 38 -25 88 95
7547 95 -169 -92 -200 66 148 -191 -59 -144 32 45 134 -2 55 26 48 154 119 -38 -17 -274 151 10 49 30
7571 30 135 63 -85 -25 -100 101 159 174 -88 -41 146 -22 -2 79 34 -221 -190 90 41 110 113 -23 -73 111 155 -66
$$ packed form
7406b24J44l1J10Q3j61P8j48J24j53O0J42O0N4j31p4J17o7K92k96J17q6l50N00
7429A60j60p5n7k8k7J52P3Q0P8k28j24JJ52j6K07j31J92k25n0j03L3J15J40l77
7453b18J16P7K8R1j37J58j31M4J17j86J59j47M8J79l89K89j01Q0m2Mm04K07J7
7476a41N8J28k19K24J07j28k79J32K35p2k02J56R3N6j53O7J02q8j84L0J25L58
7498D05l98P4J7J21j7k84P6R7j50N6j07J32k29J00J68o7l9J23p3J8J27r2Q1j78
7522c9K8o7P6n6m0J79j0k2p6J28p0r1J59Q9j63o4K29k38K85k62K50j87o3J13P
7547I5k64P7j08K66Q2l39J32q5J76J3Q9j36N7k9K2J06l5j57K1k57M25j41L9j9
7571C0J05p2j48O0p5K01N8J5k62M7J87j68K0Q1m5k55L1K80m9O9Lj36n0J84M4k21
$$ plain form
7597 -66 26 142 70 -67 -16 89 -197 -56 46 -130 -84 -65 -89 33 -154 32 170 175 235 142 -54 -4 -163 -146
7621 -146 166 -236 -122 57 -16 42 -39 -126 255 109 61 -188 183 253 -40 71 -103 105 -128 -63 -96 -162 -125
7644 -125 58 -42 213 -46 -41 26 67 -47 -164 21 -157 -109 36 -130 6 74 101 -122 16 -244 -167 13 -21
7667 -21 -41 37 159 80 166 -181 -135 158 -126 -122 -60 167 -58 -82 -183 -20 -90 18 -44 -48 -47 31 252 -106 -173 53
7693 53 -188 11 99 -112 -189 -11 447 144 -113 119 -34 215 70 121 -30 -109 110 -90 -125 242 -5 -17
7715 -17 -32 -79 -9 -5 -52 -95 -38 -190 -214 85 202 -46 51 -115 -40 -14 -186 -55 -22 -286 -36 75 -284 -165 -73
7740 -73 39 -109 50 71 -20 139 195 -160 64 178 105 32 187 392 161 -194 145 34 149 -21 -181 -182 16
7763 16 54 46 137 -13 -9 -99 22 11 16 29 -175 48 28 131 -68 202 -137 127 115 189 50 -213 149 -87 -25
$$ packed form
7597f6R2J16p2j37N1J05k86J41J02j76M6J9k4J22j87J86J38NO0r3j96N0j59J7
7621a46L12m02J14J79p3N8q1q7L81j46m8k49L71P0k93J11j74K08k33O5l3o6L7
7644a25J83j00K55k59NO7M1j14j17J85j78M8J45j66J36O8K7k23J38k60P7J80l4
7667b1k0P8J22p9Q6l47M6K93k84MO2K27k25k4j01J63p0J08o2mJP8K21l58o7K26
7693E3k41J99Q8k11p7J78M58l03k57K32j53K49j45N1j51p9K19k00l5L67k47j2
7715a7j5m7P0Mm7m3N7j52k4K99J17k48R7j66P5K6j72J31L3k64K50J11l59J19R2
7740g3J12j48J59K1r1J59N6l55K24J14p3p3J55K05k31l55L39j11J15j70j60jJ98
7763A6L8qR1j50Mr0J21j1NJ3k04K23k0J03j99K70l39K64j2P4j39k63L62k36O2
$$ plain form
7788 -25 -25 -72 0 102 -107 -142 -41 189 -341 -104 13 -61 297 140 78 51 -42 106 129 16 255 -24 123 -23
7812 -23 32 -266 -168 2 -16 121 -92 -66 77 -48 -42 165 -76 -85 -27 6 -43 -7 7 49 -31 -51 -241 -129 -236 197
7838 197 118 -32 124 273 -290 25 -20 -1 21 10 -109 -86 -40 132 88 195 147 63 11 -153 -8 -29 -102 -263
7862 -263 -71 -11 -285 6 134 67 -147 344 -194 -92 8 112 -161 121 -9 8 223 -4 0 227 -43 103
7884 103 97 -43 75 103 -18 -66 63 98 67 -17 -149 -270 146 -124 -55 -40 9 -22 110 -94 -288 -26 14 -18
7908 -18 -249 75 -183 37 203 135 -84 40 24 175 2 -187 77 -271 -75 168 -98 85 -112 -212 -172
7929 -172 22 -48 -117 -105 -28 -213 26 96 81 -56 -20 46 121 157 -292 -10 -103 180 -98 82 40 -91 -203 57
7953 57 -273 189 122 -116 280 -54 151 31 -107 -201 -48 -209 211 -63 172 -107 -30 179 95 14 49 191
$$ packed form
7788b5%m7P2J02k09l5J01K30n30K37J17p4L58j57o2k7r3J48K3j13K39k79J47j46
7812b3N5k98R8J70j8J37k13K6J43j25OK07k41rN8L3m9L6J4M2q0k0j90J12j07M33
7838A97p9j50J56J49n63L15m5J9K2j1j19K3M6J72m4J07m8q4n2j64J45k1p3j61
7862b63J92O0k74K91J28o7k14M91n38J02J00J04k73K82j30J7K15k27MK27k70J46
7884A03oj40J18K8j21m8J29L5l1q4j32j21M16k70O9J5M9l1J32k04j94K62M0l2
7908a8k31L24k58K20J66o8k19J24j6J51j73j89K64l48J96K43k66J83j97j00M0
7929a72J94p0o9J2P7j85K39P0j5j37L6O6P5L6m49K82r3K83k78J80m2j31j12K60
7953E7l30M62o7k38L96l34K05j20j38r4J53j61M20k74K35k79P7K09q4q1L5J42
$$ plain form
7975 191 94 166 104 139 69 -101 -97 -81 255 -12 63 74 -43 -53 104 144 42 -139 105 -9 -63 -27 239 -5 2
8000 2 -3 27 -210 -130 188 88 -221 161 49 -130 -149 -122 33 -45 -144 -105 -120 -18 -247 98 -144 11 119 -57
8024 -57 56 -94 -101 186 -115 13 -110 101 -54 83 -128 -111 -91 -46 90 -244 287 173 -29 -194 126 88
8046 88 147 1 -43 -86 85 51 -155 88 -148 236 -172 -270 49 97 170 26 122 -82 30 -97 177 -3 211
8069 211 -51 14 -204 -80 -108 -58 -62 -46 151 -203 134 134 -49 42 97 -138 75 -183 148 -89 163 -331 180
8092 180 251 -134 -145 -79 -45 216 146 -64 -2 -85 -14 14 -42 -188 122 131 -70 -186 242 9 121 31 -209 77
8116 77 210 -45 203 -37 276 7 -97 -165 20 73 -106 138 160 96 159 26 -47 19 -187 35 79 -19 27 150
8140 150 -24 -28 18 -150 140 84 23 -125 -179 -77 145 250 -17 -20 305 121 -167 31 -41 71 -73 227 -250
$$ packed form
7975A91r7P2o2L5p0j70MJ6L36k67P5J1j17j0J57M0j02j81K44j14n4L6K66k44P
8000BnL0k37Q0L18j00l09L82j12j79j9K7J55p8r9L9j5J02k29L45k42J55J08j76
8024e7J13j50pK87l01J28j23K11j55J37k11J7K0M5J36l34N31j14k02j65L20l8
8046H8N9j46m4m3J71l4k06K43k36L84m08r8L19M8P3j44R6k04J12j27K74j80K14
8069B11k62O5k18J24k8N0mJ6J97l54L37%j83R1N5k35K13k58L31k37K52m94N11
8092A80P1l85j1O6L4K61p0k10O2q3P1K8n6j46L10Rk01j16M28k33J12r0k40K86
8116G7J33k55K48k40L13k69j04o8J85N3j79K44K2o4O3j33p3O6k06K22M4r8M6J23
8140A50j74mM6j68K90n6o1j48n4J02K22J05k67lL25j84k88J98p2J12j44L00m77
$$ plain form
8163 -250 -283 0 57 171 60 33 -265 22 -25 125 -53 -72 -256 103 79 -150 -61 -57 -254 130 -143 -8 21
8186 21 -32 -193 -148 247 -81
$$ packed form
8163b50l3K83N7J14j11k7k98K87m7J50j78j9j84L59k4k29Q9Mj97L84k73J35K9
8186B1n3j61M5L95l28
8191h1
$$ Imaginary data points
##PAGE= N=2
##DATA TABLE= (X++(I..I)), XYDATA
$$ plain form
0 0 0 0 0 0 0 0 0 0 0 8 -8 8 -8 16 -16 24 -32 32 -40 51 -64 72 -88 104 -120 144 -164 192 -218 250 -287 326
32 326 -370 419 -472 531 -595 667 -745 830 -923 1024 -1136 1256 -1389 1533 -1690 1865
48 1865 -2054 2261 -2492 2744 -3026 3338 -3690 4086 -4538 5059 -5664 6382 -7244 8308
62 8308 -9650 11409 -13820 17333 -22944 33279 -58457 243465 193275 -282223 233418 86013
74 86013 -113400 184658 99469 -63177 160464 -30041 3117 160212 -55295 18850 163112
85 163112 -111135 -48299 205768 -46082 -93713 70823 -11589 14165 7593 -49779 -26100
96 -26100 1689 -28501 21461 -19684 -54019 -10098 -48684 -18954 9018 1521 -16072 -49540
108 -49540 -74054 39080 63500 -65300 -12693 -5588 7267 20741 -25719 37306 41217 -57094
$$ packed form
0@%%%%%%%%%Qj6J6j6K4l2M0n6O4p2R1j15J36j60J92k24K64l08L56m10M68n37O13
32C26o96P89q91J003j126J262j412J575j753J947k160K392k645K922l223L555
48A865l919M315m753N236n770O364p028P776q624R597j0723J2046j3626J5552
62H308j7958K1059k5229L1153m0277N6223r1736L01922n0190m75498N15641j47405
74H6013j99413K98058q5189j62646K23641j90505L3158J57095k15507P4145J44262
85A63112k74247O2836K54067k51850m7631J64536q2412K5754o572n7372K3679
96b6100K7789l0190M9962m1145l4335M3921l8586K9730K7972p497j7593l3468
108d9540k4514J13134K4420j28800N2607P105J2855J3474m6460O3025L911r8311
$$ plain form
120 -57094 34320 74874 -62995 53291 60294 -43617 34324 60947 38377 -8734 -43607 66665
132 66665 115929 -75652 17451 106281 -94522 26217 126023 -58928 -441 83951 -77031
143 -77031 21845 61701 -39504 72321 -36485 -94594 119293 28164 -126263 87261 15609
154 15609 -121765 104985 3385 -116637 78165 7822 -98761 76367 -8793 -73688 61642
165 61642 -61106 -27635 89170 -40605 -59802 28807 -32088 7747 57044 -65551 -13584
176 -13584 32368 -32657 -7476 40246 -8151 -26438 7469 -7444 5687 11830 24780 -31802
188 -31802 -30424 54301 15853 -27213 -4514 16387 4020 11308 -4782 12369 617 -28920
200 -28920 37310 9856 -25246 27112 8896 -66398 25921 62396 -39416 -11980 -9619 -11995
$$ packed form
120e7094R1414M0554j37869J16286P003j03911P7941K6623k2570m7111l4873J10272
132F6665M9264j91581R3103Q8830k00803J20739R9806j84951N8487Q4392j60982
143g7031R8876L9856j01205J11825j08806n8109K13887r1129j54427K13524p1652
154A5609j37374K26750j01600j20022J94802p0343j06583J75128q5160o4895J35330
165F1642j22748L3471J16805j29775j9197Q8609o0895L9835M9297j22595N1967
176a3584M5952o5025K5181M7722m8397j8287L3907j4913J3131O143J2950n6582
188c1802J378Q4725l8448m3066K2699K0901j2367P288j6090J7151j1752k9537
200b8920O6230k7454l5102N2358j8216p5294R2319L6475j01812K7436K361k376
$$ plain form
212 -11995 24112 -3574 -16880 13717 -38242 -10160 43060 -57609 8658 43281 -75674 -13031
224 -13031 56557 -41009 -13553 20460 -64203 31596 29339 -59907 11045 -1006 -35969 46049
236 46049 -5498 -60174 58480 -18479 -54690 65931 2534 -43191 31935 -12191 -38365 67849
248 67849 6334 -40836 15259 -2511 9169 23808 -16789 -3189 31343 -29588 6070 34910
260 34910 -25597 1956 16884 -18078 -4593 37282 -12118 -34945 6309 25254 -1373 -21319
272 -21319 5633 -17430 -5898 17571 -3311 -15371 -3331 -7957 -11401 4190 -6569 18558
284 18558 -23073 -40652 30651 10218 -27105 10432 -4920 -35234 36905 5322 -31742 16386
296 16386 -640 -8446 11924 -975 154 18949 -30023 8336 42448 -23521 5185 16140
$$ packed form
212a1995L6107k7686j3306L0597n1959K8082N3220j00669O6267L4623j18955O2643
224a3031O9588r7566K7456L4013q4663R5799k257q9246P0952j2051l4963Q2018
236D6049n1547n4676J18654p6959l6211J20621o3397m5725P5126m4126k6174J06214
248F7849o1515m7170N6095j7770J1680J4639m0597J3600L4532o0931L5658K8840
260C4910o0507K7553J4928l4962J3485M1875m9400k2827M1254J8945k6627j9946
272b1319K6952k3063J1532K3469k0882j2060J2040m626l444J5591j0759K5127
284A8558m1631j7579P1303k0433l7323L7537j5352l0314P2139l1583l7064M8128
296A6386j7026p806K0370j2899J129J8795m8972L8359L4112o5969K8706J0955
$$ plain form
308 16140 -31527 18934 53605 -35556 -7394 30139 -20629 17205 19282 -10643 11367 1154
320 1154 -21529 32289 9014 -20396 28698 -21781 -18690 46886 1263 -40987 18314 6377
332 6377 -19124 19467 -7007 -14226 -343 -1137 -2519 1845 -6346 -6185 -5385 -21499 17377 14680
346 14680 -23038 -20781 8237 862 -6342 14258 -14192 -18173 7321 12126 -14924 2718 15665
359 15665 -19979 -6175 12021 9161 -2088 -2238 -8581 9050 11956 -3867 10584 -14781 -3119
372 -3119 31174 970 -22612 23156 4275 -25889 27299 8490 -10753 8182 -5908 -9351
384 -9351 18542 4538 -6072 490 -24225 16507 19140 -25548 -2654 13439 -21842 -3975 21270
397 21270 -22515 -2871 7257 -18384 -2770 10794 -7426 -13580 -6913 -7268 16866 -8032 -19331
$$ packed form
308A6140m7667N0461L4671q9161K8162L7533n0768L7834K077k9925K2010j0213
320A154k2683N3818k3275k9410M9094n0479L091O5576m5623m2250N9301j1937
332F377k5501L8591k6474p219J3883p94j382M364q191J61Q00j6114L8876k697
346A4680l7718K257K9018p375p204K0600k8450l981K5494M805k7050J7642J2947
359A5665l5644J3804J8196k860j1249j50o343J7631K906j5823J4451k5365J1662
372c119L4293l0204k3582M5768j8881l0164N3188j8809j9243J8935j4090l443
384i351K7893j4004j0610O562k4715M0732K633m4688K2894J6093l5281J7867K5245
397B1270m3785J9644J0128k5641J5614J3564j8220o154O667l55K4134k4898j1299
$$ plain form
410 -19331 3367 -7801 -6130 12498 -4839 -25031 11776 -1221 -16114 10983 7166 -14047
422 -14047 -13041 6742 2916 4452 -3906 -4322 -5651 -160 13196 -1866 -10037 -5303 12246 -3530
436 -3530 -7042 11934 -718 -15983 1353 15012 -9645 2438 1442 -15067 1075 14417 162
449 162 -13092 -3528 -3224 8324 -3332 -3554 6342 -12980 -7447 10291 868 -11337 9835 -9930
463 -9930 -15820 16736 6511 -14158 -5927 3199 -4726 7048 -2510 -4855 60 -7791 8012 3179
477 3179 -8690 1031 5476 -16499 5101 18977 -11713 -8393 2366 713 -44 9717 -5456 -8660
491 -8660 1784 2722 5910 -6237 200 1286 -5704 -4063 11233 3347 -13218 1229 659 -971
505 -971 3739 5254 -13290 -4274 12340 105 -3120 -2656 2852 -3891 980 6361 2999 -3652 -4254
$$ packed form
410a9331K2698j1168J671J8628j7337k0192L6807j2997j4893K7097l817k1213
422a4047J006J9783l826J536q358m16j329N491J3356j5062q171M734J7549j5776
436c530l512J8976j2652j5265J7336J3659k4657J2083r96j6509J6142J3342j4255
449A62j3254R564L04J1548j1656k22R896j9322N533J7738r423j2205K1172j9765
463i930n890L2556j0225k0669Q231R126p925J1774r558k345M915p851J5803m833
477C179j1869R721M445k1975K1600J3876l0690L320J0759j653p57R761j5173l204
491h660J0444R38L188j2147O437J086o990J641J5296p886j6565J4447n70j630
505i71M710J515j8544R016J6614j2235l225M64N508o743M871N381l362o651o02
$$ plain form
520 -4254 6276 -423 5295 7220 -2197 -11099 9376 15400 -6371 1759 4212 196 459 10639
534 10639 2877 -2704 3386 2006 4379 1140 8618 1630 -7598 81 14763 2370 -8729 6018
548 6018 -2777 -240 8805 3136 -8793 -1664 5656 -2991 2006 2630 673 -8341 -2653 5762 3937
563 3937 -3404 -4491 949 -6391 7598 6491 -8115 -5480 5522 2771 -4140 6877 361 -3854
577 -3854 -1192 6568 3993 -201 2186 -1488 646 4068 12972 -2282 -6394 5620 6910 2665 2089
592 2089 7419 -4638 -191 8416 5182 -617 2605 2619 -5151 4975 7876 3995 -8145 -516 7066
607 7066 45 1871 1716 -1004 -6484 6120 4103 -4620 -918 1255 -3449 -4075 8215 -305 -6591
622 -6591 -4630 2165 761 -555 2649 -6523 -4067 1150 5742 -3072 -4033 2350 -2977 -2451 3431 5171
$$ packed form
520d254J0530o699N718J925r417q902K0475O024k1771Q130K453m016K63J0180
534A0639p762n581O090j380K373l239P478o988r228P679J4682j2393j1099J4747
548F018q795K537R045n669j1929P129P320q647M997O24j957r014N688Q415j825
563C937p341j087N440p340J3989j107j4606K635J1002k751o911J1017o516m215
577c854K662P760k575m194K387l674K134L422Q904j5254m112J2014J290m245n76
592B089N330j2057M447Q607l234n799L222J4p770J0126K901l881j2140P629P582
607G066p021J826j55k720n480J2604k017q723L702K173m704o26J2290q520o286
622f591J961O795j404j316L204r172K456N217M592q814r61O383n327N26N882J740
$$ plain form
638 5171 -6843 -1419 1660 360 1959 2616 -457 -7798 4741 6097 61 -3696 1598 1967 -2451
653 -2451 5204 4042 -1451 -4987 4906 1745 -685 4911 -23 -5287 -2666 9438 -240 -4224 -752
668 -752 -176 -1265 210 4769 -3891 -3672 -195 2168 -2502 587 1811 -6483 -3002 2715 4659 -6186
684 -6186 -2066 -183 -3497 2765 2624 -2466 -6294 2749 484 -980 949 1766 -3111 -4653 5175 2317
700 2317 -406 -2631 630 -2347 581 7298 -2116 -5301 139 5671 -2201 582 2975 -2997 -3458
715 -3458 1982 4583 -3156 -93 -1183 -1327 -1292 3555 3237 -7720 -2586 3324 1916 -3502 1798 -933
731 -933 -5495 1619 3341 -917 -3713 1505 -2995 -1199 2962 1260 -2451 -5033 2402 1593 666 -687
747 -687 468 -3458 -454 6211 -1799 -1591 1318 386 -2770 5203 3094 -3634 152 543 2958 591
$$ packed form
638E171j2014N424L079j300J599O57l073p341J2539J356o036l757N294L69m418
653b451P655j162n493l536R893l161k430N596m934n264K621J2104r678l984L472
668g52N76j089J475M559q660K19L477K363m670L089J224q294L481N717J944j0845
684f186M120J883l314O262j41n090l828R043k265j464J929Q17m877j542R828k858
700B317k723k225L261k977K928O717r414l185N440N532p872K783K393n972m61
715c458N440K601p739L063j090j44L5M847l18j0957N134N910j408n418N300k731
731i33m562P114J722m258k796N218m500J796M161j702l711k582P435q09r27j353
747f87J155l926L004O665q010K08K909r32l156P973k109o728L786L91K415k367
$$ plain form
763 591 2901 -652 -2465 526 5379 2540 -4596 2951 1117 -2121 1303 6463 -2518 -4472 3977
778 3977 140 154 602 1720 -4081 -2019 3880 2042 -3001 -4113 2832 -2076 -1256 2186 79 -5207
794 -5207 -2024 3636 -2081 248 -454 -2203 -3665 2062 2583 -2690 -1412 -2230 947 4 1761 -610
810 -610 -1857 -953 1438 2230 -1560 3276 -2223 -2339 3673 4023 -1933 -387 2767 -3432 2844 4420
826 4420 -197 -3084 973 2894 411 1010 526 1977 -4852 940 6362 -1462 -3387 2095 292 -3898
842 -3898 5270 930 -4204 -2032 1924 1627 -1497 -174 -521 -396 -4033 3492 1845 -4470 -683 475
858 475 -1324 -625 3465 -3238 -3259 571 1122 173 -1526 -625 -2625 408 102 799 -1554 -1769 -230 -1671
876 -1671 1335 954 -736 -4032 794 1449 -1120 761 164 -2327 -2095 5138 -314 -2565 832 378
$$ packed form
763E91K310l553j813K991M853k839p136P547j834l238L424N160q981j954Q449
778C977l837J4M48J118n801K062N899j838n043j112O945m908Q20L442k107n286
794e207L183N660n717K329p02j749j462N727N21n273J278q18L177r43J757k371
810f10j247R04K391P92l790M836n499j16O012L50n956J546L154o199O276J576
826D420m617k887M057J921k483N99m84J451o829N792N422p824j925N482j803m190
842c898R168m340n134K172L956k97l124J323l47J25l637P525j647o315L787J158
858D75j799O99M090o703k1L830N51r49j699R01k000L033l06O97k353k15J539j441
876a671L006l81j690l296M826O55k569J881n97k491K32P233n452k251L397m54
$$ plain form
892 378 -1635 598 4075 -1230 -1455 -522 3254 814 -1712 3005 -450 -2876 2703 5450 -4332 -519
908 -519 2966 -1985 844 2153 513 -2622 -448 -172 2227 -1471 -1796 1431 -3446 -364 3089 -873
924 -873 -4983 1220 -1199 -2482 1912 -1867 -2474 -1858 -147 -1142 351 -1362 -2105 -923 -1893 2573 -742
941 -742 -2663 -733 544 -1237 1642 2250 -4144 -260 1659 1240 -680 1630 659 -2445 1457 3034
957 3034 1374 -2251 1574 902 64 1968 2359 -21 -2702 2640 2414 -340 -996 2326 -1618 -2507 4179
974 4179 336 -2192 -579 543 -1397 1084 789 -1621 -1383 -2189 2516 105 -2007 -268 -207 -2705
990 -2705 844 2747 -3695 -72 204 -1731 724 1971 -2015 -1298 887 -689 2605 -857 -353 454
1006 454 -1210 918 2768 -788 -2317 3050 -1398 -51 3452 -124 -2482 452 2115 -358 1009
$$ packed form
892C78k013K233L477n305k25R33L776k440k526M717l455k426N579K747r782L813
908e19L485m951K829J309j640l135K174K76K399l698l25L227m877L082L453l962
924h73m110O203k419j283M394l779o07O16J711r95J493j713p43J182r70M466l315
941g42j921J930J277j781K879O08o394L884J919m19j920K310r71l104L902J577
957C034j660l625L825o72q38J904L91k380k681N342k26k754o56L322l944q89O686
974D179l843k528J613J122j940K481k95k410K38q06M705k411k112J739O1k498
990b705L549J903o442L623K76j935K455J247l986P17K185j576L294l462N04Q07
1006D54j664K128J850l556j529N367m448J347L503l576k358K934J663k473J367
$$ plain form
1021 1009 -207 258 -1301 628 2928 -772 -1629 407 1451 -1835 1374 1541 -2083 -1388 1577 1469
1037 1469 -1764 861 -375 -1261 25 2089 188 -2535 854 -532 1042 -51 431 -726 -1435 616
1053 616 1341 280 -1092 1607 -1969 -271 2810 -107 -1347 642 656 -1264 2694 -306 -872 -273
1069 -273 -574 1855 31 -522 116 292 -2257 3050 1466 -3163 437 826 -1210 -105 1969 -2094
1085 -2094 -1183 419 356 981 -1207 105 -328 -1173 201 2682 -2148 -2025 2209 -1261 -138 1381 163
1102 163 -2015 761 1029 -246 298 -956 276 -1196 902 1491 -21 -1338 33 1038 -470 1394
1118 1394 198 -829 -940 1806 872 -961 943 -508 -806 754 2325 -1156 -311 604 -584 792
1134 792 443 645 -1340 -298 112 1534 -633 -747 1661 -2091 -49 2092 -80 -2293 1041 128
$$ packed form
1021A009j216M65j559J929K300l700q57K036J044l286L209J67l624O95K965j08
1037A469l233K625j236q86J286K064j901k723L389j386J574j093M82j157p09K051
1053F16P25j061j372K699l576J698L081k917j240J989J4j920L958l000n66N99
1069b73l01K429j824n53O38J76k549N307j584m629L600L89k036J105K074m063
1085b094R11J602o3O25k188J312m33q45J374K481m830J23M234l470J123J519j218
1102A63k178K776K68j275N44j254J232j472K098N89j512j317J371J005j508J864
1118A394j196j027j11K746r34j833J904j451k98J560J571l481Q45R15j188J376
1134G92l49K02j985J042M10J422k167j14K408l752K042K141k172k213L334r13
$$ plain form
1150 128 -1018 1811 62 -716 -1198 252 1028 194 -1553 82 157 -2132 2476 274 -2109 -32 978
1167 978 -973 376 1440 -1571 -418 -167 989 19 -619 -257 -279 -124 353 1819 -1713 -620 930
1184 930 -348 106 1041 -15 -1637 1200 534 417 -26 530 -43 -866 1803 791 -391 -989 917
1201 917 704 -158 995 99 -609 -989 1916 -87 -844 400 332 -1132 463 2067 -1534 -561 -266 -39
1219 -39 73 233 -110 -1073 -419 142 1509 -1347 -732 651 -1124 -171 1610 -460 -2034 1145 -344
1236 -344 -12 943 -147 -703 -555 706 333 160 -935 349 -326 -422 1603 39 -998 -104 1171 -824
1254 -824 1147 837 -1122 -260 472 1126 85 -21 -41 53 -285 865 1139 -1338 -100 526 202 -231 998
1273 998 -355 -1110 915 629 303 -868 556 -459 -370 965 374 -600 -882 845 -310 174 159 -128
$$ packed form
1150A28j146K829j749p78m82J450P76q34j747J635P5k289M608k202k383K077J010
1167I78j951J349J064l011J153K51J156r70o38L62k2J55M77J466l532J093J550
1184I30j278M54R35j056j622K837o66j17m43N56n73q23K669j012j182n98J906
1201I17k13q62J153q96p08l80K905k003p57J244o8j464J595J604l601R73K95K27
1219c9J12J60l43r63O54N61J367k856O15J383j775R53J781k070j574L179j489
1236c44L32R55j090n56J48J261l73j73j095J284o75r6K025j564j037Q94J275j995
1254h24J971l10j959Q62P32O54j041j06k0R4l38J150K74k477J238O26l24m33J229
1273I98j353p55K025k86l26j171J424j015Q9J335n91r74k82J727j155M84j5k87
$$ plain form
1291 -128 -928 -709 1472 -94 -353 -267 69 -1234 924 925 -1350 -516 84 53 -367 606 -614 -474 -643
1310 -643 448 872 -1116 60 16 -133 130 1515 -483 -1281 991 -9 107 274 674 -661 36 733
1328 733 452 127 -440 785 -441 147 1223 347 -890 -139 881 -556 684 81 -616 -742 690
1345 690 368 -456 -98 -466 237 -548 930 120 -898 -320 116 289 -450 662 -843 -683 551 817
1363 817 -364 -411 715 -859 80 744 588 -697 -254 780 -122 748 56 145 -1176 75 968 -110
1381 -110 -570 10 154 -840 1041 488 -549 -716 133 165 -75 597 -436 -463 -433 652 150 -576 -212 -162
1401 -162 -156 -267 899 -965 -849 217 -103 -225 11 295 -1098 167 69 308 -267 -377 413 -158 498
1420 498 643 -51 -706 541 501 -353 438 400 0 -770 783 221 -236 110 148 -329 -157 920 -358 -667
$$ packed form
1291a28q00K19K181j566k59Q6L36j303K158Jk275Q34O00l1m20R73j220J40j69
1310f43J091M24j988J176m4j49K63J385j998p98K272j000J16J67M00j335O97O97
1328G33k81l25n67J225j226N88J076q76j237P51J020j437J240o03o97j26J432
1345F90l22q24L58l68P03p85J478q10j018N78M36J73p39J112j505J60J234K66
1363H17j181m7J126j574R39O64j56j285M43J034r02Q70o92Q9j321J251Q93j078
1381a10m60N80J44r94J881n53j037j67Q49L2k40O72j033k7L0J085n02p26L64N0
1401a62Oj11J166j864J16J066l20j22K36K84j393J265r8K39n75j10P90n71O56
1420D98J45o94o55J247m0q54P91l8m00p70J553n62m57L46L8m77J72J077j278l09
$$ plain form
1440 -667 -133 719 -426 -146 175 -719 -517 -101 966 -652 -337 229 -717 -130 175 493 -902 -242 45
1459 45 -50 -466 -174 -267 -725 488 112 -120 -573 306 -61 -398 702 43 -456 -703 628 -90 -10 306
1479 306 -247 -346 141 888 -272 -187 -63 -86 -349 319 790 -677 -266 352 740 -552 258 -40 -828 323
1499 323 239 445 -779 243 101 -61 157 564 -64 -1028 515 78 35 113 126 -316 -345 860 -9 8 -491
1520 -491 319 -250 8 498 -324 -372 -436 245 -125 142 190 -677 -457 261 485 -635 -136 -192 33 -3 413
1541 413 275 -960 2 274 166 -132 680 -212 -332 575 435 75 -331 312 -201 -75 754 211 -366 -438
1561 -438 907 14 243 267 410 -443 157 661 -124 111 -200 181 -66 475 420 -273 -296 272 697 -301 202
1582 202 119 -282 67 327 334 -693 227 -285 197 371 596 -393 -469 273 326 151 -283 69 -392 -209 147
$$ packed form
1440f67N34Q52j145K80L21q94K02M16J067j618L15N66r46N87L05L18j395O60K87
1459D5r5m16K92r3m58J213l76k32m53Q79l67l37J100o59m99k47J331p18Q0L16
1479C06n53r9M87P47j160Q5J24k3k63O68M71j467M11O18L88j292Q10k98p88J151
1499C23q4K06j224J022j42j62K18M07o28r64J543m37m3P8J3m42k9J205q69J7m99
1520d91Q10n69K58M90q22m8o4O81l70K67M8q67K20P18K24j120M99n6K25l6M16
1541D13j38j235R62K72j08k98Q12q92j20R07j40l60m06O43n13J26Q29n43n77p2
1561d38J345q93K29K4J43q53O00N04p85K35l11L81k47N41n5o93k3N68M25r98N03
1582B02q3m01L49K60Pj027R20n12M82J74K25r89p6P42N3j75m34L52m61J83L56
$$ plain form
1603 147 59 85 -355 369 -426 -87 244 -207 -658 57 647 -145 505 178 -262 -68 607 416 -246 136 182
1624 182 287 -283 379 76 -641 131 452 187 151 451 -287 -48 443 425 -189 -343 153 -184 321 80 151
1645 151 -320 -517 418 79 -30 141 -199 -680 344 504 -168 -335 -119 77 -377 382 47 -359 -433 422
1665 422 134 -363 114 -235 -358 -274 439 -42 -258 82 -111 -217 -12 419 -535 -251 251 428 -31 -210
1685 -210 442 -421 52 70 318 -385 -117 270 -140 -7 106 138 -460 258 330 -46 -150 163 -178 -248 271
1706 271 157 19 -274 -127 -8 161 533 -266 -74 -238 180 -457 -92 567 -57 51 152 228 -374 142
1726 142 86 -155 -1 466 45 -719 112 223 34 -149 -6 -56 -350 301 203 -119 -373 60 -68 -134 322
1747 322 -65 -164 -654 639 264 -304 -245 -293 -178 -2 555 11 -254 83 204 -234 159 205 -423 -7 -170
$$ packed form
1603A47q8K6m40P24p95L39L31m51m51P15N90p92O50l27m40J94O75j91o62L82M6
1624A82J05n70O62l03p17P72L21k65l6L00p38K39M91j8o14j54M96l37N05k41P1
1645A51m71j97R35l39j09J71l40m81J024J60o72j67K16J96m54P59l35m06p4Q55
1665D22k88m97M77l49j23Q4P13m81k16L40j93j06K05M31r54K84N02J77m59j79
1685b10O52q63M73J8K48p03K68L87m10J33J13L2n98P18P2l76j04L13l41p0N19
1706B71j14j38k93J47J19J69L72p99J92j64M18o37L65O59o24J08J01P6o02N16
1726A42n6k41J54M67m21p64Q31J11j89j83J43n0k94O51r8l22k54M33j28o6M56
1747C22l87r9m90J293l75n68N9m8J15J76N57n44k65L37J21m38L93M6o28M16j63
$$ plain form
1768 -170 334 -148 36 -61 -331 -11 -53 177 -547 63 -21 32 125 95 -185 -418 282 181 -82 -175 182 -295
1790 -295 -141 806 -88 76 -51 251 0 78 291 18 -148 -221 670 -195 95 313 -43 101 153 219 -386
1811 -386 -36 38 157 44 55 31 -218 -199 174 143 -336 -59 -79 -183 270 88 -94 -432 158 -294 -72 127
1833 127 -41 -219 -427 140 -245 75 -122 157 -370 12 301 -266 -171 -275 16 -277 298 198 -475 180
1853 180 232 113 -180 87 -206 -184 115 -11 363 -226 295 -59 263 133 632 -6 -203 420 191 172 -125
1874 -125 238 -311 74 315 190 -17 -125 236 -71 -74 -325 136 -224 -49 402 -193 -27 -236 -211 -181 279
1895 279 251 -204 -68 -53 -42 -467 -71 -291 -344 -274 78 91 -207 -224 -287 -248 72 374 -323 -270 -73 -182 139
1918 139 -115 7 -69 249 215 270 228 -12 14 -171 432 386 15 -159 -89 246 -97 65 -80 -28 -136 344 16
$$ packed form
1768a70N04m82J84r7k70L20m2K30p24O10q4N3R3l0k80k33P00j01k63r3L57m77
1790b95J54R47q94J64j27L02k51P8K13k73j66p3Q91q65K90K18l56J44N2O6o05
1811c86L50P4J19j13J1k4k49J9L73l1m79K77k0j04M53j82j82l38N90m52K22J99
1833A27j68j78k08N67l85L20j97K79n27L82K89n67R5j04K91k93N75j00o73O55
1853A80N2j19k93K67k93K2K99j26L74n89N21l54L22j30M99o38j97O23k29j9k97
1874a25L63n49L85K41j25k07j08L61l07lk51M61l60J75M51n95J66k09K5L0M60
1895B79k8m55J36J5J1m25L96k20n3P0L52J3k98j7o3L9L20L02o97N3J97j09L21
1918A39k54J22p6L18l4N5m2k40K6j85O03m6l71j74P0L35l43J62j45N2j08M80l28
$$ plain form
1941 16 55 128 2 3 -103 360 61 25 238 -71 43 -60 329 -233 -83 311 353 -143 -52 406 -234 6 -110
1964 -110 -130 -408 -232 98 -329 -35 -475 -407 -314 41 67 59 -16 -131 -187 -273 256 -149 -28 -205 1 -420 -157
1987 -157 401 -144 -173 -140 222 61 -74 140 -180 244 230 200 -69 49 9 35 357 33 51 -123 299 35
2009 35 80 4 -159 153 -192 255 88 -22 -281 -64 76 -294 60 -133 -138 -108 398 -162 -32 -242 -157 75
2031 75 97 281 -453 -181 108 -22 -27 -252 113 -498 -41 181 225 -40 50 -93 18 139 204 305 -347 284
2053 284 -96 141 59 -13 -9 -157 185 -41 -29 -122 125 -90 -22 293 -108 -72 -94 280 -82 156 -131 -179 -210 -14
2077 -14 337 -388 -74 29 98 36 9 82 -260 141 199 -7 38 114 -129 -217 187 106 134 -384 17 -170 30 -103
2101 -103 40 19 -355 388 -43 30 -170 14 144 112 283 90 205 -23 206 20 177 14 -59 81 63 86
$$ packed form
1941A6L9P3j26Jj06M63k99l6K13l09J14j03L89n62J50L94M2m96R1M58o40K40j16
1964a10k0k78J76L30m27K94m40O8R3L55K6qp5j15n6q6N29m05J21j77K06m21K63
1987a57N58n45k9L3L62j61j35K14l20M24j4l0k69J18m0K6L22l24J8j74M22k64
2009C5M5p6j63L12l45M47j67j10k59K17J40l70L54j93nL0N06n60J30k10Q5K32
2031G5K2J84p34K72K89j30nk25L65o11M57K22M4k65R0j43J11J21O5J01o52O31
2053B84l80K37q2p2Mj48L42k26J2r3K47k15O8L15m01L6k2L74l62K38k87m8l1J96
2077a4L51p25L14J03O9o2k7P3l42M01N8k06M5P6k43q8M04q1K8n18M01j87K00j33
2101a03J43k1l74P43m31P3k00J84J30l2J71j93J15k28K29j86J57j63p3J40j8K3
$$ plain form
2123 86 -227 -20 -90 -235 84 133 168 -53 -23 -250 126 37 170 59 -119 252 -69 -111 -293 376 -437 -228
2145 -228 7 62 -442 -232 301 -433 -89 -80 260 -210 -315 173 -207 -48 -149 -74 -463 78 -90 -124 25 67
2167 67 210 -145 526 61 45 38 186 124 37 83 -69 89 104 249 51 83 215 -176 35 -181 47 -88 -113
2190 -113 181 37 45 60 -171 -193 170 137 160 -23 -11 -15 -267 -76 58 147 -211 14 -10 -210 98 85 21 6 204
2215 204 156 -112 -20 90 -142 -73 201 -188 -40 316 8 53 25 175 -102 52 155 -1 -4 110 56 -198 61
2238 61 176 134 -218 119 2 93 206 337 94 -321 277 243 119 -30 -281 157 230 64 54 1 151 261
2260 261 -341 39 56 -284 41 -119 192 -261 -162 -22 -92 -56 -124 85 -303 -284 105 -180 -29 19 44 -57 78
2283 78 5 -20 -265 9 261 20 -6 -45 85 -42 22 134 -159 94 -117 -4 -8 116 -98 94 -54 -67 -70 193
$$ packed form
2123H6l13K07p0j45L19M9L5k21L0k27L76q9J33j11j78L71l21m2j82O69q13K09
2145b28K35N5n04K10N33p34L44RL40m70j05M88l80J59j01P5l89N41j68l4J49M2
2167F7J43l55O71m65j6pJ48o2q7M6j52J58J5J45j98L2J32l91K11k16K28j35k5
2190a13K94j44QJ5k31k2L63l3K3j83J2mk52J91J34Q9l58K25k4k00L08j3o4j5J98
2215B04m8k68R2J10k32O9K74l89J48L56l08M5k8J50k77J54J03j56lJ14n4k54K59
2238F1J15m2l52L37j17R1J13J31k43m15N98l4j24j49k51M38P3j66j0n3J50J10
2260B61o02L80J7l40L25j60L11m53R9J40p0L6o8K09l88J9L89k85J51M8K5j01J35
2283G8p3k5k45K74K52k41k6l9J30j27O4J12k93K53k11J13mJ24k14J92j48j3lK63
$$ plain form
2307 193 58 -227 237 -10 223 -18 187 -199 -132 65 -19 30 -108 178 75 -129 -263 66 -69 -176 160
2328 160 -166 -208 -136 59 47 -283 296 8 0 -321 -66 -247 -39 174 -113 -81 -217 48 -134 -11 -134 -45
2350 -45 -303 155 41 -169 50 -40 39 -135 -8 43 -169 -191 -27 155 -287 81 11 -36 -10 131 56 -169 96
2373 96 -3 -104 -67 121 -275 -122 -151 -32 -111 152 170 -118 -65 -198 40 -145 -38 26 15 34 2 -141 38 12
2397 12 86 -94 97 -165 -133 -163 186 108 -184 199 1 441 161 271 202 -74 367 -18 -30 -99 -152 -163 -100 -229
2421 -229 120 -81 -268 97 -18 328 121 -93 13 -144 109 58 80 -58 -104 -60 223 115 217 66 -26 304
2443 304 42 250 50 -128 49 18 70 -113 89 -84 -44 221 -57 -24 -47 -7 9 61 2 -10 91 54 18 121
2467 121 151 52 32 -102 67 165 -54 48 -115 227 61 -63 -17 52 -61 59 -34 -22 84 -137 -70 -135 101
$$ packed form
2307A93j35k85M64k47K33k41K05l86O7J97q4M9j38K86j03k04j34L29j35j07L36
2328A60l26m2P2J95j2l30N79k88ql21K55j81K08K13k87L2j36K65j82J23j23Q9
2350d5k58M58j14k10K19r0P9j74J27N1k12k2J64J82m42L68p0m7K6J41p5k25K65
2373I6r9j01L7J88l96J53k9J19p9K63J8k88N3j33K38j85J07O4j1J9l2j43J79k6
2397A2P4j80J91k62L2l0L49p8k92L83j98M40k80J10o9k76M41l85j2o9n3j1O3j29
2421b29L49k01j87L65j15L46k07k14J06j57K53n1K2j38m6M4K83j08J02j51r2L30
2443C04k62K08k00j78J77l1N2j83K02j73M0K65k78L3k3M0J6N2n9j2J01l7l6J03
2467A21L0r9k0j34J69R8k19J02j63L42j66j24M6O9j13J20r3J2J06k21O7o5K36
$$ plain form
2490 101 112 -231 -94 -60 93 -149 98 -222 82 -305 -176 127 -223 -109 -189 -16 -124 66 -64 -22 -63 -146
2512 -146 168 8 113 45 232 114 97 204 -9 185 -138 98 -83 204 -197 -69 116 55 188 -49 -58 15
2534 15 300 -15 -76 266 -210 -134 -182 20 52 -132 -41 43 -129 -102 1 -56 234 185 98 -232 -20 10 -173 230
2558 230 -24 -171 -62 -70 -74 -44 46 -111 139 -203 -18 155 -188 -248 -154 -55 -53 184 42 -7 154 -80 -138 85
2582 85 -86 -187 -24 48 119 127 36 261 -85 20 -17 103 -30 112 -141 186 37 67 -5 -188 100 -81 -12
2605 -12 10 -120 -72 -111 290 -219 105 -357 -192 -189 27 -109 209 -80 -107 166 124 15 -59 26 -188 78 50 -196
2629 -196 -77 110 7 47 240 69 273 88 1 81 -348 -213 326 197 20 -45 -64 68 90 -8 -117 85
2651 85 -145 142 -156 63 -134 -81 -89 212 -183 134 21 -69 -190 -92 196 -144 214 -47 -7 232 117 259
$$ packed form
2490A01J1l43J37L4J53k42K47l20L04l87J29L03l50J14q0J73j08J90j30M2m1q3
2512a46L14j60J05o8J87j18j7J07k13J94l23K36j81K87m01J28J85o1J33k37rP3
2534A5K85l15o1L42m76P6m8K02L2j84R1Q4j72K7J03n7K90m9q7l30K12L0j83M03
2558B30k54j47J09qmL0R0j57K50l42J85J73l43o0R4R9KK37j42m9J61k34n8K23
2582H5j71j01J63P2P1Qr1K25l46J05l7J20j33J42k53L27j49L0p2j83K88j81O9
2605a2K2j30M8l9M01n09L24m62J65LK16j36L18k89k7K73m2j09p4Q5k14K66k8k46
2629a96J19J87j03M0J93j71K04j85q7Q0m29J35N39j29j77o5j9J32K2r8j09K02
2651H5k30K87k98K19j97N3qL01l95L17j13r0j21R8K88l40L58k61M0K39j15J42
$$ plain form
2673 259 34 42 120 -43 207 31 -158 22 -232 -201 46 32 148 50 46 238 152 278 -183 217 69 28 23 50
2697 50 -33 -146 212 -197 -32 -18 92 -2 97 -99 -238 236 -262 -114 -108 35 -184 -101 -3 -137 -189 -93 114 -78
2721 -78 -225 -61 16 22 -29 191 -179 -138 62 -144 -124 67 -83 -119 221 -242 -47 -78 -43 -87 113 60 129 184 129
2746 129 10 164 -13 -9 -17 35 -103 -62 20 -249 38 106 21 -141 -128 -39 37 142 217 -39 -233 -105 -103 86 -101
2771 -101 -1 -125 -22 -66 -13 9 28 59 -63 -88 -103 43 -45 -261 -110 -77 -15 35 -136 -153 164 161 67 -44 -77
2796 -77 -164 -148 40 117 -187 -154 173 -108 -173 82 -67 5 -53 87 1 13 -132 81 -154 -8 254 -264 26
2819 26 -8 -127 113 -193 -7 -47 202 -135 124 -13 -22 20 104 39 -47 39 -26 90 3 97 -5 45 230 -163 84
2844 84 66 146 -100 -280 -88 -35 39 -124 -221 -17 -54 216 -12 -73 84 25 7 -186 -15 11 139 -88 -1 -147
$$ packed form
2673B59k25QP8j63K50j76j89J80k54L1K47j4J16r8mJ92q6J26m61M00j48m1nK7
2697E0q3j13L58m09J65J4J10r4R9j96j39M74m98J48OJ43k19Q3R8j34n2R6K07j92
2721g8j47J64P7On1K20l70M1K00k06K0J91j50l6L40m63J95l1L5m4K00n3O9N5n5
2746A29j19J54j77MqN2j38M1Q2k69K87O8q5j62J3Q9P6J05P5k56j94J28KJ89j87
2771a01J00j24J03m4N3K2J9L1j22k5j5J46q8k16J51L3O2N0j71j7L17lr4j11l3
2796g7q7J6J88P7l04L3L27k81o5K55j49P2n8J40q6J2j45K13k35J46K62n18K90
2819B6l4j19K40l06J86m0K49l37K59j37rM2Q4o5q6Q6o5J16q7R4j02N0J85l93K47
2844H4j8Q0k46j80J92N3P4j63r7K04l7K70k28o1J57n9j8j93J71K6J28k27Q7j46
$$ plain form
2868 -147 0 -81 150 24 69 -4 -54 85 66 205 -112 -193 147 168 74 163 -58 136 -55 57 31 80 -66 -185
2892 -185 131 152 -8 109 -80 96 60 -141 144 95 161 -107 -3 -8 -9 -226 -30 118 35 -69 127 52 -135
2915 -135 65 -145 210 8 87 -25 41 38 -101 96 12 -67 72 107 66 119 38 30 41 -11 112 -147 49 5 -110
2940 -110 100 55 84 35 -49 54 -161 67 -24 -1 228 45 -90 -49 -79 -84 -45 -122 -57 135 380 8 227 -9
2964 -9 197 17 -15 118 -78 15 18 316 -51 -206 -101 81 155 -84 46 -86 -11 -152 24 241 -77 150 -132
2987 -132 2 112 -13 -6 190 -200 -40 69 66 69 33 60 -158 130 -74 -73 -61 59 185 -167 54 168 26 57
3011 57 -54 106 -119 -61 -174 -78 -59 147 56 117 224 -127 -133 -17 41 -120 -108 227 -4 -11 114 -56 -250 -82
3035 -82 94 72 78 25 67 -25 239 15 56 125 -4 175 -253 -199 91 81 -124 -212 -222 -12 -16 132 -68 -277 -81
$$ packed form
2868a47J47q1K31j26M5p3n0J39j9J39l17q1L40K1r4Q9k21J94j91J12k6M9j46j19
2892a85L16K1j60J17j89J76l6k01K85m9O6k68J04njk17J96J48q3j04J96p5j87
2915a35K00k10L55k02P9j12O6lj39J97q4p9J39L5m1N3q1qJ1n2J23k59J96m4j15
2940a10K10m5K9m9q4J03k15K28r1K3K29j83j35M1l0nL9p7O5J92K45l72K19k36
2964iK06j80l2J33j96R3LK98l67j55J05J82P4k39J30j32P5j41J76K17l18K27k82
2987a32J34J10j25PJ96l90J60J09lLl6K7k18K88k04JJ2J20J26l52K21J14j42L1
3011E7j11J60k25N8j13R6J9K06r1O1J07l51oJ16N8j61J2L35k31pJ25j70j94J68
3035h2J76k2On3M2r2K64k24M1O9j29J79m28N4K90j0k05q8j0K10mJ48k00k09J96
$$ plain form
3060 -81 36 -197 -148 -39 -58 57 144 -35 -102 -251 26 98 86 20 -62 -275 33 395 -335 -20 110 -114 -163
3083 -163 90 -390 -47 44 176 119 280 -94 181 -21 -3 147 -42 8 145 38 -48 -106 124 113 -129 113
3105 113 -21 235 111 -159 72 79 -30 52 -40 -108 -148 8 107 25 158 -138 -321 101 19 -174 -262 -181 47 -157
3129 -157 -191 8 83 -115 -14 -150 -115 42 115 237 -87 234 -257 2 -100 -91 191 18 21 -138 -10 -165 -75
3152 -75 169 -59 55 41 44 -329 -134 -16 113 75 52 131 -3 12 -234 9 -83 -149 123 55 -119 186 -116 66
3176 66 -95 -13 -305 -28 -288 -65 -36 30 -228 -1 -155 43 -109 -2 -81 -44 69 17 -58 136 49 -101 210
3199 210 143 -93 35 32 -34 80 73 182 -14 146 128 254 41 79 -94 -116 148 -189 180 -142 278 -71 87
3222 87 -87 185 -36 -449 21 -162 31 135 22 -121 -194 -102 -49 14 4 113 110 175 196 -51 1 121 -182 169
$$ packed form
3060h1J17k33M9J09j9J15Q7j79o7j49K77P2j2o6q2k13L08L62p30L15J30k24m9
3083a63K53m80L43R1J32n7J61l74K75k02J8J50j89N0J37j07q6n8K30j1k42K42
3105A13j34K56j24k70K31Pj09Q2r2o8m0J56R9q2J33k96j83M22q2j93q8Q1K28k04
3129a57l4J99P5j98J01j36L5J57P3J22l24L21m91K59j02RK82j73Lj59J28j55R0
3152g5K44k28J14j4Ll73J95J18J29l8k3P9j34J5k46K43r2o6K72o8j74L05l02J82
3176F6j61Q2k92K77k60K23K9O6k58K27j54J98j52J07p9L7J13n2p5J94q7j50L11
3199B10o7k36J28lo6J14pJ09j96J60j8J26k13L8j73k2K64l37L69l22M20l49J58
3222H7j74K72k21m13M70j83J93J04j13j43p3R2N3O3j0J09lO5K1k47N2J20l03L51
$$ plain form
3246 169 79 -275 343 38 -39 102 -26 11 -62 54 -120 12 140 272 17 -171 88 216 132 180 128 77 -36
3269 -36 98 -161 116 117 -30 76 284 -87 -93 76 -159 226 177 -109 26 43 -91 -139 19 114 -80 144 214
3292 214 -82 280 103 -263 -83 30 -45 0 -88 -47 -17 -94 147 -56 -179 -88 -16 164 3 -110 -12 -127 93
3315 93 -186 -145 -9 147 -217 106 50 160 39 97 -148 -172 -88 74 21 -61 72 22 150 65 -273 150 -87
3338 -87 -50 -189 88 131 226 88 -247 8 -42 92 94 139 99 -39 118 52 -22 -73 120 -73 -169 -11 -64 -38 -67
3363 -67 0 99 -223 41 -79 80 215 40 -287 -41 -84 -4 30 110 -137 45 -75 -119 212 -120 -11 88 -80
3386 -80 21 -150 -48 -242 51 99 34 -12 11 73 56 66 -115 -91 -174 37 129 -25 72 -47 -26 -125 -83 -92 -125 -177
3412 -177 -39 136 21 -90 45 -97 -53 20 -213 24 157 56 115 -26 -41 -204 -72 45 41 3 31 83 193
$$ packed form
3246A69r0l54O18l05p7J41j28L7p3J16j74J32J28J32k55j88K59J28q4M8n2n1j13
3269c6J34k59K77Jj47J06K08l71oJ69k35L85m9k86J35J7j34m8J58R5j94K24P0
3292B14k96L62j77l66J80J13p5M5q8M1L0p7K41k03j23R1P2J80j61j13R8j15K20
3315I3k79M1J36J56l64L23n6J10j21N8k45k4Q4J62n3q2J33n0J28q5l38M23k37
3338h7L7j39K77M3R5j38l35K55n0J34KM5m0j38J57o6p4n1J93j93r6J58n3K6k9
3363f7O7R9l22K64j20J59J35j75l27K46m3Q0L4Q0k47J82j20m4L31l32J09R9j68
3386h0J01j71J02j94K93M8o5m6K3O2j7J0j81K4q3K11R2j54R7j19K1r9M2rl3n2
3412a77J38J75j15j11J35j42M4P3k33K37J33j01N9j41j5j63J32J17ml8K8N2J10
$$ plain form
3435 193 -21 -283 121 164 173 -122 217 177 -202 -69 -136 -67 -243 -47 -56 77 -267 -167 255 40 108 75 117 -24
3459 -24 -213 51 150 -88 53 77 68 -52 -8 -144 391 -275 -38 41 -75 166 41 141 -159 -51 -75 59 -230
3482 -230 79 131 -120 -103 196 136 69 115 185 -21 -26 -93 -84 -48 30 -137 -8 92 3 22 42 -126 28 102 -255 53
3508 53 74 -14 173 -20 8 34 -14 -8 39 -27 -98 -103 64 -48 -143 315 88 31 -155 -362 -10 118 -225 -87 -104
3533 -104 68 95 143 13 -70 -178 -4 -19 -28 173 -128 -66 40 -97 -1 173 36 1 103 -173 -31 244 -94
3556 -94 -82 -8 -46 -12 -89 -178 -43 -182 114 -139 39 -17 49 -11 12 73 148 -81 -25 -173 -64 -7 34 112 -87 -21
3582 -21 -241 -1 124 23 46 22 24 66 152 -45 18 -14 103 -177 -221 -71 -81 23 -197 -142 68 92 -35 101
3606 101 -4 -159 156 84 -162 -94 30 224 293 -38 -148 -84 4 -74 166 193 46 -47 170 90 22 -21 48 -40
$$ packed form
3435A93k14k62M04M3Rk95L39m0l79J33o7O9j76J96rJ33l44J00M22k15O8l3M2j41
3459b4j89K64R9k38J41K4rj20M4j36N35o66K37P9j16K41j25J00l00J08k4J34k89
3482b30L09N2k51J7K99o0o7M6P0k06no7RL6P8j67J29J00q9J9K0j68J54P4l57L08
3508E3K1q8J87j93K8K6m8OM7o6p1nJ67j12r5M58k27n7j86k07L52J28l43J38j7
3533a04J72K7M8j30q3j08J74j5rK01l01O2J06j37R6J74j37l5J02k76J42K75l38
3556i4J2P4l8L4p7q9J35j39K96k53J78n6O6o0K3O1P5k29N6j48J09N7M1P8j99O6
3582b1k20K40J25j01K3k4KM2Q6j97O3l2J17k80m4J50j0J04k20N5K10K4j27J36
3606A01j05j55L15p2k46O8J24J94O9l31j10O4Q8p8K40K7j47r3K17q0o8m3O9q8
$$ plain form
3630 -40 -157 108 -180 185 -7 -71 118 20 -175 123 -127 -38 270 38 -169 -206 138 282 -178 171 -127 -34
3652 -34 169 175 73 -107 320 -129 111 100 189 -160 -7 -75 74 214 116 60 -65 280 220 -151 -23 -60 -18 -123
3676 -123 -204 336 -93 0 -46 253 -2 185 71 76 125 65 -120 -29 -131 96 25 100 188 78 36 4 -101 -148 -20
3701 -20 -116 -175 4 -192 -141 -26 40 -199 -140 353 189 -162 -264 182 123 36 -143 138 -91 -60 -3 54 36 -232
3725 -232 -187 139 -89 -53 -153 -16 77 24 5 -114 113 227 42 -139 -119 131 -77 -140 -110 -5 -2 94 -20 137
3749 137 148 225 0 8 64 -126 -99 -70 121 3 -22 0 -81 0 76 -48 -88 5 -4 -27 -47 -40 -24 82 -85 -8 45 21
3777 21 14 137 -168 -212 135 46 -3 -115 8 5 -101 257 -314 21 259 14 -121 266 56 205 112 21 -96
3800 -96 -168 302 -67 28 196 -131 83 157 -112 49 -52 13 -60 7 31 -193 -216 -62 -164 -30 52 66 64 -82
$$ packed form
3630d0j17K65k88L65j92o4J89r8j95K98k50Q9L08k32k07l7L44J44m60L49k98R3
3652c4K03Oj02j80M27m49K40j1Q9l49J53o8J49J40r8n6j25L45o0l71J28l7M2j05
3676a23q1N40m29R3m6K99k55J87j14NM9o0j85R1j02K27p1P5Q8j10m2l2j05m7J28
3701b0r6n9J79j96N1J15O6k39N9M93j64l51j02M46n9q7j79K81k29L1N7N7j8k68
3725b32M5L26k28L6j00J37R3n3j9j19K27J14j85j81K0K50k08o3L0J05LR6j14J57
3749A37J1P7k25QN6j90K7K9J91j18k5K2q1Q1P6j24m0R3rk3k0PJ6J06j67P7N3k4
3777B1pJ23l05m4L47q9m9j12J23lj06L58n71L35K38k45j35L87k10J49r3r1j17
3800i6p2M70l69R5J68l27K14P4k69J61j01O5p3O7K4k24k3J54j02J34Q2J4kj46
$$ plain form
3824 -82 -5 222 99 -168 135 -198 70 -147 -10 -46 121 4 -147 208 169 145 148 -109 -113 -181 -13 86 62 181
3848 181 79 152 -28 371 -164 214 9 84 -195 -119 103 -120 -91 -205 -15 25 -13 -343 -56 144 -72 8
3870 8 180 -30 -17 127 -105 67 207 -26 -2 40 -54 179 -60 2 -107 -80 39 -191 125 286 -104 132 2
3893 2 95 -9 -207 -104 20 31 195 -103 -503 154 -114 264 -32 -166 166 -10 133 21 -278 -106 301
3914 301 -52 124 -193 14 -66 218 339 -130 -110 -54 124 -119 227 -49 -320 -45 41 0 -114 -12 29 -74
3936 -74 68 -146 -304 109 122 -107 -38 -77 -3 -108 -217 -83 -23 -54 -178 -7 -200 -116 42 -70 -13 -245 -190
3959 -190 -12 -113 174 -166 -70 77 -125 106 -175 -128 -208 -152 82 -98 -28 95 -53 247 336 198 51 -45
3981 -45 161 68 26 -138 15 -104 88 -67 -66 -222 -139 220 155 96 226 -90 185 -87 61 104 53 110 50 -66
$$ packed form
3824h2P7K27j23k67L03l33K68k17J37l6J67j17j51L55l9k4Lk57mo8J68R9k4J19
3848A81j02P3j80L99n35L78k05P5k79P6K22k23K9j14J90M0l8l30K87K00k16Q0
3870HJ72k10J3J44k32J72J40k33K4M2r4K33k39O2j09K7J19k30L16J61l90K36j30
3893BR3j04j98J03J24J1J64k98m00O57k68L78k96j34L32j76J43j12k99J72M07
3914C01l53J76l17K07q0K84J21m69K0N6J78k43L46k76k71K75Q6m1j14J02M1j03
3936g4J42k14j58M13J3k29O9l9P4j05j09J34O0l1j24J71j93Q4J58j12N7k32N5
3959a90J78j01K87l40R6J47k02K31k81M7q0N6K34j80P0J23j48L00Q9j38j47r6
3981d5K06r3m2j64J53j19J92j55Jj56Q3L59o5n9J30l16K75k72J48M3n1N7o0j16
$$ plain form
4005 -66 -115 61 216 40 -110 175 3 -5 54 161 -101 -6 62 23 23 21 -115 25 266 28 -184 -144 -70 -149 -74
4030 -74 194 -59 120 68 -18 -318 4 42 49 -68 -13 249 -96 5 -162 -29 57 -31 14 77 164 167 58 132 68
4055 68 170 253 157 45 96 -24 -3 -49 -47 -23 109 -59 -235 156 -63 -150 53 -1 -164 78 -51 -152 63 -16
4079 -16 -96 10 154 -97 -183 117 -106 11 -15 194 178 8 14 7 28 113 15 16 14 157 177 11 -124 -8 -184 70
4105 70 253 -62 -288 -28 -153 261 88 24 145 10 -48 108 -4 -119 -127 126 132 165 -86 153 108 -141 -217
4128 -217 18 47 48 -81 91 367 -138 148 58 144 97 -99 -91 223 68 62 68 143 291 61 -117 -188 -258 210 6
4153 6 96 105 0 42 424 353 -46 -41 -10 156 105 198 53 -195 -219 119 117 191 190 55 74 -88 -88 13 -95 -174 -144 -135
4181 -135 193 147 161 -41 246 161 -89 209 196 97 14 -250 79 56 124 236 -25 -34 61 183 113 -45 7 64 135
$$ packed form
4005f6m9J76J55j76j50K85j72qN9J07k62R5O8l9%kj36J40K41k38k12M0P4p9P5
4030g4K68k53J79n2q6l00L22L8Pj17N5K62l45J01j67J33Q6q8M5O3Q7Lj09P4o4
4055F8J02Q3r6j12N1j20K1m6KK4J32j68j76L91k19q7K03n4j63K42j29j01K15p9
4079a6q0J06J44k51q6L00k23J17k6K09j6j70OpK1Q5r8JkJ43K0j66j35J16j76K54
4105G0J83l15k26K60j25M14j73o4J21j35n8J56j12j15qK53OL3k51K39m5k49p6
4128b17K35K9Jj29J72K76n05K86r0Q6m7j96QL14j55oOP5J48k30j78p1p0M68k04
4153FR0Rj05M2L82p1l99NL1J66n1R3j45k48k4L38kP4jj35J9j62%J01j08p9L0R
4181a35L28m6J4k02K87q5k50K98j3r9q3k64L29k3O8J12k61rR5J22p0j58N2N7P1
$$ plain form
4206 135 -321 84 130 -87 -192 -42 53 175 292 -186 -144 117 98 -157 -57 -107 62 6 -187 -61 81 -229
4228 -229 -159 -60 -186 52 36 249 -17 56 86 -60 -45 253 133 41 103 -159 27 -87 -121 -78 -103 90 -151 105
4252 105 158 23 -111 -2 -251 -130 140 -46 -121 -74 179 46 -184 -97 164 60 -61 -42 254 -76 -110 122
4274 122 14 -101 193 -55 86 93 -202 44 -40 -70 -15 129 79 -32 64 100 -50 -73 106 120 -243 -21 -48 -21
4298 -21 -115 -48 125 123 -23 177 -12 -71 -289 114 -115 113 -167 -22 -224 -86 -48 -94 133 -126 142 -112 170
4321 170 39 86 -152 -96 290 -133 131 -66 44 77 -108 18 -75 -19 227 83 -127 38 -21 6 -188 -117 182
4344 182 -150 406 0 89 61 -253 -39 65 56 -108 -119 -11 -15 189 -2 -345 -49 -194 -3 -70 81 -91 173
4367 173 281 23 -54 2 -205 -98 -17 12 -301 -59 -37 34 41 108 99 -151 -72 12 6 -72 -149 36 -119 151 300 -153
$$ packed form
4206A35m56M05M6k17j05J50R5J22J17m78M2K61j9k55J00n0J69n6j93J26J42l10
4228b29P0R9j26K38j6K13k66P3L0j46J5K98j20r2O2k62J86j14l4M3k5J93k41K56
4252A05N3j35j34J09k49J21K70j86p5M7K53j33k30Q7K61j04j21J9K96l30l4K32
4274A22j08j15K94k48J41Pk95K46q4l0N5J44n0j11R6L6j50k3J79J4l63K22k7K7
4298b1r4O7J73kj46K00j89n9k18M03k29K28k80J45k02J38L8m6K27k59K68k54K82
4321A70j31M7k38N6L86m23K64j97J10L3j85J26r3N6K46j44k10J65n9K7j94P1K99
4344A82l32N56m06Q9k8l14K14J04rj64j1J08mK04j91l43K96j45J91o7J51j72K64
4367A73J08k58p7N6k07J07Q1K9l13K42K2P1PO7rk50P9Q4op8p7J85j55K70J49m53
$$ plain form
4393 -153 52 9 -239 -166 269 -167 68 -141 109 127 -29 78 -80 28 -98 84 -141 -134 47 -127 103 -19
4415 -19 -113 110 161 -155 -40 20 -303 -9 -176 -12 -98 -55 -94 100 -288 179 144 -183 18 7 34 -70 -135 -161
4439 -161 -44 198 -214 -28 -53 227 -155 114 147 -36 21 30 51 -6 -120 162 -146 154 -234 -70 45 247
4461 247 -161 156 131 -220 -60 -22 266 79 -233 -105 57 33 69 -16 -152 11 109 -222 -40 74 -28 54
4483 54 24 266 -107 -87 18 -84 -177 -210 -71 -125 103 -194 -67 -93 6 -122 156 116 -129 -63 -143 149 178 -135
4507 -135 215 -115 -201 -90 81 -51 126 139 65 84 -210 9 109 -223 -15 31 -57 -42 -27 -65 -37 -43 -98 214
4531 214 209 68 -94 -18 183 27 171 59 103 135 2 -24 -246 -126 -16 20 343 131 64 23 7 -226 -215 20
4555 20 -59 -135 20 331 172 0 141 -43 76 -143 -114 -90 -81 41 -169 36 38 -47 145 -28 -35 -62 -43 -156 29
$$ packed form
4393a53K05m3k48P3M35m36K35k09K50J8j56J07j58J08j26J82k25PJ81j74K30j22
4415a9r4K23N1l16J15O0l23K94j67J64q6M3l9J94l88M67l5l27K01j1K7j04o5k6
4439a61J17K42m12J86k5K80l82K69L3j83N7RK1n7j14K82l08L00l88J64J15K02
4461B47m08L17k5l51J60L8K88j87l12J28J62k4L6q5j36J63R8l31J82J14j02Q2
4483E4l0K42l73K0J05j02r3l3J39n4K28k97J27k6R9j28K78m0k45O6q0K92K9l13
4507a35L50l30q6J11J71j32J77J3p4J9k94K19J00l32K08M6q8J5J5l8K8on5L12
4531B14nj41j62P6K01j56J44j12M4L2j33k6k22J20J10L6L23k12o7m1j6k33J1K35
4555B0p9p6J55L11j59j72J41j84J19k19K9K4RJ22k10K05Kq5J92j73pk7J9j13J85
$$ plain form
4580 29 147 30 -1 -209 74 46 35 -281 33 196 -93 48 -28 184 -94 2 -16 144 294 56 71 -77 -111
4603 -111 -354 -159 -268 241 -64 -24 29 -191 23 -82 -49 36 124 19 -154 34 142 -34 -62 -62 82 111 -143
4626 -143 97 54 -14 65 26 35 65 62 -137 249 -211 48 -103 180 155 226 -82 -266 80 45 -35 49 144 -49 -145
4651 -145 181 -63 50 -264 -22 -26 159 10 7 113 -67 -67 -51 8 -117 202 11 161 70 102 196 286 -147 18
4675 18 73 47 135 84 -131 -38 -173 -225 1 115 110 -118 -3 -74 67 -84 -73 -236 145 97 94 -155 -71 -54 34 -31
4701 -31 -69 -34 58 50 -56 38 239 317 -176 141 -93 56 -53 -41 -11 50 21 -184 13 180 141 156 206 -143 213
4726 213 119 -35 -76 106 -32 175 -105 97 63 262 214 -147 189 -154 109 -44 109 -51 -109 78 218 -191
4748 -191 97 -98 -62 -40 -273 0 -170 -209 -168 259 237 -65 265 -39 -209 -35 -20 -34 -128 -18 49 -151 114
$$ packed form
4580B9J18j17l1k08K83k8j1l16L14J63k89J41p6K12k78R6j8J60J50k38J5j48l4
4603a11k43J95j09N09l05M0N3k20K14j05L3Q5Q8j05j73J88J08j76k8%J44K9k54
4626a43K40m3o8P9l9RL0lj99L86m60K59j51K83k5P1l08j84L46l5q0Q4R5j93r6
4651a45L26k44J13l14K42mJ85j49lJ06j80%J6N9j25L19j91J50r1L2R4R0m33J65
4675A8N5k6Q8n1k15R3j35n2K26J14nk28J15p1J41j51J1j63L81m8lk49Q4J7Q8o5
4701c1l8L5R2qj06R4K01P8m93L17k34J49j09J2L0O1k9k05J97J67l9J5N0l49L56
4726B13r4j54m1J82j38K07k80K02l4J99m8l61L36l43K63j53J53j60n8J87J40m09
4748a91K88j95L6K2k33K73j70l9M1M27k2l02L30l04j70J74J5j4r4J10O7k00K65
$$ plain form
4771 114 18 -112 47 194 -175 -113 -75 -92 85 -59 -8 2 -165 91 -97 -105 -142 52 -105 -414 -216 249 -6
4794 -6 245 79 -52 -149 38 -238 -540 -150 94 90 -44 -115 -201 -70 -68 76 103 142 -55 31 21 -192 -23 91
4818 91 131 -206 -24 202 -20 -57 -210 49 -262 225 64 17 189 72 287 23 -222 -419 -43 -186 -101 -45
4840 -45 -98 202 0 -196 38 -103 20 -17 137 -297 -244 75 42 73 114 88 39 -80 170 16 -231 8 -50
4863 -50 32 -11 -26 -178 1 132 -32 -64 -117 174 -151 90 206 325 66 -285 114 91 -35 -383 -110 -9
4885 -9 -187 183 118 88 322 189 -168 98 84 194 36 -118 -63 133 144 212 75 104 56 69 -4 30 -37 173 71
4910 71 -68 55 228 -63 204 167 -42 180 112 160 -142 168 -8 75 -11 -62 196 -201 -24 22 48 -207 -107
4933 -107 51 38 -265 -167 15 96 146 -75 -136 -268 9 -127 -25 -172 -19 -223 25 283 135 157 -20 -171
$$ packed form
4771A14r6j30J59J47l69O2L8j7J77j44N1J0j67K56j88ql7J94j57l09J98M65k55
4794fK51j66j31r7J87k76l02L90K44mj34p1q6J31KJ44K7L9j97Q6j0k13J69J14
4818I1M0l37J82K26k22l7j53K59l11M87j61m7J72j17K15k64k45j97L76j43Q5N6
4840d5n3L00k02j96K34j41J23l7J54m34N3L19l3L1M1k6m9j19K50j54k47K39n8
4863e0Q2m3j5j52J79J31j64l2n3K91l25K41J16J19k59l51L99k3j26l48K73J01
4885ij78L70o5l0K34j33l57K66j4J10j58j54N5J96J1O8j37K9m8J3p3L4o7K10j02
4910G1j39J23J73k91K67l7k09K22o8M8l02L10j76Q3q6n1K58l97J77M6K6k55J00
4933a07J58j3l03R8J82Q1N0k21o1j32K77j36J02j47J53k04K48K58j48K2j77j51
$$ plain form
4955 -171 -50 -111 -132 23 4 -69 38 -234 123 41 109 23 -111 116 -7 -14 -117 33 -209 55 -64 64 26
4978 26 65 59 137 63 -14 94 -285 10 -51 165 13 -103 202 1 17 -76 -87 -38 88 51 -104 53 140 -84 -26
5003 -26 63 32 56 97 48 -36 -72 -140 -128 149 -98 235 71 -39 13 74 227 41 146 -20 -8 -257 -218 140 15
5028 15 63 -129 -37 45 -51 -271 -129 -92 155 -89 142 16 50 290 34 -141 41 3 -23 -103 -20 -157 -63 -143
5052 -143 -27 -113 -77 -29 92 -245 -64 -33 -189 93 176 84 -163 116 -37 130 -161 77 -169 15 -19 -38 -33
5075 -33 4 -105 -197 48 212 141 206 -136 27 48 71 -25 20 55 -69 279 -197 -198 -119 69 -61 -173 108 -37
5099 -37 37 -27 -107 -72 334 -73 -29 -129 -195 -63 -217 29 -78 -56 -99 105 185 -23 -108 -85 221 75 -60 -20
5123 -20 -31 -37 105 118 -212 -2 -12 -4 -89 -68 147 -27 24 76 47 -104 12 -130 83 -6 -234 114 -238 -1 -46
$$ packed form
4955a71J21o1k1J55j9p3J07k72L57q2O8q6j34K27j23pj03J50k42K64j19J28l8
4978B6L9oP8p4p7J08l79K95o1K16j52j16L05k01J6r3j1M9J26l7j55J57Q7k24N8
5003b6Q9l1K4M1m9q4l6o8J2K77k47L33j64j10N2O1J53j86J05j66J2k49L9L58j25
5028A5M8j92R2Q2r6k20J42L7K47k44K31j26L4K40k56j75J82l8k6q0Q3j37R4q0
5052a43J16q6L6M8J21l37J81L1j56K82Q3r2k47K79j53J67k91K38k46J84l4j9N
5075c3L7j09r2K45J64p1O5l42J63K1K3r6M5L5j24L48m76jP9J88j30j12K81j45
5099c7P4o4q0L5M06m07M4j00o6J32j54K46j07K2m3K04Q0k08q5K3L06j46j35M0
5123b0j1oJ42J3l30K10j0Qq5K1K15j74N1N2k9j51J16j42K13q9k28L48l52K37m5
$$ plain form
5148 -46 156 149 292 -199 -192 59 147 -66 109 -45 50 137 -105 187 116 -102 10 -55 56 58 -202 8 15 75 -116
5173 -116 -209 -92 18 -292 42 140 120 317 33 32 -175 37 70 -208 126 -69 130 -70 3 -252 -4 127
5195 127 -158 130 140 -105 -27 101 320 -117 14 278 60 238 -96 -52 50 39 115 27 90 297 37 104 19
5218 19 -60 13 -69 -160 184 -156 -66 260 -86 162 210 95 29 63 -110 105 -319 -279 -136 94 117 -4 91 52
5242 52 38 -183 -55 -77 6 129 -247 -125 -57 -87 81 131 107 -101 16 0 -165 -75 -193 -81 151 -116 -40 -10
5266 -10 180 -127 144 73 -190 50 -22 -7 -19 -4 -230 -146 -223 68 300 -70 -255 -175 18 146 43 41 234 126
5290 126 224 95 79 87 231 150 124 72 9 100 156 -140 -223 -53 7 294 -77 104 -69 -109 -145 30 -194 -12 -267
5315 -267 -303 -50 175 64 43 129 15 286 -22 42 -192 -51 -283 155 92 -15 -17 18 -104 10 -190 -232 -189
$$ packed form
5148d6K02pJ43m91PK51Q8k13J75j54R5Q7k42K92p1k18J12o5J11Kk60K10PO0j91
5173a16r3J17J10l10L34R8k0J97k84jk07K12L3k78L34j95J99k00P3k55K48J31
5195A27k85K88J0k45P8J28K19m37J31K64k18J78l34M4J02j1P6q8O3K07k60O7q5
5218A9p9P3q2r1L44l40R0L26l46K48M8j15o6L4j73K15m24M0J43K30K3j21R5l9
5242E2j4k21J28k2Q3J23l76J22O8l0J68N0k4k08J17j6j65R0j18J12K32k67P6L0
5266a0J90l07K71p1k63K40p2J5j2J5k26Q4p7K91K32l70j85Q0J93J28j03kJ93j08
5290A26R8j29j6QJ44q1k6n2o3R1N6k96q3J70O0K87l71J81j73m0l6J75k24J82k55
5315b67l6K53K25j11k1Q6j14K71l08O4k34J41k32M38o3j07kL5j22J14k00m2M3
$$ plain form
5338 -189 -8 92 50 10 -50 54 -53 -133 -19 -54 -63 -35 208 -90 -41 -94 136 108 83 101 -50 78 224 54
5362 54 -89 -125 119 107 -16 187 -103 -31 276 -80 241 -92 33 3 -103 143 -32 42 -69 -62 -149 111 -253
5385 -253 -34 -181 111 156 -60 110 -189 224 70 22 -19 106 -81 -41 206 32 -103 -83 -138 -192 183 249 46
5408 46 45 62 -103 -319 -77 -175 158 65 129 236 91 -135 -104 -58 22 141 88 147 209 214 275 97 -27 184 -117
5433 -117 -138 -140 168 -8 -43 -47 -201 89 -47 -44 107 -135 0 -99 236 36 -173 279 80 -76 65 88 -97
5456 -97 41 -237 -69 131 -83 -157 125 96 -4 -344 -2 -132 184 128 -127 45 -221 -111 -210 -105 -19 -145
5478 -145 45 -17 -272 71 69 18 -190 257 -41 -7 -153 164 -14 65 103 67 -70 -141 -32 38 339 34 40 -222
5502 -222 172 164 -134 53 -112 -350 93 -252 -76 108 239 186 0 -172 -113 -48 -106 -59 -122 -1 -186 58 -293
$$ packed form
5338a89J81J00m2m0o0J04j07q0J14l5rK8K43k98M9n3K30k8k5J8j51J28J46j70
5362E4j43l6K44j2j23K03k90P2L07l56L21l33J25l0j06K46j75P4j11Pq7K60l64
5385b53K19j47K92M5k16J70k99M13j54m8m1J25j87M0K47j74j35K0n5n4L75O6k03
5408D6jJ7j65k16K42r8L33r3O4J07j45k26L1M6Q0J19n3N9O2NO1j78j24K11l01
5433a17k1kL08j76l5mj54K90j36LJ51k42J35r9L35k00k09M52j99j56J41K3j85
5456i7J38k78J68K00k14p4K82k9j00l40L42j30L16n6k55J72k66J10r9J05Q6j26
5478a45J90o2k55L43kn1k08M47k98L4j46L17j78P9L8l6j37p1J09P0L01l05Ok62
5502b22L94qk98J87j65k38M43l45J76J84J31n3j86j72N9O5n8M7o3J21j85K44l51
$$ plain form
5525 -293 78 153 21 76 -32 -63 -80 34 33 67 -19 70 41 -83 119 205 107 -38 -298 16 60 217 198 85 -180
5550 -180 64 167 156 69 -174 -15 92 -18 -12 87 -52 -137 4 -45 -64 -155 78 130 8 -137 144 24 -39 -29
5574 -29 46 3 8 -39 163 -226 71 -243 -89 -89 -198 -141 8 82 -19 22 190 62 231 -147 16 -61 169 -46
5598 -46 -60 -25 -111 -229 81 73 0 -32 17 10 -15 156 46 -292 -151 185 -190 126 -59 -101 267 -19 10 -225 67
5623 67 480 -84 -242 70 -30 -1 182 -97 -104 155 11 -46 -14 17 23 -40 -79 -82 -52 -119 -41 51 192 324 157 96
5649 96 240 -119 -93 -31 -211 175 -28 37 201 179 43 -38 190 50 38 158 -171 -318 -261 -88 20 78 46
5672 46 -37 249 265 33 246 -62 135 -30 226 133 -107 147 -124 161 -127 96 -8 215 34 -8 120 83
5694 83 -40 -76 31 56 81 249 11 67 41 58 40 25 4 -138 65 37 140 -64 20 -58 -4 -22 -110 6 -78 -70
$$ packed form
5525b93L71P5j32N5j08l1j7J14jL4q6Q9k9j24K02Q6r8j45k60L14M4J57j9j13k65
5550a80K44J03j1q7k43J59J07j10OR9j39q5J41m9j9r1K33N2j22j45K81j20o3J0
5574b9P5m3Nm7K02l89K97l14J54%j09N7J49P4j01M1J68j28J69l78J63p7K30k15
5598d6j4L5q6j18L10qp3l2M9pk5J71j10l38J41L36l75L16j85m2L68k86K9k35K92
5623F7M13n64j58L12j00K9J83k79pK59j44n7L2L1Oo3l9lL0o7P8R2J41J32j67o1
5649I6J44l59K6O2j80L86k03O5J64k2j36q1K28j40j2J20l29j47N7J73J08N8l2
5672D6q3K86J6k32K13l08J97j65K56r3k40K54k71K85k88K23j04K23j81m2J28l7
5694H3j23l6J07K5K5J68k38N6k6J7j8j5k1j42K03k8J03k04Q4p8N4j8q8J16q4Q
$$ plain form
5720 -70 154 -33 -146 320 9 -31 155 201 -26 -118 26 91 -62 -104 -124 -228 -88 32 -262 204 82 189
5742 189 -157 48 -31 -37 -35 -70 -173 56 4 -30 242 82 -41 80 110 27 69 -3 -151 165 -137 109 156 61 45
5767 45 178 -103 -137 -97 -42 92 -100 151 238 8 -274 27 -155 116 32 -277 2 -34 -66 35 -15 92 51
5790 51 50 22 -148 6 -45 2 24 -141 143 -169 -98 -22 99 243 112 202 122 105 -119 -155 175 -20 -53 -188 -6
5815 -6 -64 -86 100 25 -125 149 33 94 15 -26 -217 120 437 142 -215 -95 -170 220 76 45 -162 -117 -114 -232
5839 -232 -62 -39 -77 12 148 -166 -19 -52 -95 46 -138 -134 -238 -271 -91 85 -10 -32 87 1 -190 -95 68 -55
5863 -55 -95 -46 141 19 24 -35 189 11 -143 -65 84 -172 36 -89 27 260 86 40 182 -187 273 83 -130
5886 -130 185 -102 -181 -88 -113 -35 -77 -76 -106 94 -106 -212 29 37 134 272 47 -12 -306 180 250 54 -77 -50 -24
$$ packed form
5720g0K24j87j13M66l11m0J86M6k27r2J44O5j53m2k0j04J40J20k94M66j22J07
5742A89l46K05p9oKl5j03K29n2l4K72j60j23J21L0q3M2p2j48L16l02K46M7r5j6
5767D5J33k81l4M0N5J34j92K51Q7k30k82L01j82K71q4l09K79l6l2J01n0J07m1
5790E1jk8j70J54n1M7K2j65K84l12P1P6J21J44j31R0q0j7k24l6L30j95l3j35J82
5815fn8k2J86p5j50K74j16O1p9m1j91L37L17k95l57J20p5L90j44l1k07M5Lj18
5839b32J70K3l8Q9J36l14J47l3m3J41j84Mj04l3J80J76r5k2J19q6j91R5J63j23
5863e5m0M9J87j22Nn9K24j78j54P8J49k56K08j25J16K33j74m6J42l69M60j90k13
5886a30L15k87p9R3k5P8m2Jl0K00k00j06K41QR7J38k25n9k94M86P0j96j31K7K6
$$ plain form
5911 -24 18 -100 -117 115 14 80 -346 -290 -15 -100 -15 30 6 153 69 104 160 100 210 -131 146 163 108 179 -164
5936 -164 193 89 -149 -11 -118 231 -84 -89 -218 -64 -58 -223 227 -74 -175 328 103 -30 191 -152 -24
$$ packed form
5911b4M2j18j7K32j01O6m26N6K75q5Q5M5k4J47q4L5N6o0J10l41K77J7n5P1l43
5936a64L57j04k38J38j07L49l15nj29J54Oj65M50l01j01N03k25j33K21l43J28
$$ [...]
8191C7
##END NTUPLES=NMR FID
##END=
