##TITLE=1H_CA-8759-2
 CDCl3, 8 sc, 
 21.9.2020
##JCAMPDX= 6.0         $$ Bruker NMR JCAMP-DX V2.0
##DATA TYPE= NMR FID
##DATA CLASS= NTUPLES
##ORIGIN= UXNMR, Bruker Analytische Messtechnik GmbH
##OWNER= root
$$ XWIN-NMR		Version 3.5
$$ Mon Sep 21 10:45:25 2020 Russian Standard Time (UT+4h)  she@DPX200
##.OBSERVE FREQUENCY= 200.1315066352
##.OBSERVE NUCLEUS= ^1H
##.DELAY= (6, 6)
##.ACQUISITION MODE= SIMULTANEOUS
##.ACQUISITION SCHEME= undefined
##.AVERAGES= 8
##.DIGITISER RES= 18
##SPECTROMETER/DATA SYSTEM= spect
##.PULSE SEQUENCE= zg30
##.SOLVENT NAME= CDCl3
##.SHIFT REFERENCE= (INTERNAL, CDCl3, 0, 15.7039)
##AUDIT TRAIL= $$ (NUMBER, WHEN, WHO, WHERE, WHAT)
$$ ##TITLE= Audit trail, XWIN-NMR		Version 3.5
$$ ##JCAMPDX= 5.01
$$ ##ORIGIN= Bruker BioSpin GmbH
$$ ##OWNER= she
$$ F:/spectra/data/she/nmr/H-F/1/audita.txt
$$ ##AUDIT TRAIL=  $$ (NUMBER, WHEN, WHO, WHERE, WHAT)
(   1,<2020-09-21 10:44:25.68 +0400>,<she>,<DPX200>,
      <created by zg, POWCHK disabled, PULCHK disabled
       configuration hash MD5:
       00 E9 B6 7A A2 85 ED C7 34 08 36 98 17 FE 4E 26
       data hash MD5: 16K
       63 AE E8 E6 2B C2 66 01 79 C5 B3 F6 35 BD 20 5D>)
$$ ##END=
$$ 
$$ hash MD5
$$ 66 EF 1F CF 75 18 51 68 49 D9 94 2D 01 12 8B 6D
##$RELAX= 
##$RELAX= 
##$RELAX= 
##$RELAX= 
##$RELAX= 
##$RELAX= 
$$ Bruker specific parameters
$$ --------------------------
##$DU= <F:/spectra>
##$EXPNO= 1
##$NAME= <H-F>
##$PROCNO= 1
##$TYPE= <nmr>
##$USER= <she>
##$AMP= (0..31)
100 100 100 100 100 100 100 100 100 100 100 100 100 100 100 100 100 100 
100 100 100 100 100 100 100 100 100 100 100 100 100 100 
##$AQSEQ= 0
##$AQ_mod= 1
##$AUNM= <au_zg>
##$AUTOPOS= <>
##$BF1= 200.13
##$BF2= 200.13
##$BF3= 200.13
##$BF4= 200.13
##$BF5= 200.13
##$BF6= 200.13
##$BF7= 200.13
##$BF8= 200.13
##$BYTORDA= 1
##$CFDGTYP= 0
##$CFRGTYP= 5
##$CHEMSTR= <none>
##$CNST= (0..31)
1 1 145 1 1 1 1 1 1 1 1 1 1 1 1 1 1 1 1 1 1 1 1 1 1 1 1 1 1 1 1 1 
##$CPDPRG= <>
##$CPDPRG1= <>
##$CPDPRG2= <>
##$CPDPRG3= <>
##$CPDPRG4= <mlev>
##$CPDPRG5= <mlev>
##$CPDPRG6= <mlev>
##$CPDPRG7= <mlev>
##$CPDPRG8= <mlev>
##$CPDPRGB= <>
##$CPDPRGT= <>
##$D= (0..31)
0 1.2 0 0 0 0 0 0 0 0.06 0 0.03 0 0 0 0 0.0002 0 0 0 0 0 0 0 0 0 0 0 0 
0 0 0 
##$DATE= 1600670665
##$DBL= (0..7)
120 120 120 120 120 120 120 120 
##$DBP= (0..7)
150 150 150 150 150 150 150 150 
##$DBP07= 0
##$DBPNAM0= <>
##$DBPNAM1= <>
##$DBPNAM2= <>
##$DBPNAM3= <>
##$DBPNAM4= <>
##$DBPNAM5= <>
##$DBPNAM6= <>
##$DBPNAM7= <>
##$DBPOAL= (0..7)
0.5 0.5 0.5 0.5 0.5 0.5 0.5 0.5 
##$DBPOFFS= (0..7)
0 0 0 0 0 0 0 0 
##$DE= 6
##$DECBNUC= <off>
##$DECIM= 32
##$DECNUC= <off>
##$DECSTAT= 4
##$DIGMOD= 1
##$DIGTYP= 9
##$DL= (0..7)
0 120 120 120 120 120 120 120 
##$DP= (0..7)
150 150 150 150 150 150 150 150 
##$DP07= 0
##$DPNAME0= <>
##$DPNAME1= <>
##$DPNAME2= <>
##$DPNAME3= <>
##$DPNAME4= <>
##$DPNAME5= <>
##$DPNAME6= <>
##$DPNAME7= <>
##$DPOAL= (0..7)
0.5 0.5 0.5 0.5 0.5 0.5 0.5 0.5 
##$DPOFFS= (0..7)
0 0 0 0 0 0 0 0 
##$DQDMODE= 0
##$DR= 18
##$DS= 0
##$DSLIST= <SSSSSSSSSSSSSSS>
$$ [...]
##$SUBNAM2= <"">
##$SUBNAM3= <"">
##$SUBNAM4= <"">
##$SUBNAM5= <"">
##$SUBNAM6= <"">
##$SUBNAM7= <"">
##$SUBNAM8= <"">
##$SUBNAM9= <"">
##$SW= 16.880792210976
##$SWIBOX= (0..15)
0 0 2 0 0 0 0 0 0 0 0 0 0 0 0 0 
##$SW_h= 3378.37837837838
##$TD= 16384
##$TD0= 1
##$TE= 0
##$TE2= 300
##$TE3= 300
##$TEG= 300
##$TL= (0..7)
0 120 120 120 120 120 120 120 
##$TP= (0..7)
150 150 150 150 150 150 150 150 
##$TP07= 0
##$TPNAME0= <>
##$TPNAME1= <>
##$TPNAME2= <>
##$TPNAME3= <>
##$TPNAME4= <>
##$TPNAME5= <>
##$TPNAME6= <>
##$TPNAME7= <>
##$TPOAL= (0..7)
0.5 0.5 0.5 0.5 0.5 0.5 0.5 0.5 
##$TPOFFS= (0..7)
0 0 0 0 0 0 0 0 
##$TUNHIN= 0
##$TUNHOUT= 0
##$TUNXOUT= 0
##$USERA1= <user>
##$USERA2= <user>
##$USERA3= <user>
##$USERA4= <user>
##$USERA5= <user>
##$V9= 5
##$VALIST= <valist>
##$VCLIST= <CCCCCCCCCCCCCCC>
##$VD= 0
##$VDLIST= <DDDDDDDDDDDDDDD>
##$VPLIST= <PPPPPPPPPPPPPPP>
##$VTLIST= <TTTTTTTTTTTTTTT>
##$WBST= 1024
##$WBSW= 4
##$XGAIN= (0..3)
0 0 0 0 
##$XL= 0
##$YL= 0
##$YMAX_a= 275040
##$YMIN_a= -256247
##$ZGOPTNS= <>
##$ZL1= 120
##$ZL2= 120
##$ZL3= 120
##$ZL4= 120
##$ABSF1= 10
##$ABSF2= 0
##$ABSG= 5
##$ABSL= 3
##$ALPHA= 0
##$AQORDER= 0
##$ASSFAC= 0
##$ASSFACI= 0
##$ASSFACX= 0
##$ASSWID= 0
##$AUNMP= <proc_1d>
##$AZFE= 0.1
##$AZFW= 0.1
##$BCFW= 1
##$BC_mod= 2
##$BYTORDP= 1
##$COROFFS= 0
##$CY= 11.3945322036743
##$DATMOD= 1
##$DC= 2
##$DFILT= <>
##$DTYPP= 0
##$F1P= 16.9975609425685
##$F2P= -3.02152046262296
##$FCOR= 0.5
##$FTSIZE= 0
##$FT_mod= 4
##$GAMMA= 1
##$GB= 0.15
##$INTBC= 1
##$INTSCL= 1
##$ISEN= 128
##$LB= 0.24
##$LEV0= 0
##$LPBIN= 0
##$MAXI= 10000
##$MC2= 0
##$MEAN= 0
##$ME_mod= 0
##$MI= 1.114404
##$NCOEF= 0
##$NC_proc= 0
##$NLEV= 6
##$NOISF1= 3.799351
##$NOISF2= 2.8
##$NSP= 1
##$NTH_PI= 0
##$NZP= 0
##$OFFSET= 15.70392
##$PC= 1
##$PHC0= -9971.485
##$PHC1= 15.6009
##$PH_mod= 1
##$PKNL= yes
##$PPARMOD= 0
##$PSCAL= 0
##$PSIGN= 0
##$REVERSE= no
##$SF= 200.130013532006
##$SI= 16384
##$SIGF1= 3
##$SIGF2= 2
##$SINO= 400
##$SIOLD= 16384
##$SREGLST= <1H.CDCl3>
##$SSB= 0
##$STSI= 0
##$STSR= 0
##$SW_p= 3612.71676300578
##$SYMM= 0
##$S_DEV= 0
##$TDeff= 0
##$TDoff= 0
##$TI= <>
##$TILT= no
##$TM1= 0
##$TM2= 0
##$TOPLEV= 0
##$USERP1= <user>
##$USERP2= <user>
##$USERP3= <user>
##$USERP4= <user>
##$USERP5= <user>
##$WDW= 1
##$XDIM= 8192
##$YMAX_p= 0
##$YMIN_p= 0
$$ End of Bruker specific parameters
$$ ---------------------------------
##NTUPLES= NMR FID
##VAR_NAME=  TIME,          FID/REAL,        FID/IMAG
##SYMBOL=    X,             R,               I
##VAR_TYPE=  INDEPENDENT,   DEPENDENT,       DEPENDENT
##VAR_FORM=  AFFN,          ASDF,            ASDF
##VAR_DIM=   8192,          8192,            8192
##UNITS=     SECONDS,       ARBITRARY UNITS, ARBITRARY UNITS
##FACTOR=    0.000296,      1,               1
##FIRST=     0,             0,               0
##LAST=      2.424536,      0,               0
##MIN=       0,             -256247,         0
##MAX=       2.424536,      275040,          0
$$ Real data points
##PAGE= N=1
##DATA TABLE= (X++(R..R)), XYDATA
$$ plain form
0 0 0 0 0 0 0 0 0 0 0 0 0 0 5 -8 8 -8 16 -16 16 -24 29 -32 40 -48 56 -68 80 -92 105 -124 141 -161 182 -208
34 -208 238 -268 302 -338 378 -426 474 -527 588 -652 723 -797 883 -975 1075 -1184 1303
51 1303 -1435 1582 -1744 1922 -2123 2348 -2603 2894 -3231 3626 -4097 4668 -5376 6283 -7493
66 -7493 9188 -11735 16069 -43298 275040 -30988 -209357 180936 -55217 -120936 135442
77 135442 -25450 -25163 126966 -102693 47452 108326 -93220 68690 148133 -127093 13230
88 13230 173142 -32454 -1610 43579 13134 57102 27260 -9777 25250 7004 -6039 57464
100 57464 -3326 13208 -1829 -34555 10506 -8488 6000 36206 -46103 -89127 48634 16022
112 16022 -44132 -12506 -28902 2505 -27534 -34721 25136 1523 -66987 25909 9636 -60499
$$ packed form
0@%%%%%%%%%%%%Nj3J6j6K4l2L2m0N3o1P2q8J04j24J48j72J97k29K65l02L43l90
34b08M46n06N70o40P16q04R00j001J115j240J375j520J680j858K050k259K487
51A303k738L017l326L666m045M471m951N497o125O857p723Q765j0044J1659j3776
66g493J6681k0923K7804n9367L18338l06028j78369L90293k36153o5719K56378
77A35442j60892K87J52129k29659J50145O0874k01546J61910P9443k75226J40323
88A3230J59912k05596L0844M5189l0445M3968k9842l7037L5027j8246j3043O3503
100E7464o0790J6534j5037l2726M5061j8994J4488L0206q2309m3024J37761l2612
112A6022o0154L1626j6396L1407l0039p187N9857k3613o8510R2896j6273p0135
$$ plain form
124 -60499 35258 2787 -32803 -2341 22658 34245 -19278 -71485 58124 61069 -86976 60773
136 60773 45201 -92185 47064 63417 -62171 49736 46132 -74173 57097 15839 -10407
147 -10407 88485 -43692 -48107 117007 -11677 -55283 115623 -40600 -36094 114461 -39626
158 -39626 -36587 93724 -30195 -37207 86282 -33601 -5278 43949 -62638 11668 63136
169 63136 -30688 -16396 18192 -45255 33162 29463 -46139 13532 10029 -30765 -1098 31524
181 31524 -9971 -5892 -4291 -8038 767 13321 25635 -40673 -14038 36940 8205 -20988 5520
194 5520 5501 -4175 12255 -5923 23789 -8595 -17136 29829 -1131 -8586 43317 -3245 -56530
207 -56530 45197 31551 -11239 8527 -13981 3027 20850 -1536 9368 20887 -34863 20750
$$ packed form
124f0499R5757l2471l5590L0462K4999J1587n3523n2207J29609K945j48045J47749
136F0773j5572j37386J39249J6353j25588J11907l604j20305J31270m1258k6246
147a0407R8892j32177m415J65114j28684m3606J70906j56223M506J50555j54087
158c9626L039J30311j23919p012J23489j19883K8323M9227j06587P4306N1468
169F3136r3824J4292L4588o3447P8417l699p5602N9671l503m0794K9667L2622
181C1524m1495M079J601l747Q805J2554J2314o6308K6635N0978k8735k9193K6508
194E520j9r676J6430j8178K9712l2384q541M6965l0960p455N1903m6562n3285
207e6530J01727j3646m2790J9766k2508J7008J7823k2386J0904J1519n5750N5613
$$ plain form
219 20750 14821 -38596 47191 15922 -55607 17420 30521 -33536 30447 -7973 -49306 47541
231 47541 1929 -30252 16741 -16832 -20015 39305 -34099 -18246 50705 -51784 -21192 46722
243 46722 -20791 -16838 31650 -43859 -17815 51006 -15225 -7785 -512 -12904 15607 10892 -20981
256 -20981 18325 14101 -32016 21039 12394 -10099 11025 5967 -17682 8785 28789 -12401 -13478
269 -13478 2526 19631 -3219 1499 4798 -18159 5832 13585 -438 -6069 11807 -9233 -9448
282 -9448 787 11387 17055 -32061 -10635 19350 -6698 -10647 18993 -24649 -23432 30409 -14630
295 -14630 -13910 6087 -8449 -8692 -377 -11421 12668 364 -41877 22495 12628 -20202 14014
308 14014 -5330 -32030 27021 21210 -28573 18733 -4737 -15355 21187 2212 -2233 19678
$$ packed form
219B0750n929n3417Q5787l1269p1529P3027J3101o4057O3983l8420m1333R6847
231D7541m5612l2181M6993l3573l183N9320p3404J5853O8951j02489L0592O7914
243D6722o7513L953M8488p5509K6044O8821o6231P440P273j2392K8511m715l1873
256b0981L9306m224m6117N3055q645k2493K1124n058k3649K6467K0004m1190j077
269a3478J6004J7105k2850M718L299k2957K3991P753j4023n631J7876k1040k15
282i448J0235J0600N668m9116K1426K9985k6048l949K9640m3642J217N3841m5039
295a4630P20J9997j4536k43Q315j1044K4089j2304m2241O4372r867l2830L4216
308A4014j9344k6700N9051n811m9783M7306k3470j0618L6542j8975m445K1911
$$ plain form
320 19678 -10911 -14530 31485 -4381 9962 16310 -29587 7607 38399 -11456 -12870 28586 -13599
333 -13599 -2089 21707 -1755 -3352 1270 2681 -737 6002 1226 9662 -18472 -14553 27890 7645
347 7645 -16362 -7469 7690 -12552 4899 12061 -11202 -11150 3390 469 -15174 15496 1542
360 1542 -17955 -6550 2376 3929 2914 -5756 -15623 10191 -1922 2552 2631 -19031 5579 16597
374 16597 -12060 -3377 27404 -19177 -7936 22253 -2688 6062 11639 -8651 -3939 20022 3373
387 3373 10733 -5628 -13427 27144 5134 -12676 16108 9281 -22085 14832 9555 -12927 14871
400 14871 -267 -11230 5729 12598 -3908 -774 -10257 1859 17141 -9644 -49 966 -9529
413 -9529 1085 13851 -12823 -6498 12534 -15975 -6225 12077 5055 -15797 -5726 -103 -2086
$$ packed form
320A9678l0589l619M6015l5866J4343O348m5897L7194L0792m9855j414M1456m2185
333a3599J1510K3796k3462j597M622J411l418O739m776Q436k8134L919M2443k0245
347G645k4007Q893J5159k0242J7451P162k3263N2J4540k921j5643L0670j3954
360A542j9497J1405Q926J553j015q670r867K5814j2113M474P9k1662K4610J1018
374A6597k8657Q683L0781m6581J1241L0189k4941Q750N577k0290M712K3961j6649
387C373P360j6361p799M0571k2010j7810K8784o827l1366L6917n277k2482K7798
400A4871j5138j0963J6959O869j6506L134r483J2116J5282k6785R595J015j0495
413i529J0614J2766k6674O325J9032k8509R750J8302p022k0852J0071N623j983
$$ plain form
426 -2086 4738 -1707 -3709 -11751 4511 5778 -2337 -8531 -533 4216 -11076 3634 8869 -3305
440 -3305 -14049 5043 2286 -4331 11003 -7259 -11322 4381 12079 -4593 -1379 -2957 -4994 5024
454 5024 -3757 7639 1324 -10733 -4033 7952 -6438 1975 11249 -22281 -4794 15079 853
467 853 -11074 1860 -3344 -5412 4600 -2046 4852 -8424 -4998 6209 -594 -5006 7093 -2543
481 -2543 -19063 12571 8459 -7009 -4033 -921 -4551 2815 6612 -8184 -557 -4113 -605 -362
495 -362 527 1939 -5946 -8195 -2627 9394 -5636 -2464 -1810 -8863 -578 7345 -1698 -16341 3489
510 3489 2168 -5443 -4255 3373 -2722 -11992 224 1870 1322 -9479 -2116 -2953 -6376 3494 4438
525 4438 -8372 -14975 9526 2168 -6086 -619 1507 -4544 -3623 5909 -539 2744 -3729 -477 33
$$ packed form
426b086O824o445k002q042J6262J267q115o194P998M749j5292J4710N235j2174
440c305j0744J9092k757o617J5334j8262m063J5703P698j6672L214j578k037J0018
454E024q781J1396o315j2057O700J1985j4390Q413R274l3530J7487J9873j4226
467H53j1927J2934n204k068J0012o646O898j3276L426J1207o803m412J2099r636
481b543j6520L1634m112j5468K976L112l630P366L797j4796P627l556L508K43
495c62Q89J412p885k249N568J2021j5030L172O54p053Q285P923r043j4643J9830
510C489j321p611J188P628o095r270J2216J646n48j0801P363q37l423R870R44
525D438j2810o603K4501p358q254N467K126o051R21R532o448L283o473L252N10
$$ plain form
540 33 2758 8051 -2054 -4784 476 10634 -1667 2939 1561 -6077 4985 8525 -708 -5510 8231
555 8231 -3492 -4433 5992 7218 -2146 -9643 2729 2570 1721 -1592 2640 -8155 -6709 10551 1447
570 1447 -7646 -4090 5123 -7568 -2032 5521 -1221 -6493 -5627 3948 -1110 1294 -2785 -3740 -5347
585 -5347 2333 7756 -5386 -3002 -1544 1546 -1666 5836 1175 -5675 1107 605 3776 1913 5983
600 5983 -5262 -4101 5711 7882 2013 -4035 5555 -551 1193 6124 7057 -4023 -1651 9393 -342
615 -342 1485 5468 3298 -8503 2403 10177 -142 -2653 -1348 2613 -2931 4940 2255 -3827 -3852
630 -3852 1723 3371 -3629 4610 -908 -3893 -2953 6214 2251 -4152 930 -3237 96 1918 5100
645 5100 -5522 -3687 3690 820 -351 -409 4345 -5460 -886 4851 3669 -2187 -1215 3002 -3548 4766
$$ packed form
540C3K725N293j0105k730N260J0158j2301M606j378p638J1062L540r233m802J3741
555H231j1723r41J0425J226r364p497J2372j59q49l313M232j0795J446J7260r104
570A447r093L556R213j2691N536P553o742n272Q66R575n058K404m079r55j607
585e347P680N423j3142K384J458L090l212P502m661o850O782n02L171j863M070
600E983j1245J161R812K171n869o048R590o106J744M931R33j1080K372J1044r735
615c42J827L983k170j1801J0906P774j0319k511J305L961n544P871k685o082k5
630c852N575J648p000Q239n518k985R40R167l963o403N082m167L333J822L182
645E100j0622J835P377k870j171n8M754r805M574N737j182n856R72M217o550Q314
$$ plain form
661 4766 5492 -93 -6679 3150 6006 -1485 2021 825 162 -3517 4989 2799 -1323 -49 -4 231
677 231 -1297 7966 -733 -5485 -1277 5790 627 -2750 3434 -5070 -2138 3015 4193 -5027 -1216
692 -1216 2642 -4131 -145 2951 3192 -7383 -2035 3192 1979 419 -144 -453 -6076 5137 4113
707 4113 -1146 -3279 1871 283 -1945 5824 471 -1753 -2789 2652 546 1570 2880 -3341 -2414
722 -2414 118 7390 -1906 -3116 389 206 -1934 1657 5605 -6530 -2366 2287 1104 -2398 2441
737 2441 832 -7271 236 3389 3324 -5925 -1964 814 -2055 48 2324 541 -8139 1868 1241 -1764
753 -1764 -537 777 -3452 -3167 4956 -1017 402 -2035 -1411 41 2303 2907 -2378 -737 -605 4263
769 4263 -1740 2312 3556 -4390 -1362 5765 4332 -4770 3925 1122 -2512 2069 5528 647 -5785
$$ packed form
661D766P26n585o586R829K856p491L506j196o63l679Q506k190m122J274M5K35
677B31j528R263q699m752M208P067n163l377O184q504K932N153J178r220L811
692a216L858o773L986L096K41j0575N348N227j213j560n63l09n623J1213j024
707D113n259k133N150j588k228P769n353k224j036N441k106J024J310o221R27
722b414K532P272r296j210L505j83k140L591L948j2135M164M653j183l502M839
737B441j609q103P507L153o5r249L961K778k869K103K276j783q680J0007o27l005
753a764J227J314m229K85Q123n973J419k437O24J452K262O04n285J641J32M868
769D263o003M052J244p946L028P127j433r102Q695k803l634M581L459m881o432
$$ plain form
784 -5785 2417 3483 1475 -2695 3533 1087 -5572 2130 4963 -22 -5968 3115 -198 -1597 2070
799 2070 907 -2949 -4620 3399 586 163 -3142 -1331 -883 -1915 1731 -502 -506 -3971 517 -1085
815 -1085 2031 863 -5437 -863 1645 489 -1852 4718 -3898 -4264 5172 2456 -2052 -1407 3542 -1967
831 -1967 -223 2381 5364 -2096 -5651 6406 3315 -1663 1451 5198 -5705 200 8006 324 -1907
846 -1907 -457 2926 -891 1158 2142 2388 -3456 -2529 5990 -13 -504 457 -258 -2937 3744 2637 -2633
863 -2633 -179 -1766 1533 711 1868 -1719 -1247 -73 -470 1763 -1219 1017 -3898 -1476 1676 2092
879 2092 -1699 -2802 1396 -3388 546 2195 32 -5598 313 2906 -3311 841 1013 -1771 -4592
894 -4592 3245 1727 -1631 -926 -499 1444 -2595 3144 2341 -2946 -2376 5336 1185 -2913 5051 -1256
$$ packed form
784e785Q202J066k008m170O228k446o659P702K833m985n946R083l313j399L667
799B070j163l856j671Q019k813m23l305J811M48j032L646k233ml465M488j602
815a085L116j168o300M574K508j156k341O570q616l66R436k716m508O45M949n509
831a967J744K604K983p460l555J2057l091m978L114L747j0903N905P806p682k231
846a907J450L383l817K049R84K46n844R27Q519o003m91R61p15k679O681j107n270
863b633K454j587L299q22J157l587M72J174l97K233k982K236m915K422L152M16
879B092l791j103M198m784L934J649k163n630N911K593o217M152J72k784k821
894d592P837j518l358P05M27J943m039N739q03n287N70P712m151m098P964o307
$$ plain form
910 -1256 -2227 1721 4351 -291 -372 590 329 2492 -984 4150 -553 -2977 2452 4260 -1194 -145
926 -145 2872 -4335 1712 2607 -366 -739 -1016 -1254 -228 2094 -2343 25 -3122 -652 1116 -1400
942 -1400 -838 -1574 -2603 -2422 3798 -2836 -2839 233 -1873 -2367 335 3182 -4382 -2909 679 2310 -2203
959 -2203 -588 2538 -3785 -1181 3067 3182 -3678 -375 2772 -658 -345 3133 2975 -5409 1161 3678
975 3678 325 -242 1066 -60 -1685 3209 499 1333 -2458 -955 1831 -95 375 605 -766 -3358
991 -3358 2827 -842 -272 1428 -3807 -1675 2375 493 -3525 1339 -1957 -1721 763 89 866 -3283
1007 -3283 -1400 1627 1379 -3417 2782 1100 -5625 2268 3566 -1183 -2613 1957 -834 -202 1218
1022 1218 765 20 -3297 2281 2049 -679 -786 1808 -1753 -1730 3927 -89 -887 -917 886 -975 1085
$$ packed form
910a256r71L948K630m642q1R62k61K163l476N134m703k424N429J808n454J049
926a45L017p207O047Q95k973l73k77k38J026K322m437K368l147K470J768k516
942a400N62p36j029J81O220o634lL072k106m94K702K847p564J473L588J631m513
959b203J615L126o323K604M248J15o860L303L147l430L13L478j58q384O570K517
975C678l353n67J308j126j625M894k710Q34l791J503K786j926M70K30j371k592
991c358O185l669N70J700n235K132M050j882m018M864l296K36K484o74P77m149
1007c283J883L027k48m796O199j682o725P893J298m749j430M570k791O32J420
1022A218m53p45l317N578k32k728j07K594l561K3N657m016p98l0J803j861K060
$$ plain form
1039 1085 1318 -2239 -334 -225 1711 -1466 949 -981 -2086 288 1046 862 -2248 283 -873 -24
1055 -24 -257 2264 -535 -4100 2306 1109 -821 -173 1931 -2927 -271 2949 -165 265 -1608 681
1071 681 281 570 694 1656 -2520 -1341 4606 -1334 -30 1573 -672 -2070 3140 1207 -2146 1316
1087 1316 -1625 720 683 1081 254 -1477 -1759 1670 1978 -2817 2323 -496 -2390 1450 2432 -1878 -1681
1104 -1681 1500 -2166 646 751 407 -1798 -1632 886 400 89 -1203 425 -2285 368 1815 -581
1120 -581 -1627 -786 938 -1637 2053 1011 -1637 -1296 1559 744 -687 2052 -1443 -834 483 2117
1136 2117 219 -1071 -38 260 836 -1090 3028 -549 -2432 1649 1623 -925 134 1979 -3012 392
1152 392 1752 989 -193 -1019 451 658 840 -540 1992 -2681 -163 2402 -985 -27 613 -929 -1929
$$ packed form
1039A085K33l557J905J09J936l177K415j930j105K374P58j84l110K531j156Q49
1055b4k33K521k799l565O406j197j930O48K104m858K656L220l114M30j873K289
1071F81m00K89J24R62m176J179N947n940J304J603k245j398N210j933l353L462
1087A316k941K345l7L98q27j731k82L429L08m795N140k819j894L840R82m310J97
1104a681L181l666K812J05l44k205J66K518m86l11j292J628k710K653J447k396
1120e81j046Q41J724k575L690j042k648L41K855q15j431K739l495O09J317J634
1136B117j898j290J033K98N76j926M118l577j883M081k6k548J059J845m991L404
1152C92J360p63j182q26J470K07J82j380K532m673K518K565l387R58O40j542j000
$$ plain form
1169 -1929 3230 -297 -735 304 -1192 -33 219 1468 -1206 -1107 -822 1775 -447 -1592 1333 -1277
1185 -1277 -1405 612 2416 -2536 -657 1060 -1117 66 504 1137 -2471 -182 1106 764 -387 -634
1201 -634 537 -1019 1112 837 880 -1583 -61 1183 -202 1333 525 -286 -1190 2495 231 308 1468
1218 1468 -1210 -477 1096 1845 -786 193 -397 354 174 159 1784 -2106 -1550 1131 1976 -2169 700
1235 700 863 -2991 487 1276 342 -1714 -168 -357 4 -40 251 609 -2818 290 1273 -90 -988 447
1253 447 -1037 -1250 2065 -887 -5 -767 -86 -398 747 300 -951 -278 -656 1320 -452 569 243
1270 243 -924 -527 1129 1340 -1882 592 391 -337 -226 1590 574 -1975 833 707 553 -845 1186
1287 1186 -653 -1191 1008 1375 477 -1963 1080 641 -507 155 1082 -817 -1128 1948 -378 102 -77
$$ packed form
1169a929N159l527m38J039j496J159K52J249k674R9K85K597k222j145K925k610
1185a277j28K017J804m952J879J717k177J183M38O33l608K289J288l42j151k47
1201f34J171j556K131k75M3k463J522J244j385J535q08q11r04L685k264P7J160
1218A468k678P33J573P49k631R79n90P51j80j5J625l890N56K681Q45m145K869
1235G00J63l854L478P89r34k056J546j89L61m4K91L58l427L108R83j363q98J435
1253D47j484k13L315k952Q82p62O81l12J145m47j251O73l78J976j772J021l26
1270B43j167L97J656K11l222K474k01p28J11J816j016k549K808j26j54j398K031
1287A186j839n38K199L67q98k440L043m39j148O62R27j899l11L076k326M80j79
$$ plain form
1304 -77 -115 -887 470 816 -635 147 -1194 473 -198 261 129 -1315 -765 609 708 -1328 995 -718
1322 -718 -1426 521 1047 -444 -1108 855 -355 527 343 1191 -729 -1376 1129 964 -37 -651 1299
1339 1299 -1289 315 1514 207 -496 -480 779 -430 844 1 80 -1132 220 1178 -709 -121 -451
1356 -451 -209 -812 1085 397 -1314 -22 -32 367 -608 1514 -806 -1289 212 724 140 -425 1120 -1235
1374 -1235 -86 844 1016 -649 -546 820 -130 532 348 923 -1233 108 1263 176 455 -117 418
1391 418 -745 1253 491 221 -277 -377 470 -409 999 -271 -471 -828 713 400 -756 669 -737
1408 -737 -726 -461 1091 -980 -755 0 -553 -130 -390 583 -1032 -588 24 595 -425 -309 707 -1001
1426 -1001 325 688 636 -831 -144 882 -100 912 93 279 -624 1099 573 192 467 266 192 -470 1614
$$ packed form
1304g7l8p72J357L46j451P82j341J667o71M59j32j444N50J374R9k036K323j713
1322g18p08J947N26j491o64J963j210Q82j84Q48j920o47K505j65j001o14J950
1339A299k588J604J199j307p03J6J259j209J274q43P9j212J352R58j887N88l30
1356d51K42o03J897o88j711J292j0L99r75K122k320m83J501N12n84n65J545k355
1374a235J149R30J72j665J03J366r50O62j84N75k156J341J155j087K79n72N35
1391D18j163J998p62k70m98j00Q47q79J408j270k00l57J541l13j156J425j406
1408g37J1K65J552k071K25P55n53M23k60R73j615M44O12N71j020J16J016j708
1426a001J326L63n2j467O87J026r82J012q19J86r03J723n26l81K75k01p4o62K084
$$ plain form
1445 1614 -101 -390 -19 363 141 -231 1021 -733 -593 340 1028 -591 -336 396 -685 -290 244 914
1463 914 -1098 -478 209 145 1 75 216 -1483 159 402 299 -621 -557 20 -692 790 -153 -207 -820 164
1483 164 -101 15 408 -730 -462 -505 949 -39 28 72 -567 -478 390 1110 -1096 -150 181 315 -542 770
1503 770 852 -1187 -164 608 693 -911 356 166 -599 316 960 543 -1537 255 432 -6 103 116 -482
1522 -482 -704 698 -41 626 -197 42 -291 -129 616 -404 -161 -577 23 -371 480 134 -578 -425 -209
1541 -209 228 -537 516 -74 -629 149 801 130 -1077 -26 -118 -138 -274 370 -206 -1252 73 224 -5
1560 -5 -824 463 -456 -797 556 474 -445 -899 614 -159 306 74 -45 -207 -221 636 -195 264 -414 286
1580 286 -303 695 455 -381 -61 -51 469 -100 773 -146 -738 142 582 310 -586 661 -362 -222 -43 796
$$ packed form
1445A614j715k89L71L82k22l72J252j754J40R33O88j619K55P32j081L95N34O70
1463I14k012O20O87o4j44P4J41j699J642K43j03r20O4N77p12J482r43n4o13R84
1483A64k65J16L93j138K68m3J454r88O7M4o39Q9Q68P20k206R46L31J34q57J312
1503G70Q2k039J023P72Q5j604J267j90p65R15O44m17k080J792J77m38J09J3n98
1522d82k22J402p39O67q23K39l33J62P45j020K43m16O00l94Q51l46p12J53K16
1541b09M37p65J053n90n55P78O52o71j207J051r2k0j36O44n76j046J325J51k29
1560eq19J287r19l41J353q2r19m54J513p73M65k32j19j62j4Q57q31M59o78P00
1580B86n89R98k40q36L20J0N20n69Q73r19n92Q80M40k72q96J247j023J40J79Q39
$$ plain form
1600 796 -62 -690 703 -215 292 296 628 -785 -257 618 218 -45 -480 136 -831 279 219 34 -342 -113
1620 -113 262 -522 392 -151 -24 -543 277 484 -340 -7 -474 -60 -375 823 -78 -577 -12 48 259 -30
1640 -30 739 -323 -279 186 637 65 -333 259 -403 441 249 767 -391 -176 587 -195 559 32 90 -497
1660 -497 152 428 132 66 -43 -60 -409 961 -90 -338 -193 460 -25 146 800 -214 -366 154 494 -250
1680 -250 -117 142 -347 -140 52 726 -549 -301 82 113 45 -319 428 -725 -132 198 734 -210 -197 187
1700 187 -201 338 -111 151 -422 -309 -6 114 518 -172 -51 -261 303 82 58 10 -77 -219 103 966 -347
1721 -347 -156 345 169 -231 349 475 -825 -222 437 587 -671 -11 370 -505 21 286 237 -893 162
1740 162 156 98 -105 222 -286 -608 6 362 170 -533 31 64 -133 426 22 63 -385 -10 185 23 69 -412
$$ packed form
1600G96q58o28J393r18N07ML32j413N28Q75m00k63m35O16r67J110o0j85l76K29
1620a13L75p84R14n43J27n19Q20K07q24L33m67M14l15J198r01m99N65O0K11k89
1640c0P69j062M4M65M51n72l98N92o62Q44j92N18j158K15P63p82P54n27N8n87
1660d97O49K76k96o6j09j7l49J370j051k48J45O53m85J71O54j014j52N20L40p44
1680b50J33K59m89K07J92O74j275K48L83L1o8l64P47j153N93L30N36r44J3L84
1700A87l88N39m49K62n73J13L03J20M04o90J21k10N64k21k4m8q7j42L22Q63j313
1721c47J91N01j76m00N80J26j300O03O59J50j258O60L81q75N26K65m9j130J055
1740A62on8k03L27n08l22O14L56j92p03N64L3j97N59m04M1m48L75J95j62M6m81
$$ plain form
1762 -412 -138 -164 406 -162 241 -219 -149 -26 346 542 -670 87 -21 17 -232 243 84 -423 54 122 133
1783 133 -667 220 -180 -317 251 295 -170 -616 463 -196 87 114 88 -117 -408 608 -215 242 -316 417
1803 417 -130 95 380 -208 -139 -239 388 -147 203 98 -31 7 415 499 -102 210 0 -18 -54 579 456 -642
1825 -642 66 134 170 -72 448 -349 -216 409 75 287 -369 349 -563 203 44 12 -126 -335 136 -123 172
1846 172 -306 -313 -618 74 649 -280 76 -94 62 -395 293 7 -307 -103 271 189 -360 99 -137 -304 -53
1867 -53 439 5 -374 165 -184 105 128 508 -198 -198 200 268 270 169 196 -144 277 235 -54 -70 -127 321 -194 512
1891 512 298 -234 -170 85 62 33 428 -78 -226 -196 636 105 -96 245 -88 -217 -26 589 -215 -199 9 228
1913 228 33 -221 372 -445 -137 65 97 -81 -102 8 -83 92 -129 -52 -566 -55 -218 -301 39 -156 9 -123
$$ packed form
1762d12K74k6N70n68M03m60P0J23L72J96j212P57j08L8k49M75j59n07M77O8J1
1783A33q00Q87m00j37N68M4m65m46J079o59K83K7k6k05k91J016q23M57n58P33
1803D17n47K25K85n88O9j00O27n35L50j05j29L8M08Q4o01L12k10j8l6O33j23j098
1825f42P08O8L6k42N20p97J33O25l34K12o56P18r12P66j59l2j38k09M71k59K95
1846A72m78pl05O92N75r29L56j70J56m57O88k86l14K04L74q2n49M59k36j67K51
1867e3M92m34l79N39l49K89K3L80p06%L98O8Kj01K7l40M21m2k89j6n7M48n15P06
1891E12k14n32O4K55k3k9L95n06j48L0Q32n31k01L41l33j29J91O15q04J6K08K19
1913B28j95k54N93q17L08K02L2j78k1J10r1J75k21P7n14N11j63q3L40j95J65j32
$$ plain form
1935 -123 354 47 -13 257 -158 -243 -125 458 -203 -121 -64 261 -208 60 407 -227 209 147 430 -438 159 605
1957 605 30 -166 266 357 -561 -35 47 449 72 67 88 -337 245 -110 120 -213 -93 -102 -130 -97 -293 -11 -522
1980 -522 253 -291 -39 108 -336 -195 -316 338 -144 43 -419 -201 -35 65 459 -401 -84 -188 197 -119
2000 -119 -76 135 -246 19 437 281 -470 291 -25 97 252 123 448 -254 159 97 -65 51 110 -78 -366
2021 -366 216 259 55 -88 292 -90 89 53 -284 -233 -181 123 -150 217 1 -142 -382 190 462 -306 -251 -583
2043 -583 -185 -132 78 150 -648 -58 52 23 -153 169 -216 -295 201 -59 262 -260 255 -32 114 5 215
2064 215 7 -355 375 43 479 -6 162 -96 103 105 -185 144 -96 -9 -235 373 140 -226 40 -106 184
2085 184 -208 316 -149 -214 88 123 -4 45 203 -260 218 -35 269 -31 -467 361 -355 -119 -208 52 -335
$$ packed form
1935a23M77l07o0K70m15q5J18N83o61Q2N7L25m69K68L47o34M36o2K83q68N97M46
1957F05n75j96M32R1r18N26Q2M02l77nK1m25N82l55K30l33J20rk8L3j96K82n11
1980e22P75n44K52J47m44J41j21O54m82J87m62K18J66J00L94q60L17j04L85l16
2000a19M3K11l81K65M18j56p51P61l16J22J55j29L25p02M13o2j62J16N9j88k88
2021c66N82M3k04j43L80l82J79l6l37N1N2L04k73L67k16j43k40N72K72p68N5l32
2043e83L98N3K10P2p98N90J10k9j76L22l85p9M96k60L21n22N15k87J46j09K10
2064B15k08l62P30l32M36m85J68k58J99Kk90L29k40Q7k26O08k33l66K66j46K90
2085A84l92N24m65o5L02L5j27M9J58m63M78k53L04l00m36Q28p16K36q9K60l87
$$ plain form
2106 -335 -209 247 103 -158 -62 246 -54 71 35 131 -149 -88 443 90 265 -30 233 115 463 140 -52
2127 -52 -7 116 322 -41 705 168 -72 -134 59 -29 -252 107 0 -206 -131 195 88 -96 246 -251 100 62
2149 62 291 -72 29 38 34 110 -50 194 -550 -20 6 -3 -136 -285 36 -196 31 -198 -58 -257 243 56 -234
2172 -234 322 -1 -57 -29 459 -15 2 122 44 162 230 334 -398 9 -116 249 -124 92 500 -215 64 329
2194 329 279 -206 36 143 -47 179 80 161 -309 -217 -67 78 17 40 -19 1 127 112 77 -190 54 -224 -80
2217 -80 350 -307 -74 39 263 -182 -230 147 -222 -195 -3 141 -506 80 131 -104 -138 352 121 -256 102 -56
2239 -56 83 28 35 0 -271 123 -104 165 -309 192 -209 70 153 -257 213 -338 195 22 393 -139 82 -95
2261 -95 23 199 -295 17 -126 -22 -176 337 45 -190 -1 -12 23 -100 23 -62 -289 30 61 155 -150 64
$$ packed form
2106c35J26M56j44k61R6L08l00J25l6R6k80O1N31l53J75k95K63j18L48l23j92
2127e2M5J23K06l63P46n37k40o2J93q8k23L59j07k06P5L26j07j84L42m97L51l8
2149F2K29l63J01RmP6j60K44p44N30K6rj33j49L21k32K27k29J40j99N00j87k90
2172b34N56l23n6K8M88m74J7J20p8J18O8J04p32M07j25L65l73K16M08p15K79K65
2194C29n0m85K42J07j90K26r9Q1m70R2J50J45o1K3n9K0J26j5l5k67K44k78J44
2217h0M30o57K33J13K24m45m8L77l69K7J92J44o47N86N1k35l4M90k31l77L58j58
2239e6J39n5Pl5k71L94k27K69m74N01m01K79Q3m10M70n51N33j73L71n32K21j77
2261i5J18J76m94L12j43J04j54N13k92k35J89j1L5j23J23q5k27L19L1R4l05K14
$$ plain form
2283 64 -90 -100 114 -38 -85 -192 172 -4 134 -167 238 114 -92 76 145 -49 -271 26 -170 300 -49
2304 -49 -93 -131 -26 113 -184 106 -122 95 -14 -40 80 -150 268 28 -44 -102 -164 -93 -212 51 67 256 -83
2327 -83 190 -209 47 56 -45 80 -27 -35 12 72 26 -42 -191 -150 134 -122 -118 -57 -4 -76 176 -40 -67 -65 -222 283
2353 283 -275 252 65 -262 30 151 32 -143 18 -89 -34 -76 237 -2 -250 172 -144 12 -204 145 96
2374 96 -223 147 114 68 -76 219 93 67 322 65 -20 -86 238 -193 328 265 47 -162 -46 70 195 8
2396 8 0 -105 -270 48 28 -250 138 -49 175 -170 47 -153 -191 -45 102 -51 -86 136 -128 84 72 3 -257
2419 -257 -162 8 -13 -256 -89 319 -100 -38 -221 110 268 -290 19 -93 -23 -9 253 -199 78 -79 -54 81
2441 81 100 -2 -169 145 -118 -150 -31 -204 101 -207 269 -177 -146 139 -60 231 -200 -59 -187 96 -30
$$ packed form
2283F4j54j0K14j52m7j07L64j76J38l01M05j24k06J68O9j94k22K97j96M70l49
2304d9m4l8J05J39k97K90k28K17j09k6J20k30M18k40p2n8o2P1j19K63J6J89l39
2327h3K73l99K56Rj01J25j07qM7O0m6o8j49M1K84k56MO1N3p2K52k16k7Kj57N05
2353B83n58N27j87l27K92J21j19j75J61j07N5m2L13k39k48M22l16J56k16L49m9
2374I6l19L70l3m6j44K95j26k6K55k57q5o6L24m31N21o3k18k09J16J16J25j87
2396Hqj05j65L18k0k78L88j87K24l45K17k00l8J46J47j53l5K22k64K12j2o9k60
2419b57R5J70k1k43J67M08m19O2j83L31J58n58L09j12P0J4K62m52K77j57K5J35
2441H1J9j02j67L14k63l2J19j73L05l08M76m46L1K85j99K91m31J41j28K83j26
$$ plain form
2462 -30 184 -154 -228 137 -94 77 160 132 -110 0 127 257 -69 -192 44 -35 231 16 206 -32 27 173
2484 173 73 357 65 -284 13 70 107 -59 66 -221 62 -6 -13 -59 65 108 -109 140 161 4 -80 10 52 220
2508 220 -49 -38 58 -282 131 -17 270 -76 131 71 20 138 122 61 -54 117 -86 74 -137 -15 74 164 76
2531 76 -88 1 -154 -21 -175 37 26 -246 -185 103 231 -284 -109 14 -92 95 4 243 -17 -43 20 -323
2553 -323 -69 72 82 -127 178 -50 177 -116 47 -108 -165 95 -172 -38 -250 231 -114 157 427 21 110
2574 110 -226 -19 -29 -121 -5 218 -5 -6 346 -120 119 162 -71 -44 -20 81 59 38 -10 283 71 108 -205 87
2598 87 -167 23 -145 -79 45 -90 -34 -290 390 -151 -76 -85 -12 220 -107 260 -282 48 22 -237 -85 184 -81
2621 -81 -22 265 -3 -225 101 -61 196 74 118 221 87 11 136 192 -11 98 142 181 197 -27 356 37 -156
$$ packed form
2462c0K14l38p4L65k31J71Q3k8k42J10J27J30l26j23K36p9K66k15J90k38N9J46
2484A73j00K84k92l49K97N7L7j66J25k87K83o8pm6J24M3k17K49K1j57q4R0M2J68
2508B20k69J1R6l40M13j48K87l46K07o0n1J18j6o1j15J71k03J60k11J22Q9R0q8
2531G6j64Q9j55J33j54K12j1k72O1K88J28n15J75J23j06J87r1K39k60k6O3l43
2553c23K54J41J0k09L05k28K27k93J63j55n7K60k67J34k12M81l45K71K70m06Q9
2574A10l36K07j0r2J16K23k23jL52m66K39M3k33K7K4J01k2k1m8K93k12L7l13K92
2598H7k54J90j68O6J24j35N6k56O80n41P5rP3K32l27L67n42L30k6k59J52K69k65
2621h1N9K87k68k22L26j62K57j22M4J03j34p6J25N6k03J09M4L9J6k24L83l19j93
$$ plain form
2644 -156 -61 -224 -66 215 -92 -65 5 64 -193 146 24 -129 358 -227 -45 -43 62 172 168 97 -47 97 -395
2667 -395 54 -41 -74 163 -264 125 -209 111 -49 -157 40 -24 -38 73 -65 11 130 -33 141 -77 197 -68
2689 -68 43 180 -99 119 83 33 234 306 243 161 99 -138 286 -255 -70 -184 181 -236 -222 50 -13 172 66
2712 66 -164 -74 203 197 183 95 -103 177 -144 175 -144 -91 -95 119 -108 -1 44 -6 -37 -237 -171 14 -182 -366
2736 -366 155 2 45 199 -86 20 194 -111 50 -170 146 -21 188 -9 -58 -197 -3 103 13 96 -25
2757 -25 76 3 -77 -5 2 20 65 -186 -200 275 129 -118 180 161 251 -36 4 -112 -34 64 -15 -77 -180 76 -40
2782 -40 107 -165 122 -123 48 276 -8 269 -297 46 65 -96 -32 -75 96 -258 235 3 188 67 -62
2803 -62 -205 95 -22 -76 -55 35 -46 80 177 205 61 -5 -78 59 -65 49 70 -60 -153 150 163 -75 -78 -212 -37
$$ packed form
2644a56R5j63J58K81l07K7P0N9k57L39j22j53M87n85J82KJ05J10mp1j44J44m92
2667c95M49r5l3K37m27L89l34L20j60j08J97o4j4J11j38P6J19j63J74k18K74k65
2689f8J11J37k79K18l6n0K01P2o3q2o2k37M24n41J85j14L65m17J4K72o3J85j06
2712F6k30R0K77oj4q8j98K80l21L19l19N3mK14k27J07M5n0l1k00O6J85j96j84
2736c66N21j53M3J54k85J06J74l05J61k20L16j67K09j97m9j39J94J06r0Q3j21
2757b5J01p3q0P2PJ8M5k51j4M75j46k47K98j9R0k87M0j16P8R8p9o2j03K56j16
2782d0J47k72K87k45J71K28k84K77n66L43J9j61O4m3J71l54M93k32J85j21j29
2803f2j43L00j17n4K1R0q1J26R7K8j44o6p3J37j24J14K1j30r3L03J3k38lj34J75
$$ plain form
2828 -37 -25 52 -163 66 -27 -23 157 36 67 19 319 41 204 -127 38 98 -79 -41 26 30 -183 -5 -68 67 -75
2853 -75 118 85 -186 44 -24 -47 -237 38 -35 -65 -19 -113 -292 -27 -123 204 -382 224 48 -90 12 198 77
2876 77 -103 44 -15 93 0 128 -60 269 279 -71 87 -114 126 58 -51 4 92 -272 -74 -64 -109 98 49
2899 49 193 -32 -49 -97 66 -73 14 -246 -130 -111 142 -138 -73 88 -41 67 -120 111 48 -19 -11 106 -11
2922 -11 163 2 -59 -321 154 99 128 -61 49 64 124 -84 65 -29 46 -158 164 140 -195 -7 133 148 67 -54
2946 -54 95 -58 -13 -103 -72 62 -26 -16 -66 -34 -141 -122 -37 -75 96 -10 104 116 75 33 -204 74 -80 285 -327
2971 -327 212 28 -376 342 10 7 23 -23 22 52 158 -9 84 -61 291 -137 299 56 35 23 99 -270 -11
2994 -11 62 -217 -92 -70 -77 -110 130 9 101 -78 0 -18 -31 -194 82 31 294 66 -134 -132 64 210 9 62 -67
$$ packed form
2828c7J2P7k15K29r3MJ80j21L1m8L00k78J63l31J65O0j77L8O7Mk13J78o3J35j42
2853g5J93l3k71K30o8k3j90K75p3l0M6r4j79K65r6L27n86O06j76j38J02J86j21
2876G7j80J47n9J08r3J28j88L29J0l50J58k01K40o8j09N5Q8l64J98J0m5K07m9
2899D9J44k25j7m8J63j39Q7k60J16J9K53k80O5J61j29J08j87K31o3o7QJ17j17
2922a1J74j61o1k62M75n5K9j89J10J5O0k08J49r4P5k04L22k4l35J88J40J5q1j21
2946e4J49j53M5r0L1J34q8J0n0L2j07J9Q5l8J71j06J14J2m1m2k37K78j54L65o12
2971c27N39j84m04P18l32lJ6m6M5L0J06j67R3j45L52m28M36k43k1j2P6l69K59
2994a1P3k79J25K2pl3K40j21R2j79P8j8j3j63K76n1K63k28k00KJ96J46k01N3j29
$$ plain form
3019 -67 -110 -204 60 183 108 -34 -116 -189 126 135 -137 59 23 193 -5 -15 -212 -12 -64 -52 71 -273 164 -52
3043 -52 19 64 -219 -90 -185 9 -38 223 132 -36 147 -208 -139 7 -43 87 -94 105 -209 163 71 206 192
3066 192 -3 -189 80 91 -23 141 37 164 135 24 -67 -77 -93 187 -175 -261 -38 -173 -86 14 362 21
3088 21 -9 314 145 150 220 147 -123 -257 -42 140 -108 -132 92 -109 136 -181 -101 75 91 104 33 23 -364 -226
3112 -226 -96 117 -129 -109 -184 -10 -24 92 177 -128 104 61 141 -194 16 170 179 -26 75 430 29 -86 -98
3135 -98 -78 117 -274 185 0 38 119 -67 -83 -41 -131 80 -72 -52 46 -104 207 -255 96 187 1 -183 -234 164
3159 164 57 -101 129 -127 207 304 128 227 -7 17 41 -278 12 14 22 -62 -230 28 -112 89 182 -325 -207
3182 -207 -66 226 80 139 18 -62 -81 -153 -92 -283 -129 126 -102 -118 44 -54 73 91 -232 -38 -136 151 -181
$$ packed form
3019f7m3r4K64J23p5j42q2p3L15Rk72J96l6J70j98j0j97K00n2J2J23l44M37k16
3043e2P1M5k83J29r5J94m7K61r1j68J83l55O9J46n0J30j81J99l14L72r2J35j4
3066A92j95j86K69J1j14J64j04J27k9j11r1j0j6K80l62q6K23j35Q7J00L48l41
3088B1l0L23j69NP0p3k70j34K15J82k48k4K24k01K45l17Q0J76J6J3p1j0l87J38
3112b26J30K13k46K0p5J74j4J16Q5l05K32m3Q0l35K10J54Rk05J01L55m01j15j2
3135i8K0J95l91M59j85L8Q1j86j6M2r0K11j52K0R8j50L11m62L51R1j86j84n1L98
3159A64j07j58K30k56L34R7j76R9k34K4K4l19K90KQq4j68K58j40K01R3n07J18
3182b07J41K92j46N9j21q0j9p2O1j91J54K55k28j6J62r8J27J8l23J94r8K87l32
$$ plain form
3205 -181 56 124 -180 153 218 -57 -86 15 -98 -28 -174 40 195 -12 263 -56 11 -181 212 -17 9 -64
3227 -64 -163 -211 59 -49 15 1 144 55 147 -137 230 115 -6 -69 139 -104 150 -24 -183 65 -84 90 -47
3250 -47 75 -135 61 29 -122 86 231 -9 -110 -29 176 333 10 242 -4 23 -22 -224 96 -95 290 -39
3272 -39 -209 -10 -135 178 -3 -294 219 -198 374 252 -273 -104 82 -95 -56 -141 -85 184 160 74 56 287
3294 287 57 -107 116 68 238 89 -280 11 227 251 -77 425 -113 -77 -61 82 -158 38 28 -21 93 48
3316 48 257 25 153 -121 -24 -233 23 19 -2 13 -3 22 -310 210 -7 -61 113 137 -1 95 -210 26 -52 -77
3340 -77 44 214 -71 188 -7 -123 -212 -109 -188 -14 -140 44 40 3 -88 -183 91 115 48 31 169 194 -72 388
3364 388 -145 4 -98 -17 -148 -78 118 -53 -117 -18 53 -64 67 11 -180 223 -149 206 -156 -93 75 17 37
$$ packed form
3205a81K37O8l04L33O5k75k9J01j13P0j46K14J55k07K75l19O7j92L93k29K6p3
3227f4r9m8K70j08O4j4J43q9R2k84L67j15j21o3K08k43K54j74j59K48j49J74j37
3250d7J22k10J96l2j51K08J45k40j01Q1K05J57l23K32k46K7m5k02L20j91L85l29
3272c9j70J99j25L13j81k91N13m17N72j22n25J69J86j77L9q5N6K69k4q6j8K31
3294B87k30j64K23m8J70j49l69K91K16K4l28N02n38L6J6J43k40J96j0m9J14m5
3316D8K09k32J28k74R7k09K56mk1J5j6K5l32N20k17n4J74K4j38R6l05K36p8k5
3340g7J21J70k85K59j95j16q9J03p9J74j26J84ml7r1r5K74K4o7j7J38K5k66M60
3364C88n33J49j02Q1j31P0J96j71o4R9P1j17J31n6j91M03l72L55l62O3J68n8K0
$$ plain form
3387 37 -47 115 46 -17 -251 -31 31 15 38 -211 -149 -5 107 9 -83 -100 -113 160 116 94 -266 -77 159 16 -81
3412 -81 -43 3 -267 147 15 75 -1 43 -51 -245 -36 -23 160 -98 40 -4 76 161 135 12 -108 273 155 -163
3436 -163 87 82 55 13 -84 -79 105 85 -7 196 42 -18 47 73 -141 161 -118 -47 -317 262 -89 59 263 -119
3460 -119 50 -68 -105 8 -182 -291 100 161 -39 -40 193 -152 -108 121 -203 0 163 122 194 -107 333 -145
3482 -145 -320 -50 -86 -123 144 -52 -158 115 75 15 -206 -159 -48 131 -224 77 -31 -29 -67 -31 -202 -231 35
3505 35 -353 7 2 132 -149 -148 7 -162 58 37 -213 197 -167 100 51 -25 -296 -240 24 -98 74 -16 -74 96
3529 96 131 -33 41 259 64 16 154 92 -61 64 -65 63 162 -272 -50 -87 83 76 -37 94 75 5 143 73
3553 73 101 152 151 -120 -95 -279 90 -196 34 -80 67 114 -174 184 130 144 -188 25 -118 42 -195 9 308
$$ packed form
3387C7q4J62o9o3k34K20O2j6K3k49O2J44J12r8r2j7j3K73m4k2l60J89K36j43r7
3412h1L8M6k70M14j32O0p6M4r4j94K09J3J83k58J38m4Q0Q5k6j23j20L81j18l18
3436a63K50nk7m2r7NJ84k0r2K03j54o0O5K6k14L02k79P1k70N79l51J48K04l82
3460a19J69j18l7J13j90j09L91O1k00jK33l45M4K29l24K03J63m1P2l01M40m78
3482a45j75K70l6l7K67j96j06K73m0o0k21M7J11J79l55L01j08Kl8L6j71k9K66
3505C5l88L60nJ30k81JJ55j69K20k1k50M10l64K67m9p6k71N6K64j22J72r0n8J70
3529I6L5j64P4K18j95m8J38o2j53J25j29J28R9m34K22l7J70pj13J31j9p0J38p0
3553G3K8N1jk71K5j84L69k86K30j14J47M7k88L58n4J4l32K13j43J60k37K04K99
$$ plain form
3576 308 169 52 35 138 -110 -210 -112 -55 -46 -128 73 55 10 162 260 201 77 7 -18 -51 -113 -14 -142 21 150
3601 150 63 -177 225 127 60 55 -29 62 354 18 97 -144 -37 110 84 -97 109 170 155 226 55 112 -172 -274
3625 -274 -233 167 13 -19 -122 -102 -52 -324 -122 -143 -102 76 -313 -22 -317 153 102 -31 13 114 -61 111 -271
3648 -271 34 106 187 -62 88 91 130 125 33 129 -218 75 266 -223 22 92 77 -185 -260 77 51 172 73 183 -88
3673 -88 -72 231 280 -56 183 -42 26 194 -37 -256 -33 -37 -69 47 122 -98 -127 258 23 114 13 -182 111
3696 111 143 121 -131 135 -59 63 -40 145 -16 -26 30 -35 -37 83 -71 -136 15 60 -35 46 -198 -91 -37 475
3720 475 105 159 81 -26 149 -3 44 -98 -39 125 196 -9 -27 -158 -92 80 260 -167 119 0 53 55 -42 -72
3744 -72 -112 -49 -197 -39 -44 -81 155 31 116 -42 -179 13 -30 276 -47 -26 -48 77 -63 -15 -68 149 -104 -172
$$ packed form
3576C08j39j17j7J03k48j00R8N7Rq2K01j8m5J52R8n9j24p0k5l3o2R9j28J63J29
3601A50q7k40M02r8o7nq4R1K92l36P9k41J07J47k6j81K06O1j5P1j71N7k84j02
3625b74M1M00j54l2j03K0N0k72K02k1M1J78l89K91k95M70n1j33M4J01j75J72l82
3648b71L05P2Q1k49J50LL9nr2R6l47K93J91m89K45P0j5k62p5L37k6J21r9J10k71
3673h8J6L03M9l36K39k25O8J68k31k19K23ml2J16P5k20k9L85k35R1j01j95K93
3696A11L2k2k52K66j94J22j03J85j61j0N6o5kJ20j54o5J51M5r5Q1k44J07N4N12
3720D75l70N4p8j07J75j52M7j42N9J64P1k05j8j31O6J72J80m27K86j19N3Kr7l0
3744g2m0O3j48J58nl7K36j24Q5j58j37J92m3L06l23K1k2J25j40M8n3K17k53o8
$$ plain form
3768 -172 -54 -20 -61 -105 -66 27 -60 -17 -106 -150 67 -139 -70 45 -76 -149 -144 -160 -36 -110 178 -43 -144 120 -123
3793 -123 -19 55 117 14 -271 -182 234 -21 -30 -35 -196 -68 209 -80 45 73 59 85 -97 -215 83 149 168 184
3817 184 -27 -12 56 -152 58 -33 47 115 108 -40 132 101 -48 -73 156 -139 -215 118 67 77 -66 -41 -63 67 -311
3842 -311 -91 -8 -257 -28 -299 82 13 -47 -11 214 -35 -197 -7 -84 -50 -24 215 48 -120 135 -30 54 108
3865 108 2 -36 52 78 -76 172 -58 43 32 47 212 133 -109 -178 -113 156 140 -174 51 -91 109 69 -31
3888 -31 -80 36 -45 42 38 -46 125 41 55 205 -55 -169 85 157 -94 75 -63 -14 81 -224 136 78 64 -36 7
3913 7 -105 -112 133 -62 252 -119 -227 89 -73 -196 165 99 -109 195 -28 14 -154 35 197 -121 228 -128
3935 -128 115 -166 24 -62 -209 -138 -170 -76 127 187 -185 125 -48 -270 90 78 -395 117 -221 25 -123 32
$$ packed form
3768a72J18L4m1m4L9R3q7M3q9m4K17k06O9J15j21p3Nj6J24p4K88k21j01K64k43
3793a23J04P4O2j03k85Q9M16k55rnj61J28K77k89J25K8j4K6j82j18K98O6J9J6
3817A84k11J5O8k08K10r1Q0O8pj48J72l1j49k5K29k95p6L33n1J0j43K5k2J30l78
3842c11K20Q3k49K29k71L81o9o0L6K25k49j62J90p7L4K6K39j67j68K55j65Q4N4
3865A08j06l8Q8K6j54K48k30J01j1J5J65p9k42o9O5K69j6l14K25j42K00m0j00
3888c1m9J16q1Q7mq4J71q4J4J50k60j14K54P2k51J69j38M9R5l05L60n8j4j00M3
3913Gj12pK45j95L14l71j08L16j62j23L61o6k08L04k23M2j68J89J62l18L49l56
3935a28K43k81J90q6j47P1l2R4K03O0l72L10j73k22L60j2m73N12l38K46j48J55
$$ plain form
3957 32 51 152 25 214 10 241 -118 -96 87 -6 -123 -240 -10 -4 125 117 83 321 -5 208 -338 -87 187
3980 187 95 -76 87 22 10 -101 72 -107 -81 94 -15 -71 89 230 72 -174 118 -26 -190 -32 51 290
4002 290 131 85 34 32 26 210 209 -88 96 41 216 27 -85 -234 266 197 193 -61 -52 -53 -66 73 -29 10 -116 9
4028 9 146 -192 -120 -15 69 -24 -183 141 -258 44 -156 -26 89 -29 -145 171 -143 -227 145 59 8 -219 123
4051 123 -79 174 58 91 89 -197 111 -47 -35 -99 46 -65 24 -39 176 -168 50 -197 91 42 -59 -89 -37
4074 -37 63 22 246 -275 -137 250 112 -39 317 19 106 176 -18 159 -141 -152 -8 111 -115 6 49 1
4096 1 -141 78 -107 -210 50 -200 -49 48 39 18 272 78 91 286 10 133 -25 101 -173 19 -19 49 -40
4119 -40 -96 188 -39 211 -31 246 34 -146 39 -146 73 -267 26 43 -208 182 -14 109 240 -60 -118
$$ packed form
3957C2J9J01j27J89k04K31l59K2J83r3j17j17K30OJ29ql4K38l26K13n46K51K74
3980A87r2j71J63o5j2j11J73j79K6J75j09n6J60J41j58k46K92j44j64J58Q3K39
4002B90j59m6n1koJ84jk97J84n5J75j89j12j49N00o9mk54Rjj3J39j02L9j26J25
4028IJ37l38P2J05Q4r3j59L24l99L02k00J30J15j18j16L16l14q4L72q6n1k27L42
4051A23k02K53j16L3kk86L08j58J2o4J45j11Q9o3K15l44K18k47K88m9j01l0N2
4074c7J00m1K24n21J38L87j38j51L56k98Q7P0j94J77l00j1J44J19k26J21M3m8
4096Aj42K19j85j03K60k50J51R7rk1K54j94J3J95k76J23j58J26k74J92l8O8q9
4119d0n6K84k27K50k42K77k12j80J85j85K19l40K93J7k51L90j96J23J31l00n8
$$ plain form
4140 -118 67 181 -134 -116 -133 20 -273 220 280 256 -270 36 -285 267 106 -109 61 -292 274 106 176 -1
4162 -1 -100 -24 -180 42 115 -22 -69 188 -125 66 1 -28 15 -108 -181 -38 192 29 60 -196 -97 214 166 103 101
4187 101 23 -114 21 101 -3 124 169 205 192 -53 67 -112 133 89 70 -112 198 164 -175 -94 -142 245 -82
4210 -82 5 -87 -178 -125 -227 143 151 89 2 -54 102 116 -51 -2 130 -184 108 -119 230 -270 -50 -80 -37 23 42
4235 42 180 -152 -69 -130 -20 -61 283 361 0 142 134 -196 34 105 -14 8 -163 78 204 190 -30 -6 409 -67
4259 -67 -44 36 -231 -287 -60 159 -2 57 178 45 62 -134 21 -112 -93 14 42 -179 28 95 -84 -130 46
4282 46 -80 -166 -189 -240 128 221 19 60 33 -23 180 223 -100 126 -10 26 198 -18 359 -61 137 -27 106
4305 106 72 -335 184 -213 127 -42 -22 -192 -65 150 77 16 -67 38 59 29 71 -51 18 -263 84 50 166
$$ packed form
4140a18J85J14l15J8j7J53k93M93O0k4n26L06l21N52j61k15J70l53N66j68P0j77
4162ar9P6j56K22P3j37m7K57l13J91o5k9M3j23p3J43K30j63L1k56R9L11m8o3k
4187A01p8j37J35Q0j04J27M5L6j3k45J20j79K45m4j9j82L10l4l39Q1m8L87l27
4210h2Q7r2r1N3j02L70Qo2q7n6J56J4j67M9J32l14K92k27L49n00K20l0M3O0J9
4235D2J38l32Q3o1J10m1L44P8l61J42ql30K30P1j19K2j71K41J26j4k20K4M15m76
4259f7K3Q0k67n6K27K19j61N9J21j33J7j96J55j33J9J07K8k21K07O7j79m6J76
4282D6j26q6k3n1L68R3k02M1k7n6K03M3l23K26j36L6J72k16L77m20J98j64J33
4305A06l4m07N19l97L40j69K0j70J27K15p3o1q3J05K1l0M2j22O9k81L47l4J16
$$ plain form
4328 166 241 -144 137 -60 -210 155 -130 -126 246 -293 112 65 25 76 191 19 38 -55 -190 24 8 -27 85
4351 85 164 -171 180 -54 110 -183 -5 81 86 -264 36 -141 145 139 137 -135 -259 154 -40 189 -65 -107 -44 65
4375 65 31 -67 -240 10 50 -38 96 -294 127 185 114 -37 26 -54 5 -149 -169 166 -101 56 -28 6 -115 269
4399 269 -52 142 -18 190 144 -130 -6 285 -23 -66 5 17 134 -276 -116 103 -190 206 -44 139 223 132
4421 132 -9 -46 -6 200 -25 -9 57 100 281 -26 162 -112 213 167 153 125 64 -104 75 -27 16 76 -114 -25
4445 -25 -99 -33 43 -75 -75 55 -118 128 -15 24 -53 -79 -143 81 -52 -24 -185 -77 120 -202 -89 220 -48 -193
4469 -193 156 115 149 47 70 184 -138 122 210 -84 -195 168 7 -164 9 -27 245 94 -117 -11 171 78
4491 78 94 24 75 196 99 377 24 57 200 -108 -18 -229 133 -212 -36 -135 67 16 -77 11 80 -117 -57 54
$$ packed form
4328A66P5l85K81j97j50L65k85ML72n39M05m7m0N1J15j72J9r3j35K14j6l5J12
4351H5P9l35L51k34J64k93J78Q6Nl50L00j77K86okk72j24M13j94K29k54m2O3J09
4375F5l4r8j73K50M0q8J34l90M21N8p1j51O3q0N9j54k0L35k67J57q4L4j21L84
4399B69l21J94j60K08m6k74J24K91l08m3P1J2J17m10J60K19k93L96k50J83Q4r1
4421A32j41l7M0K06k25J6O6M3J81l07J88k74L25m6j4k8o1j68J79j02M3O0j90Q9
4445b5p4O6P6j18%J30j73K46j43L9p7k6o4K24j33K8j61J08J97l22J13L09k68j45
4469a93L49m1L4j02K3J14l22K60Q8k94j11L63j61j71J73l6K72j51k11J06J82r3
4491G8J6p0N1J21r7K78l53L3J43l08R0k11L62l45J76r9K02n1r3Q8O9j97O0J11
$$ plain form
4515 54 19 -17 -124 -72 -197 -100 88 -280 68 -131 63 105 26 -169 10 -181 -15 102 -59 -64 25 113 -90 39
4539 39 141 -126 -117 -311 -75 -124 56 189 -110 135 55 168 -89 94 183 33 128 -42 240 109 34 -198 -57
4562 -57 15 39 -46 106 -9 193 -192 56 -25 66 -22 -77 16 -65 -107 -78 -62 140 240 118 -21 -47 -112 -143 49
4587 49 -114 -147 115 11 -87 17 -61 -214 19 46 180 235 152 228 -159 72 198 -96 -50 15 182 145 -34 29
4611 29 138 8 0 -253 123 68 -218 -106 84 281 -117 -71 -6 30 51 -212 -115 13 167 43 -111 21 -40
4634 -40 6 -6 15 -186 -55 -235 20 -3 -38 16 -181 92 -184 -61 170 148 -113 110 -49 67 -40 -7 7
4657 7 -189 72 45 73 -1 -205 28 -152 220 -34 -16 55 -50 172 -70 135 -170 88 -160 -66 -78 24 -151
4680 -151 48 -30 -86 104 -145 -50 -26 -36 -58 -74 18 121 109 -203 -99 -107 -80 -237 -9 48 216 392 71 62 -26
$$ packed form
4515E4l5l6j07N2j25R7J88l68L48j99J94M2p9j95J79j91J66J17j61nQ9Q8k03J29
4539C9J02k67Rj94K36m9J80J33k99K45q0J13k57J83Q9j50R5j70K82j31p5k32J41
4562e7P2K4q5J52j15K02l85K48q1R1q8n5R3q1m2K9J6K02J00j22j39k6o5l1J92
4587D9j63l3K62j04r8J04p8j53K33K7J34N5q3P6l87K31J26k94M6O5J67l7j79O3
4611B9J09j30qk53L76n5k86J12J90J97l98M6O5L6K1k63R7J28J54j24j54J32o1
4634d0M6j2K1k01J31j80K55k3l5N4j97K73k76J23K31k2k61K23j59J16j07L3J4
4657Gj96K61k7K8p4k04K33j80L72k54J8P1j05K22k42K05l05K58k48R4j2J02j75
4680a51J99p8n6J90k49R5K4j0k2j6R2J03j2l12J04qK7j57K28N7J68J76l21rq8
$$ plain form
4705 -26 22 -143 -132 -25 -322 86 91 10 76 53 -50 86 -199 39 -72 107 -184 89 -152 -15 275 -99 84
4728 84 60 125 -144 -60 -208 269 -83 -94 -92 -118 -138 -312 -72 -84 -167 19 76 179 -33 4 69 115 90 238 209 45
4754 45 35 8 -3 -60 19 -165 -138 -14 94 -149 37 -17 56 234 -46 88 -89 -109 -15 -20 -112 164 15 -120 -32
4779 -32 -32 73 -120 83 48 68 -75 107 -154 14 -48 -28 73 -182 -46 -101 -97 -4 11 -15 3 57 -81 358 -107
4804 -107 42 -71 -107 27 -13 -18 -156 -259 24 11 -83 8 196 -140 -35 64 -82 -64 74 -10 -185 -21 -141
4827 -141 203 -238 -79 -385 -69 -85 48 10 -46 96 -35 108 3 127 202 64 110 -7 97 -86 -39 -150
4849 -150 68 -88 -10 37 -8 61 164 -57 -237 -20 3 122 -37 122 104 -214 1 -37 -32 180 -76 196 -147
4872 -147 -86 42 -99 -8 -3 90 -102 -24 147 166 -80 -74 73 -15 -54 -16 57 52 -64 41 247 -80 47 -82 -125
$$ packed form
4705b6M8j65J1J07k97M08Nq1O6k3j03J36k85K38j11J79k91K73k41J37K90l74J83
4728H4k4O5k69Q4j48M77l52j1Kk6k0j74K40j2q3J86N7J03k12L7O5M6k5J48k9j64
4754D5j0k7j1n7P9j84K7J24J08k43J86n4P3J78k80J34j77k0R4nr2K76j49j35Q8
4779c2%J05j93K03l5K0j43J82k61J68o2K0J01k55J36n5MR3J5k6J8N4j38M39m65
4804a07J49j13l6J34m0nj38j03K83j3r4R1J88l36J05R9j46J8J38q4j75J64j20
4827a41L44m41J59l06L16j6J33l8n6J42j31J43j05J24P5j38M6j17J04j83M7j11
4849a50K18j56P8M7m5O9J03k21j80K17K3J19j59J59j8l18K15l8NK12k56K72l43
4872a47O1J28j41R1NR3j92P8J71J9k46OJ47q8l9L8P3nj16J05K06l27J27j29m3
$$ plain form
4897 -125 -130 106 -36 -217 -122 13 168 43 118 163 -162 131 -8 69 -81 152 -20 66 -40 260 -210 -122 10
4920 10 39 53 -253 -96 -75 20 -288 -49 -22 165 249 -99 -121 -149 -142 197 226 17 -11 233 -82 29 -105 394
4944 394 222 109 -123 -44 6 -264 -101 56 -82 15 -186 -188 -22 76 -151 -115 55 -42 -168 131 115 -173 105
4967 105 -46 -170 -30 -166 172 203 -71 132 -13 232 -3 4 -79 172 91 18 -240 -26 148 170 -216 -57
4989 -57 89 -81 91 106 145 -193 154 97 53 -47 -122 -138 14 -19 -197 -34 53 140 -51 11 43 -2 -156 -79 -37
5014 -37 -37 -56 -64 86 236 -53 -49 227 124 79 -80 -182 193 256 -216 143 18 73 313 -134 12 96 148 -263
5038 -263 163 -208 38 125 -188 61 140 42 -23 -14 147 -135 19 -296 8 192 65 129 -209 170 -75 -58 -218
5061 -218 -76 161 -225 -74 266 -144 -297 108 4 -78 143 -172 55 65 13 -115 89 141 27 -173 39
$$ packed form
4897a25nK36j42j81R5J35J55j25P5M5l25K93j39P7j50K33j72Q6j06L00m70Q8J32
4920A0K9J4l06J57K1R5l08K39K7J87Q4l48k2k8PL39K9k09k8K44l15J11j34M99
4944C94j72j13k32P9N0k70J63J57j38R7k01kJ66R8k27L6J70r7j26K99j6k88K78
4967A05j51j24J40j36L38L1k74K03j45K45k35Pq3K51q1p3k58K14J74K2l86J59
4989e7J46j70J72J5L9l38L47n7m4j00p5j6J52l3j78J63Q7Q7j91O2L2m5j54P7M2
5014c7%j9qJ50J50k89MK76j03m5j59j02L75O3m72L59j25N5K40m47J46Q4N2m11
5038b63M26l71K46Q7l13K49P9r8o5RJ61k82J54l15L04J84j27O4l38L79k45J7j60
5061b18J42K37l86J51L40m10j53M05j04q2K21l15K27J0n2j28K04N2j14k00K12
$$ plain form
5082 39 -142 -138 6 49 -75 205 48 -285 19 104 74 96 -44 84 180 79 230 -78 29 -138 -78 -107 104
5105 104 319 74 -33 44 -56 -41 76 23 -153 -79 100 94 99 -15 -9 -195 -92 98 5 129 -156 -21 94 -61
5129 -61 -72 -5 -63 -173 48 246 44 67 -42 112 199 -141 -109 7 18 28 -21 40 115 -41 -30 -48 -222 17 -78
5154 -78 34 190 103 80 -142 17 -200 282 30 123 237 -47 -32 26 9 151 -203 135 22 142 -59 -72 -24
5177 -24 -106 121 23 11 -171 -328 167 89 72 201 -104 -38 25 207 -239 35 41 -49 -171 -116 -105 184 89 -98 -171
5202 -171 -84 117 -131 73 176 48 67 34 59 71 -69 57 166 -31 63 101 -120 17 -91 -66 103 -21 -111
5225 -111 -67 133 -156 -20 138 129 -139 138 26 130 93 -217 130 -79 254 -108 -80 -294 -14 -61 10 -75 25
5248 25 -35 153 -38 31 82 19 -123 223 -197 72 -288 -174 -118 -120 239 49 196 -18 39 72 375 -260 -241 50
$$ packed form
5082C9j81MJ44M3j24K80j57l33L04Q5l0K2j40J28R6j01J51l08J07j67O0k9K11
5105A04K15k45j07P7j00J5J17n3j76P4J79oNj14Oj86J03J90r3J24k85J35J15j55
5129f1j1O7n8j10K21J98k02K3j09J54Q7l40L2J16J1J0m9O1P5j56J1j8j74K39r5
5154g8J12J56q7k3k22J59k17M82k52R3J14k84J5N8j7J42l54L38j13J20k01j3M8
5177b4q2K27r8j2j82j57M95p8j7J29l05O6O3J82m46K74Or0j22N5J1K89r5j87p3
5202a71Q7K01k48K04J03j28J9l3K5J2j40J26J09j97R4L8k21J37j08K5J69j24r0
5225a11M4K00k89J36J58rk68K77j12J04l7l10L47k09L33l62K8k14K80m7P1q5J00
5248B5o0J88j91O9N1o3j42L46m20K69l60J14N6kL59j90J47k14N7L3L03o35J9K91
$$ plain form
5272 50 110 289 -88 -139 -55 -1 143 213 -113 -62 -77 118 183 154 197 -61 -204 1 -16 -58 43 133 83 -113 77
5297 77 -80 -1 4 -164 9 -163 -108 -6 121 -203 80 153 -161 76 175 -18 -190 -61 -78 364 -113 -65 -6
5320 -6 -23 15 11 80 -197 -18 227 65 -188 -73 152 321 -265 98 71 -27 97 29 -134 131 -131 -183 -19 210
5344 210 149 41 -21 -179 -13 146 40 -55 89 141 255 -98 106 -139 163 -104 -143 -111 150 -71 -140 -48 -46
5367 -46 113 195 116 -136 -161 105 175 119 -289 -152 149 -24 -91 -170 154 -15 21 -71 -136 -54 -80 74 -2 36 -182
5392 -182 207 120 -109 130 -243 -169 148 102 156 -32 -50 -11 -263 -71 163 116 -161 219 55 5 58 166 -11
5415 -11 -2 -226 -150 -165 18 137 -163 -178 -30 167 98 131 -24 -193 40 -43 66 -93 18 44 53 -61 -97 140
5439 140 -168 170 -168 229 -94 -42 207 85 -38 -85 202 -36 175 -29 -160 -176 -18 36 -4 -133 21 81
$$ packed form
5272E0O0J79l77n1Q4N4J44P0l26N1j5J95O5k9M3k58j43K05j7m2J01R0n0j96J90
5297G7j57P9Nj68J73j72N5J02J27l24K83P3l14K37R9j93j72J29j7M42m77M8N9
5320fj7L8mO9k77J79K45j62k53J15K25J69n86L63k7r8J24o8j63K65k62n2J64K29
5344B10o1j08o2j58J66J59j06r5J44N2J14l53K04k45L02k67l9L2K61k21o9R2K
5367d6J59Q2p9k52k5K66P0n6m08J37L01j73o7p9L24j69L6r2o5Q2k6J54p6L8k18
5392a82L89q7k29K39l73P4L17m6N4j88j8L9k52J92K34m7k77L80j64n0N3J08j77
5415a1Rk24P6j5J83J19l00j5J48J97o9L3j55j69K33q3J09j59J11K6Rj14l6K37
5439A40l08L38l38L97l23N2K49j22j23m7K87k38K11k04j31j6J58N4m0j29J54O0
$$ plain form
5461 81 166 220 19 104 -53 107 106 -120 16 29 100 42 98 -38 -179 55 39 -57 -111 240 29 -71 10 124 18
5486 18 183 -275 266 -103 88 -34 -113 -56 21 -114 -130 -29 83 -88 113 59 114 128 146 -14 -86 -31 -141 13
5510 13 26 66 16 22 35 96 226 -140 12 -64 -323 9 17 289 140 259 19 173 -280 34 144 39 -142 -62
5534 -62 110 -6 -117 17 183 9 -44 -35 42 -226 -169 -2 109 2 47 188 214 71 123 74 11 108 69 93 73
5559 73 12 -73 -12 -61 369 203 -33 -154 16 328 -44 -48 -54 35 -138 -15 -156 1 -175 130 33 -144 -276 162
5583 162 58 56 -86 70 -38 -75 -8 43 -185 10 127 -33 78 -190 46 -61 67 59 -309 -126 88 -17
5605 -17 -9 -17 295 -36 69 -186 250 68 152 -188 -126 -31 139 -39 -36 40 -280 73 51 -24 269 51 18 20 -75 -174
5631 -174 -285 -48 18 -59 150 -47 -314 52 -35 -101 255 -9 108 -217 21 90 104 -139 -57 -111 -141 381 3
$$ packed form
5461H1Q5N4k01Q5j57J60jk26J36J3P1n8N6j36j41K34j6r6n4L51k11j00Q1J14j06
5486A8J65m58N41l69J91j22p9N7P7j35j6J01J12j71K01n4N5J4J8j60p2N5j10J54
5510A3J3M0n0OJ3O1J30l66J52p6k59L32QK72j49J19k40J54m53L14J10j05j81Q0
5534f2J72j16j11J34J66j74n3RP7k68N7J67J11j07M5J41K6j43N2m9o3R7l9K4k0
5559G3o1q5O1m9M30j66k36j21J70L12l72moQ9j73J23j41J57j76L05r7j77j32M38
5583A62j04kj42J56j08l7O7N1k28J95J17j60J11k68K36j07J28ql68J83K14j05
5605a7QqL12l31J05k55M36j82Q4l40O2R5J70j78LP6l20L53k2p5K93k18l3Kr5r9
5631a74j11K37O6p7K09j97k67L66q7o6L56k64J17l25K38O9J4k43Q2n4l0N22l78
$$ plain form
5654 3 -35 23 -25 9 -96 223 -220 125 -77 180 -40 185 49 -29 13 67 54 200 164 -202 215 15 -142 -3
5678 -3 -77 228 8 22 5 86 177 -65 297 -60 -179 -31 286 44 -5 131 -39 161 205 -27 16 10 106 -44
5702 -44 185 -125 -152 -16 112 -55 -149 64 221 54 -57 120 -173 115 157 -214 -30 -233 68 182 -8
5723 -8 -50 20 -41 -27 -79 14 47 58 2 -222 112 -52 -7 6 148 -24 176 -16 -146 50 -174 71 -270 -145
5747 -145 -59 -208 294 -170 -85 57 86 33 4 -102 -310 -62 55 4 0 -77 44 86 87 141 208 0 281 -141 21
5772 21 -155 220 53 -162 -131 167 -34 -60 -278 9 239 -128 -82 185 87 -143 30 -138 130 -240 -47 -3
5794 -3 1 151 -129 -297 -55 17 116 -266 158 -74 -172 152 -70 62 10 9 45 -82 -65 -114 -12 140 -7 -2 -18
5819 -18 -62 91 168 -46 46 -13 -85 195 -10 -28 96 138 73 -40 260 182 18 -138 -83 55 11 34 296 -27
$$ packed form
5654Cl8N8m8L4j05L19m43L45k02K57k20K25j36p8M2N4j3J46l6l66M17k00j57J39
5678cp4L05k20J4j7Q1R1k42L62l57j19J48L17k42m9J36j70K00M4k32M3oR6j50
5702d4K29l10k7J36J28j67r4K13J57j67j11J77k93K88M2l71J84k03L01J14j90
5723hm2P0o1J4n2R3L3J1n6k24L34j64M5J3J42j72K00j92j30J96k24K45l41J25
5747a45Q6j49N02m64Q5J42K9n3k9j06k08K48J17n1mp7J21M2JN4O7k08K81m22J62
5772B1j76L75j67k15L1K98k01k6k18K87K30l67M6K67r8k30J73j68K68l70J93M4
5794cMJ50k80j68K42P2R9l82M24k32r8L24k22J32n2jL6j27J7m9J02J52j47Nj6
5819a8m4J53P7k14R2n9p2K80k05j8J24M2o5j13L00p8j64j56N5J38m4K3K62l23
$$ plain form
5843 -27 -62 -74 127 -29 5 68 -88 -17 -75 -53 -52 14 -143 171 187 100 90 -51 -213 148 -80 101 -155 -136 -264
5868 -264 -45 -69 -97 -22 -85 167 225 91 -41 -60 98 -47 -261 3 -118 -96 -146 67 222 -83 -214 94 133
5891 133 65 223 237 180 217 65 231 90 -95 124 -45 106 27 137 -186 -165 134 21 -75 128 -137 12
5913 12 -171 -158 188 -132 185 -215 -12 331 46 -44 -147 -69 -35 60 16 77 -164 168 -130 -47 -137 52 -76
5936 -76 -125 -82 96 -136 -74 -6 132 39 42 -201 17 185 44 94 99 -130 -15 11 -12 -140 33 -37 52 84 -281
5961 -281 -69 90 65 -108 141 -25 35 -124 -74 98 -70 -104 -177 259 -14 95 20 -152 46 -83 -307 -166
5983 -166 244 251 69 -200 -57 114 36 198 67 -203 1 -124 88 -228 -137 30 -28 60 170 -153 -282 6
6005 6 -78 -19 177 -20 -74 61 -114 184 76 -141 7 -177 5 133 -213 101 -116 -58 183 -175 -66 -39
$$ packed form
5843b7l5j2K01j56L4O3j56P1n8K2JO6j57L14J6q7j0j41j62L61k28J81k56J9j28
5868b64K19k4k8P5o3K52N8j34j32j9J58j45k14K64j21K2n0K13J55l05j31L08L9
5891A33o8J58J4n7L7j52J66j41j85K19j69J51p9J10l23K1K99j13r6K03k65J49
5913A2j83J3L46l20L17m00K03L43k85r0j03P8L4R5m4O1k41L32k98Q3r0J89j28
5936g6m9M3J78k32O2O8J38r3Lk43K18J68j41N0Nk29J15K6k3j28J73p0Q9L2l65
5961b81K12J59k5j73K49j66O0j59N0J72j68l4p3M36k73J09p5j72J98j29k24J41
5983a66M10Pj82k69J43J71p8J62j31k70K04j25K12l16R1J67n8Q8J10l23j29K88
6005Fq4N9J96j97n4J35j75K98j08k17J48j84J82J28l46L14k17N8K41l58J09K7
$$ plain form
6027 -39 127 75 157 123 -76 65 14 -14 -46 132 -17 -29 91 305 -193 58 256 91 175 -21 -256 -1 214
6050 214 49 -105 173 -364 -16 69 25 107 129 -43 -240 8 84 200 164 -33 -87 192 204 -41 -64 30 -21 175
6074 175 109 274 -59 97 -13 12 -41 231 -202 387 -199 -175 -31 183 -130 225 8 1 -138 11 -100 141
6096 141 96 31 43 -52 163 -56 53 9 -150 -19 145 85 167 12 -242 94 176 75 29 69 126 -41 86 -201
6120 -201 29 -113 224 -50 260 78 -100 -6 -14 37 228 -64 74 -49 -92 -70 102 -157 112 139 193 64 -57
6143 -57 173 44 165 59 -56 132 -13 92 47 95 157 -155 54 -83 -123 -37 -188 -148 -7 49 -125 -141 79
6166 79 13 -46 -130 120 -4 167 -51 198 17 -28 17 -18 -30 161 44 -55 45 58 88 66 145 6 155 -57
6190 -57 -18 59 -29 47 -73 6 -53 -55 -310 244 -212 79 9 262 248 -148 -210 -112 -174 120 45 96 -226 -158 23 67
$$ packed form
6027c9J66n2Q2l4j99J41n1k8l2J78j49j2J20K14m98K51J98j65Q4j96k35K55K15
6050B14j65j54K78n37L48Q5m4Q2K2j72j97K48P6J16l6j97n4K79J2k45k3R4n1J96
6074A75o6J65l33J56j10K5n3K72m33N89n86K4J44K14l13L55k17pj39J49j11K41
6096A41m5o5J2r5K15k19J09m4j59J31J64o0Q2j55k54L36Q2j01m6M0N7j67J27k87
6120b01K30j42L37k74L10j82j78R4qN1J91k92J38j23m3K2J72k59K69K7N4j29j21
6143e7K30j29J21j06j15J88j45J05m5M8O2l12K09j37m0Q6j51M0J41N6j74j6K20
6166G9o6n9q4K50j24J71k18K49j81m5M5l5j2J91j17r9J00J3L0k2P9j39J49k12
6190e7L9P7q8P6j20P9n9kk55N54m56K91p0K53j4l96o2R8o2K94p5N1l22O8J81M4
$$ plain form
6216 67 204 248 223 10 108 -105 -192 -82 83 -89 333 392 -248 -134 4 90 83 -105 -12 124 91 -3 51 10 210
6241 210 -98 69 122 140 120 -128 107 -20 -41 -3 -184 44 -25 -65 -103 29 109 114 197 132 -261 -39 -152 62
6265 62 -45 -42 36 34 -155 36 206 236 -139 -69 35 85 115 26 -70 -177 -99 -96 -23 20 -223 14 -109 -204 164 -134
6291 -134 69 -68 247 61 103 -92 -34 102 -138 170 -5 45 -191 -21 55 -17 -287 -119 97 -91 19 -55
6313 -55 180 71 -84 -67 -61 48 -134 43 -112 177 -170 -181 25 57 57 -240 -170 5 -16 -60 0 46 75 -68 -205
6338 -205 72 46 96 -23 71 25 -91 37 114 84 315 33 -161 76 159 24 16 114 73 14 168 19 -171 -166 -82
6363 -82 225 205 132 -69 219 40 84 -19 141 317 -65 28 63 95 79 25 2 -79 75 139 6 61 -19 137 192
6388 192 -5 -35 16 357 178 271 3 -375 186 -226 92 168 180 -14 -232 -2 73 16 102 -8 129 -309 200
$$ packed form
6216F7J37M4k5k13R8k13q7J10J65j72M22N9o40J14J38Q6pj88R3J36l3r4N4m1K00
6241B10l08J67N3J8k0k48K35j27k1L8j81K28o9m0l8J32Q0NQ3o5l93K22j13K14
6265F2j07LP8kj89J91J70L0l75P0J04N0L0q9r6j07P8LP3M3k43K37j23r5L68k98
6291a34K03j37L15j86M2j95N8J36k40L08j75N0k36J70P6p2k70J68K16j88J10p4
6313e5K35j09j55J7OJ09j82J77j55K89l47j1K06L2%k97P0J75k1m4O0M6K9j43j37
6338b05K77k6N0j19R4m6j16J28P7l0K31k82j94K37Q3j35qR8m1n9J54j49j90NQ4
6363h2L07k0p3k01K88j79M4j03J60J76l82R3L5L2j6n4k3q1J54O4j33N5q0J56N5
6388A92j97l0N1L41j79R3k68l78N61m12L18P6J2j94k18K30P5n7Q6j10J37m38N09
$$ plain form
6411 200 29 -168 -59 -157 122 -6 218 168 -45 -169 -196 -55 61 -43 363 217 276 57 -64 38 70 -95
6433 -95 -76 -46 217 -6 126 -14 143 -66 184 -193 -202 1 74 -190 -14 163 -109 -279 89 24 -11 -238 14
6456 14 228 -339 -157 -82 80 111 3 -112 -73 -208 -124 -1 -152 96 -18 116 32 -305 18 -45 215 43
6478 43 -35 -298 20 -5 -66 -92 -263 76 111 51 50 -18 185 -89 -120 161 219 -40 151 156 94 18 20 165 34 85
6504 85 -19 -58 -68 -107 -22 -65 159 -124 100 24 111 86 48 92 -69 -183 34 4 -36 151 5 53 103 -37 101
6529 101 -80 55 44 -58 -126 -119 259 144 -38 40 -165 -28 -157 -282 -28 148 126 -163 -23 -180 -31 10
6551 10 -99 -50 -18 320 -201 -16 48 -101 36 48 -46 -52 112 69 133 -149 -94 -143 -285 -139 298 56 -344 42
6575 42 54 73 58 81 -34 78 77 24 -19 -4 92 150 -74 -153 181 -9 -143 87 175 52 47 12 -38 -115 -37 -26 -327
$$ packed form
6411B00j71j97J09r8K79j28K24n0k13j24k7J41J16j04M06j46N9k19j21J02L2j65
6433i5J9L0K63k23J32j40J57k09K50l77rK03P3k64J76J77k72j70L68o5l5k27K52
6456A4K14n67J82P5J62L1j08j15L9j35Q4J23j51K48j14J34q4l37L23o3K60j72
6478D3p8k63L18k5o1k6j71L39L5o0jo8K03k74l1K81N8k59J91No2p6KJ45j31N1
6504H5j04l9j0l9Q5m3K24k83K24p6Q7k5l8M4j61j14K17l0m0J87j46M8N0j40J38
6529A01j81J35j1j02o8PL78j15j82P8k05J37j29j25K54J76k2k89J40j57J49M1
6551A0j09M9L2L38n21J85O4j49J37J2r4oJ64m3O4k82N5m9j42J46M37k42m00L86
6575D2J2J9j5K3j15J12jn3m3J5R6N8k24p9L34j90j34K30Q8j23nl5n0p7P8J1l01
$$ plain form
6602 -327 153 147 22 42 -63 284 -272 137 -64 -166 -39 14 30 158 149 57 -17 116 72 51 54 -58 32 -140 2
6627 2 -22 82 66 -253 -122 -158 28 84 91 343 205 -78 258 46 75 -120 79 11 -240 -55 175 -47 -76 -149
6651 -149 17 113 13 -117 105 -173 205 240 45 15 88 15 -43 -139 232 -242 165 -203 17 -213 -70 -49 -125
6674 -125 25 -39 -320 118 -37 -149 -71 -141 -49 99 129 63 102 112 154 49 99 35 65 -3 -125 22 -156 101
6698 101 -92 -142 -378 73 -8 18 -193 -256 -81 -184 120 -173 -31 29 158 -125 40 110 -33 60 -27 72 92
6721 92 -72 30 1 168 -62 56 -71 -295 104 -216 -101 -21 74 -12 85 167 68 31 -238 81 25 -174 -33
6744 -33 159 -27 83 -29 143 -41 235 -174 70 -19 -28 106 7 -32 -160 -140 -48 122 -2 -168 4 50 124
6767 124 -99 131 -34 -8 -42 56 -183 -14 -31 -50 151 78 -138 142 212 -10 -43 170 -13 153 -17 18 29
$$ packed form
6602c27M80oj25K0j05L47n56M09k01j02J27N3J6J28rr2p4J33m4k1Lj12R0j72J42
6627Bk4J04j6l19J31l6J86N6PK52j38k83L36k12K9j95J99o8k51J85K30k22k9p3
6651a49J66R6j00j30K22k78L78L5j95l0P3p3n8r6L71m74M07l68K20k30J43K1p6
6674a25J50o4k81M38j55j12P8p0R2J48L0o6L9J0M2j05N0o4L0o8j22J47j78K57
6698A01j93n0k36M51q1K6k11o3J75j03L04k93J42O0J29k83J65P0j43R3q7R9K0
6721I2j64J02k9J67k30J18j27k24L99l20J15Q0R5q6R7Q2r9l7k69L19n6j99J41
6744c3J92j86J10j12J72j84K76m09K44q9rJ34r9l9j28K0R2J70j24j66J72M6P4
6767A24k23K30j65K6l4R8k39J69j7j9K01p3k16K80P0k22l3K13j83J66j70L5J1
$$ plain form
6790 29 -62 -105 -243 47 33 168 -157 -49 111 41 78 9 -80 191 -100 -113 248 115 33 57 -131 -121 -156 142
6814 142 96 186 -120 -240 -144 -314 16 -95 -20 -39 24 114 -222 16 -175 -50 62 19 -6 -69 -169 191 20
6837 20 54 -63 -169 -41 323 -129 -99 7 88 -93 -31 114 -178 201 -54 -48 -84 75 -7 -97 -70 -159 76 -110
6861 -110 70 147 56 40 -47 67 103 26 45 6 -210 -118 133 117 -7 -151 4 -2 319 44 -117 -62 160 -153
6885 -153 120 -5 -274 -72 107 134 55 -5 -177 35 263 246 250 -136 -216 23 144 88 130 133 152 -45 79 -150
6909 -150 114 -136 149 42 28 122 70 123 -168 -84 -119 189 117 -117 -139 185 -72 78 -98 52 239 41 33
6932 33 202 9 -136 -6 -111 -14 77 64 37 -66 13 116 -10 -5 50 51 -107 -51 -200 98 103 257 -52 107 -40
6957 -40 104 -232 -145 157 20 -133 -236 160 191 -65 35 -219 -9 8 -90 13 -150 37 -142 67 113 57
$$ packed form
6790B9r1m3j38K90j4J35l25J08J60p0L7o9q9K71k91j3L61j33q2K4j88J0l5K98
6814A42m6R0l06j20R6j70L30j11P5j9O3R0l36K38j91J25J12m3k5o3j00L60j71
6837B0L4j17j06J28L64m52L0J06Q1j81O2J45k92L79k55Ol6J59q2r0K7q9K35j86
6861a10J80P7r1j6q7J14L6p7J9l9k16R2K51j6j24j44J55oL21k75j61N5K22l13
6885a53K73j25k69K02J79K7p9o0j72K12K28j7Ml86q0K39J21n6M2LJ9j97J24k29
6909a50K64k50K85j07j4R4n2N3k91Q4l5L08p2k34k2L24k57J50j76J50J87j98q
6932C3J69j93j45J30j05R7R1j3k7j03P9J03j26NN5Jj58N6j49K98NJ54l09J59j47
6957d0J44l36Q7L02j37j53j03L96L1k56J00k54K10J7r8J03j63J87j79K09M6n6
$$ plain form
6979 57 -14 40 -16 19 115 78 -280 90 -21 -1 3 140 -45 26 39 -205 -15 103 -95 233 -63 236 47 -64
7003 -64 -228 -145 1 248 225 -28 150 3 -78 26 6 37 10 46 -44 -39 -58 65 93 84 113 90 217 -70 36 -135
7029 -135 -22 -250 -85 -144 -66 88 -86 -17 59 -49 51 -136 25 109 -39 -29 41 -59 78 116 -144 -88 0
7052 0 -67 -96 -33 -43 29 -38 -124 -111 60 83 -62 149 -76 -199 54 -94 57 -23 -10 105 46 -89 -44 -64 119
7077 119 -68 -93 -139 95 25 -54 227 -118 37 156 -101 86 -94 39 -87 273 292 2 108 68 172 289
7099 289 11 -7 20 -183 129 -36 -24 43 31 -95 -89 -95 -98 78 -232 64 -97 -226 -83 -33 136 113 173 93 -145
7124 -145 -39 -236 -112 -62 -26 88 31 96 -214 16 124 20 -232 182 -42 -83 94 -169 95 -66 -177 118
7146 118 -87 -19 87 102 -107 4 71 43 65 -306 -47 226 -68 17 -86 -117 100 119 -21 187 -164 202 -179
$$ packed form
6979E7p1N4n6L5R6l7l58L70j11K0MJ37j85P1J3k44J90J18j98L28k96K99j89j11
7003f4j64Q3J46K47k3k53J78j47q1J04k0L1k7L6r0Nj9J23K8rK9k3J27k87J06j71
7029a35J13k28J65n9P8J54j74O9P6j08J00j87J61Q4j48J0P0j00J37L8k60N6Q8
7052@o7k9O3j0P2o7q6J3J71K3j45K11k25j23K53j48J51q0J3J15n9j35M5k0J83
7077A19j87k5m6K34p0p9K81l45J55J19k57J87j80J33j26L60J9k90J06m0J04J17
7099B89k78j8K7k03L12j65J2O7j2j26OolJ76l10K96j61j29J43N0J69k3O0q0k38
7124a45J06j97J24N0L6J14n7O5l10K30J08j04k52M14k24m1J77k63K64j61j11K95
7146A18k05O8J06J5k09J11O7k8K2l71K59K73k94Q5j03l1K17J9j40K08l51L66l81
$$ plain form
7169 -179 -72 72 -45 -112 162 43 -36 152 -29 51 -131 -6 68 -57 49 -155 -209 243 -289 -8 -52 177
7191 177 -23 -74 69 -9 -139 -90 -151 -26 86 -56 79 -51 -59 49 -86 139 207 -38 -73 73 -63 -190 -42
7214 -42 -11 46 -152 -197 -116 318 53 123 -272 234 61 -73 98 62 4 -245 54 30 79 -82 68 -263 228
7237 228 56 61 42 55 63 118 160 8 110 -125 -150 7 117 25 -108 51 -98 153 -213 -86 144 -119 8
7260 8 174 1 -80 -58 -56 18 247 12 -25 19 88 207 130 83 -45 150 -292 -41 64 -160 -96 112 -58 192
7284 192 23 107 -190 -32 -131 -48 71 -116 -89 354 241 -59 56 -93 -4 95 96 -183 86 -107 -153 181 -107
7307 -107 -202 -15 279 186 -213 -242 108 -86 85 -40 -140 147 -98 15 41 160 168 191 -210 -58 42 -126
7329 -126 -81 -12 -7 -130 211 14 -39 -10 -5 -166 82 159 50 -72 -24 105 -171 -96 73 -123 155 -24 167 -181
$$ packed form
7169a79J07J44j17o7K74j19p9J88j81Q0j82J25P4j25J06k04n4M52n32K81m4K29
7191A77k00n1J43p8j30M9o1J25J12j42J35j30qJ08j35K25O8k45l5J46j36j27J48
7214d2L1N7j98m5Q1M34k65P0l95N06j73j34J71l6n8k49K99k4M9j61J50l31M91
7237B28j72Nj9J3QN5M2j52J02k35k5J57J10r2j33J59j49K51l66J27K30k63J27
7260HJ66j73q1K2KP4K29k35l7M4O9J19p7m7j28J95m42K51J05k24O4K08j70K50
7284A92j69Q4k97J58r9Q3J19j87K7M43j13l00J15j49Q9R9Jk79K69j93m6L34k88
7307a07r5J87K94r3l99k9L50j94J71j25j00K87k45J13K6J19QK3m01J52J00j68
7329a26M5O9Nj23L41j97n3K9Nj61K48P7j09j22M8J29k76P5J69j96K78j79J91l48
$$ plain form
7353 -181 70 -37 175 -132 -45 166 127 58 -120 -88 -244 56 56 -114 -110 82 -4 10 -1 89 43 -152 -87 -141 67
7378 67 -32 -139 30 -78 -83 44 -219 92 -93 94 -454 -234 -224 -27 -44 48 -40 -2 -61 22 193 -217 -172 197
7402 197 -3 110 16 -145 -38 10 52 -139 112 -108 190 104 285 115 -26 -42 -46 -197 -92 208 -231 -169 -38
7425 -38 89 -163 250 -85 50 39 -118 -23 -103 -100 -11 -116 94 -52 62 159 -19 4 -28 -98 25 199 -144 197
7449 197 18 77 -26 -50 -64 -261 -89 85 -81 9 -8 120 -114 -127 122 -218 16 -149 -18 -55 -14 16 -11
7472 -11 -88 -154 58 -10 48 -114 -58 41 17 -171 54 9 -70 2 71 42 71 112 4 3 -23 -216 -122 71 -3 68 122
7499 122 27 79 21 172 -122 102 394 192 236 163 151 -130 -124 -231 0 -92 -44 -3 109 62 7 103 67 26 165
7524 165 -284 69 -42 -117 33 -44 -219 -20 9 -60 -232 -112 126 -13 -137 -5 -37 61 -53 -56 210 176 1
$$ packed form
7353a81K51j07K12l07Q7K11l9o9j78L2j56L00%j70MJ92q6J4j1R0m6j95O5n4K08
7378F7r9j07J69j08nJ27k63L11j85J87n48K20J0J97j7R2q8L8n9Q3J71m10M5L69
7402A97k00J13r4j61J07M8M2j91K51k20K98q6J81j70j41j6mj51J05L00m39O2J31
7425c8J27k52M13l35J35j1j57R5q0LQ9j05K10j46J14R7j78K3l2p0J23J74l43L41
7449A97j79N9j03k4j4j97J72J74j66R0j7J28k34j3K49l40K34j65J31l7M1L0k7
7472a1p7o6K12o8N8j62N6R9k4j88K25m5p9P2O9k9K9M1j08jk6j93R4J93p4P1N4
7499A22r5N2n8J51k94K24K92k02M4p3j2k81Oj07K31r2M8M1J12m7n5R6l6m1J39
7524A65m49L53j11p5J50p7j75J99K9o9j72J20K38j39j24J32l2R8j14lK66l4j75
$$ plain form
7547 1 -122 -77 -24 -40 165 -82 -169 -42 -20 -108 -109 -114 -32 -54 125 70 60 -98 -76 133 -105 138 -43 -99 72 -352
7573 -352 -91 0 -17 72 -59 -53 25 -243 -11 130 -172 16 83 43 -39 -75 -80 70 -247 -63 -74 -74 50 -377 -46
7598 -46 250 -28 6 48 -69 -191 -242 -61 -212 -118 44 134 62 73 -61 -47 -154 6 -17 67 57 -69 -121 132
7622 132 -36 -73 76 -137 29 76 106 13 184 -70 200 -195 -61 75 -97 193 -165 135 238 55 -126
7643 -126 -223 150 -119 -83 -6 16 -110 90 140 -203 357 186 -9 45 76 11 297 -127 -116 31 -28 94 -84
7666 -84 -67 -59 -61 -168 118 -228 -156 -88 -5 -180 36 96 31 -57 -15 155 149 -47 51 100 -129 -5 -13 75 -155 -6 171
7693 171 -158 98 -1 -52 132 40 -47 79 43 -122 198 -50 -36 90 -10 -118 -127 59 69 138 236 -138 -156 -40
7717 -40 223 -73 -25 3 142 -76 244 96 -22 194 398 126 50 -138 68 141 34 82 -15 107 235 -62
$$ packed form
7547Aj23M5N3j6K05k47q7J27K2q8jnQ2k2J79n5j0j58K2K09k38K43j81n6J71m24
7573c52K61R1j7Q9j31OP8k68K32J41l02J88O7m0q2l6nJ50l17J84j1%J24m27L31
7598d6K96k78L4M2j17j22n1J81j51R4J62R0p2J1j34J4j07J60k3Q4j0j26n2K53
7622A32j68l7J49k13J66M7L0r3J71k54K70l95J34J36j72K90l58L00J03j83j81
7643a26r7L73k69L6P7K2j26K00N0l43N60j71j95N4L1o5K86m24J1J47n9J22j78
7666h4J7Qkj07K86l46P2O8Q3j75K16O0o5q8M2J70oj96R8M9k29J24qQ8k30J49J77
7693A71l29K56r9n1J84r2q7J26l6j65L20k48J4J26j00j08rJ86J0O9R8l74j8J16
7717d0K63k96M8K8J39k18L20j48j18K16K04k72p6j88K06P3j07M8r7J22J28k97
$$ plain form
7739 -62 -11 113 18 -50 225 -173 218 -10 32 -41 79 -216 -130 68 -26 199 -113 59 144 -83 -21 19 179 120
7763 120 -19 97 -88 -108 34 11 151 143 169 -58 183 -177 -69 -201 34 -49 40 -107 192 12 -9 230 -47
7786 -47 155 -50 -160 58 97 92 -46 -26 -49 -120 302 -25 191 -83 217 -18 -153 -122 -143 163 105 115 -18 196
7810 196 76 -152 39 -52 -8 53 -103 21 -43 -47 27 -222 -125 -122 100 13 -130 -134 40 -75 -58 -126 152 -82 -16
7835 -16 202 30 -59 41 -19 -18 -76 122 162 102 -115 -107 31 114 87 68 37 -69 -172 40 127 18 -25 104 57 -37
7861 -37 -89 78 43 -94 17 69 -287 8 55 -50 146 -47 216 220 -107 -28 65 -173 13 95 -156 90 240
7884 240 30 298 49 158 105 -109 121 163 -18 33 -60 228 -21 143 -96 -112 143 25 281 143 -116 -44
7906 -44 -61 -125 -140 144 -39 -33 151 -63 356 -65 -19 -75 151 155 97 -235 52 -120 -219 -193 -138 -24 56 38 -21 61
$$ packed form
7739f2N1J24r5o8K75l98L91k28M2p3J20k95Q6J98r4K25l12J72Q5k27O2M0J60n9
7763A20j39J16j85k0J42k3J40qK6k27K41l60J08j32K35q3Q9j47K99j80k1K39k77
7786d7K02k05j10K18L9nj38K0k3p1M22l27K16k74L00k35j35L1k1L06n8J0j33K14
7810A96j20k28J91r1M4O1j56J24o4mP4k49R7LK22q7j43mJ74j15J7o8K78k34O6
7835a6K18j72q9J00o0Jn8J98M0o0k17QJ38Q3k7j9l1j06j03K12Q7j09m3J29m7r4
7861c7n2J67l5j37J11N2l56K95M7j05J96j93K63Ml27P9R3k38J86Q2k51K46J50
7884B40k10K68k49J09n3k14K30M2j81N1r3K88k49J64k39j6K55j18K56j38k59P2
7906d4j7o4j5K84j83OJ84k14M19m21M6n6K26Mn8l32K87j72r9K6N5J14Q0j8n9Q2
$$ plain form
7932 61 66 -268 59 65 7 -59 224 -198 -114 116 -2 -118 -106 -165 58 -56 115 149 30 -57 2 251 -34 -96 9
7957 9 -53 -165 -238 -106 68 -3 211 -43 -25 219 55 14 -87 -35 -209 22 75 42 -20 99 355 -128 -127 156
7981 156 62 132 -197 -15 3 -55 -160 11 15 8 128 -124 -12 78 -37 -33 207 -78 -153 -42 129 20 275 40
8005 40 50 -366 110 -135 22 -35 -29 2 -53 144 -75 -46 -80 -41 -3 126 0 -167 -42 158 74 -194 161 -189
8029 -189 64 14 150 242 160 189 -200 -54 71 229 123 -63 -188 -130 132 47 206 107 -31 118 82 21 -204
8052 -204 -59 107 -217 42 74 -183 -168 101 -10 -191 103 117 -49 -26 15 122 17 -225 87 104 109 6 -213
8075 -213 152 219 146 224 -13 2 133 -31 -200 9 343 161 -28 -114 -105 202 72 -237 -69 40 -115 -169 -156
8098 -156 -35 9 -97 -9 -149 160 -334 60 -128 -294 -20 65 -47 21 48 29 124 54 64 -46 182 32 170
$$ packed form
7932F1Nl34L27On8o6K83m22Q4K30j18j16J2n9K23j14J71L4j19q7N9K49k85o2J05
7957Io2j12p3J32J74p1K14k54J8K44j64m1j01N2j74K31N3l3o2J19K56m83JK83
7981A56r4P0l29J82J8n8j05J71MpJ20k52J12R0j15MK40k85p5J11J71j09K55k35
8005D0J0m16M76k45J57n7OL1n5J97k19K9l4L9L8J29j26j67J25K00q4k68L55l50
8029a89K53n0J36R2q2K9l89J46J25J58j06j86j25N8K62q5J59r9j38J49l6o1k25
8052b04J45J66l24K59L2k57J5K69j11j81K94J4j66K3M1J07j05k42L12J7Nj03k19
8075b13L65O7p3P8k37J5J31j64j69K09L34j82j89q6RL07j30l09J68J09j55n4J3
8098a56J21M4j06Q8j40L09m94L94j88j66K74Q5j12O8K7j9R5p0J0j10K28j50J38
$$ plain form
8121 170 -63 170 -14 178 -60 -7 203 198 -62 45 49 -38 85 65 -8 258 -29 -152 94 -2 45 -118 -111 131
8145 131 28 -2 115 -147 -85 38 66 -81 -22 -204 5 -70 -100 -84 -32 -37 193 -35 -106 -132 21 -246 109 94
8169 94 -32 -209 -124 106 -131 2 43 -21 116 167 221 -141 -67 2 3 -139 -141 178 -10 457 15 -100
$$ packed form
8121A70k33K33j84J92k38N3K10nk60J07Mq7J23k0p3K66k87j23K46r6M7j63PK42
8145A31j03l0J17k62O2J23K8j47N9j82K09p5l0J6N2nK30k28p1k6J53k67L55j5
8169I4j26j77Q5K30k37J33M1o4J37N1N4l62P4O9Jj42kL19j88M67m42j15
8191a00
$$ Imaginary data points
##PAGE= N=2
##DATA TABLE= (X++(I..I)), XYDATA
$$ plain form
0 0 0 0 0 0 0 0 0 0 0 0 -8 8 -8 16 -16 24 -24 32 -40 48 -56 64 -80 88 -104 127 -144 168 -192 221 -252 288
32 288 -325 368 -416 468 -524 588 -656 732 -813 904 -1000 1107 -1225 1352 -1492 1644 -1811
49 -1811 1994 -2196 2419 -2666 2942 -3254 3603 -4002 4459 -4995 5628 -6390 7328 -8513
63 -8513 10070 -12202 15313 -20285 29474 -51941 216969 185272 -256247 200464 98836 -115287
75 -115287 150781 102452 -71770 148706 -24484 -15289 153413 -55668 -4175 153750 -92887
86 -92887 -62496 178748 -28605 -85015 53981 -7111 14789 1672 -41510 -12941 5948 -32983
98 -32983 22963 -12300 -43255 -6650 -49555 -1062 1331 -16385 8514 -38439 -80764 38619
110 38619 51843 -63571 -9212 -4186 5959 5923 -17764 32207 26689 -40745 16230 58815 -42990
$$ packed form
0@%%%%%%%%%%qJ6j6K4l2M0m8N6p2Q8j04J20j44J68j92K31k71L12l60M13m73N40
32B88o13O93p84Q84r92J112j244J388j545J717j904K107k332K577k844L136l455
49a811L805m190M615n085N608o196O857p605Q461r454J0623j2018J3718j5841
63h513J8583k2272K7515l5598M9759q1415K68910l1697m41519M56711j01628k14123
75a15287K66068m8329j74222K20476j73190R195J68702k09081N1493J57925k46637
86i2887L0391K41244k07353n6410J38996o1092K1900j3117m3182K8569J8889l8931
98c2983N5946l5263l0955L6605m2905M8493K393j7716K4899m6953m2325J19383
110C8619J3224j15414N4359N026J0145l6k3687M9971n518o7434N6975M2585j01805
$$ plain form
123 -42990 33096 46804 -24050 21493 41058 33459 -4367 -36786 47728 97272 -65344 12252
135 12252 91747 -76851 18926 98907 -49014 817 75314 -69009 17696 62374 -44563
146 -44563 50988 -14735 -76580 88148 26516 -100744 74192 8338 -94481 91661 -10293
157 -10293 -86493 71650 -344 -79580 66492 -4807 -61599 48104 -42645 -19389 65340
168 65340 -29691 -49277 25594 -22688 1620 44174 -53685 -8509 23141 -27804 -7837 29837
180 29837 -8200 -24083 3432 -7998 7987 6124 14825 -26951 -22408 44593 10708 -25582 -892
193 -892 18794 -6548 12011 -153 6766 5720 -24989 26300 9730 -18569 20672 5771 -56185
206 -56185 26716 48298 -37913 -7969 -9002 -7025 16674 -4799 -13315 9512 -29118 -10135 30369
$$ packed form
123d2990P6086J3708p0854M5543J9565p599l7826l2419Q4514M9544j62616P7596
135A2252P9495j68598R5777P9981j47921M9831P4497j44323Q6705M4678j06937
146d4563R5551o5723o1845J64728o1632j27260J74936o5854j02819J86142j01954
157a0293p6200J58143p1994p9236J46072p1299n6792J09703r0749K3256Q4729
168F5340r5031j9586P4871m8282K4308M2554r7859M5176L1650n0945J9967L7674
180B9837l8037j5883K7515j1430J5985j863Q701m1776M543O7001l3885l6290K4690
193h92J9686k5342J8559j2164O919j046l0709N1289j6570k8299L9241j4901o1956
206e6185Q2901K1582q6211K9944j033J977K3699k1473q516K2827l8630J8983M0504
$$ plain form
219 30369 -41677 15098 26040 -61121 -2829 43989 -33675 -5490 16828 -54096 32017 24385
231 24385 -47488 9172 4185 -25148 29437 -4750 -40673 50061 -21873 -40827 56353 -3495
243 -3495 -34711 28482 -12852 -30170 58217 -2281 -29940 12921 -5963 12316 15554 -15652
255 -15652 3000 25136 -28692 7507 26927 -18513 3212 6626 -12701 -29 25969 -14237
267 -14237 -21694 6360 14201 -2633 -15827 3779 -17034 -873 13298 -6100 -14304 1121 -5228
280 -5228 -17378 5967 2639 7380 -27200 -19604 25371 -923 -17201 10627 -6167 -27959 33184
293 33184 3243 -23449 14621 870 -5031 7070 2268 5624 13916 -28918 14890 34927 -23564
306 -23564 6169 10024 -21381 18878 35381 -30376 2667 17056 -19896 21625 11400 -9638
$$ packed form
219C0369p2046N6775J0942q7161N8292M6818p7664K8185K2318p0924Q6113p632
231B4385p1873N6660m987k9333N4585l4187l5923R0734p1934j8954R7180n9848
243c495l1216O3193m1334j7318Q8387o0498k7659M2861j8884J8279L238l1206
255a5652J8652K2136n3828L6199J9420m5440K1725L414j9327J2672K5998m0206
267a4237p457K8054P841j6834j3194J9606k0813J6161J4171j9398q204J5425o349
280e228j2150K3345l328M741l4580P596M4975k6294j6278K7828j6794k1792O1143
293C3184k9941k6692L8070j3751n901J2101m802L356Q292m2834M3808K0037n8491
306b3564K9733L855l1405M0259J6503o5757L3043J4389l6952M1521j0225k1038
$$ plain form
318 -9638 11140 -364 -18750 27707 8228 -12832 17705 -22979 -2511 36678 -8668 -29092
330 -29092 22055 -2379 -19483 20895 -5911 -13228 -2296 870 -4346 -494 -3021 -3835 -11373 -19005
344 -19005 24110 6412 -25076 -11884 9290 -4136 -4120 13508 -12740 -11308 4291 7849 -10313
357 -10313 8278 10303 -19612 -604 10217 8200 381 -1796 -9861 10416 10165 -5486 7403
370 7403 -11997 4441 20471 -5871 -10466 22899 -6805 -19879 27070 1017 -6163 8159 -7103
383 -7103 -8347 16814 3579 -6953 -1518 -17633 18290 8734 -22414 3902 9698 -22718 -534
396 -534 16912 -21054 3062 2528 -17336 1150 8891 -8910 -11143 -4580 -5112 14126 -11134 -12474
410 -12474 2723 -9398 -2514 8826 -8447 -16285 13575 -8650 -9936 14308 3739 -14708 -8053
$$ packed form
318i638K0778j1504j8386M6457j9479k1060L0537m0684K0468L9189m5346k0424
330b9092N1147k4434j7104M0378k6806p317J0932L166n216L852k527q14p538p632
344a9005M3115j7698l1488J3192K1174j3426J6J7628k6248J432J5599L558j8162
357a0313J8591K025k9915J9008J0821k017p819k177q065K0277k51j5651J2889
370G403j9400J6438J6030k6342m595L3365k9704j3074M6949k6053p180J4322j5262
383g103j244K5161j3235j0532N435j6115L5923r556l1148K6316N796l2416K2184
396e34J7446l7966K4116n34j9864J8486P741j7801k233O563n32J9238k5260j340
410a2474J5197j2121O884J1340j7273p838K9860k2225j286K4244j0569j8447O655
$$ plain form
423 -8053 9316 -458 4794 -1469 -3845 -5117 3837 10272 -5062 -5893 -2110 7577 -6997 -352 9605
438 9605 -5238 -12570 2116 10010 -8233 5456 -3446 -12671 5614 11137 -4921 -9379 1565
451 1565 -5552 6014 -722 586 1967 -11711 -3065 8103 -636 -7042 10075 -15326 -9699 19546
465 19546 556 -13877 -1854 3719 -6810 5776 -936 -960 -3347 -7786 8652 842 -5168 1624
479 1624 2909 -15511 8381 14766 -11985 -5049 1446 922 823 7623 -7288 -3351 2193 -1082 4130
494 4130 -1198 1875 -5315 -4304 445 9657 -1375 -7893 2925 -5444 1740 6420 127 -13427
508 -13427 3035 10050 -5412 -1300 3070 2635 -8821 3868 7707 1947 -3849 -1589 6655 -1437
522 -1437 6812 6553 -2801 -8991 11889 12126 -6601 2715 4697 1476 -1303 9106 2845 410 990
$$ packed form
423h053J7369r774N252o263k376j272Q954O435j5334q31L783R687j4574O645R957
438I605j4843p332J4686P894j8243J3689q902r225J8285N523j6058m458J0944
451A565p117J1566o736J308J381j3678Q646J1168q739o406J7117k5401N627K9245
465A9546j8990j4433J2023N573j0529J2586o712k4k387m439J6438p810o010O792
479A624J285j8420K3892O385k6751O936O495n24r9O800j4911L937N544l275N212
494D130n328L073p190J011M749R212j1032o518J0818q369P184M680o293j3554
508a3427J6462P015j5462M112M370m35j1456J2689L839n760n796K260Q244q092
522a437Q249k59r354o190K0880K37j8727R316J982l221k779J0409o261k435N80
$$ plain form
537 990 -904 5736 2245 6768 -2452 -4627 1710 9737 482 -4386 4043 -5572 4167 7303 -1627
552 -1627 -7814 4595 1310 -7201 6661 3763 -3232 -10135 2826 5714 -554 -2173 -1112 -2518
566 -2518 -6960 10874 3098 -9148 -3759 6269 -848 -4216 8824 -914 -3722 -2254 7597 4042
580 4042 212 1580 -1568 2421 4298 10838 -2646 -2665 3998 4913 3296 3980 5379 -5497 3415 4747
596 4747 4346 2249 2515 -1607 -4917 8687 6456 561 -6306 3275 2546 -1866 4832 2290 -3618 -6010
612 -6010 8147 60 -3672 2141 -396 -7082 -2133 10146 -3740 -6394 -2683 2092 -1400 261
626 261 2685 -6920 -2644 910 4909 -4090 405 559 -5340 -523 4032 3952 -7156 487 -395 82
642 82 3163 2537 -2946 -5458 6445 1757 131 -536 3403 -1624 -2079 6906 2082 -1594 -3308 4558
$$ packed form
537I90j894O640l491M523r220k175O337Q027r255m868Q429r615R739L136q930
552a627o187J2409l285q511J3862k898o995o903J2961K888o268j619J061j406
566b518m442J7834p776j2246N389J0028p117l368J3040r738k808J468R851l555
580D042l830J368l148L989J877O540j3484j9O663R15j617O84J399j0876Q912J332
596D747m01k097K66m122l310J3604k231n895o867R581p29m412O698k542n908k392
612f010J4157q087l732N813k537o686M949J2279j3886k654L711M775l492J661
626B61K424r605M276L554L999q999M495J54n899M817M555q0j1108P643q82M77
642H2L081o26n483k512J1903m688j626o67L939n027m55Q985m824l676j714P866
$$ plain form
658 4558 -1210 1499 5105 -3066 -5506 481 7835 -3760 -1491 -109 -1463 -2514 1691 3986 -4971
673 -4971 -1090 -1027 565 -1719 4032 -70 -8385 -22 4485 1502 -5886 1821 -2307 -3341 3979 2436
689 2436 -3910 -4500 4617 -2468 -271 3113 1463 -5550 -3785 6653 1139 -87 -2435 402 -3641
704 -3641 3132 5898 -3627 -3168 280 3008 -3048 4011 358 -3769 -1466 1317 2701 -1829 1967
719 1967 -3818 -2377 915 4974 -1179 -6902 1259 105 -327 -1029 3687 -5390 -5146 4089 497 -2215
735 -2215 -971 2236 -6531 137 4980 1118 -4645 -3640 4095 -700 843 1299 1528 -5710 1048 6029
751 6029 -2207 448 993 -316 -2181 6402 1508 -2001 814 -764 2663 1893 3186 -2646 -443 1340
767 1340 3154 657 -1351 4192 -4110 -1237 4932 3916 -5393 -237 3944 -3937 1814 3060 12
$$ packed form
658D558n768K709L606q171k440N987P354j1595K269J382j354j051M205K295q957
673d971L881O3J592k284N751m102q315Q363M507k983p388P707m128j034P320j543
689B436o346n90R117p085K197L384j650p013J765J0438n514j226k348K837m043
704c641O773K766r525M59L448K728o056P059l653m127K303K783J384m530L796
719A967n785J441L292M059o153n723Q161j154m32p02M716r077K44R235l592k712
735b215J244L207q767O668M843l862n763J005P735m795J543M56K29p238O758M981
751F029q236K655N45j309j865Q583m894l509K815j578L427p70J293n832K203J783
767A340J814k497k008N543q302K873O169j016r309N156M181p881N751J246l048
$$ plain form
782 12 -6659 1208 4008 -807 -3308 -580 2217 -6077 939 3944 -1430 -6509 553 2829 -4018 1080
798 1080 -401 -2701 -4177 3293 2107 -2344 -1944 -1942 2073 -1239 2095 143 -608 -1898 826 2965
814 2965 553 2804 -4285 526 4006 1536 -1361 2838 258 -4894 6422 3475 -2573 -1825 3699
829 3699 482 -1091 3609 2330 -872 -6632 5392 4858 -3520 -732 3460 -3200 -3248 8139 -1274
844 -1274 -4909 -1010 2262 -249 -1057 1586 -790 -2327 -4331 5050 565 -3761 -205 -1017 -1563 670
860 670 3139 -4999 -1223 -746 159 946 -777 -1166 -3039 703 -672 1201 -1238 -861 -1921 -2262 3436
877 3436 769 -1191 -3570 1920 -915 -452 3066 -385 -3723 -813 5343 -2479 -511 2122 -1224
892 -1224 -2611 2587 4144 -2956 -364 150 2692 -631 1183 3153 -3367 -1427 4208 3462 -4876 3186
$$ packed form
782A2o671P867K800m815k501K728K797q294P016L005n374n079P062K276o847N098
798A080j481k300j476P470j186m451M00KM015l312L334j952p51j290K724K139
814B965k412K251p089M811L480k470k897M199k580n152J1316k947o048P48N524
829C699l217j573M700j279l202n760J2024n34q378K788M192o660m8J1387r413
844a274l635L899L272k511q08K643k376j537k004R381m485m326L556q12n46K233
860F70K469q138L776M77R05P87j723l89j873L742j375J873k439L77j060l41N698
877C436k667j960k379N490k835M63L518l451l338K910O156p822J968K633l346
892a224j387N198J557p100K592N14K542l323J814J970o520J940N635p46q338Q062
$$ plain form
908 3186 1024 -3751 2259 3356 -312 -3070 1029 -695 1733 -1499 114 349 -4950 1420 2419 -2368
924 -2368 -3721 2171 -3469 -1727 3003 -2930 -2289 -2079 -726 -1206 1464 -2573 -2141 -849 -1577 2411
940 2411 -1852 -979 -1050 -807 -823 3202 374 -4194 2148 -215 -308 1106 3659 -2374 -2586 3595 2623 33
958 33 -1319 3846 -1638 -455 3945 2515 -2449 -2103 4339 -385 -233 1807 2305 -4580 -1068 5266
974 5266 -937 -1670 -388 113 -2518 1885 441 -1355 -1464 -2378 2422 -500 -552 -761 -1134 -2735 1538
991 1538 1546 -2883 1499 -2790 -1568 2779 1402 -3483 309 1234 -2320 2695 157 385 -1659 -631
1007 -631 2352 1824 -1843 467 3233 -4766 1833 4967 -1447 -2777 1621 1492 -1472 2312 -100 151
1023 151 -2343 1172 3076 -1476 -966 714 238 -2988 3278 305 -2483 -607 484 278 -193 1765
$$ packed form
908C186k162m775O010J097l668k758M099j724K428l232J613K35n299O370R99m787
924b368j353N892n640J742M730n933O41K10J353m80K670m037M32J292p28L988
940B411m263Q73p1K43j6M025k828m568O342k363r3J414K553o033k12O181r72k590
958C3j352N165n484J183M400j430m964L46O442m724J52K040M98o885L512O334
974E266o203p33J282N01k631M403j444j796j09r14M800k922n2k09l73j601M273
991A538Qm429M382m289J222M347j377m885L792R25l554N015k538K28k044J028
1007f31K983n28l667K310K766p999O599L134o414j330M398j29k964L784k412K51
1023A51k494L515J904m552N10J680m76l226O266k973k788J876J091k06m71J958
$$ plain form
1039 1765 -2458 -554 548 1470 -506 -438 430 -1967 1573 914 923 -1755 -36 985 -227 944 706
1056 706 631 -3572 2026 2358 -1281 -235 1685 -1049 -1309 4197 -492 -617 -898 382 1587 250 532
1073 532 464 -843 -2184 4275 -85 -2489 1537 -754 -1470 1671 2141 -3589 368 -218 -447 1111 -229
1090 -229 -69 -1950 -569 708 2064 -2924 -181 811 -3081 1704 2124 -1461 -2543 2125 -364 -29
1106 -29 1619 -616 -769 -1501 2133 763 548 -1051 412 -282 -199 2744 -885 -1040 -626 1854 -416
1123 -416 803 1756 -1970 -346 1391 1784 -1393 1168 -325 -1433 1506 1364 587 -1898 345 -39
1139 -39 873 -797 889 396 -3370 1617 2056 -737 -1429 1608 -1806 -792 2553 -517 -503 -1677 702
1156 702 371 114 -812 372 -1067 -1598 3085 -949 -1221 327 -231 -1662 1989 858 -2844 807 -793
$$ packed form
1039A765m223J904J102R22j976O8Q68k397L540o59Rk678J719J021j212J171k38
1056G06p5m203N598L32l639J046J920k734k60N506m689j25k81J280J205j337K82
1073E32o8j307j341O459m360k404M026k291p16L141M70n730L957n86k29J558j340
1090b29J60j881J381J277J356m988K743R92l892M785M20l585j082M668k489L35
1106b9J648k235j53p32L634j370k15j599J463o94Q3K943l629j55M14K480k270
1123d16J219R53l726J624J737L93l177K561j493j108K939j42p77k485K243l84
1139c9R12j670J686m93l766M987M39k793o92L037l414J014L345l070J4j174K379
1156G02l31k57r26J184j439n31M683m034k72J548n58j431L651j131l702L651j600
$$ plain form
1173 -793 122 531 794 -1060 -1537 213 903 803 -2230 1278 -205 -1564 1207 2048 -1058 -1802 2365
1190 2365 -399 424 1020 814 -1406 -278 2570 485 -46 -842 1142 -681 708 1435 110 -914
1206 -914 -588 1925 -413 796 85 -754 -761 1498 968 -1548 962 -1167 -618 603 1118 -1034 -1112 33
1224 33 -664 825 -1030 926 -1546 -2064 1287 1381 -1625 -1002 1736 -2528 248 2151 -294 -2025 -421
1241 -421 1227 -343 441 -537 688 -1984 -126 2095 -429 -894 -124 533 -1201 2119 -140 -1040 222
1258 222 -87 524 485 915 -1069 117 67 1111 386 -541 632 -1039 313 1084 1466 -1740 -253 1364
1276 1364 -502 278 895 721 -2065 500 1462 -261 -974 164 638 -1379 966 789 167 -1916 152
1293 152 1418 -832 66 -202 -506 -1706 1547 16 -1222 -46 -358 -222 -80 927 -969 -163 -634
$$ packed form
1173g93R15M09K63j854m77J750O90j00l033L508j483j359K771Q41l106p44M167
1190B365k764Q23N96k06k220J128K848k085n31p96J984j823J389P27j325j024
1206i14L26K513k338J209p11q39pK259n30k516K510k129N49J221N15k152p8J145
1224C3o97J489j855J956k472n18L351R4l006O23K738m264K776J903k445j731J604
1241d21J648j570P84r78J225k672J858K221k524m65P70O57j734L320k259r00J262
1258B22l09O11l9M30j984J186n0J044p25r27J173j671J352P71L82l206J487J617
1276A364j866P80O17j74k786K565R62j723p13J138M74k017K345j77o22k083K068
1293A52J266k250Q98k68l04j200L253j531j238J176l12J36J42J007j896Q06m71
$$ plain form
1310 -634 175 785 -326 550 -1369 -99 780 1000 -1110 283 777 -1291 1176 1131 -224 -1293 1020
1327 1020 459 -76 884 167 86 -1619 1473 1047 -287 -746 692 82 -871 1854 -398 -702 -441 709
1345 709 -266 -72 518 -990 -389 -382 1246 -402 -501 -175 -591 -9 665 903 -1641 156 396 338 77 754
1365 754 125 -1719 858 871 336 -965 545 -310 -270 1380 485 15 -1471 1003 172 232 476 59 -620
1384 -620 -761 1709 -199 -436 -393 -109 -889 349 647 -1362 -368 -705 300 -262 439 -208 -1206 -521 246
1403 246 402 -1463 417 -413 -506 249 700 -254 -1387 603 196 437 -153 454 -194 -706 962 516 483
1422 483 -786 1001 -251 13 1282 182 -310 -589 1150 -144 750 -46 -337 -328 447 784 -825 106
1440 106 -427 -111 -416 583 -83 -1353 -387 -14 -10 -610 746 -975 -1209 249 561 -418 -1344 580 -535
$$ packed form
1310f34Q09O10j111Q76j919J270Q79K20k110J393M94k068K467m5j355j069K313
1327A020n61n35R60p17q1j705L092m26j334m59J438o10r53K725k252l04K61J150
1345G09r75J94N90j508O01PJ628j648r9L26m16N82O74K38k544J797K40n8k61O77
1365G54o29j844K577J3n35j301J510q55M0J650q95m70j486K474q31O0K44m17o79
1384f20j41K470j908k37M3K84p80J238K98k009R94l37J005n62P01o47r98O85P67
1403B46J56j865J880q30r3P55M51r54j133J990m07K41n90O07o48n12J668m46l3
1422D83j269J787j252K64J269j100m92k79J739j294Q94p96k91RP75L37j609R31
1440A06n33L16l05R99o66j270R66L73Mo00J356j721k34J458L12r79r26J924j115
$$ plain form
1459 -535 -249 215 295 -899 -1168 546 -134 -60 -484 257 -1149 -102 1079 -260 -234 -657 353 -303 642
1478 642 -89 -445 -3 -197 609 86 687 -710 -419 67 651 450 -672 208 -550 135 362 989 -919
1497 -919 -607 714 27 218 -129 858 -1253 -444 877 515 -405 -632 902 -672 -23 518 59 -1316
1515 -1316 -42 790 -228 58 -190 125 -986 301 508 -172 -353 -487 137 -388 724 -512 -524 -184
1533 -184 -80 165 -243 424 -840 155 88 450 -314 -197 143 -612 475 403 515 -1174 -89 365 100
1552 100 -48 349 324 -1080 787 677 64 -406 444 428 -727 714 352 -56 -525 668 559 -26 370
1571 370 -310 -15 -320 1091 -204 -231 -44 179 197 -73 767 -665 -399 -157 454 66 329 99 -1117
1590 -1117 487 365 258 -907 297 -74 -338 315 185 279 -1036 618 161 -5 284 -6 -299 -387 715
$$ packed form
1459e35K86M64Q0j194k69J714o80P4m24P41j406J047J181j339K6m23J010o56R45
1478F42p31l56M42j94Q06n23O01j397K91M86N84k01j122Q80p58O85K27O27j908
1497i19L12J321o87J91l47R87k111Q09J321l62r20k27J534j574O49N41m59j375
1515a316J274Q32j018K86k48L15j111J287K07o80j81j34O24n25J112j236j2L40
1533a84J04K45m08O67j264R95o7L62p64J17L40p55J087p2J12j689J085M54k65
1552A00j48L97k5j404J867j10o13m70Q50j6j155J441l62m08m69J193j09n85L96
1571C70o80K95l05J411j295k7J87K23J8k70Q40j432K66K42O11l88K63k30j216
1590a117J604j22j07j165J204l71k64O53j30R4j315J654m57j66K89k90k93q8J102
$$ plain form
1609 715 -216 -72 -264 103 -43 232 962 -324 -94 -190 902 -300 101 340 -257 -119 363 753 -556
1628 -556 -25 84 281 84 525 299 -811 356 300 161 -167 384 189 -443 477 442 203 -559 50 -10
1648 -10 -3 355 165 -212 -447 749 -265 157 -134 -4 -440 -188 512 -564 135 -403 259 -152 591 284
1668 284 -713 -125 262 217 -383 632 -237 -417 55 287 33 -866 796 -198 25 149 669 -302 -969 478
1688 478 21 -28 -474 240 -530 -369 421 339 -183 -669 465 -91 119 66 3 -238 -259 359 -236 183 -457
1709 -457 -2 -160 98 133 -254 365 -226 97 -257 602 -289 -555 459 -66 33 76 372 -651 -87 574
1729 574 496 -237 -391 502 -588 -96 193 422 -855 -254 567 -112 -217 -184 257 -474 336 550 -76 -323
1749 -323 -513 197 -77 45 -264 130 -229 -133 319 -92 101 -330 -71 -277 360 -252 -184 -106 -470 172 50
$$ packed form
1609G15r31J44j92L67j46K75P30j286K30r6J092j202M01K39n97J38M82L90j309
1628e56N31J09J97j97M41k26j110J167n6j39l28N51j95o32R20l5k39p62O09o0
1648a0PL58j90l77k35J196j014M22k91J30m36K52P00j076O99n38O62m11P43l07
1668B84r97N88L87m5o00J015q69j80M72K32k54q99J662r94K23J24N20r71o67J447
1688D78m57m9m46P14p70J61P90q2n22m86J134n56K10n3o3k41k1O18n95M19o40
1709d57M55j58K58L5l87O19n91L23l54Q59q91k66J014n25R9M3K96j023N64O61
1729E74p8p33j54Q93j090M92K89K29j277O01Q21o79j05L3M41p31Q10K14o26k47
1749c23j90P10k74J22l09L94l59R6M52m11J93m31K59k06O37o12O8P8l64O42j22
$$ plain form
1770 50 185 -500 -65 209 -189 -36 -140 325 -688 -97 383 52 -379 4 313 -442 551 143 -155 -347
1790 -347 430 322 -152 97 -102 189 -409 701 249 -44 -11 214 145 -141 573 -66 -101 101 408 -86 -44
1811 -44 292 -359 507 55 81 -205 -22 204 -157 89 31 342 -725 181 93 78 -74 127 -58 -461 285
1832 285 -163 -88 -455 -27 -13 -357 139 -183 -215 -502 217 191 19 -42 -256 -106 -161 811 -504 -92 10 46
1854 46 35 394 -69 -354 -79 42 477 -109 317 124 -323 311 413 151 -458 337 284 131 358 11 56
1875 56 -256 343 -138 343 90 68 117 -9 701 -122 21 -272 267 -57 91 267 -450 130 30 155 -281
1896 -281 65 -49 -435 -158 199 140 -514 -116 70 -84 -179 81 -168 -457 23 218 -165 -527 85 -256 -475
1917 -475 468 248 -110 -374 111 -252 73 186 119 -259 -414 469 73 90 -12 27 -66 122 320 -118 130
$$ packed form
1770E0J35o85M35K74l98J53j04M65j013N91M80l31m31L83L09p55R93m08k98j92
1790c47P77j08m74K49j99K91n98J110m52k93L3K25o9k86P14o39l5K02L07m94M2
1811d4L36o51Q66m52K6k86J83K26l61K46n8L11j067R06q8j5j52K01j85m03P46
1832B85m48P5l67M28J4l44M96l22l2k87P19k6j72o1k14J50n5R72j315M12J02L6
1854D6j1L59m63k85K75J21M35n86M26j93m47O34J02k62o09P95n3j53K27l47M5
1875E6l12N99m81M81k53k2M9j26P10q23J43k93N39l24J48J76p17N80j00J25m36
1896b81L46j14l86K77L57n9o54L98J86j54r5K60k49k89M80J95l83l62O12l41k19
1917d75R43k20l58k64M85l63L25J13o7l78j55Q83l96J7j02L9r3J88J98m38K48
$$ plain form
1938 130 -169 240 81 472 28 -245 242 -223 215 -382 310 -253 -302 221 260 -236 -360 572 -444 1
1958 1 88 354 -243 -387 242 26 -5 -529 161 -274 -120 87 -83 -233 -143 61 -435 29 -217 -349 -384 47
1980 47 193 -104 -110 -196 -124 -49 382 56 -23 108 -69 204 -58 665 -27 -103 178 320 208 -271 227 -203 35
2003 35 354 344 -42 -113 484 -11 233 166 161 -242 83 79 94 89 -423 173 -340 110 -16 -192 6 -19 -77 -276
2027 -276 125 -207 -101 -79 -117 -58 -181 226 -401 -209 -88 624 30 -168 131 25 380 35 335 -161 41
2048 41 209 -96 34 -207 183 -304 313 258 186 -216 5 147 -69 218 5 -2 -65 482 65 170 -108 -54
2070 -54 -173 -79 464 -521 56 72 43 -15 -38 134 -353 45 248 270 -143 -205 168 -365 -100 280 279 -476 156
2093 156 -3 67 -46 90 242 -260 174 353 -129 -186 -208 0 -230 232 135 -221 -118 48 5 -32 54 -126
$$ packed form
1938A30k99M09j59L91m44k73M87m65M38n97O92n63m9N23L9m96j24R32j016M45
1958AQ7K66n97j44O29k16l1n24O90m35J54K07j70j50R0K04m96M64k46j32l5M31
1980D7J46k97oq6P2P5M31l26p9J31j77K73k62P23o92p6K81J42j12m79M98m30K38
2003C5L19j0l86p1N97m95K44o7nm03L25mJ5nn12N96n13M50j26j76J98k5n8j99
2027b76M01l32J06K2l8N9j23M07o27J92J21P12n94j98K99j06L55l45L00m96K02
2048D1J68l05J30k41L90m87O17n5p2m02K21J42k16K87k13po3N47m17J05k78N4
2070e4j19R4N43r85N77J6k9n8k3J72m87L98K03K2m13o2L73n33K65L80jp55O32
2093A56j59P0j13J36J52n02M34J79m82n7k2K08k30M62r7l56J03J66m3l7Q6j80
$$ plain form
2115 -126 113 70 342 -250 133 53 -101 -36 267 231 -406 190 309 117 -35 185 189 -190 94 178 -30 -253
2137 -253 186 -238 -190 -113 -265 30 -558 238 37 -247 56 -59 -300 -361 363 -8 50 -100 4 -56 171 445
2159 445 -163 63 -49 69 -20 205 -128 141 3 -40 367 -68 299 165 -173 296 250 271 -97 176 -73
2180 -73 -8 53 374 -47 -320 367 219 264 -107 340 -207 -394 -74 -92 -248 -415 253 -390 -48 14 -288 -129
2202 -129 -251 60 -319 56 -308 -83 -195 139 -74 -117 -144 -124 61 -334 283 -39 -218 -192 226 -163 -313
2223 -313 19 -489 -92 34 153 -150 -102 145 166 159 -62 134 -240 0 132 139 -100 -226 284 -162 182 118
2245 118 75 9 267 307 -7 284 -269 30 -32 184 -21 -34 195 -283 -87 -98 178 -302 -185 165 44 -4
2267 -4 -216 335 -362 225 -9 -156 -209 -197 137 -507 -143 119 41 -270 -235 -64 69 200 45 -31 -542 140
$$ packed form
2115a26K39m3K72n92L83q0j54O5L03l6o37N96J19j92j52K20Ml79K84Q4k08k23
2137b53M39m24M8P7j52K95n88P96k01k84L03j15k41o1P24l71N8j50J04o0K27K74
2159D45o08K26j12J18q9K25l33K69j38m3M07m35L67j34l38M69m6K1l68K73k49
2180g3O5O1L21m21k73O87j48M5l71M47n47j87L20j8j56j67O68o43L42O2l02J59
2202a29j22L11l79L75l64K25j12L34k13m3k7K0J85l95O17l22j79K6M18l89j50
2223c13L32n08L97J26J19l03M8K47K1pk21J96l74K40J32Pk39j26N10m46L44o4
2245A18m3o6K58M0l14K91n53K99o2K16k05j3K29m78J96j1K76m80J17L50j21m8
2267dk12N51o97N87k34j47n3J2L34o44L64K62p8l11L5J71J33J31j55p6n11O82
$$ plain form
2289 140 49 161 -72 -29 -160 -134 108 24 141 -260 140 221 -12 216 -150 182 42 136 148 147 53 -281 -119
2312 -119 -57 95 -70 73 -30 -33 -32 66 47 -419 -209 -74 -337 -215 19 98 -215 -56 134 -63 -197 84 -33
2335 -33 28 199 -33 -103 33 214 -70 230 62 17 -93 -95 250 -83 132 19 -371 -55 -33 317 -207 172
2357 172 -62 56 -270 137 105 275 338 179 155 -318 253 -258 138 113 103 -88 -187 141 47 -62 150 -121
2379 -121 -123 194 127 12 -123 -180 224 -79 0 -105 -146 -7 -151 211 -204 -171 -91 42 -127 -42 86 -349 58
2402 58 20 10 -336 154 39 -26 -16 290 -37 -114 187 -190 -79 -82 401 48 16 -14 -56 47 164 41 -51 -158
2426 -158 157 -291 203 -147 -149 -48 49 137 -212 -25 -44 179 -338 128 -143 -81 217 153 85 -147 146 99 -31
2449 -31 -15 92 72 -224 69 117 125 149 34 -155 105 -5 91 175 -60 115 -334 0 134 73 9 -251 217 -254
$$ packed form
2289A40r1J12k33M3j31K6K42q4J17m01M00Q1k33K28l66L32j40R4J2jr4l34J62
2312a19O2J52j65J43j03lJR8j9m66K10J35k63J22K34P9l13J59J90j97j34K81j17
2335c3O1J71k32p0J36J81k84L00j68m5j10kL45l33K15j13l90L16K2L50n24L79
2357A72k34J18l26M07l2J70O3j59k4m73N71n11L96k5j0j91r9L28r4j09K12k71
2379a21kL17o7j15j35n7M04l03P9j05m1J39j44L62m15L3Q0J33j69Q5J28m35M07
2402E8l8j0l46M90j15o5J0L06l27p7L01l77J11lM83l53l2l0m2J03J17j23r2j07
2426a58L15m48M94l50kJ01R7Q8l49J87j9K23n17M66k71O2K98o4o8k32K93m7j30
2449c1J6J07k0k96K93M8QK4j15j89K60j10R6Q4k35J75m49L34J34o1o4k60M68m71
$$ plain form
2473 -254 -89 160 233 81 67 -15 202 210 -148 214 -366 -55 63 51 34 -269 146 -212 406 -325 -60 107
2495 107 152 20 -159 83 -294 30 161 132 -156 64 133 202 159 -100 159 -294 244 -142 -49 -54 -147 59 -49
2518 -49 234 132 82 -169 248 -179 32 250 10 100 53 79 161 -72 228 15 -60 24 231 134 -43 286 -122
2541 -122 -23 20 121 -308 -27 -223 298 -211 152 4 -193 315 -53 22 -184 -70 -54 154 299 172 80 -238
2563 -238 193 66 -33 189 122 165 -1 79 -25 119 110 128 164 36 -25 -187 -139 49 161 -218 -115 188 113 57
2587 57 238 243 -56 -128 74 79 44 147 -74 -252 123 -108 349 40 -124 -66 79 98 -243 25 12 177 -95
2610 -95 220 218 -184 116 -112 194 -55 206 121 -176 -55 -1 68 -91 139 -58 102 -108 -4 22 119 133 26
2633 26 162 -22 62 120 -90 -58 69 -78 -356 8 -125 59 -148 -68 -324 32 76 -88 113 -242 78 -14
$$ packed form
2473b54J65K49P3j52j4q2K17Ql58L62n80L11J18j2j7l03M15l58O18p31K65J67
2495A07M5j32j79K42l77L24J31k9k88K20O9O9m3k59K59m53N38l86R3nr3K06j08
2518d9K83j02n0k51M17m27K11K18k40R0m7K6Q2k33L00k13p5Q4K07r7j77L29m08
2541a22R9M3J01m29K81j96N21n09L63j48j97N08l68P5k06J14J6K08J45j27r2l18
2563b38M31j27r9K22o7M3j66Q0j04J44rJ8L6j28o1j62M8J88J12l79J03L03p5n6
2587E7J81Nk99p2K02Nl5J03k21j78L75k31M57l09j64N8J45J9l41K68j3J65k72
2610i5L15km02L00k28L06k49K61q5k97J21N4O9j59K30j97J60k10J04K6R7J4j07
2633B6J36j84Q4N8k10L2J27j47k78L64j33J84k07Q0k56L56M4j64K01l55L20r2
$$ plain form
2655 -14 63 -120 -66 -167 -84 102 -320 35 -167 -57 -263 16 91 -72 175 -141 -31 17 16 273 -39 196 -32
2678 -32 121 -12 23 -52 -97 161 148 24 -119 122 -69 162 137 71 -41 145 164 -94 281 -76 -177 -64 -25
2701 -25 280 -131 4 -132 77 -109 -49 77 89 35 68 -20 -194 177 -492 -73 -80 -179 13 66 111 -14 60 -20
2725 -20 4 -170 -158 156 -187 27 -189 43 -166 37 45 9 77 148 6 -204 26 300 245 276 138 -31 -296
2748 -296 33 -231 21 -68 246 -16 -134 56 -30 -112 -83 -42 -115 43 -83 79 -31 -268 53 -37 43 186 80
2771 80 -46 128 -108 -214 -8 -271 -22 -120 -152 -5 -16 198 -103 32 -375 124 25 83 35 -104 -40 -40 94
2794 94 -102 -65 -34 206 208 197 -138 -240 -224 -158 239 -67 94 265 13 36 -162 70 -46 49 -176 16 98 57
2818 57 -166 -89 -116 5 135 -150 96 -10 -364 152 106 -85 33 167 -148 -187 -8 -29 -88 53 138 -108 125
$$ packed form
2655a4P7j83N4j01Q3J86m22L55k02J10k06K79P5j63K47l16J10M8jK57l12K35k28
2678c2J53j33L5p5m5K58j3j24j43K41j91K31k5o6j12J86J9k58L75l57j01J13L9
2701b5L05m11J35j36K09j86O0J26J2n4L3q8j74L71o69M19pr9J92N3M5j25P4q0
2725b0K4j74J2L14l43K14k16K32k09K03Ql6O8P1j42k10K30K74n5L1j38j69k65
2748b96L29k64K52q9L14k62j18J90q6q2K9M1p3J58j26J62j10k37L21r0Q0J43j06
2771H0j26J74k36j06K06k63K49r8l2J47j1K14l01J35m07M99r9N8m8j39O4%J34
2794I4j96L7L1K40Kj1l35j02J6O6L97l06J61J71k52K3j98K32j16R5k25J92Q2m1
2818E7k23P7k7J21J30k85K46j06l54N16m6j91J18J34l15l9J79k1n9J41Q5k46K33
$$ plain form
2841 125 -16 73 -210 -33 95 -77 19 -8 7 -182 173 -142 -161 79 -58 -14 -134 102 -14 -109 102 -178
2863 -178 187 -270 -10 12 3 -88 -94 -27 -12 79 -155 82 -221 82 -81 127 -34 -173 -146 107 115 -109 -74 55
2887 55 -114 -52 -5 -85 -187 -59 23 15 -19 18 79 -226 -96 -101 153 -94 -25 -104 145 -40 -207 15 -244 -72 -8
2912 -8 70 -55 3 -190 -93 -10 69 8 191 272 77 -133 -64 58 36 111 135 -150 113 30 81 -26 183 21 -69
2937 -69 152 13 -51 -162 199 -101 -66 228 125 79 124 90 -287 -28 -189 -93 202 -33 -105 -169 -219 66 132 -57
2961 -57 172 14 -100 77 -282 -15 0 279 2 74 -42 80 43 -38 161 -120 346 77 -4 -11 -191 165 -84
2984 -84 -37 -111 253 -180 -30 332 135 -49 120 248 -61 -83 -64 -239 12 -131 37 -165 -164 -110 277 100 45
3007 45 -26 190 224 -174 168 58 -113 147 -123 122 -29 0 -276 -15 -1 -50 -17 -210 -363 218 286 -293 13
$$ packed form
2841A25j41Q9k83J77J28j72R6k7J5j89L55l15j9K40j37M4j20K36j16r5K11k80
2863a78L65m57K60K2rr1oO7J5R1k34K37l03L03j63K08j61j39K7K53Qk24L5J29
2887E5j69O2M7q0j02J28Q2ql4L7O1l05J30nK54k47O9p9K49j85j67K22k59J72O4
2912hP8j25N8j93R7Q3P9o1J83Q1j95k10O9J22k2P5K4k85K63q3N1j07K09j62r0
2937f9K21j39o4j11L61l00L5K94j03m6M5l4l77K59j61R6K95k35p2o4n0K85O6j89
2961e7K29j58j14J77l59K67J5K79k77P2j16J22l7q1J99k81M66k69q1pj80L56k49
2984h4M7p4L64m33J50L62j97j84J69J28l09k2J9j75K51j43J68k02JN4L87j77n5
3007D5p1K16L4l98L42j10j71K60k70K45j51K9k76K61J4m9L3j93j53N81O8n79L06
$$ plain form
3030 13 -269 -276 -239 -154 114 50 92 -76 51 227 115 52 104 122 -22 51 -23 92 -67 23 95 -94 290 -302 57
3055 57 -176 -145 10 34 -75 195 40 -78 154 73 82 -38 63 175 3 407 -184 -47 11 -114 -31 100 -151
3078 -151 -113 54 35 217 -107 51 -168 -307 -136 -379 47 8 -168 -101 -106 -2 92 -50 -88 307 -175 9 -262
3101 -262 50 112 -233 -97 -141 225 -4 76 -326 212 124 264 -23 81 25 -130 -22 166 -35 -155 78 -35
3123 -35 -151 227 -55 33 -245 187 5 48 25 -88 248 107 54 163 159 -294 147 210 111 -190 -50 -295 -179
3146 -179 -170 -159 119 -119 65 182 20 290 -50 -205 102 56 236 87 -2 154 135 149 194 -116 -45 -160 -124
3169 -124 383 -107 -77 -103 20 -82 -33 59 163 24 -148 160 117 4 29 -218 0 -43 90 220 -235 53
3191 53 63 -33 -36 -60 -18 96 -150 -116 24 -13 -202 -144 -116 -12 245 -153 -15 64 -236 -260 78 162 91 25 -1 -109
$$ packed form
3030A3k82pL7Q5K68o4M2j68J27J76j12o3N2J8j44P3p4J15j59R0P2j89L84n92L59
3055E7k33L1J55K4j09K70j55j18K32q1Rj20J01J12j72M04n91J37N8j25Q3J31k51
3078a51L8J67j9J82l24J58k19j39J71k43M26l9j76O7nJ04R4j42l8L95m82J84k71
3101b62L12O2l45J36m4L66k29Q0m02N38q8J40k87J04n6j55J08J88k01j20K33j13
3123c5j16L78k82Q8k78M32j82M3k3j13L36j41n3J09mm53M41O3r9l01J40k45J16
3146a79RJ1K78k38J84J17j62K70l40j55L07m6J80j49q9J56j9J4M5l10P1j15L6
3169a24N07m90L0k6J23j02M9R2J04j39j72L08m3j13K5k47K18m3J33J30m55K88
3191E3J0r6lk4M2J14k46L4J40l7j89N8K8J04K57l98J38P9l00k4L38Q4p1o6k6j08
$$ plain form
3217 -109 -168 -227 9 -27 60 133 -255 33 -253 -263 -40 77 164 93 42 93 -133 -213 -66 -109 236 74 56 -144
3241 -144 -8 60 308 -138 -49 52 -59 -128 -1 178 59 39 -36 6 -147 161 170 46 148 59 -51 -22 42 4
3265 4 -301 -5 66 -6 46 -84 -58 167 120 -150 -48 54 -69 -36 -102 -305 -190 -8 43 171 26 149 -97
3288 -97 6 156 -114 -61 -71 41 -167 -120 -141 -78 -158 193 95 -147 113 51 128 27 -69 200 64 33 -18 -24 -65
3313 -65 100 -87 85 -13 -234 79 -140 10 -74 -188 100 -67 12 -89 -8 79 -31 -255 -70 -30 -173 -24
3335 -24 -2 12 -105 85 182 167 -199 -232 -86 170 34 249 220 54 110 -14 -138 77 94 130 -228 142 -25
3358 -25 61 60 -33 -7 300 -151 -24 2 -161 47 -202 82 26 -147 110 -95 124 157 169 82 189 122 171 94 -201
3383 -201 51 104 395 -99 80 -6 -103 145 111 4 64 31 -47 -21 11 3 5 -50 18 85 103 91 -91 114 -141 -171
$$ packed form
3217a09n9n9K36l6Q7P3l88K88k86j0K23J17Q7p1n1N1k26q0J47m3L45j62j8k00
3241a44J36O8K48m46Q9J01j11o9J27J79j19k0p5M2j53L08Rj24J02q9j10K9O4l8
3265Dl05K96P1p2N2j30K6K25m7k70J02J02j23L3o6k03J15J82N1J28j45J23k46
3288i7J03J50k70N3j0J12k08M7k1O3q0L51r8k42K60o2P7j01r6K69j36l1n1om1
3313f5J65j87J72r8k21L13k19J50q4j14K88j67P9j01Q1Q7j10k24J85M0j43J49
3335b4K2J4j17J90R7j5l66l3J46K56j36K15k9j66N6j24j24K15J7L6l58L70j67
3358b5Q6jr3K6L07m51J27K6j63K08k49K84n6j73K57k05K19L3J2q7J07o7M9p7k95
3383b01K52N3K91m94J79q6r7K48l4j07O0l3p8K6L2qKn5O8O7J8j2j82K05k55l0
$$ plain form
3409 -171 -141 143 -51 -460 -49 -6 118 31 -88 148 71 164 -61 8 -132 175 -16 7 -280 -130 -138 79 27
$$ packed form
3409a71L0K84j94m09M11M3J24q7j19K36p7R3k25O9j40L07j91K3k87J50qK17n2
$$ [...]
8191c7
##END NTUPLES=NMR FID
##END=
