##TITLE=1H_CA-8756-2
 DMSO, 8 sc, 
 4.9.2020
##JCAMPDX= 6.0         $$ Bruker NMR JCAMP-DX V2.0
##DATA TYPE= NMR FID
##DATA CLASS= NTUPLES
##ORIGIN= UXNMR, Bruker Analytische Messtechnik GmbH
##OWNER= root
$$ XWIN-NMR		Version 3.5
$$ Fri Sep  4 10:31:56 2020 Russian Standard Time (UT+4h)  she@DPX200
##.OBSERVE FREQUENCY= 200.1315066352
##.OBSERVE NUCLEUS= ^1H
##.DELAY= (6, 6)
##.ACQUISITION MODE= SIMULTANEOUS
##.ACQUISITION SCHEME= undefined
##.AVERAGES= 8
##.DIGITISER RES= 18
##SPECTROMETER/DATA SYSTEM= spect
##.PULSE SEQUENCE= zg30
##.SOLVENT NAME= DMSO
##.SHIFT REFERENCE= (INTERNAL, DMSO, 0, 15.7039)
##AUDIT TRAIL= $$ (NUMBER, WHEN, WHO, WHERE, WHAT)
$$ ##TITLE= Audit trail, XWIN-NMR		Version 3.5
$$ ##JCAMPDX= 5.01
$$ ##ORIGIN= Bruker BioSpin GmbH
$$ ##OWNER= she
$$ F:/spectra/data/she/nmr/H-F/1/audita.txt
$$ ##AUDIT TRAIL=  $$ (NUMBER, WHEN, WHO, WHERE, WHAT)
(   1,<2020-09-04 10:30:41.10 +0400>,<she>,<DPX200>,
      <created by zg, POWCHK disabled, PULCHK disabled
       configuration hash MD5:
       00 E9 B6 7A A2 85 ED C7 34 08 36 98 17 FE 4E 26
       data hash MD5: 16K
       2E C7 D9 B1 8A F1 C9 C6 CC F3 46 66 AF CD E7 19>)
$$ ##END=
$$ 
$$ hash MD5
$$ D6 F9 A3 3A 14 98 CF 6E FB 59 5F 32 78 F1 AE 68
##$RELAX= 
##$RELAX= 
##$RELAX= 
##$RELAX= 
##$RELAX= 
##$RELAX= 
$$ Bruker specific parameters
$$ --------------------------
##$DU= <F:/spectra>
##$EXPNO= 1
##$NAME= <H-F>
##$PROCNO= 1
##$TYPE= <nmr>
##$USER= <she>
##$AMP= (0..31)
100 100 100 100 100 100 100 100 100 100 100 100 100 100 100 100 100 100 
100 100 100 100 100 100 100 100 100 100 100 100 100 100 
##$AQSEQ= 0
##$AQ_mod= 1
##$AUNM= <au_zg>
##$AUTOPOS= <>
##$BF1= 200.13
##$BF2= 200.13
##$BF3= 200.13
##$BF4= 200.13
##$BF5= 200.13
##$BF6= 200.13
##$BF7= 200.13
##$BF8= 200.13
##$BYTORDA= 1
##$CFDGTYP= 0
##$CFRGTYP= 5
##$CHEMSTR= <none>
##$CNST= (0..31)
1 1 145 1 1 1 1 1 1 1 1 1 1 1 1 1 1 1 1 1 1 1 1 1 1 1 1 1 1 1 1 1 
##$CPDPRG= <>
##$CPDPRG1= <>
##$CPDPRG2= <>
##$CPDPRG3= <>
##$CPDPRG4= <mlev>
##$CPDPRG5= <mlev>
##$CPDPRG6= <mlev>
##$CPDPRG7= <mlev>
##$CPDPRG8= <mlev>
##$CPDPRGB= <>
##$CPDPRGT= <>
##$D= (0..31)
0 1.2 0 0 0 0 0 0 0 0.06 0 0.03 0 0 0 0 0.0002 0 0 0 0 0 0 0 0 0 0 0 0 
0 0 0 
##$DATE= 1599201040
##$DBL= (0..7)
120 120 120 120 120 120 120 120 
##$DBP= (0..7)
150 150 150 150 150 150 150 150 
##$DBP07= 0
##$DBPNAM0= <>
##$DBPNAM1= <>
##$DBPNAM2= <>
##$DBPNAM3= <>
##$DBPNAM4= <>
##$DBPNAM5= <>
##$DBPNAM6= <>
##$DBPNAM7= <>
##$DBPOAL= (0..7)
0.5 0.5 0.5 0.5 0.5 0.5 0.5 0.5 
##$DBPOFFS= (0..7)
0 0 0 0 0 0 0 0 
##$DE= 6
##$DECBNUC= <off>
##$DECIM= 32
##$DECNUC= <off>
##$DECSTAT= 4
##$DIGMOD= 1
##$DIGTYP= 9
##$DL= (0..7)
0 120 120 120 120 120 120 120 
##$DP= (0..7)
150 150 150 150 150 150 150 150 
##$DP07= 0
##$DPNAME0= <>
##$DPNAME1= <>
##$DPNAME2= <>
##$DPNAME3= <>
##$DPNAME4= <>
##$DPNAME5= <>
##$DPNAME6= <>
##$DPNAME7= <>
##$DPOAL= (0..7)
0.5 0.5 0.5 0.5 0.5 0.5 0.5 0.5 
##$DPOFFS= (0..7)
0 0 0 0 0 0 0 0 
##$DQDMODE= 0
##$DR= 18
##$DS= 0
##$DSLIST= <SSSSSSSSSSSSSSS>
$$ [...]
##$SUBNAM2= <"">
##$SUBNAM3= <"">
##$SUBNAM4= <"">
##$SUBNAM5= <"">
##$SUBNAM6= <"">
##$SUBNAM7= <"">
##$SUBNAM8= <"">
##$SUBNAM9= <"">
##$SW= 16.880792210976
##$SWIBOX= (0..15)
0 0 2 0 0 0 0 0 0 0 0 0 0 0 0 0 
##$SW_h= 3378.37837837838
##$TD= 16384
##$TD0= 1
##$TE= 0
##$TE2= 300
##$TE3= 300
##$TEG= 300
##$TL= (0..7)
0 120 120 120 120 120 120 120 
##$TP= (0..7)
150 150 150 150 150 150 150 150 
##$TP07= 0
##$TPNAME0= <>
##$TPNAME1= <>
##$TPNAME2= <>
##$TPNAME3= <>
##$TPNAME4= <>
##$TPNAME5= <>
##$TPNAME6= <>
##$TPNAME7= <>
##$TPOAL= (0..7)
0.5 0.5 0.5 0.5 0.5 0.5 0.5 0.5 
##$TPOFFS= (0..7)
0 0 0 0 0 0 0 0 
##$TUNHIN= 0
##$TUNHOUT= 0
##$TUNXOUT= 0
##$USERA1= <user>
##$USERA2= <user>
##$USERA3= <user>
##$USERA4= <user>
##$USERA5= <user>
##$V9= 5
##$VALIST= <valist>
##$VCLIST= <CCCCCCCCCCCCCCC>
##$VD= 0
##$VDLIST= <DDDDDDDDDDDDDDD>
##$VPLIST= <PPPPPPPPPPPPPPP>
##$VTLIST= <TTTTTTTTTTTTTTT>
##$WBST= 1024
##$WBSW= 4
##$XGAIN= (0..3)
0 0 0 0 
##$XL= 0
##$YL= 0
##$YMAX_a= 257784
##$YMIN_a= -203296
##$ZGOPTNS= <>
##$ZL1= 120
##$ZL2= 120
##$ZL3= 120
##$ZL4= 120
##$ABSF1= 10
##$ABSF2= 0
##$ABSG= 5
##$ABSL= 3
##$ALPHA= 0
##$AQORDER= 0
##$ASSFAC= 0
##$ASSFACI= 0
##$ASSFACX= 0
##$ASSWID= 0
##$AUNMP= <proc_1d>
##$AZFE= 0.1
##$AZFW= 0.1
##$BCFW= 1
##$BC_mod= 2
##$BYTORDP= 1
##$COROFFS= 0
##$CY= 11.3945322036743
##$DATMOD= 1
##$DC= 2
##$DFILT= <>
##$DTYPP= 0
##$F1P= 16.9975609425685
##$F2P= -3.02152046262296
##$FCOR= 0.5
##$FTSIZE= 0
##$FT_mod= 4
##$GAMMA= 1
##$GB= 0.15
##$INTBC= 1
##$INTSCL= 1
##$ISEN= 128
##$LB= 0.24
##$LEV0= 0
##$LPBIN= 0
##$MAXI= 10000
##$MC2= 0
##$MEAN= 0
##$ME_mod= 0
##$MI= 1.114404
##$NCOEF= 0
##$NC_proc= 0
##$NLEV= 6
##$NOISF1= 3.799351
##$NOISF2= 2.8
##$NSP= 1
##$NTH_PI= 0
##$NZP= 0
##$OFFSET= 15.70392
##$PC= 1
##$PHC0= -9974.393
##$PHC1= 11.0009
##$PH_mod= 1
##$PKNL= yes
##$PPARMOD= 0
##$PSCAL= 0
##$PSIGN= 0
##$REVERSE= no
##$SF= 200.130013532006
##$SI= 16384
##$SIGF1= 3
##$SIGF2= 2
##$SINO= 400
##$SIOLD= 16384
##$SREGLST= <1H.CDCl3>
##$SSB= 0
##$STSI= 0
##$STSR= 0
##$SW_p= 3612.71676300578
##$SYMM= 0
##$S_DEV= 0
##$TDeff= 0
##$TDoff= 0
##$TI= <>
##$TILT= no
##$TM1= 0
##$TM2= 0
##$TOPLEV= 0
##$USERP1= <user>
##$USERP2= <user>
##$USERP3= <user>
##$USERP4= <user>
##$USERP5= <user>
##$WDW= 1
##$XDIM= 8192
##$YMAX_p= 0
##$YMIN_p= 0
$$ End of Bruker specific parameters
$$ ---------------------------------
##NTUPLES= NMR FID
##VAR_NAME=  TIME,          FID/REAL,        FID/IMAG
##SYMBOL=    X,             R,               I
##VAR_TYPE=  INDEPENDENT,   DEPENDENT,       DEPENDENT
##VAR_FORM=  AFFN,          ASDF,            ASDF
##VAR_DIM=   8192,          8192,            8192
##UNITS=     SECONDS,       ARBITRARY UNITS, ARBITRARY UNITS
##FACTOR=    0.000296,      1,               1
##FIRST=     0,             0,               0
##LAST=      2.424536,      0,               0
##MIN=       0,             -203296,         0
##MAX=       2.424536,      257784,          0
$$ Real data points
##PAGE= N=1
##DATA TABLE= (X++(R..R)), XYDATA
0 0 0 0 0 0 0 0 0 0 0 0 0 0 0 -6 8 -8 8 -8 16 -16 17 -24 25 -32 40 -45 51 -60 69 -80 92 -107 118 -136 154
35 154 -174 194 -218 245 -273 305 -339 378 -418 463 -511 566 -625 688 -758 834 -921 1013
53 1013 -1117 1233 -1363 1509 -1677 1869 -2096 2360 -2682 3078 -3583 4248 -5173 6562 -8908
68 -8908 14005 -55120 52967 -75759 -203296 20505 -64842 -181735 -9696 -33185 -182636
79 -182636 -1075 17270 -165308 -53001 57452 -127091 -69588 64899 -64254 -57397 62175
90 62175 -39316 -58092 74103 -5486 -47116 90318 33387 -43265 81288 59823 -43923
101 -43923 90777 93067 -29188 81243 118390 -27271 49607 144774 -7185 29171 160220
112 160220 23632 -11474 146276 52318 -37121 132106 86093 -39493 93182 106209 -46931
123 -46931 45748 121745 -26096 14403 116864 -1461 -21152 95081 11549 -32265 82978
134 82978 31144 -33415 53980 39934 -39569 33357 45083 -26829 30017 47497 -27127 13378
146 13378 53006 -27802 9243 64808 -13356 639 64042 -6201 -18498 72649 13921 -24514
158 -24514 73204 39575 -36488 51769 61479 -35344 40606 81872 -18546 15663 86565 -3268
170 -3268 -10917 86519 23705 -15658 71258 43124 -25410 47454 53807 -20318 34182 60339 -6060
183 -6060 10640 51454 -2479 -925 46152 6064 -1138 36080 7653 -14336 25581 6110 -13054
196 -13054 25026 6993 -16848 15488 7871 -30082 11164 18486 -27777 4198 23753 -28019
208 -28019 -13646 29567 -22236 -20757 35441 -4700 -33167 23798 11142 -39808 16063 27122
220 27122 -28628 3764 35191 -22499 -14668 38653 -5719 -16954 33791 12831 -21861 19901
232 19901 19468 -20339 15256 27091 -9310 4059 25847 -7409 -3779 22226 -98 419 19289
245 19289 2620 -7119 15402 467 -9306 17096 4633 -9091 12907 5080 -20280 10196 11281
258 11281 -20519 6592 18723 -19983 -9645 21970 -18329 -16259 27088 -5699 -25482 20870
270 20870 4642 -35996 12109 16902 -28329 1440 24484 -24621 -14586 26221 -16883 -20037
282 -20037 25449 -1283 -26306 15481 4171 -28299 9526 10749 -21066 2459 14910 -21382
294 -21382 -6504 14180 -16233 -5479 15426 -10629 -11278 15140 -12628 -15683 18426 -4738 -15471
307 -15471 17477 1968 -23975 15302 8572 -24507 14412 21490 -22595 2603 29236 -20424
319 -20424 -5015 35549 -7235 -11427 35797 3283 -23402 30977 15314 -21641 23706 27439
331 27439 -19779 10291 30405 -18476 2725 33291 -8248 -6783 29248 -4987 -16713 22907
343 22907 -1470 -17019 17989 2696 -24733 8550 2322 -29728 3337 4474 -28613 -5687
355 -5687 5357 -35397 -15556 7981 -33454 -22071 9619 -27368 -34365 7686 -23526 -40046
367 -40046 7853 -11087 -42062 940 270 -44975 -6249 9551 -35251 -10418 17321 -26012
379 -26012 -19609 21292 -16079 -20732 23072 -540 -20008 19570 7822 -21292 17983 15734 -14342
392 -14342 15013 23096 -11711 7522 25026 -9353 6203 26764 -4256 -784 26379 -4475
404 -4475 -10415 24606 -945 -13615 18927 2584 -23137 10843 4667 -28148 3856 9584 -27871
417 -27871 -8979 10639 -29339 -18556 11347 -23236 -23682 9453 -16172 -32283 5098 -9197
429 -9197 -30957 3205 460 -27299 -2218 7145 -24794 -3165 13893 -13832 -2235 18448 -6071
442 -6071 -3841 22099 1540 -38 26782 12456 664 26247 18664 675 28530 24631 5262
455 5262 27327 30012 4550 20709 33255 6745 17122 33921 10626 9045 31304 9966 1191
468 1191 28757 13210 -2132 20546 15073 -7834 11145 14204 -8308 5772 14339 -7913 -3570
481 -3570 13094 -8483 -8104 11507 -3871 -8505 8150 -904 -11175 6909 2418 -8144 7556
494 7556 8714 -5358 5710 12606 -2923 8512 17751 3832 9960 20884 8374 8981 23988
507 23988 14031 11890 26149 20105 10402 24360 23411 9945 24166 25898 13335 20173 25305 11677
521 11677 14639 24397 12255 11090 21111 13583 4342 14619 10399 1190 11113 7839 -809 3741
535 3741 5717 -5542 -2528 3355 -4949 -5409 -22 -5749 -9744 -1919 -7820 -10212 -2367 -5211 -9837
550 -9837 -5441 -3807 -10675 -5220 -1869 -6763 -3966 982 -5041 -4880 3631 -2397 -1816 5597 3766 -292
566 -292 5222 6412 169 6504 9662 4201 6528 12161 4699 4876 12392 6181 5581 11810 9459 3031
582 3031 8851 9102 1711 7741 9371 2038 4458 9015 -1235 518 6861 -200 -1421 4608 1051
597 1051 -5512 2104 -1198 -7126 663 590 -8139 -2252 723 -9737 -4994 -74 -7055 -5882 575
612 575 -6277 -9354 776 -5958 -9594 974 -1257 -9569 -86 -324 -9959 -714 1487 -6899 -1851
627 -1851 4895 -6232 -4406 5566 -4224 -4641 6173 -682 -5937 5948 352 -7084 4781 3118
641 3118 -5612 2790 6034 -6782 304 6564 -5638 -978 8044 -3033 -3731 7529 -2924 -5424
655 -5424 6561 -190 -6002 5406 2705 -8809 3048 3381 -7993 1260 5777 -6789 -1310 6366
669 6366 -7253 -3177 6816 -3237 -5119 6750 -1357 -7542 5834 -320 -7285 4795 3506 -8323
683 -8323 2539 4712 -8261 808 5902 -5324 -1272 7237 -5199 -4410 7862 -3243 -4958 7153
697 7153 264 -7249 5937 1143 -7922 4467 3644 -6844 1813 6072 -8014 -596 6429 -6126
711 -6126 -1665 7650 -3469 -4680 7309 -2621 -5959 6432 715 -6092 5162 2811 -7999 3882
725 3882 4250 -6572 1962 6509 -5357 -860 7152 -4941 -1563 7370 -1724 -3662 7536 -231
739 -231 -5830 6565 1325 -4791 5075 3713 -6148 3228 4908 -6471 1518 5876 -4534 -1171 6318
754 6318 -4239 -3330 6079 -2808 -4407 5061 -597 -6639 3525 -244 -6937 2646 1479 -6590 274
769 274 3044 -7537 -1462 3270 -5723 -2624 3675 -4079 -4906 4048 -3330 -5054 3950 -163 -4776
784 -4776 2629 1430 -5669 2735 2602 -3892 2002 4703 -3031 97 5515 -2047 493 6048 730
799 730 -573 6617 1372 -1731 6315 2938 -612 5175 4559 -1258 3947 4656 -1644 3717 5585 -325
815 -325 1337 5548 -807 -193 4886 22 -588 3864 733 -2875 2533 730 -3160 1580 1279 -2933
831 -2933 -343 902 -3969 -945 1014 -2870 -1613 1158 -2069 -2940 933 -1860 -1781 1290 -187 -1921
847 -1921 931 975 -1984 1336 1566 -286 1612 2935 193 1477 3774 988 2493 4416 3183 2059
863 2059 4482 3438 2377 5013 4251 3187 4298 4862 2761 3800 4606 3099 3613 4034 3438 2298 3549
880 3549 2071 1665 2923 2311 1621 1290 1949 104 387 432 -62 -583 60 -252 -2030 -968 -1358 -1789 -1927
899 -1927 -1180 -1958 -2315 -1156 -3122 -2487 -1816 -1673 -2611 -1214 -1427 -2797 -1160 -1447 -1640 -877 200 -1774
917 -1774 -609 496 -1033 -330 1345 484 -55 2500 104 -218 2437 1557 165 2361 3181 209 2192
934 2192 2559 389 1744 3260 440 678 3681 -145 -98 2226 911 -553 2147 1147 -2161 1126
950 1126 128 -2687 -57 943 -2666 -1224 378 -3503 -1940 -360 -2825 -2699 -96 -2774 -4008 -504
966 -504 -3086 -4099 -353 -1588 -4449 -259 -948 -4467 -774 -398 -3116 -1050 1225 -3324 -1801 1579
982 1579 -2295 -2080 2108 -541 -2626 2261 -544 -2414 1904 694 -2305 1043 2252 -2581 603
997 603 1863 -2028 -468 2291 -1724 -1299 2273 -2436 -1721 1800 -920 -2428 1431 -495 -3299 909
1013 909 -583 -3915 36 555 -4196 -1017 722 -4340 -1345 489 -2827 -2421 1190 -2733 -3452 1377
1029 1377 -2323 -3402 1027 -463 -3900 993 -239 -3589 725 653 -2708 -429 2043 -2517 -936
1044 -936 2417 -1781 -1375 2553 -630 -2120 2475 -684 -1585 2143 472 -1725 1373 1623 -2571 1074
1060 1074 1843 -2110 300 2269 -1990 -524 2489 -2254 -694 1995 -982 -1714 1898 -110 -2807
1075 -2807 1492 195 -2505 971 1083 -2856 526 1338 -2655 -171 1436 -1372 -879 2115 -1150 -1419
1091 -1419 1895 -1046 -1447 1973 196 -2089 1480 326 -1849 1185 862 -1484 583 1437 -1989 -100
1107 -100 1457 -1425 -760 1577 -1242 -1550 1600 -1266 -1447 1076 -400 -1785 504 99 -2614 357
1123 357 -192 -2546 -300 845 -2488 -1053 293 -2443 -886 402 -1507 -1520 517 -963 -2190 378
1139 378 -660 -1540 217 159 -1677 147 390 -1626 290 877 -576 -265 1208 -724 -345 1462 -522
1156 -522 -25 1460 202 -609 1229 392 -556 1110 562 52 539 1047 -603 424 1040 -593 128 940
1174 940 -405 -331 862 -583 -6 571 -341 -625 154 -13 -1331 223 -396 -978 -253 -114 -956 -716 -427
1193 -427 -1191 -541 -284 -391 -456 -122 -570 -778 -40 -579 -385 -305 -529 -485 -7 -97 -410 238 -70 263 282 202
1215 202 204 556 407 600 766 527 749 775 450 526 1005 851 596 1098 494 382 458 596 134 1111 527 92
1237 92 583 448 -13 168 838 -156 221 679 -148 -125 66 -219 -215 722 -317 -666 -119 -542 -960 -18 -149
1258 -149 -1304 70 -316 -1152 -532 -230 -569 -282 618 -838 -444 253 -645 -437 332 -378 -800 821 -264
1277 -264 -731 290 250 -504 575 774 -719 513 469 -197 227 1068 -146 280 1166 -298 -1 807 25
1296 25 -701 921 248 -618 887 -58 -893 391 451 -1160 -82 266 -1487 -622 28 -1122 -1200 510
1314 510 -1576 -1083 -26 -1453 -1839 -292 -728 -1998 -124 -1075 -1861 -685 -458 -1601 -749 78 -1921
1331 -1921 -706 75 -1646 -967 276 -1064 -1296 339 -832 -1101 160 -125 -1225 439 56 -1188
1347 -1188 324 363 -1047 90 681 -1075 -17 1022 -816 -50 799 -398 -513 1011 -354 -972 826
1364 826 -16 -889 333 58 -1423 271 357 -1600 -267 138 -1356 -959 -89 -1415 -1163 340 -1391
1381 -1391 -1325 -41 -855 -1873 -46 -965 -1510 -278 -665 -1597 -601 121 -1821 -442 -81 -1498 -722 201
1399 201 -1112 -654 697 -934 -482 510 -204 -699 665 134 -766 551 434 -358 530 896 -588 384
1417 384 1097 -860 309 1022 -145 81 1060 -306 -273 985 0 -304 701 373 -777 594 361 -739
1435 -739 346 293 -346 -221 240 -820 -285 493 -807 -341 440 -311 -867 532 -718 -628 419 -295 -743
1454 -743 92 181 -530 39 -9 -759 150 253 -666 -33 684 -694 15 372 -276 -395 643 -96 -556 464
1474 464 -34 -549 196 125 -861 299 367 -548 188 239 -312 -24 273 -168 -552 161 -231 -277 -173 -198 -467
1495 -467 108 -431 -687 -106 -421 -394 -131 -178 -470 -231 -271 -243 -77 2 -218 -262 350 -408 -8 346 -198 86
1517 86 86 91 -458 401 88 -306 189 471 -93 72 471 -106 117 193 135 426 306 53 -166 351 198 372
1539 372 104 295 -70 381 -69 -328 304 -289 -9 -61 -3 122 301 193 -226 244 -24 -245 205 215 -264
1560 -264 189 233 -340 418 131 35 -178 507 -144 -40 151 312 243 121 399 168 550 576 523 412 390 159
1582 159 480 219 372 821 198 300 754 455 291 343 849 -132 280 528 -179 334 343 97 -99 713 40
1603 40 3 404 166 -466 -2 266 -466 116 99 -254 -240 230 -342 -74 70 -218 -89 123 -47 -105 169 -56
1625 -56 -180 384 -194 -25 105 -260 -62 450 -10 -166 616 375 -30 288 763 -168 347 848 -186 213
1645 213 604 256 -98 865 266 -37 1049 453 -24 452 492 -126 229 399 -91 268 365 -14 94 56 -162
1666 -162 163 34 -175 -357 101 -321 -353 266 -414 -279 314 -302 -610 59 -182 -1031 22 18 -897 -208 115
1687 115 -594 -457 322 -786 -401 281 -293 -794 94 61 -638 73 122 -308 -142 561 -151 -89 313 -117 -48
1708 -48 215 48 229 195 35 33 33 -10 70 550 -60 -6 393 10 -132 211 -67 -506 245 122 -687 100 320
1731 320 -381 -241 296 -392 -687 379 -437 -507 -45 12 -846 15 382 -632 -105 108 -263 -185 226 -282
1751 -282 -402 16 -72 -197 -241 144 -22 310 80 -527 323 170 370 192 354 -114 556 272 -203 524 249
1772 249 -141 204 458 -446 362 719 213 57 836 181 -56 817 67 -74 298 421 -194 26 95 -55
1792 -55 121 259 80 -101 107 113 -135 114 144 163 157 38 71 115 121 270 246 -336 100 490 79 -47 397 123
1816 123 -294 372 234 95 187 437 76 312 558 -49 126 495 470 -127 340 382 -182 174 274 15 35
1837 35 716 228 31 236 345 47 -1 287 -168 68 -36 241 -33 -110 226 -77 -76 -71 146 -240 -165 12 -166
1860 -166 108 88 68 -245 18 -85 -132 146 45 -462 -194 430 -444 -15 80 184 -284 109 97 -33 313 38
1882 38 52 227 361 -13 54 164 458 175 132 432 342 161 70 648 -47 141 290 15 -17 278 180 -179 104
1905 104 329 -485 8 118 -2 -338 120 142 -305 29 -141 -306 -123 128 -241 -139 -110 1 -144 -23 -112
1926 -112 106 -160 33 -191 61 -65 1 -33 91 370 46 48 181 123 277 221 130 347 -95 523 176 -14
1948 -14 192 518 -113 551 393 235 299 422 158 -22 469 160 50 263 204 93 112 96 -11 310 118 102
1970 102 16 -129 18 -307 47 -151 -50 -32 -113 100 -164 -377 -41 -129 -379 -319 189 -66 -302 14 -49 -295
1992 -295 -282 -37 -322 -9 289 24 -119 342 83 -31 385 268 177 135 380 -216 85 447 170 167 205 211 45
2015 45 141 123 359 348 97 76 367 350 121 -24 -145 147 138 -187 -206 280 -56 -184 -56 51 38 -15 274 -313
2039 -313 45 -80 -42 -280 -59 -289 -228 30 -106 -573 -7 85 -292 28 -25 -309 -113 52 -259 -187 417 -160
2061 -160 7 254 -126 8 126 8 -99 146 11 -6 -7 -274 -39 85 -37 56 -17 140 70 230 -36 -151
2083 -151 79 109 -350 48 245 -114 -120 -116 -17 -246 98 176 -148 96 -68 -78 -199 50 -44 32 222 -227 253
2106 253 80 101 -258 99 70 164 39 -171 5 87 130 -154 299 159 15 217 -88 171 10 173 -70 -38
2128 -38 69 -73 194 39 2 -55 240 15 81 197 244 -84 90 50 -45 254 18 -145 55 -127 82 23 137
2151 137 -27 159 -138 -70 -8 -7 -216 -89 197 -125 40 153 -126 -53 111 68 74 73 46 -193 186 -32 -284 60
2175 60 131 -67 91 -165 -202 -153 113 21 41 48 11 123 -12 46 -82 184 10 78 209 309 126 18 216 -61
2199 -61 123 -307 -26 -137 48 -181 -24 40 -74 -12 253 -44 -51 170 -44 -145 -62 -104 -78 21 -83 -212 -103
2222 -103 69 -161 181 140 210 -127 -34 -95 -9 69 -140 32 134 114 -19 -61 243 -145 62 -23 -7 -26 91 -52
2246 -52 93 23 7 137 -221 18 -40 82 -8 -6 -20 119 70 -2 127 101 134 -39 -131 225 43 -117 -42 -66 -255
2271 -255 42 116 -103 -53 81 0 105 166 153 98 60 -23 45 123 -134 257 49 42 -147 74 54 -98 -31 68 -142
2296 -142 -59 -17 -142 -87 169 -86 -11 223 -160 185 190 -150 -77 235 108 155 217 140 -81 227 -51 -56 100 -106
2320 -106 -17 50 -254 -137 14 39 -194 137 249 -213 47 61 -146 -7 -17 -110 81 13 -36 -91 -200 -105 -284
2343 -284 117 3 -201 112 50 11 63 31 84 -66 142 -165 -8 -58 54 103 -408 189 -183 171 134 -83 285
2366 285 61 -118 127 113 271 167 2 109 52 10 -51 103 -79 44 -365 157 -172 70 -17 -117 -221 -229
2388 -229 -209 -146 -121 7 -131 -238 -111 102 141 -48 -60 -218 39 -97 82 67 -182 179 83 36 103 -104 320
2411 320 106 -2 134 223 136 123 236 -12 -85 152 32 140 105 136 160 111 -2 249 11 -249 62 2 -102
2434 -102 -139 70 -15 -61 -11 36 -80 66 -66 -178 -171 -164 -92 -240 -116 4 97 -35 -147 -19 -161 -48 37 -53
2458 -53 75 -22 -115 -150 -8 37 20 -233 113 -12 43 -154 -193 -106 91 -107 -109 109 250 -32 271 11 11 50 226
2483 226 88 108 44 -193 15 26 168 242 30 17 -114 241 462 12 224 262 -47 20 -223 -40 41 -122 -87
2506 -87 -141 48 -97 196 -55 96 -77 63 -80 3 133 -4 30 163 66 -62 117 -61 32 -4 -168 -131 11
2529 11 -10 -60 167 207 243 121 -1 -123 61 30 -32 55 -315 170 127 -140 -115 -40 30 -32 7 -49 12 95 12 -51
2555 -51 -34 235 80 -10 206 367 186 -53 42 -77 -126 231 209 -136 -15 -135 -94 -209 3 -58 -166 -163 171
2578 171 9 179 196 172 59 80 -70 -65 -86 -145 77 -198 -205 99 -57 101 -136 -115 -123 -95 -74 -123 -239 129 240
2603 240 -197 -18 -184 69 -14 -155 -99 -205 -161 -87 64 -60 -139 153 207 -145 -78 -138 8 21 -116 16 74
2626 74 -54 -79 -14 -119 -134 -56 98 -41 -2 61 -46 56 -18 -128 -33 81 -64 121 244 22 -4 129 -52
2649 -52 -356 98 88 54 -27 21 51 111 -83 175 -136 -4 -116 -273 -204 -43 -234 -49 -55 -166 -114 -115 -11 -298
2673 -298 -293 -167 -51 -178 -117 -22 -175 -163 -74 52 142 -40 340 -17 56 6 -74 99 71 -32 -94 68 -101 84
2697 84 -184 82 219 -112 88 215 -35 -91 54 163 86 91 -5 110 -32 -136 184 12 -62 126 -53 -327
2719 -327 70 -177 82 -43 -51 194 -172 158 -76 -181 60 -194 -74 -47 -113 96 -175 -33 55 60 -23 6 -176
2742 -176 123 -72 -55 -189 -27 56 221 -337 93 -91 122 -18 48 -66 43 -175 -88 -108 -157 -87 -304 169
2764 169 -64 89 28 31 158 56 335 159 38 -129 -183 39 -87 178 53 213 143 85 42 -80 -69 156 54
2787 54 -22 90 104 73 -18 -169 -104 -65 29 -44 -84 -35 235 -116 157 -123 -125 111 -396 -197 -43 -101 23 235 -156
2812 -156 -85 -4 195 -199 203 -21 187 216 -100 6 -37 101 -146 14 165 133 -125 231 41 -36 283 191
2834 191 -70 35 -116 11 74 167 -97 307 -68 -75 -72 -11 -133 -290 36 -29 44 -62 22 -149 17 -44 -18 30
2858 30 243 -31 -26 -57 -285 61 -91 28 85 4 170 -14 323 109 180 -2 -68 -17 -33 169 38 2 -12 58
2882 58 -53 -211 -122 17 128 139 49 88 -166 305 -295 91 -109 -76 45 47 17 102 34 42 72 29 -67 -251 -157 -176
2908 -176 -65 -43 -105 144 -1 -165 -110 2 -109 59 23 8 192 -129 -60 -122 83 -85 109 6 -263 189
2930 189 -189 28 9 -152 164 -44 -135 -91 -118 -200 -295 -151 137 -62 186 190 -114 89 -90 -53 90 -9 -77 111
2954 111 -38 -127 145 -143 -330 62 54 72 -56 75 105 -256 33 1 -231 37 3 -35 -27 50 -159 212 18 -34
2978 -34 73 -90 -45 -145 -130 -30 125 -144 191 39 27 -5 314 161 223 72 -122 110 -93 144 -52 -145
3000 -145 -152 -12 -20 76 47 -132 53 -7 114 -58 -81 -120 -96 -49 -37 -246 -98 -178 -194 -205 -151 -223 -179 21 29 -181 -4
3027 -4 -34 182 -217 -80 18 -44 113 47 -51 -32 -89 163 -141 11 -192 -126 36 -122 -60 1 165 18 -66 0 92
3052 92 131 7 322 54 -7 175 -19 42 -121 147 170 229 142 11 99 185 53 -141 -55 -86 -69 15 -223 123
3076 123 -64 -1 282 75 -45 -289 132 -88 -121 -113 17 -63 88 23 140 -225 59 103 -68 -76 -164 -178 -31 -214
3100 -214 163 -52 86 -142 59 -105 52 -36 19 -68 -7 -48 -38 57 202 284 3 86 65 213 -53 -129 293 67
3124 67 -58 219 189 62 -16 53 -91 99 105 65 -25 57 -99 96 78 94 -57 -158 -35 222 -34 -93 222 -158
3148 -158 182 47 -75 -29 -25 82 -174 -22 34 3 -92 -6 -143 -107 -223 -132 19 358 -255 97 -80 -15 115
3171 115 23 26 -1 119 -158 152 -97 -62 -258 -21 16 92 48 86 -176 -117 136 122 -39 -39 -121 -66 52 41 124 -25
3197 -25 -118 -28 63 -180 -213 24 -362 71 316 -126 175 115 11 -140 -188 35 -51 -103 94 -152 -100 -199 -113 5
3221 5 -124 -22 -132 136 -71 7 80 -25 170 -66 -72 88 -91 36 184 309 31 40 206 2 42 -76 88
3244 88 -62 39 158 -168 -30 329 -160 -14 124 -292 0 172 -89 -194 185 37 -169 53 53 -9 -155
3265 -155 -48 -119 -127 14 -116 -413 90 -78 41 -91 49 301 -12 121 -250 -94 181 -141 -27 15 52 -24
3287 -24 -4 180 84 -184 -257 -154 -23 -111 -36 -22 -165 60 -175 39 -103 193 107 -90 -101 126 -31 165 -7
3310 -7 -22 -44 -28 -9 109 -39 -128 10 154 -115 28 50 67 -188 105 116 53 -17 -132 108 13 -129 -106 -46 -154
3335 -154 120 -197 -1 -228 194 -10 -157 -19 -238 -59 41 144 131 -184 -201 81 -113 86 -180 182 -24
3356 -24 14 138 -32 -131 -89 -88 -68 173 -69 251 116 83 58 159 -190 -18 64 88 -112 -5 76 71 62 -63 -10 -86
3382 -86 -190 -31 -38 30 -55 -36 72 -81 -239 -113 -19 259 221 -1 104 -52 -7 11 -64 -135 215 217 128 21 8
3407 8 46 212 -191 -117 -75 86 -58 115 -98 16 -72 -2 11 68 -163 -154 49 23 -119 246 139 -49 248 -12
3431 -12 19 -69 64 -215 107 141 -118 -295 42 63 212 -222 13 96 31 68 -176 99 -39 -113 -181 20 0 3
3455 3 18 -52 -45 -51 -30 31 183 59 -267 -23 -69 80 149 -64 31 112 4 220 -40 72 11 129 48 262 257 -109
3481 -109 -103 -45 219 -210 -112 79 150 -129 -150 -24 -207 33 -11 89 233 -29 103 -136 -11 44 -2 18 -211
3504 -211 42 -90 161 66 71 216 59 0 -94 -332 -22 -134 -39 41 85 111 -131 235 -74 -176 -91 -84 -5 -234
3528 -234 62 12 18 -179 17 -104 65 69 -157 -145 120 -11 -65 121 -39 -12 9 72 -27 -88 83 124 157 81 87 -270
3554 -270 -147 -155 15 196 4 -74 233 -44 7 10 -19 -42 135 41 -34 -91 135 -193 -108 -178 132 281 162 148 191
3579 191 -75 32 152 35 -338 95 -55 -248 -58 13 84 -28 -126 201 214 134 -36 85 -97 152 68 -120
3601 -120 -13 -122 -33 -18 -5 153 65 245 37 -112 149 -162 -163 -33 31 54 -25 -59 150 -82 148 -33 114
3624 114 -14 -8 -124 145 48 -156 -58 -155 65 126 -78 -6 -7 -19 19 -32 -38 -73 14 65 75 72 160 0 -42 -104 58 -75
3652 -75 -85 13 -204 212 -20 242 -82 -91 -13 69 143 -160 324 3 -66 50 -110 115 -250 138 -228 -83 126
3675 126 -81 -100 397 -153 106 42 97 -186 -46 64 -240 102 129 67 -199 -123 -203 -30 -97 -2 -35 89 -10 -195
3699 -195 50 -165 -135 92 119 -90 -73 101 -29 -23 45 122 6 -49 5 -127 -189 26 -70 -61 146 10 -138 -249
3723 -249 -191 -112 -109 162 -30 -459 61 -264 117 245 -46 10 117 -147 10 39 207 6 139 164 -24 -122 -20
3746 -20 30 186 -104 -42 -39 93 53 -103 243 8 177 -120 -34 -67 -95 -53 166 195 -134 119 72 0 -241 37
3770 37 43 -206 -167 61 -113 -76 -87 12 -34 137 -166 376 368 -130 -88 -50 25 316 85 82 -140 97 150 -98 196
3795 196 -22 -46 60 -133 6 40 96 273 104 197 127 105 20 57 35 66 48 -288 10 266 42 31 269 -93
3819 -93 52 16 -118 24 -53 137 370 -49 -140 7 35 -15 -9 39 42 -129 -110 31 39 99 -75 9 -117 -64 -53 29
3845 29 48 118 -275 -251 -123 -190 27 -82 117 75 22 -53 86 94 -92 2 -22 384 -27 91 -236 93 70 15 58
3870 58 99 99 -220 -17 -201 136 64 123 0 28 -66 -23 106 -36 -33 97 -40 163 103 183 82 4 107 -157 171
3895 171 29 -130 31 -110 39 -132 -119 17 -123 -102 -58 -108 -51 114 -77 189 -124 34 27 82 -34 -127 -17
3918 -17 51 208 100 -404 46 -6 -39 -14 -151 207 -217 -164 -28 -234 31 -120 49 85 -82 12 36 42 -20 70
3942 70 -30 64 -165 -164 -85 109 -172 -20 227 76 -50 214 216 246 -101 -60 133 -41 112 -95 -131 86 69 228
3966 228 226 61 49 10 -95 -5 142 -95 203 96 11 -48 167 234 395 94 92 -52 -174 92 139 -192 -162 185
3990 185 -103 95 92 142 -39 -40 -93 85 100 188 -72 12 -251 31 -98 -190 -179 -138 -162 143 36 110 -91 -96 28
4015 28 82 247 -10 -63 -125 7 -123 -39 59 -7 53 -115 83 -20 157 20 -8 6 -58 154 103 146 6 150
4039 150 27 150 -43 -128 97 313 138 29 2 -183 29 80 -83 23 -97 212 -57 -32 156 -222 -143 -25
4061 -25 -12 -82 86 285 -164 74 232 -85 11 -46 -148 34 68 -8 -146 -119 -130 -33 61 67 -99 78 56 174 12
4086 12 96 48 -22 -322 -113 -21 108 -129 -129 -25 217 -107 59 141 14 105 144 -128 43 190 -169 15 -140
4109 -140 -33 -172 -93 -96 -81 -66 139 -14 9 41 251 -67 -161 120 5 71 213 93 154 -93 92 -72 -16 -15
4133 -15 84 147 61 -40 -188 21 -2 -82 -25 -91 -21 49 -333 -28 -56 73 -73 16 -43 157 56 99 -125 204 -121
4158 -121 -252 41 154 -67 -245 -164 -94 -46 -14 19 -412 -103 -109 -172 -31 -118 -38 -96 -72 -54 9 102 84 -74 30
4183 30 -78 -77 47 30 -53 35 289 182 -86 11 85 12 61 -62 112 77 102 -16 241 -126 -182 115 177 93 244
4208 244 -101 -96 -11 7 57 210 -81 386 78 -1 27 25 -53 13 -1 176 -49 -189 -233 77 -221 -90 -269 148
4232 148 -16 -38 270 101 313 63 -22 127 154 46 59 -8 11 -171 8 -58 -299 60 -69 -186 24 -79
4254 -79 299 21 82 39 158 39 57 -110 -80 -35 -176 -117 368 65 -61 -84 -310 -85 -47 -76 -64 218 22 -100
4278 -100 114 84 -52 54 75 95 -9 129 15 -89 149 -37 109 -218 -135 -157 -130 32 167 -23 107 -57
4300 -57 45 -6 70 -181 -130 146 -13 117 -45 -136 236 115 150 17 131 100 8 62 -5 -248 -59 82 168 121
4324 121 -105 110 -90 -169 71 324 62 9 94 3 24 -189 105 107 -242 2 -31 139 72 -117 14 14 -294 -80
4348 -80 -73 -137 -46 154 -122 -91 -81 54 -85 -21 59 234 39 -15 -114 180 20 -91 89 -157 33 -46 63 -105
4372 -105 157 11 -15 31 -205 33 195 -41 -165 -82 172 -345 -52 51 13 26 -164 -97 -143 30 96 -71 104
4395 104 297 11 72 1 109 -39 166 146 -70 2 3 11 30 217 -153 -148 19 -220 -44 174 -41 179 21 54
4419 54 166 -287 -41 -30 -184 -22 -21 -107 241 104 27 106 -45 30 -157 -43 258 56 -86 56 91 -86 -160
4442 -160 42 -72 28 135 73 225 -146 176 58 -220 -96 -120 -39 40 -217 103 -97 127 -23 -34 206 49
4464 49 44 269 -1 -47 233 -120 -24 17 43 -146 -82 -53 -45 201 -233 -16 110 -257 -161 -45 117 21 -47 -5 32
4489 32 21 68 36 70 73 72 30 -105 -154 113 -18 70 -9 -82 -116 -22 -98 -36 -76 -146 40 59 29 17 -115 -125 140 141 38
4518 38 -224 211 -218 -195 -268 -44 3 -41 -50 63 -16 32 87 91 0 -109 131 233 5 -177 21 162 -313 7
4542 7 73 -159 59 -95 140 -266 141 101 109 42 -157 -51 -44 35 129 94 17 37 59 -65 70 161 -341 105 -92
4567 -92 11 141 -88 -39 -44 29 -92 77 95 -94 57 -30 -174 -114 53 18 245 106 69 62 -116 197 254 -50
4591 -50 -183 130 58 -65 -96 20 53 -4 186 73 -144 -37 -153 -99 113 99 192 -6 -128 167 195 -79 -178
4614 -178 162 31 128 -7 -4 209 -36 74 -93 86 -7 149 -64 194 228 238 105 111 1 -127 -104 43 -154
4637 -154 -408 42 -215 -137 -104 146 208 -143 26 -85 -33 -17 -173 -62 50 -31 211 45 -198 -20 67 52 -31
4660 -31 81 -140 -29 101 -163 225 48 -193 -134 -271 70 -128 127 -18 190 -80 -66 -45 -69 -239 -159 -89
4682 -89 162 99 -44 42 213 116 -200 21 83 113 -16 6 8 -95 33 -94 50 109 112 252 -137 108 244 -27
4706 -27 -340 38 -41 -63 -157 66 22 177 -175 53 169 141 -181 -135 68 -193 79 -15 58 213 60 74 -336
4729 -336 137 141 -55 127 194 146 -35 -23 72 85 63 -121 -53 85 7 15 -172 -61 70 -8 11 16 77 36 22 115 212
4756 212 26 -170 307 -135 -116 192 -62 -31 56 86 -80 32 -20 48 226 132 -13 -105 70 -208 -2 143 71
4779 71 34 -263 90 152 -3 0 -166 -40 -62 224 -225 205 -36 -110 -36 49 220 37 -37 -185 131 39 19 -134
4803 -134 -262 -6 162 -38 38 -86 -58 -7 -260 -12 -41 144 -18 -29 103 115 230 -170 -250 -173 -9 -139 -49
4826 -49 -260 -18 -124 187 -74 -330 180 70 -260 81 -60 139 -55 28 -198 2 225 41 -12 -171 20
4847 20 -16 -55 -117 -201 27 274 122 185 -83 -47 211 -72 127 44 7 58 44 91 -81 83 82 -24 -45 -18 -54 -180
4873 -180 117 50 23 24 55 -123 146 -42 144 -79 -76 33 48 -39 -73 3 14 106 70 15 187 101 40 -183 68 137
4899 137 -96 -66 138 -75 -30 219 212 -78 10 -89 -177 32 28 136 -87 33 -121 25 -186 -33 -69 -18 2 -53
4923 -53 117 144 -9 43 -170 169 159 131 -137 242 103 -3 -90 -18 83 26 62 -12 -89 -86 -41 156 92 64 -6 94
4949 94 -32 -47 -20 85 -45 -96 -210 115 179 -71 44 2 -17 42 115 -99 118 35 -197 -360 51 33 -143 256
4973 256 -86 -94 -93 -88 -4 81 156 -5 322 140 14 -95 79 62 71 174 147 -105 -139 -111 146 86 -142 -149 158 8
4999 8 110 -53 22 -54 103 -284 -186 16 -67 -1 -147 -12 -31 -169 142 314 -118 58 -64 -1 -26 350 -69
5022 -69 -23 -50 -191 2 -161 65 120 136 -204 -13 49 24 -40 145 73 78 -68 247 -102 -18 -150 102 -119 -14
5046 -14 -20 -175 234 -151 37 -20 -94 114 -17 63 16 118 -287 -153 104 53 -19 1 121 -70 -236 176 -147
5069 -147 -105 -107 88 -146 89 -111 -210 7 61 -4 -124 16 -98 99 -117 214 -1 -93 26 -95 251 -71
5091 -71 101 14 -114 226 123 150 -128 -139 -45 89 -112 84 38 273 46 167 -147 12 -38 -131 -97 18 -33
5114 -33 287 93 -185 168 38 119 74 237 59 28 10 -68 -29 -131 -63 -44 24 67 8 -104 18 21 15 65 -65 -33
5140 -33 231 145 48 87 -48 -114 57 -74 -135 3 -155 -96 -117 94 26 148 52 -122 111 -137 -79 -155 -51 -25
5164 -25 -157 -85 150 104 -75 -54 -1 -76 168 22 169 -46 -62 7 -47 165 -164 88 26 88 -81 -94 -73 -12 -68
5189 -68 -188 116 -152 -180 -3 44 -166 -200 11 144 -133 121 64 -133 -132 53 -20 -114 -250 -33 -101 34 240
5212 240 -187 -89 117 -337 -134 -29 -95 -154 146 -102 140 25 -113 129 61 -20 -159 -13 -9 15 -113 96 111
5235 111 9 -4 -106 -173 112 -51 -99 -139 26 234 37 -213 -32 115 118 -38 -15 35 -93 35 18 -105 45
5258 45 -157 189 -124 -119 148 -7 178 -86 -173 -44 25 235 274 109 16 138 -4 68 44 117 125 3 -183 71
5282 71 187 26 -10 -162 7 44 125 33 -162 91 -76 46 -151 4 22 -163 -74 7 77 29 68 85 -64 -42
5306 -42 -74 119 58 150 154 -61 -55 238 111 -62 -305 140 209 36 -333 73 158 256 -165 -2 -163 -106 172 -53
5330 -53 -51 -80 63 -43 149 -61 -78 2 -3 -22 -43 270 86 22 -57 -52 109 15 -146 -140 224 107 164 159 12 -312 109
5357 109 147 -99 -45 -122 61 245 10 -102 279 -104 -5 -83 -26 83 -157 -25 -5 -220 -1 50 -143 5 -131
5380 -131 122 -53 -107 18 -137 150 68 26 326 -126 -43 -50 161 60 -104 44 163 -149 -30 103 112 118 147 135
5404 135 125 145 154 41 -245 -91 221 133 101 -218 -50 -96 -312 70 -166 7 -12 7 182 -102 -76 -216 -86
5427 -86 23 -63 226 170 -39 -240 15 -127 -79 -119 -18 -117 113 -142 -23 -88 -2 75 -135 -52 65 36 49 -102
5451 -102 -119 40 151 18 84 -203 -139 94 193 -133 -25 6 -88 -2 156 55 112 -14 -178 106 176 82 3 244
5475 244 19 45 32 36 -119 -200 -176 -23 -87 -259 -344 -238 21 76 15 -19 217 -80 -38 200 -123 -268 -7 -208
5499 -208 19 -36 86 -8 -226 -132 -36 10 153 -54 -147 235 -146 139 -18 -66 -107 129 -78 -45 32 -163 91
5522 91 209 32 -79 -55 174 -147 138 54 -59 -13 -60 267 -36 161 -259 99 76 57 5 -27 29 -50 124 20
5546 20 -173 181 98 56 155 -56 -202 86 -70 -14 167 -56 -15 -29 112 92 -11 -22 64 -10 -151 14 33 72
5570 72 129 47 -107 -111 -83 2 -231 51 -182 -84 -58 -46 48 -95 -181 92 91 172 -82 179 40 102 86 178 -202 -151
5596 -151 100 113 -11 17 21 24 -57 -308 80 -115 -127 99 147 -163 40 219 64 101 -3 97 -12 -188 198
5619 198 16 102 -132 44 40 -146 -57 -70 75 36 226 -203 -8 -177 -211 173 -238 -7 -77 -224 -43 138 130
5642 130 52 -61 -93 22 -190 186 -67 39 -11 -116 -83 -102 48 78 47 257 -20 -141 -38 -196 293 220 10
5665 10 -55 126 -42 -178 -49 -22 65 75 -55 -33 463 -125 -47 -5 5 63 250 -17 80 -13 24 100 -140 114 60
5690 60 -14 17 -44 342 -46 -58 -73 96 -137 25 -189 -121 96 -68 -48 -151 -38 -236 43 148 -131 212 89
5713 89 -43 278 8 4 196 201 -118 -176 -118 38 153 -106 89 47 12 24 259 119 84 -81 156 -121 -26 83
5737 83 -2 -177 256 163 57 71 23 54 -16 -2 -105 -18 1 -46 -34 8 -141 -52 -2 92 -99 -145 -155 181 -137 39
5763 39 129 -103 -94 -60 20 183 -32 75 -255 -150 182 119 172 150 5 -14 76 161 84 -137 -49 150 54 9 -340
5788 -340 164 82 289 76 -225 -135 -91 43 57 59 156 -219 47 -36 21 -117 -60 207 -92 -218 -128 222 -165 -85
5812 -85 -205 -97 -45 111 -24 252 10 160 -111 128 71 -104 82 123 -189 294 13 32 8 -94 132 21
5834 21 190 -88 169 38 125 -113 78 27 55 -505 -18 -39 -127 26 221 -158 45 143 -29 63 -80 -5 26
5857 26 -73 -63 63 -213 71 -106 51 -105 -70 205 -161 -54 -58 -133 -129 -104 -40 -21 -130 17 288 -227 -97 22
5881 22 -211 62 -295 -238 -34 52 64 -77 -190 47 -7 -267 184 55 -26 89 -73 70 74 49 -122 17 38
5904 38 -40 22 -158 3 181 -76 -122 -30 76 147 -267 -85 124 18 -7 21 -112 218 86 -36 245 81 70
5927 70 0 12 71 141 -111 -76 102 -111 -224 63 -44 365 -13 -152 170 -39 38 -247 112 -128 -112 -104 -79 -55
5951 -55 -18 90 -173 198 9 44 53 95 -4 -25 153 88 185 -123 -26 24 200 161 -67 -219 -146 -22 51 -11 61 -91
5977 -91 -145 -140 57 100 25 35 134 -69 -91 14 69 -36 99 49 -138 -22 36 2 26 -208 242 148 -55 109 5
6002 5 18 -78 20 -35 -98 -77 54 59 -95 -156 -74 13 -105 -79 13 -76 -47 -181 112 90 83 -90 -187 -20 169 42 -85
6029 -85 -52 88 -42 35 -58 54 -132 215 43 45 43 21 -84 -14 -42 101 -26 211 -88 188 208 37 207 140
6053 140 105 175 -179 -107 -154 272 -146 11 18 179 -23 -191 185 34 -7 175 -196 -19 229 148 90 -11 29
6076 29 -136 48 -134 58 -48 -157 -1 28 74 -189 -288 25 4 22 47 289 -28 -317 167 -48 -118 144 26
6099 26 100 -147 -127 -28 226 -41 44 11 15 118 110 -108 81 149 147 110 -192 -102 70 163 41 -37 -26 121 -37 -81
6125 -81 336 12 50 -208 -16 -74 -63 43 26 -89 102 -114 15 194 217 -106 -299 184 146 -23 -104 42 -71
6148 -71 -197 -4 174 -124 202 181 29 235 17 -232 -84 234 -149 33 -151 124 -9 -32 106 -169 -149
6169 -149 -68 -6 -15 -74 54 61 25 59 40 157 21 2 99 140 -52 103 151 -134 113 130 -25 50 -29 -2 27 -115
6195 -115 -174 -101 57 81 -39 86 0 36 75 0 -124 141 25 167 206 242 205 180 260 103 -44 17 -66 -23 -77
6220 -77 -43 -149 -34 23 -44 -28 5 -22 212 94 43 -43 3 -101 -88 118 257 255 0 -60 -13 112 104 7 -218 143
6246 143 2 48 -126 133 -145 205 -303 13 -144 137 -116 -127 101 171 24 141 79 173 220 -97 79 -114
6268 -114 76 -54 -218 36 64 126 -119 -118 81 -66 -13 0 190 -22 53 159 69 125 85 -105 -223 58 -181
6291 -181 -110 -50 182 220 -205 -188 -54 -147 -38 -59 27 226 18 -182 -113 -126 -79 99 -196 26 62 98 263 -149
6315 -149 -130 -258 135 151 -191 132 207 -48 -106 -51 327 -136 -209 274 145 9 -89 51 -34 -164 126 202 117
6338 117 -94 -24 -35 140 116 -204 -20 -44 -28 81 28 -40 9 -69 -5 -143 -39 -40 45 202 120 -36 -23 341 30
6363 30 25 5 -271 -288 -87 -43 -35 -99 -164 -2 24 -59 -12 -2 -109 -196 -54 10 -60 75 -61 170 64 -86 243 -31
6389 -31 -100 12 232 -28 -26 50 -27 -8 -165 -56 106 -79 32 -127 78 -266 -39 140 -22 140 126 8 -152
6412 -152 114 -287 -87 -330 -67 92 172 161 22 -73 -92 248 10 -111 -26 41 39 198 41 1 48 61 -81 150
6436 150 76 30 66 31 146 50 -11 136 -228 -82 229 -49 -175 90 164 40 45 109 71 91 70 -29 -145 -104 40
6461 40 232 -48 56 44 139 -135 315 187 90 1 -25 -151 13 -11 -155 134 -62 -9 -167 -20 122 -255 -33
6484 -33 31 -7 -36 -41 258 78 -189 -244 -322 120 97 43 -74 0 121 -117 201 -17 174 -255 153 2 -75 -15
6508 -15 -32 71 -162 -58 19 150 -72 -147 -130 -18 -78 -189 43 99 196 -21 -7 274 -75 -146 -258 44 -92
6531 -92 82 18 125 -102 -14 -90 -41 90 253 -22 50 124 -172 -191 68 -13 -27 14 56 -149 -151 -251 -215 -17 -18 -41
6557 -41 -156 -101 -60 243 117 230 47 -126 105 97 34 -133 -137 30 367 144 -248 51 222 -40 15 -107 -40
6580 -40 81 153 169 -125 37 -123 -47 88 -103 49 226 140 -79 46 -172 -91 -26 99 -193 -214 11 -64 55
6603 55 -44 83 -98 3 -22 -3 74 191 71 119 115 -93 -62 33 -25 -105 4 172 10 102 12 -13 -169 -76 69
6628 69 107 -35 34 -125 -5 73 -35 130 -86 43 -37 93 43 -22 97 -95 83 101 -51 -103 -87 117 -161
6651 -161 -155 -16 -79 163 95 84 266 -18 -41 55 71 98 -6 -73 -96 -304 144 -71 110 -43 -27 35 272 14
6675 14 31 -188 -95 13 -137 243 32 48 49 -26 13 30 173 261 -65 273 230 125 193 -149 -20 -76 -147 21 75
6700 75 -106 -24 15 70 -11 -79 -182 -151 124 -102 60 -101 -11 73 117 36 0 131 55 -227 9 150 168 320 -168
6725 -168 -53 -58 -45 199 -156 4 -51 -52 -138 -187 95 1 -110 -201 116 278 -91 -132 202 26 292 -57 -126 121
6749 121 44 -87 47 -34 -199 -9 -61 -42 -102 -210 -79 50 -39 188 -282 -13 130 59 285 -47 -155 -186 -105
6772 -105 -132 76 256 -13 222 147 -146 201 5 29 -2 60 -203 140 57 -42 -31 -185 233 -57 -39 -154 157
6795 157 -67 -60 183 47 26 -61 98 -122 -288 39 147 29 -161 57 -70 293 141 82 -23 -253 -137 306
6817 306 226 54 -39 93 120 259 -156 55 64 -100 158 -25 130 168 -33 65 223 -13 -67 41 112 125 61 -12
6841 -12 50 76 109 140 45 -84 134 110 108 217 79 65 86 1 94 338 -121 -9 186 10 152 134 23 -203 305
6866 305 370 -30 -67 6 150 -148 293 125 21 -106 -101 45 34 -76 68 -25 -16 -87 -85 122 91 -89 15 53 236
6891 236 -85 -14 179 -112 -5 2 79 -277 -10 236 -38 -119 31 176 9 161 1 -5 -72 -154 -19 -3 76 100
6915 100 -162 -19 -64 -126 -185 111 -217 -118 -97 102 -45 198 183 -78 -48 -97 -11 -28 178 79 89 133 -41 54 178
6940 178 -23 91 58 -58 -27 89 77 -61 -38 -96 91 239 -153 -242 -110 -73 244 -50 34 62 -32 98 -72
6963 -72 -97 86 -150 -24 133 -84 -81 42 -156 -193 180 69 91 181 146 33 160 12 187 166 136 -302 236
6986 236 -112 52 -171 44 -252 16 -195 43 -221 -69 226 -79 -51 -99 140 82 -26 142 -55 -10 -21 47
7008 47 5 29 208 -36 -219 148 209 11 -46 12 11 -5 10 -131 38 241 141 64 86 52 -166 77 -235 -48
7032 -48 264 -160 95 65 -72 -92 177 61 78 -39 -52 157 28 180 -303 176 -13 -66 -23 -107 109 -37 126
7055 126 71 -12 -59 -91 220 -98 -56 -22 -120 107 -123 111 66 213 -40 120 -93 -147 -111 142 106 -115 -94 14
7079 14 82 23 -66 24 -35 69 215 -127 -66 121 12 136 42 -165 -151 137 203 219 -47 68 61 212 -53 -59 329
7104 329 -257 79 115 48 -158 6 71 141 129 19 113 3 -118 325 -63 -22 224 69 -230 182 -121 -174 -37
7127 -37 81 160 132 65 124 -89 -17 48 5 -43 164 -174 -43 -79 -74 196 184 -52 -61 -26 14 33 -101 -7 44 -30 162
7154 162 -52 -139 -110 68 20 -196 83 -80 34 -51 0 -114 121 90 -24 61 -72 -11 -66 -149 175 29 107 119
7178 119 -67 166 -225 -217 -160 25 223 -268 -237 -132 -124 105 106 77 -227 173 144 -25 -16 -60 -4 -91 28 115 -62
7203 -62 143 -96 222 -29 308 111 -159 -145 -384 -53 5 87 146 -62 30 -140 155 -58 -96 -57 -128 -161 17
7226 17 -5 -35 258 113 -128 -116 58 -2 -158 76 16 -290 59 -128 -105 -269 118 1 82 -248 -193 -45 -127
7249 -127 95 -202 -117 194 -271 158 -149 162 -11 21 -122 106 -368 20 -9 117 18 172 -128 78 -134
7270 -134 -67 177 -87 173 109 -111 -40 50 37 150 -79 73 -28 279 196 -36 -88 48 23 102 -119 -204 99
7293 99 248 211 -13 67 94 146 -126 -131 -39 190 134 24 62 112 -88 -10 -79 -220 181 53 -38 200 40 114 183
7318 183 170 46 -68 -95 2 -176 39 36 -104 250 -17 -88 -14 96 179 39 119 28 44 105 -180 -261 -89 -28 -33
7343 -33 -72 0 -120 214 -252 -82 104 30 116 -177 -42 -118 -129 -147 -112 66 11 -449 177 330 86 28 125 -49
7367 -49 95 84 231 -80 -129 -209 -38 -40 -92 112 -21 -5 -116 46 67 -168 -64 -55 -32 69 -64 -148 9 -18 200
7392 200 271 -93 -165 -54 -55 87 94 -90 -57 312 -103 62 140 155 46 173 -34 -154 -268 -237 -31 -88 -73 126
7416 126 -27 -169 -91 -136 77 138 21 -269 36 14 -10 -35 -42 -51 -98 -19 -70 -118 -135 93 -66 28 -156 -44 -52 15
7442 15 -82 -83 -67 115 91 38 -88 -1 -273 29 135 -180 -135 66 -151 34 -73 -79 144 135 -221 -11 -81 332 90
7467 90 -36 -248 -23 -186 137 72 95 20 9 -108 161 23 19 153 -106 -270 -260 -3 -112 -101 -93 247 -221 87
7491 87 30 -17 30 138 -41 212 59 139 96 -94 132 -92 52 -168 11 72 3 272 -71 -6 -36 49 177 -77
7515 -77 -71 178 82 135 -37 -197 180 171 -68 -40 99 -143 61 -170 48 114 121 95 -103 215 81 168 102 -9 188
7540 188 18 136 23 -12 -173 95 -145 -63 -47 -15 20 -46 207 -31 38 -49 6 40 -56 -79 -96 151 151 123 -82
7565 -82 152 -19 188 84 -129 -133 -5 -57 221 137 -165 -47 176 141 46 15 36 -85 -115 89 46 27 -143 54
7589 54 -62 117 6 131 6 153 183 -169 119 80 -112 -72 194 -163 -89 154 -100 17 -50 95 -50 -161
7611 -161 -46 -199 -19 71 -122 -30 101 62 28 77 -15 62 -5 87 -133 -126 -191 32 -15 -143 14 -132 24 -94
7635 -94 -52 -1 -78 169 107 95 121 -52 -328 134 1 -10 -169 70 -17 226 -133 119 8 -265 -48 -45 7 40
7659 40 -138 18 -203 -70 -233 -110 89 -90 -88 -173 -12 -93 66 173 127 152 157 -45 247 167 114 -61 106 -16
7683 -16 38 -140 70 80 -196 -128 -27 114 -152 -87 -211 92 170 -15 -204 -180 74 25 -71 -3 -44 170 -71 84
7707 84 -124 -6 3 79 6 61 -113 192 -205 -64 87 76 -122 47 -192 -111 -5 -58 11 82 -154 -19 30 78
7731 78 44 47 -203 141 -186 -9 43 56 -29 70 95 -27 -231 -115 -43 -68 -34 34 -158 -155 146 82 194 52 115 190
7757 190 13 -27 79 -106 -8 77 126 -11 -115 -27 157 53 -53 -234 104 -205 -55 65 -4 197 53 75
7779 75 123 -48 9 -363 -76 -37 104 15 71 -135 83 -168 -12 115 -82 -64 5 142 -126 79 -179 146 -64
7802 -64 19 -189 203 163 234 -176 184 98 -80 -81 74 -4 -66 -62 338 154 -210 36 94 -102 -25 14 12 -78 93 113
7828 113 53 66 -140 -29 -191 -31 -100 -83 151 330 115 156 223 -97 -14 48 -176 51 10 -253 245 -103 252
7851 252 5 -26 52 -294 34 99 -46 35 -95 -101 68 107 244 10 -127 -130 294 175 115 104 97 65 -48 76 174
7876 174 -201 -9 -101 -15 -51 -21 -35 124 -120 37 -177 87 -48 -44 -80 66 189 -56 -84 45 -40 -149 47
7899 47 -34 -153 -8 40 -149 -261 -7 -59 -15 1 42 -6 -185 -83 -199 90 103 -22 95 303 -90 16 -112
7922 -112 -96 244 75 15 138 -80 34 -93 -180 274 -340 -32 -116 192 6 11 139 -78 7 -100 145 -49
7944 -49 -114 8 243 -152 -62 -93 157 -72 -86 -66 -2 29 100 -73 183 -79 72 -115 -84 51 -60 123 -74
7967 -74 46 31 72 -187 196 47 -170 65 52 150 48 77 263 -164 107 125 -79 22 -164 -192 -162 90 99 134
7991 134 1 -2 93 18 -223 -208 132 20 40 -135 75 109 144 302 134 27 133 78 -135 -87 -105 140 -14 20
8015 20 -37 -63 74 48 -63 -181 -72 -23 -160 -92 -29 -146 -256 80 -114 -162 -93 -46 130 166 118 -113 84 6
8039 6 -140 27 -159 95 133 -12 -96 -238 92 -262 -141 -116 -172 -131 -53 116 -45 -59 -301 -133 90 -50 120
8062 120 -158 -225 -7 -9 -60 -91 127 61 324 -24 -9 78 -61 132 144 190 -71 -191 -29 -230 45 -144 -23
8085 -23 236 51 -76 17 13 201 -43 47 -79 -236 -119 -1 76 44 3 46 -38 11 -239 31 19 -24 39 37 -68
8110 -68 70 -355 -116 53 222 -88 135 125 -201 9 -13 32 -221 -60 -55 54 -53 -35 -53 -82 253 29 -23
8133 -23 -91 227 178 -122 11 55 68 -3 35 121 -234 -169 112 -5 -41 -70 -92 88 -35 -110 -262 -10 123 15
8157 15 113 -97 37 55 188 -144 -22 84 34 51 -85 -113 -103 26 -76 78 -150 -62 138 91 21 -16 -49 -107
8181 -107 128 56 35 -75 66 -207 -123 -28 128 109
8191A09
$$ Imaginary data points
##PAGE= N=2
##DATA TABLE= (X++(I..I)), XYDATA
0 0 0 0 0 0 0 0 0 0 0 0 -8 8 -8 8 -16 16 -24 24 -32 40 -48 56 -64 74 -88 104 -120 138 -160 184 -210 237
32 237 -269 306 -345 388 -436 487 -545 608 -676 753 -833 923 -1020 1129 -1244 1372 -1510
49 -1510 1666 -1835 2021 -2228 2458 -2717 3008 -3340 3722 -4168 4692 -5326 6101 -7082 8367
64 8367 -10130 12705 -16836 24542 -43835 198217 257784 -40759 239425 248498 60151 149025
76 149025 221680 39937 153837 207822 9904 51164 208160 23885 -10486 155624 43712
87 43712 -37315 90276 17398 -61112 58223 20930 -84906 34686 16655 -101688 -8581
98 -8581 24908 -104191 -16610 44181 -97842 -35001 53765 -80755 -56016 82509 -35613
109 -35613 -62563 98925 9112 -73101 91189 69603 -60184 92065 121123 -34075 70034
120 70034 146956 -806 45938 175870 46261 32181 168215 80762 16543 143104 108541
131 108541 18470 129008 117547 17265 90025 111076 16133 59505 105627 17218 39114
142 39114 79838 1356 7016 64507 -7787 -16605 55779 -16241 -43691 26981 -22273 -69120
154 -69120 15447 -11502 -86975 -3326 -4519 -99162 -36477 12041 -88841 -52326 23751 -72839
166 -72839 -73125 18597 -44313 -84904 20293 -7233 -78609 6225 12810 -66444 -9438 35452
178 35452 -42377 -10666 44892 -19269 -20018 38560 3765 -16385 42612 19000 -8471 34759
190 34759 22178 -9244 28318 30927 -4152 29795 27442 -7450 17717 25715 -13588 9899 35646
203 35646 -15914 -3563 28772 -17323 -23273 27294 -9235 -34500 23691 -2609 -48126 1166
215 1166 9435 -48974 -12675 20592 -41438 -29382 15501 -31623 -45346 16061 -12534 -45697
227 -45697 6419 -367 -43982 -10639 10228 -33793 -11208 16809 -21375 -18841 12369 -11144
239 -11144 -20342 14820 -76 -11468 11285 1948 -12969 8767 8268 -10451 14703 12613 -9180
252 -9180 9109 13067 -12596 7946 24245 -11428 4039 26147 -8564 -11153 27241 488 -16376
265 -16376 29514 9271 -23761 16461 19540 -27726 6918 31799 -19579 -5231 29851 -12159
277 -12159 -20229 29515 22 -23130 24848 10694 -26570 9115 17423 -24195 4194 21807
289 21807 -16372 -3973 18633 -13826 -13454 19031 -7361 -11938 16023 -5312 -17985 10471 -3898
302 -3898 -21800 13640 1267 -23711 5900 3409 -29421 -182 11598 -29152 -3807 17237
314 17237 -27635 -19177 19875 -19813 -26560 23731 -8440 -31713 16269 2226 -37932 10032
326 10032 16988 -32265 2440 23629 -24781 -10498 27886 -14803 -12690 31706 -2631 -16498
338 -16498 25366 7202 -18785 23696 16604 -12449 20571 20371 -13133 12843 25917 -10636 11796
351 11796 29717 -6920 4793 28191 -6560 -3631 32486 -2111 -9023 29574 2113 -20048
363 -20048 21522 8802 -25657 17825 14809 -28471 2999 18709 -29786 -9437 23634 -23091
375 -23091 -17834 20056 -17394 -29812 16608 -7650 -32145 13211 1466 -31780 2199 7575
387 7575 -29801 -499 15215 -22401 -3062 17647 -16046 -9213 21982 -7012 -6180 25969 1006
400 1006 -6947 25715 9473 -8685 29957 19799 -4755 27937 26414 -4188 23000 35501 -841
413 -841 21475 41976 4208 11297 42020 10766 4877 43752 17558 1399 37032 22853 -4733
426 -4733 28352 28857 -4527 21850 30132 -3876 9605 29084 -3220 2709 29219 26 -2657
439 -2657 22071 1947 -9328 18212 5043 -10420 15442 7428 -13392 7426 10365 -13877 6366
452 6366 14170 -11830 2862 14656 -10636 -3108 19189 -4099 -4261 19751 1937 -7321 17464
465 17464 8370 -8652 19568 15825 -6653 14735 19687 -4076 9124 24043 950 7979 24134
478 24134 4467 1753 22603 8896 -836 22263 11723 -1120 15030 11427 -3477 10694 13149
491 13149 -4137 6864 10981 -5479 -1761 9134 -6702 -5124 8182 -7555 -9372 2489 -7762
504 -7762 -14671 -63 -6306 -16020 -2667 -6138 -18835 -8904 -3380 -19063 -9959 -2016 -16490 -13081
518 -13081 -3389 -13656 -15115 -939 -8682 -14012 -1311 -4505 -13702 -3236 614 -9995 -224 2968
532 2968 -6098 -1683 4480 -3386 -2371 7707 1255 -710 6015 3455 -2019 5788 4762 -1445 6893
547 6893 5237 -1353 1683 4452 -2018 -626 4501 -2027 -2537 1066 -4010 -8402 -512 -4695 -9788
562 -9788 -2799 -6098 -11932 -9458 -6609 -13901 -10893 -6548 -13310 -14019 -8296 -13477 -16978 -7870 -11841
577 -11841 -15291 -8397 -9445 -15688 -11295 -6313 -13560 -9218 -3441 -9732 -9393 -1590 -7522 -8821 1617
592 1617 -2895 -5672 1595 1322 -5102 1183 4306 -3042 3822 7073 -937 1849 8762 -468 706
607 706 9492 2812 1163 7871 3457 -2696 6998 4169 -3395 5675 5771 -4615 591 5091 -6307
622 -6307 -1186 4593 -5703 -4268 3098 -5404 -9281 2267 -4622 -10120 1098 -3095 -11846 -2116
636 -2116 -1871 -12927 -2640 -141 -10701 -5603 1010 -10083 -8359 2852 -8211 -7693 3569 -4348
650 -4348 -9560 2971 -1964 -9140 3944 1201 -7469 2154 4520 -7927 227 7214 -5368 16
664 16 8059 -3145 -2590 8824 -1738 -3603 9499 1493 -4633 7089 4033 -6432 5654 6064
678 6064 -5704 4591 7628 -5678 391 8508 -5172 -813 8475 -2273 -3115 7525 -1587 -6852
692 -6852 7552 712 -6558 5669 3040 -7997 2550 4346 -7917 1981 5939 -6239 -1651 6609
706 6609 -6172 -4444 7105 -3641 -4809 6190 -1780 -8062 4974 139 -8315 4226 2288 -7551
720 -7551 1178 3627 -8633 -768 5672 -6679 -2169 5557 -4867 -5690 5537 -3450 -5716 6034
734 6034 -1235 -6748 3830 1452 -8183 3463 3433 -6146 2186 4869 -5965 -449 6605 -4938 -931
749 -931 7368 -2271 -2823 6794 -719 -4374 7145 1482 -4195 5883 3239 -5289 3318 4961 -4894
764 -4894 2725 5696 -3743 51 6115 -3505 -2157 6585 -1940 -2794 5118 -946 -5196 3703 81
779 81 -5783 3175 1563 -5479 530 2508 -5969 -360 3377 -4989 -1427 3129 -4020 -4063 3561 -2561
795 -2561 -3790 3710 -744 -4003 2578 724 -4664 3071 2742 -3074 2012 3558 -2231 948 5127
810 5127 -1567 1282 5749 10 29 5301 1490 -743 5948 2471 -128 4734 3455 -1140 3495 4561
826 4561 -1063 3168 4360 -186 816 3648 -935 -87 4078 -484 -924 2164 -260 -2796 1164 -406
842 -406 -2970 493 -581 -3665 -1883 -404 -3931 -2200 -491 -3851 -2858 -1275 -3489 -3888 -929 -3245
858 -3245 -3502 -1095 -2824 -3880 -2194 -1746 -3704 -902 -1098 -2770 -1498 -774 -2229 -2222 203 -1468 -745
875 -745 -59 -699 -1469 -73 174 -1192 823 581 -294 -446 634 -156 -226 986 175 242 647 833 -724
894 -724 112 493 -723 99 263 -211 -1114 -53 -901 -1282 -173 -630 -1885 -1386 -957 -2925 -1364 -1336 -2553
913 -2553 -1906 -1089 -2885 -3179 -1194 -3106 -3068 -1475 -2129 -3647 -1685 -2505 -4532 -1525 -2139 -3429 -2437
930 -2437 -1268 -3706 -3066 -820 -3652 -2605 -341 -2334 -3560 -104 -2228 -3577 -240 -1166 -2507 -619
946 -619 75 -3216 -824 255 -2579 -636 1250 -1905 -1662 1544 -1683 -1436 1566 -672 -1452 1324
962 1324 166 -2556 1358 217 -2148 1157 1586 -2279 42 1642 -2780 -48 1846 -1838 -1151 1664
978 1664 -1596 -2542 1736 -1327 -2758 1338 -171 -3417 362 -158 -3842 135 176 -3292 -1158 1021
994 1021 -3315 -2382 1284 -2736 -2199 1198 -1581 -3274 1406 -1761 -3376 1358 -168 -2900 565 647
1010 647 -3029 736 1708 -2615 304 2439 -2048 -708 3425 -1643 -574 3117 -288 -633 2945 869
1026 869 -2000 3070 1407 -1685 2576 2590 -2042 1472 2993 -1734 1292 2964 -1046 -282 2965 -809
1042 -809 -1303 3094 -458 -1585 2533 388 -2489 1493 363 -2774 1118 686 -2387 -157 1378 -2818
1058 -2818 -1025 1717 -2437 -1228 1542 -1431 -2388 1780 -1601 -2061 1854 -456 -2457 1051 833 -2978
1074 -2978 727 1504 -2253 586 1998 -1764 -184 2499 -1694 -405 2609 -475 -964 1823 239
1089 239 -1561 2443 846 -1376 1865 1205 -1912 1032 1771 -1678 1282 1809 -769 50 1965 -964
1105 -964 -766 2087 -701 -809 1756 -207 -1769 1667 214 -2009 1477 329 -1739 123 918 -2125
1121 -2125 -75 1410 -1963 -401 1066 -1430 -1354 1281 -1389 -1199 1118 -681 -1328 657 120 -2056
1137 -2056 495 425 -1409 232 633 -1284 -280 983 -1261 133 999 -627 -554 805 -188 -1077 1221
1154 1221 20 -485 1210 562 -589 971 901 -708 1237 918 -281 664 1142 -232 336 1721 154
1171 154 643 1341 310 -72 1453 509 81 1545 673 236 855 689 -132 797 1164 93 878 688 -47
1190 -47 20 1142 -116 426 663 104 64 19 -83 -553 443 30 -132 65 -326 -598 -122 -154 -710 140 -291
1211 -291 -374 76 -459 -435 -616 -34 -582 -151 -143 -485 -203 -241 -57 -386 146 -452 182 -124 -153 -54 96 -343
1233 -343 -24 537 -293 176 299 -124 -12 558 -44 -406 500 -256 -66 543 306 -393 354 111 -538 77
1253 77 -22 -489 -99 383 -550 -314 138 -842 -335 -18 -618 -596 279 -785 -964 -32 -764 -754 -317 -446 -1335
1274 -1335 -56 -436 -1382 -278 -229 -1064 -950 301 -1268 -771 -10 -1057 -908 306 -697 -1219 493
1291 493 -433 -968 391 26 -977 350 252 -1162 403 402 -787 207 719 -649 -546 997 -683 -118
1309 -118 762 3 -285 841 -239 -740 998 1 -775 338 444 -1155 42 311 -1324 141 541
1326 541 -875 -584 613 -1018 -886 482 -899 -1122 328 -620 -1611 294 -332 -1540 256 51 -1368
1343 -1368 -154 408 -1462 -293 561 -1055 -554 809 -603 -641 987 -659 -646 996 119 -588 1041
1360 1041 541 -741 1058 739 -405 801 1156 -159 543 1445 -328 391 1420 136 298 1560 233
1377 233 -30 1405 496 -134 1139 1242 -154 1106 1116 -426 888 1099 -61 501 1444 -272 258 1360
1395 1360 -32 25 912 279 -767 894 66 -545 938 283 -569 431 817 -704 504 455 -733 287
1413 287 785 -590 -348 882 -676 -187 788 -93 -479 899 300 -467 777 402 -531 717 754 -513
1431 -513 898 1118 -595 385 1112 -48 55 1167 256 41 1109 274 332 1153 605 -318 798 758 -9
1450 -9 860 689 61 695 825 -68 526 1110 16 317 831 -6 7 738 -403 -46 663 13 6 532 156
1471 156 -543 345 296 -534 209 485 -505 165 333 -692 -72 469 -310 -272 342 -144 -580 187 -109 -213
1491 -213 264 3 -265 296 216 106 327 457 166 659 380 189 470 567 321 443 777 399 256 863 205
1512 205 344 795 310 168 648 491 -28 615 821 50 566 710 190 341 892 129 194 306 -115 373
1532 373 342 211 -156 298 82 182 256 195 166 293 395 46 355 -24 233 415 -140 247 345 199 116 423
1554 423 245 112 142 407 45 252 662 -70 183 514 238 301 495 272 169 532 353 223 30 262 267
1575 267 254 535 119 472 5 225 214 357 57 -115 130 -81 421 12 -400 82 244 -201 22 758 -502
1596 -502 -200 503 147 -200 176 77 -153 373 106 -198 98 623 -287 53 428 -102 -149 30 161 -246 171
1617 171 -55 -29 287 -156 -160 135 185 -490 352 -207 -144 44 -16 -270 -33 87 -783 -69 -133 -323 81 92 -587
1640 -587 -469 426 -215 -698 219 -44 -643 373 178 -639 -234 200 -579 -8 343 -432 -331 521 -113 -233
1660 -233 77 -190 -282 230 -41 122 265 86 -94 664 187 -182 556 136 -172 486 42 -203 154 416
1680 416 -282 113 40 -639 -158 635 -348 -294 576 -134 -606 432 -63 -527 49 114 -470 -47 257 -362 -462
1701 -462 484 -298 -472 237 -356 -388 125 -75 -327 55 -214 -403 201 60 -75 303 131 37 243 -5 -219
1722 -219 363 319 -113 25 679 -286 60 881 -89 55 773 482 -255 817 395 -265 545 431 -87 399
1742 399 523 55 203 578 50 98 764 193 -77 297 132 5 361 232 140 103 172 203 96 -89 -7 685
1764 685 126 -37 132 373 -158 361 221 -443 112 484 89 80 783 -19 -51 396 143 -427 302 211 -194
1785 -194 208 516 56 75 687 80 69 444 -100 0 351 464 23 38 0 -163 265 389 110 172 5 119
1807 119 428 -239 -60 402 -77 52 120 126 -465 157 317 -201 -219 170 -198 -480 242 -64 -396 -23 -91 -127
1829 -127 -19 -47 -507 51 42 -229 -31 133 110 -335 167 -99 -217 111 -71 -154 -1 325 -103 17 -38 81
1851 81 277 -37 -119 105 -87 -323 433 -290 -324 160 -72 -261 136 165 -241 -57 302 -180 -147 326 -75 -119
1873 -119 -97 267 -357 -3 305 -66 18 -40 31 -162 -83 181 76 151 183 -38 64 14 162 -245 -43 -164 -84
1896 -84 -108 159 220 -282 59 141 -22 -11 435 30 36 381 185 -182 197 390 -166 91 138 -253 -101 224 -164
1919 -164 -164 216 -39 96 -78 138 43 134 -144 41 -26 -139 61 -87 -7 41 240 -84 -292 305 -30 -164
1941 -164 56 -89 -458 331 209 -27 -112 112 -293 -132 310 -207 -51 214 -82 -160 104 356 -110 -142 262
1962 262 -248 -39 83 -92 90 -119 141 249 296 197 164 -66 6 -134 165 -29 -169 100 134 70 -14 -169
1984 -169 -314 209 102 43 -46 47 -449 -12 48 -676 -195 244 -26 -34 -13 -171 -431 -1 -102 -273 -73 4 -545
2007 -545 43 30 -342 -210 114 -144 -122 -168 -352 -138 -85 -340 -77 4 -76 -124 -167 -137 107 206 -109 43 -37 169
2031 169 -146 218 -100 -150 95 284 82 -59 360 -100 -91 156 -59 -173 210 -86 -137 134 -166 -46 10 -191
2053 -191 -106 -72 122 -237 -189 -74 123 -198 -100 -20 3 73 -309 96 -77 -225 -184 238 -58 -165 66 -66 -147
2076 -147 192 225 -137 96 331 -67 77 116 45 124 261 -151 -118 300 -6 -30 -24 195 10 68 124 27 135 258
2100 258 -321 -220 -33 35 75 299 164 99 80 123 -32 292 -97 47 -19 107 161 10 -9 -143 342 -24 -157
2123 -157 -78 -44 -15 410 138 -163 7 176 41 -26 156 83 -197 387 104 212 276 169 218 100 187 -123 94
2146 94 104 8 24 76 116 134 117 -37 5 59 -86 -13 156 62 119 47 -288 -21 -145 48 -85 123 42 -109 -41
2171 -41 112 -190 16 192 -344 -104 -127 8 -40 -50 -152 -180 162 -205 213 201 -169 -86 -173 -109 -77 -35 45 -13
2195 -13 -232 -85 -125 21 -200 -266 -25 -60 -312 -259 -108 205 -78 -13 74 72 -49 -38 -14 124 30 -112 -11 -14 -180
2220 -180 -37 174 -139 58 -54 20 71 -15 -310 -160 46 15 -95 -104 90 -108 198 -177 -82 -119 -40 -115 94
2243 94 -5 101 -53 93 46 43 -119 -95 94 -50 -138 -134 211 72 -38 -84 26 -98 86 123 -169 144 -72 -1
2267 -1 103 144 129 -113 -190 318 -21 -8 7 -86 37 -59 -16 131 -224 -1 133 51 -261 -161 -103 -10 -16 40 132 -8
2293 -8 121 47 38 58 -57 183 -165 -143 68 283 -292 18 166 84 46 51 -51 -35 408 203 -6 40 -5 45 1
2318 1 270 -13 9 -111 -193 54 -18 -171 -119 42 73 92 231 77 -116 212 -60 -51 -19 -11 -16 21 -42 -136 114 76
2344 76 -68 56 -58 44 -172 -158 -269 141 143 167 25 -70 -118 -23 -134 168 -111 -415 124 109 187 84 151 132
2368 132 15 27 44 -74 -91 172 243 -104 -165 186 -109 65 153 -151 -229 254 -91 -106 126 -123 137 153 84
2391 84 10 -123 9 72 13 -129 79 -115 147 -96 -177 58 -151 69 55 95 89 -78 -70 -4 222 159 -130 5
2415 5 85 -19 213 81 103 -248 139 72 -125 127 218 132 -62 161 -82 111 56 186 -37 -15 93 64 161 226
2439 226 269 -41 129 88 155 -17 33 -120 -184 21 290 -28 31 147 -53 -28 -100 -234 -38 36 64 96 -87 32
2463 32 14 -144 119 115 -140 40 -36 112 160 173 -248 -19 -31 -16 -6 -198 -140 56 86 87 -151 117 135 -48 -57 -3
2489 -3 -210 11 90 -39 103 62 44 11 -40 20 172 88 17 24 100 24 0 150 61 80 229 -67 31 -13 84 55 92
2516 92 0 -28 -11 -106 -141 14 -160 -27 166 -127 56 153 -76 43 165 -97 -193 -79 48 -64 -49 228 14
2539 14 76 48 -273 -53 10 -104 -346 37 124 240 18 39 -110 -39 48 -228 -99 -118 18 25 64 -82 109 -213
2563 -213 30 7 -201 -109 40 67 11 -47 -28 165 -156 112 -99 142 -32 253 -24 -29 -68 255 260 -77 -40 -33 -85
2588 -85 -27 285 125 75 40 176 57 -83 -270 -154 -78 -55 -91 62 19 21 -8 42 -53 -1 -19 -242 -266 -173 144 -189
2614 -189 60 -110 -86 28 -61 153 -69 306 -22 7 -84 -230 -45 -172 100 -133 60 -121 13 60 40 88
2636 88 -122 41 -160 121 113 89 -96 -125 -187 68 22 -71 -51 -132 -6 179 -35 132 155 63 121 -1 38 -40 -64
2661 -64 104 152 153 53 -44 365 145 79 84 -74 311 73 -88 10 395 -124 -23 74 110 82 15 -81 -5 37 140
2686 140 8 19 66 161 -107 38 -113 -72 -95 -81 35 152 33 -112 135 2 8 -1 87 -88 202 -69 132 193
2710 193 -193 68 44 37 7 100 29 -41 237 27 116 -21 126 159 -66 42 127 24 95 94 115 -30 55 114 -36
2735 -36 -141 36 -32 -25 -158 -29 -98 -156 -82 -81 -95 260 72 -84 82 73 -106 -79 -90 -104 66 26 -15 -15 129 -284
2761 -284 -8 -2 26 5 91 -245 -68 -110 -162 -242 8 132 31 48 -80 173 38 57 82 110 -22 122 7 -26
2785 -26 344 218 114 186 138 -39 72 282 -216 171 52 292 355 171 148 8 -44 -56 91 -111 -371 73
2807 73 79 -99 -53 54 -87 -298 -36 124 -94 -216 45 -134 100 -309 -47 -167 -550 201 177 -144 72 -19
2829 -19 -68 -158 -46 111 231 -196 66 -78 184 -93 -121 112 -95 21 -35 107 11 59 117 78 -198 -11 221
2852 221 -88 -47 35 -86 60 212 -87 -73 203 -73 53 6 79 -177 -73 186 -3 100 -189 -123 91 130
2874 130 -27 -14 -1 -75 -99 -167 -195 1 50 120 67 -93 -191 -138 130 21 -71 -103 63 126 89 -59 -91 -133 16 12
2900 12 -43 260 -132 -20 -197 65 149 187 -44 159 114 -53 45 -266 67 -47 -47 52 -75 124 128 79 57 25 64
2925 64 541 97 58 261 99 -54 25 45 21 -65 -97 -2 76 -132 -64 26 -58 49 -170 -119 102 13 120 -109 -99
2950 -99 -93 -80 207 -78 -263 60 -76 -211 -10 -167 -164 128 5 112 34 75 -29 -58 -18 -176 -31 125 6
2973 6 -160 13 55 -13 163 -85 68 104 -175 -28 13 20 168 155 -4 -73 -225 281 236 -143 -134 14 -122 26
2997 26 3 -32 188 31 -50 -5 343 65 -146 124 -105 91 244 20 -16 64 75 -248 -34 -28 233 -98 -57 -41
3021 -41 -21 215 -28 -90 68 -9 -75 -8 174 140 6 162 -42 -124 104 22 43 221 -93 107 49 -172 -70 3
3045 3 -199 56 -65 -27 8 -104 245 11 -48 -208 -36 -60 -128 -98 -122 168 -83 -149 159 26 -3 -103 -183 175
3069 175 -185 -122 97 -4 -117 35 -128 97 -47 115 69 -109 46 -97 19 -150 -308 -181 -92 80 206
3090 206 -55 -180 95 87 191 70 -35 110 45 18 40 83 -52 -24 113 185 68 -15 -109 192 -73 -61 -130 35
3114 35 -27 12 13 -118 61 -244 -195 -15 35 -52 -16 -40 27 -168 -2 -198 46 97 103 -135 88 -128 186 -34 31
3139 31 174 68 -185 -151 102 -111 135 -199 84 102 -54 6 64 -92 -207 118 -1 -92 -357 -113 76 120
3161 120 -115 -119 33 -160 82 103 -76 -110 -9 -67 75 -39 31 -9 -9 -12 -212 317 -174 160 -100 13 162 -90
3185 -90 155 -99 -69 -63 -101 82 176 183 90 -34 69 35 231 166 -121 18 2 -22 -35 82 48 161 84 113 -145 -98
3211 -98 -25 -26 -14 42 120 10 -134 -50 106 -29 57 -106 195 -64 47 -232 -173 18 82 41 195 -227 88 -95
3235 -95 -132 35 26 32 -166 283 -86 25 -229 195 -171 -105 -83 28 7 101 117 -196 52 -20 256 43 -18 90
3259 90 -38 94 29 -148 48 225 -172 44 303 58 12 -191 -19 -160 -22 333 -37 61 98 54 -98 -50
3281 -50 -81 -195 165 12 119 -11 -197 -106 161 -118 137 78 -18 -92 -70 -92 -35 -216 19 145 -110 -130 -15
3304 -15 47 -206 139 16 -25 149 18 -125 17 -62 -151 184 -188 143 182 -37 177 32 2 151 -86 -118 -86
3327 -86 -171 -123 -24 68 100 70 -128 -40 292 -81 23 13 47 -120 -72 200 -129 213 -122 -101 -43 -140 -204 -121 -177 -168
3353 -168 72 -52 -3 0 9 -148 -182 -88 71 50 15 186 106 -271 141 -279 -139 -149 -30 43 15 -14 -191 74 84
3378 84 -143 27 -78 -63 -167 179 203 -5 183 97 91 -68 -22 111 142 -270 -91 46 30 -99 35 38 27 63
3402 63 8 56 -164 -46 -108 18 79 -2 26 178 -65 151 142 14 -283 -136 -58 130 180 128 -23 67 16 238 100
3427 100 -36 -88 178 40 -10 194 -133 -111 5 22 -66 51 -125 145 89 136 -69 -9 43 -212 -135 -178 -167 -74
3451 -74 26 18 77 54 -98 116 45 -32 -97 -44 22 -99 -45 -114 91 -52 -9 -11 286 48 -123 144 272 -7 -103
3476 -103 -49 33 33 -11 -97 -248 -144 -85 74 -147 22 123 -126 -46 256 13 60 -76 48 -172 65 122 64 161
3500 161 -92 -109 -174 81 25 -66 118 -48 -151 -338 -120 -90 171 142 162 55 -65 -196 -61 162 66 -71 -132
3523 -132 -61 -289 154 -40 -118 81 142 -118 -23 -86 -114 99 23 -85 -63 148 127 355 0 199 -262 237 53
3546 53 -306 -32 -127 182 194 77 -20 192 257 -60 36 -44 -108 -17 -148 -7 123 -12 -72 -92 -22 21 26 -32 92
3571 92 -228 -158 59 7 -30 -138 15 -148 31 -99 -66 87 100 -123 180 -5 33 152 66 0 347 -203 -11
3594 -11 -46 77 24 101 17 178 -17 -60 59 179 146 47 31 75 -238 -12 251 -61 282 -16 44 -71 182 -69
3618 -69 162 235 100 62 32 167 -51 -81 196 96 -147 70 -110 64 15 -69 153 264 -32 -88 -46 252 110
3641 110 43 201 224 -170 -163 -19 -29 32 68 163 132 -39 -2 -144 -340 79 171 -101 121 48 -127 -104 -110 -169 -66
3666 -66 108 96 -164 -114 75 -217 -40 191 157 59 -101 -143 -86 24 32 -93 -142 -19 15 150 -181 -2 -31 -185
3690 -185 -9 86 46 78 122 -12 48 -144 20 -83 -168 72 230 110 -47 29 -20 -157 -5 -14 -18 170 56 68
3714 68 192 -17 3 46 -92 85 153 110 14 -100 124 -103 37 -52 119 -150 130 220 54 78 -17 133 168 101
3738 101 -119 -15 -9 -46 -25 -15 7 -124 -11 65 -34 18 166 -286 114 -167 23 -171 -48 -133 -150 -156 -75 35 76
3763 76 121 8 -33 1 47 -24 -271 51 49 59 149 -136 157 89 96 154 6 -106 -88 -96 -87 -113 -98 -16 -165 -169 -15 -226
3791 -226 -21 -107 -217 -88 -22 -10 -70 -244 -38 53 11 220 276 -9 80 116 -92 139 183 -107 -220 -82 6 181
3815 181 -158 -34 -92 223 139 70 22 238 36 107 66 72 93 23 115 9 17 75 -48 -244 -170 47 187 -21 267
3840 267 157 -42 -117 -129 37 12 -322 44 119 -345 29 -208 41 -10 -3 -123 -43 -80 -25 -64 45 -170 -79 15
3864 15 -99 104 84 -59 32 106 -213 -110 -174 41 -104 99 185 282 130 312 -33 155 -183 -15 6 -171 -181
3887 -181 67 -241 261 -222 -238 82 141 135 -79 42 6 171 5 20 8 -61 116 59 4 -31 86 174 -22 148
3911 148 155 -88 -93 30 18 -144 106 64 155 151 -187 -20 88 -79 105 112 51 -44 -175 -243 42 17 46 142 186 108
3937 108 52 -42 -62 -128 -4 47 -30 -195 133 -42 13 -15 19 103 202 96 13 45 -69 -164 -214 -151 -17 -30 -46 -19
3963 -19 -202 -4 18 125 98 82 -48 53 -299 251 -300 -57 316 129 -57 24 -18 -63 -409 -45 259 -113
3985 -113 94 124 415 149 71 -109 -122 -131 -87 -123 -210 -78 -42 119 110 -56 197 -125 -76 -107 151 63 -247 163 -56
4010 -56 84 -203 87 42 147 83 -101 -254 -64 -226 23 -187 121 -102 78 -73 -117 -202 77 116 70 212
4032 212 7 -6 -85 -56 175 -39 -201 -57 -75 28 -200 -2 146 129 45 52 3 -30 8 -141 -9 59 100 -122
4056 -122 28 63 107 -65 32 -68 160 -90 216 55 1 47 -32 7 -22 -36 -93 108 4 -134 -43 24 -131 54
4080 54 -172 20 -40 -96 -144 68 -214 -191 34 106 -51 -177 170 -116 -23 10 -88 14 54 -48 -48 42 -32 277 -194
4105 -194 40 -144 -26 91 232 -123 -204 120 55 10 -101 -233 196 -78 72 -234 -128 114 -129 -258 -137
4126 -137 -102 129 116 -174 -15 -17 111 -17 69 -81 -18 -110 -224 -230 -35 -2 96 -208 -4 -190 -21 185 -19 42
4150 42 -58 120 -102 21 198 200 243 -111 137 -41 -26 -233 74 83 96 -91 12 -253 -29 143 -97 -190 168
4173 168 -94 51 81 -299 -38 78 98 137 -184 -103 10 -70 54 -9 -99 7 47 20 23 115 -131 58 -191 183
4197 183 -10 25 2 -115 -171 -57 335 61 -41 151 170 158 -55 -46 -326 53 266 -4 59 -181 -7 62 -90
4220 -90 -92 5 102 -161 55 -113 -93 196 -16 97 95 -14 -136 -121 -120 -175 -41 195 149 -10 -27 -68 -3 82 126 -51
4246 -51 336 -46 -57 175 -126 276 -46 132 97 -3 13 -83 87 105 -116 -39 -58 47 50 26 110 133 74 -33 -41
4271 -41 -62 -107 -156 15 121 -190 -114 33 -14 71 -211 -2 -2 100 -60 72 -10 -71 34 4 195 63 -5 -116
4295 -116 -197 -6 -96 -23 56 9 -233 -18 -26 -86 -72 119 93 -68 32 -138 -216 -72 54 -29 279 -160 211 -138
4319 -138 98 145 -80 -65 64 -152 50 167 204 26 9 -85 -96 -209 -22 -202 -123 -153 68 223 92 13 -188
4342 -188 -7 -16 -124 -61 -87 12 32 -36 -98 22 152 -60 -189 -15 29 178 -211 -146 -30 56 -165 -85 91 73
4366 73 75 65 133 58 280 230 -9 175 120 -41 288 152 138 87 244 45 10 -256 -25 -44 226 -10 31 152
4390 152 -57 173 -65 185 19 -115 -30 77 66 121 -14 -181 109 68 74 52 -22 13 -21 -157 -170 12 -36 -235
4414 -235 -37 101 19 -135 -2 57 -9 51 94 51 -135 271 108 164 -71 138 -13 -12 159 -206 206 182 -189
4437 -189 -217 125 14 20 202 -24 -64 66 -152 95 240 -120 42 -214 -79 79 -24 61 22 -226 -26 11
4459 11 176 71 -3 -275 -54 -88 113 -27 148 -92 200 -87 110 170 -148 41 178 -96 34 -24 -200 4
4481 4 153 -30 -19 64 21 -179 101 143 164 -15 62 -134 36 174 -258 -135 -92 77 -130 251 -240 292 34
4504 34 -76 -53 -130 -16 -27 -10 54 -97 5 -110 28 203 143 -39 -167 -109 -16 102 -186 74 35 -27 47 -39
4528 -39 -84 -251 -29 -220 190 -178 13 26 134 120 -45 -32 73 127 28 -75 -163 115 -71 32 -102 96 -63
4551 -63 -42 123 106 -89 275 39 1 97 38 55 42 234 1 191 53 -8 -163 -129 -85 -117 73 -249 -1 112
4575 112 96 96 -163 64 97 -112 -218 138 44 37 140 259 -74 -76 19 -122 -33 -7 207 81 112 241 28 36 -209
4600 -209 -32 -149 158 -45 -15 -99 -16 61 69 54 66 100 20 -316 -337 38 -5 -32 -15 -258 -9 -106 -58 -82 -5 105
4626 105 -108 41 -217 -8 107 -128 -11 -78 57 39 -59 -2 -47 -47 -80 142 -102 125 114 42 -12 206 -198 -58
4650 -58 -49 -109 -80 -61 210 109 -48 44 -37 -139 -8 57 -135 -42 -1 -35 72 -114 97 -59 45 -79 -79 3 -7
4675 -7 110 -74 44 5 -91 -122 -257 10 -36 -86 153 105 -17 -293 -65 139 -85 -113 17 98 46 -24 -101 128
4699 128 228 116 -20 77 -198 170 -69 -8 -64 -52 23 59 132 14 -160 155 52 -2 204 206 -108 70 -123
4722 -123 18 24 29 317 -10 -81 -76 -132 200 67 -62 25 -1 67 151 -190 -183 29 -157 4 155 -64 87 -64 29
4747 29 -99 87 33 54 -100 -105 11 94 183 178 12 131 205 -12 -118 11 41 -127 112 -230 -82 -96 -21 112
4771 112 97 -55 -157 83 -14 212 152 139 108 -30 -87 188 -179 64 103 -175 -74 -113 -117 -282 217 61 56 60 -132
4796 -132 121 170 151 -51 -108 104 -183 -199 -80 18 79 147 157 -110 161 -166 -45 -202 -84 114 -13 10 -259
4819 -259 17 47 42 -121 64 68 54 -37 95 -29 133 -183 -75 -37 158 34 33 19 18 66 46 306 -3 14 115
4844 115 69 -97 74 26 -308 -47 -104 -115 -4 -23 -74 -52 -59 27 131 -182 -141 32 254 -46 106 -28 295 -107
4868 -107 22 64 -66 76 -111 -43 40 134 -338 46 151 71 -67 -89 -49 282 -131 35 -199 226 -237 35
4890 35 -23 -203 -18 204 61 62 111 -86 -17 160 88 93 1 -74 -139 -60 -167 -209 74 -137 -124 -93 49 74 31 239
4916 239 -147 -224 33 -140 56 -155 -320 -36 -132 -112 -48 -35 -96 79 223 82 69 -225 -21 -56 -132 -32 -3
4939 -3 -19 92 22 44 209 -99 123 59 -340 -125 -57 -81 -129 86 98 108 123 -31 -87 153 -155 65 -124 -3
4963 -3 203 -120 50 -46 -5 205 127 -114 40 -220 -112 148 -111 -142 146 78 -43 231 -355 -194 -34 76
4985 76 -85 69 -151 -163 -86 -31 180 -1 201 144 85 117 -12 14 160 66 12 29 176 -27 -162 270 -30 -154
5009 -154 -110 89 55 2 -6 -23 -79 78 76 -56 -144 171 -18 10 -136 -61 -60 119 -9 4 11 -59 13 -21 -37 117 226
5036 226 20 100 -121 22 -138 -98 -215 2 -242 129 -107 -100 -245 40 -248 -56 22 69 -2 13 178 -138 -169
5059 -169 -268 122 -76 -51 40 -39 86 -30 -121 -270 -2 -55 -179 -42 -75 -15 -25 345 168 -166 -183 -167 -258 143
5083 143 32 136 -255 97 -90 144 60 14 -31 -187 -24 -133 173 -56 66 29 -69 -171 -179 -137 193 28 -82
5106 -82 -100 8 -311 -191 -31 -237 -218 -157 176 353 -45 91 211 -12 -7 -63 38 -118 -52 -27 -123 -42 -134 -54
5130 -54 -56 -100 -266 -168 7 189 -87 -38 329 114 -149 88 -94 -27 -145 18 172 56 159 -94 -8 -164 -73
5153 -73 169 -106 -198 122 11 -156 90 189 73 -42 74 -95 -83 -68 110 5 -72 -93 153 24 -58 199 139
5176 139 129 -191 -66 -59 -190 -61 -88 -191 -60 -319 -171 -19 48 4 -37 36 -2 0 32 169 -201 77 12 -80 47
5201 47 194 73 -23 -279 -210 -172 -83 60 -50 -162 141 -22 -300 184 -70 126 -11 -15 -49 -121 158 108 208
5224 208 179 66 242 172 -22 -103 15 -201 74 115 -13 143 -86 -30 -21 61 -148 -25 -209 4 -85 -18 28 259
5248 259 -53 -127 82 8 20 -20 133 -143 19 212 22 85 -23 -63 153 -4 -56 -63 24 122 -335 -43 -80 11
5272 11 -98 -73 -96 -16 101 73 76 79 -98 8 43 -117 61 -69 45 25 246 71 -313 93 -24 261 74 79
5296 79 -163 -97 34 -128 105 107 59 13 -70 19 81 -39 -45 103 114 123 183 -64 -181 -291 -100 227 110 -26 -166
5321 -166 102 189 -185 -82 -136 -36 -272 56 66 -70 42 -66 -315 215 9 11 -41 -71 76 -135 -79 14 242
5344 242 44 -10 -69 -174 73 112 108 -147 -198 -119 -246 81 31 -74 15 7 194 -60 106 117 -28 -179 -47 -66
5368 -66 -84 -169 -87 -78 239 18 91 67 -43 113 -111 -100 0 -23 -110 -189 67 170 -75 27 -6 -1 104 38 -206
5393 -206 6 16 -129 -59 295 -44 124 76 -179 -14 324 -175 55 57 257 195 1 2 -9 36 163 -159 -139 -93
5417 -93 206 37 -214 -56 74 -124 191 47 -7 -52 -71 -37 -50 75 194 -54 217 -25 -99 21 -209 18
5439 18 89 -175 144 63 46 88 -50 -33 16 120 -26 111 136 72 39 -39 -43 -149 -16 -126 27 -19 -52 -94 -87 157
5465 157 -234 -168 23 19 190 -77 -32 -78 -86 148 -124 17 -101 154 3 69 -285 -53 196 -31 -159 129 74
5488 74 83 -30 85 128 -49 279 81 122 63 -72 -51 -133 93 74 92 299 -157 -13 -88 -43 -378 27 30 88 -4
5513 -4 118 -55 -137 55 97 -215 -228 9 50 -21 33 102 -45 -161 -117 38 -90 131 -102 230 49 6 -253 -13
5537 -13 -132 -96 -52 -6 -34 76 -68 53 -168 285 36 -6 44 -140 106 -83 62 51 59 129 -99 -113 -323 33
5561 33 -154 218 -113 -15 41 19 138 195 133 -71 -13 97 83 138 101 -120 116 -267 -152 75 318 -24 69 77
5585 77 61 172 -136 111 -254 83 -105 101 -32 -132 -38 -66 -46 -282 -46 170 -94 -72 -343 1 -48 -82 212
5608 212 -137 72 104 -19 102 92 65 1 17 -111 -112 -243 -183 167 -260 92 -190 221 -21 17 194 47 39 -66
5632 -66 -190 -196 -210 -149 -170 -16 279 59 -204 148 73 -91 -6 -4 257 -97 -16 -168 265 -126 -180 142 -5 9
5656 9 120 -164 -109 -3 38 -345 83 -54 51 -236 -24 69 16 -94 -78 59 -218 -25 -191 45 -19 86 114
5679 114 14 23 0 -106 64 -22 8 199 204 120 193 166 -82 -41 -122 221 78 35 -52 -57 -10 151 -141 16 -72 -212
5705 -212 -229 -33 -167 -85 -166 32 -43 98 23 98 175 131 27 8 2 228 168 -24 197 -224 -185 29 -122 2
5729 2 38 -76 -56 83 99 186 -120 129 136 -27 2 -70 132 -98 156 10 -9 64 268 38 0 -33 -120 147 -19
5754 -19 133 -114 -53 55 173 130 54 94 221 152 -101 -34 101 -86 -148 -200 9 -46 38 64 27 -186 -64 120
5778 120 91 219 195 53 24 -253 -122 55 117 95 -145 105 180 15 77 173 -222 84 90 -1 -98 29 -11 -15 -54
5803 -54 -34 -51 16 25 -196 207 -36 72 32 59 -70 -12 -78 -203 30 4 -202 53 23 116 197 -72 27 -107 66
5828 66 14 47 -22 -242 -30 -26 73 -126 28 58 113 120 101 -30 89 129 21 3 -319 31 200 99 -59 7 -81
5853 -81 59 -5 -100 -191 -172 102 49 -9 167 141 3 114 -123 26 62 41 -127 84 22 -52 0 -5 182 265 90
5878 90 -166 28 -139 -179 55 -50 -58 30 39 -91 -139 183 254 28 240 266 304 -25 -178 -36 -14 28 -24 -44 103
5903 103 132 -99 -139 -92 182 -7 -83 157 132 217 -67 95 21 60 -77 95 91 -67 -10 128 -137 162 40 97
5927 97 -65 -33 187 112 63 -119 64 11 33 -107 -77 -202 88 -170 14 -110 -239 1 -119 -154 27 -69 40
5950 40 -35 -161 18 100 46 32 -28 219 -137 183 68 -91 -270 -25 -91 -12 236 -7 36 77 106 170 -173 -178 -103
5975 -103 64 17 -34 395 -231 186 175 153 -111 -8 -285 -61 -43 -220 -32 82 84 4 -117 -47 -57 227 -59
5998 -59 31 77 -30 -49 -130 -86 115 -141 165 15 -141 52 73 151 -51 103 46 14 -244 -100 -117 104 75 162
6022 162 -22 -132 8 200 -358 -23 135 -147 84 48 73 -33 102 -132 -166 -135 127 161 86 -23 -335 -17
6044 -17 -136 -310 222 71 100 192 231 25 13 -21 -211 7 16 93 -151 144 160 -63 59 166 27 31 -94 -70
6068 -70 161 -12 105 -180 135 9 -188 20 -84 -32 -3 -296 121 136 -281 66 -80 -58 -105 73 69 -292 -131
6091 -131 19 -93 128 -96 175 -157 -106 131 62 122 125 29 253 49 23 -238 -15 15 211 -59 73 239 1
6114 1 202 111 122 -61 38 -109 144 30 115 -181 94 67 21 167 -207 -137 35 -17 -86 0 12 108 -28 -58 -18
6139 -18 30 -187 -57 177 102 181 -73 74 140 -117 -209 97 100 -117 -34 -14 87 45 -102 -136 43 -6 190 116 123
6164 123 59 -123 -53 -169 -20 -133 -68 170 19 -38 71 -66 -203 -84 -107 -117 31 124 -23 125 83 160 -132
6187 -132 -109 -3 -42 135 30 107 133 66 180 44 295 361 35 -16 -107 -1 -110 -200 74 36 184 -194 25
6210 25 123 52 -192 109 84 -125 236 -179 135 245 2 72 96 -44 139 -179 26 169 242 90 -85 246
6232 246 48 -94 62 -45 -64 79 -3 23 -116 170 -47 16 -227 10 -122 117 -252 38 -50 35 -27 -58 -50
6255 -50 -3 78 -178 21 9 -138 11 34 111 283 84 17 33 -231 170 -127 -239 109 163 -55 186 254 -224
6278 -224 -120 -318 111 146 116 44 116 -58 -16 -187 -42 -48 300 -3 62 76 8 144 -104 1 -107 116 -156
6301 -156 54 138 -33 -117 -43 -102 120 -270 64 81 47 -170 134 96 -25 8 41 40 138 -107 -182 -3 -45 -31 126
6326 126 -228 98 -77 -243 -46 170 -107 -64 -146 -33 168 5 -9 -56 97 71 -145 -7 -114 100 117 -133
6348 -133 -126 -280 -127 -101 133 71 55 -82 25 -95 117 245 108 -1 -71 93 86 44 7 339 120 -12 13 92
6372 92 138 -79 146 -110 -44 114 135 96 -49 202 -50 131 216 91 -39 -64 -170 95 -99 -68 -25 66 127 -132
6396 -132 -118 -172 -5 -131 55 -22 -70 286 -179 -105 1 152 -50 -104 -283 45 -82 -78 -105 -112 -107 -103 89 124 86 -85
6422 -85 9 -154 -25 -103 -95 58 40 94 -48 185 -192 -156 75 -63 99 30 -163 43 -10 110 108 21 37 63 -63
6447 -63 -151 -20 -178 66 183 -51 107 -68 -60 -115 185 132 -70 -17 -12 -167 -50 -67 58 41 -37 27 28 -41 -234
6472 -234 -218 -155 201 -38 235 -64 -2 -167 -247 -146 99 -119 -186 -34 -175 55 -22 -84 -8 129 29 137 56
6495 56 29 -174 33 -62 -96 162 154 -5 47 10 78 93 -95 200 34 31 254 72 125 19 -98 -152 55 -48 48
6520 48 -117 92 -110 -84 111 -6 -23 -180 -12 37 -143 118 132 168 -52 65 -17 -142 -97 -43 -111 -123 151 -142
6544 -142 -82 268 87 33 -102 47 -113 -329 -30 78 -44 -84 -11 7 61 -26 -183 -132 118 -15 -9 39 -43 168
6568 168 211 -205 15 -73 -30 15 -135 -20 4 18 -123 -68 254 72 -159 -117 -34 72 -167 -81 93 -6 144 18
6592 18 -76 -176 53 105 -27 -15 260 179 -43 127 -129 248 17 -10 -48 221 68 70 -248 -71 -50 -69 113 207
6616 207 122 113 90 -107 57 -84 61 -154 8 -65 -139 -20 104 -78 30 -176 -190 -237 36 123 5 -110 29
6639 29 217 -42 23 -382 -19 -29 102 -11 -142 -87 112 15 152 172 53 134 -38 -72 -39 -66 -116 352 -214 105
6663 105 -90 31 107 -14 45 -86 -351 131 40 -246 -122 -10 -51 -175 -28 81 116 -171 54 -87 0 36
6685 36 180 -151 -160 23 13 -191 -71 -243 56 23 14 239 15 73 -121 119 126 -221 213 -32 -76 23 40 26 -208
6710 -208 74 235 308 80 18 -50 3 80 116 26 -66 189 -26 357 -80 -17 78 49 -350 26 10 -168 -70 -43 92
6735 92 43 87 132 100 85 182 -81 -34 243 -120 -112 -93 6 161 -29 -207 81 -66 27 143 -1 46 75 -69 220
6760 220 187 -132 33 11 90 -118 152 173 -228 -58 -51 -133 25 -300 42 242 -57 -118 128 -118 5 -47 -25
6783 -25 97 -406 -22 45 5 11 -63 -188 254 108 50 -194 -153 67 -244 -227 241 -39 -66 -74 122 -114 -163 134
6807 134 58 -165 -121 -53 -177 -112 -86 -93 9 143 137 48 -115 -45 -205 1 122 29 -90 133 52 -157 16 279
6831 279 7 31 -53 -118 -147 200 165 -84 2 146 163 158 144 -173 -89 20 150 -62 -91 133 -133 -38 26 23 -128
6856 -128 -172 22 78 -91 -159 -161 57 -36 -30 276 -90 45 -157 66 468 -2 -96 -15 -12 36 10 89 -283 135 -124
6881 -124 -84 -47 42 -28 30 88 16 -2 -21 246 -158 121 -93 81 72 267 -38 185 -168 -137 -182 89 37 -109 -96
6906 -96 -117 168 29 233 -204 22 82 -40 -59 -144 107 -54 -20 -73 -217 71 64 70 124 -92 -169 -72 120 -179 115
6931 115 60 -120 85 141 -3 155 33 -38 -88 80 163 61 -209 -148 161 55 191 -190 41 -30 229 103
6953 103 18 -215 15 -39 109 -240 -325 95 41 6 153 228 -184 52 269 168 -99 -56 202 -11 -13 97 213
6976 213 156 77 94 34 262 87 240 -212 -149 -105 112 45 -201 -131 135 -368 -54 -63 119 -119 -205 -5 55 77
7000 77 274 68 28 -89 -136 88 118 29 60 40 -46 -68 88 -51 70 -81 21 -11 -193 257 80 7 19 209
7024 209 -192 0 -100 26 112 159 158 365 9 -124 36 5 15 176 0 155 -119 173 80 -19 27 -1 -98 68
7048 68 -45 100 163 76 -13 -190 -132 -141 -224 -63 -7 -320 81 -14 -162 -12 137 349 -2 157 -92 -205 77
7071 77 14 -10 172 -158 179 -136 -79 -183 -121 -81 -42 57 -32 -38 120 97 -49 226 -108 38 23 149 -222 -37
7095 -37 307 -143 -157 -123 49 -209 -48 15 215 -185 -134 96 -76 -104 127 -60 -39 12 -240 -268 -229 165 24
7118 24 -97 -109 -52 -70 219 126 146 271 -165 91 -57 -19 127 -196 184 209 -132 231 130 113 77 -33 1 46
7142 46 4 -149 166 -84 -139 -123 14 40 -139 45 -187 83 -159 -183 -24 -74 11 23 179 49 -370 -60 114
7165 114 47 24 -206 -134 -34 175 -96 22 169 61 -378 30 117 76 -1 181 53 49 317 40 130 142 118 129
7189 129 -34 -136 -10 64 55 97 -121 15 -12 -99 53 111 52 -45 46 67 -119 117 171 123 -29 6 143 -177 132
7214 132 -138 35 11 -248 59 69 -166 -29 239 -192 -6 -71 224 210 14 144 -159 -147 178 -19 86 115
7236 115 124 73 158 180 7 -27 16 179 266 161 209 -102 -107 -320 65 114 -208 -148 -5 -17 -10 337 -163 -3 -48 -65
7262 -65 -105 28 -120 -76 -135 -26 10 124 -99 174 140 4 31 -52 -334 -78 149 -219 40 -191 -151 -1 -148
7285 -148 -173 -60 -34 37 90 -11 -118 -55 -20 104 -104 188 21 10 98 -45 217 -68 53 99 184 10 1 5 48
7310 48 2 -152 96 232 99 34 49 -71 -126 140 44 -3 -21 80 15 83 -5 130 -43 197 59 -96 -63 -65 -63
7335 -63 -165 49 -115 -28 -27 -54 -106 -217 124 103 -26 115 -19 24 -231 -226 44 20 46 22 -3 -24 23 -5 -14 112
7361 112 -83 -9 -220 -88 -21 149 -61 47 -94 -142 -157 133 215 273 172 34 -18 15 -10 70 11 -133 169 9
7385 9 -114 0 96 -289 4 201 217 60 118 85 -80 -106 -32 -85 -57 290 -124 -118 85 -123 -8 79 -77 251
7409 251 114 32 -36 36 -122 244 -115 -34 16 -70 94 29 -55 -153 -149 69 -98 -117 -4 216 128 -147 90 -51
7433 -51 -205 35 34 35 -75 -116 18 -70 246 -77 82 -19 -60 81 -76 -137 -15 2 106 -32 64 -130 -66 -223
7457 -223 100 155 373 15 -208 -137 18 206 -156 -13 122 35 -84 34 -20 297 -121 29 -5 -167 -228 -54
7479 -54 -98 106 302 -26 399 -19 -142 87 154 -47 -7 86 -107 -45 117 10 190 79 -53 79 -139 56
7501 56 -18 305 -75 301 -103 55 -236 21 -23 -181 319 135 -138 -126 51 -117 -111 -41 -58 -79 162 231 57
7524 57 79 -106 5 165 183 240 23 117 -105 -50 17 -14 152 227 -56 235 136 -257 -103 -18 -138 -56 -191 90
7548 90 -83 -167 17 -8 83 32 92 40 -122 -73 -56 -15 133 151 10 80 37 158 -19 -22 -45 -237 129 51 -23 79
7574 79 -93 77 -2 179 -80 111 -31 -10 228 -59 -15 93 188 180 -100 -162 350 -101 -48 -8 -22 34 328 240
7598 240 -86 236 -27 -64 147 -119 70 12 -126 -79 126 103 -132 -115 182 42 160 59 85 -21 -230 -60
7620 -60 -50 150 -7 157 1 -74 209 -132 -132 62 -130 322 -29 135 27 -51 236 48 214 -174 223 -62
7642 -62 19 -56 -139 -73 -9 119 92 -54 -102 -242 98 -7 -51 -11 152 86 -85 265 -27 -113 -241 -33 -139 -76
7666 -76 -46 82 -207 -151 0 -31 -223 -102 -16 -48 -52 -41 -54 -155 -249 37 -13 -11 92 -59 117 118 -130 -81 60 211
7692 211 141 12 85 103 80 -211 -142 -69 216 -84 -95 100 48 66 105 -213 106 -38 323 31 0 -165 127 160
7716 160 -69 112 -112 164 148 -252 139 119 189 96 -84 191 -362 -68 -40 39 -144 -7 183 -36 308 21
7738 21 43 157 -53 -250 203 57 99 26 -18 135 66 85 -192 83 94 94 -45 100 -84 -206 53 138 51 149
7762 149 -139 -67 -72 127 130 0 -52 40 -99 137 -99 37 -83 -1 107 38 214 97 -93 -55 -48 -76 -201 -79
7786 -79 -154 63 -30 214 -211 -17 -55 -52 52 -14 -241 -74 -110 -255 25 20 48 47 314 -78 183 37 -31 -199 -104
7811 -104 -1 80 121 109 -78 -160 270 85 -153 -190 -10 -37 -46 -209 -127 -36 206 231 39 -82 157 -40 18 -65
7835 -65 3 193 -271 -50 93 -100 113 37 -28 -77 -178 -117 -259 -154 4 -7 29 234 52 64 11 82 -33 -108
7859 -108 -50 -191 -246 -41 -178 -205 -136 343 -11 -209 -51 -14 -46 -37 9 -121 -23 104 -22 -44 -339 -139 -249 -301
7883 -301 -2 -220 68 78 -76 -115 -13 27 -69 -23 -50 59 179 -100 113 -145 123 138 104 -84 -31 87 -11
7906 -11 -8 68 -77 -20 -10 241 -116 -62 132 -88 31 22 -109 -86 295 22 111 234 221 -29 -5 -172 175 286
7930 286 40 -13 -58 -164 -21 -9 -142 -29 32 -20 47 70 11 4 -35 -371 21 21 33 5 -80 -26 -3 -10 -10 -82 223 181
7958 181 -88 -31 -76 235 -188 29 -65 -148 35 -1 115 -46 -16 73 63 -64 -21 72 -128 126 20 -12 -76 46
7982 46 28 34 -117 -74 125 -229 -84 -48 19 -7 -139 32 105 44 -3 34 -10 66 159 -116 96 64 76 -278 112 -161
8008 -161 -56 -11 -58 -54 -186 22 26 184 -110 -197 -93 68 -247 244 7 0 -277 117 -129 -24 -20 -308 -143 -74
8032 -74 -22 -53 -70 42 29 200 -284 129 -120 42 -238 111 -10 -27 97 87 77 -215 111 -55 91 -120 13
8055 13 -111 -70 -43 -105 -127 -73 -250 110 -12 -16 153 39 -79 52 -18 183 -65 -26 -21 -142 74 26 41 93 -75
8080 -75 -17 -91 -198 116 14 22 -232 -9 -108 227 -76 -14 43 -63 -67 88 -274 93 15 72 -64 3 -19 76 -86
8105 -86 45 96 -4 -111 -136 66 138 124 147 79 -24 207 -401 230 127 67 204 -4 -225 -36 -188 148 108
8128 108 58 16 -95 33 243 -116 -203 -35 126 74 216 18 -10 76 43 136 35 49 -9 0 -100 -235 -45 99
8152 99 23 107 20 -78 128 102 39 -271 -95 -1 25 110 -21 47 39 -315 -28 51 -119 174 -85 -52 38 115 0 47
8178 47 -129 -229 -133 -4 -71 -41 -59 7 107 107 90 8 134
8191A34
##END NTUPLES=NMR FID
##END=
