##TITLE=1H_CA-8756-1
 CDCl3, 8 sc, 
 4.9.2020
##JCAMPDX= 6.0         $$ Bruker NMR JCAMP-DX V2.0
##DATA TYPE= NMR FID
##DATA CLASS= NTUPLES
##ORIGIN= UXNMR, Bruker Analytische Messtechnik GmbH
##OWNER= root
$$ XWIN-NMR		Version 3.5
$$ Fri Sep  4 10:26:09 2020 Russian Standard Time (UT+4h)  she@DPX200
##.OBSERVE FREQUENCY= 200.1315066352
##.OBSERVE NUCLEUS= ^1H
##.DELAY= (6, 6)
##.ACQUISITION MODE= SIMULTANEOUS
##.ACQUISITION SCHEME= undefined
##.AVERAGES= 8
##.DIGITISER RES= 18
##SPECTROMETER/DATA SYSTEM= spect
##.PULSE SEQUENCE= zg30
##.SOLVENT NAME= CDCl3
##.SHIFT REFERENCE= (INTERNAL, CDCl3, 0, 15.7039)
##AUDIT TRAIL= $$ (NUMBER, WHEN, WHO, WHERE, WHAT)
$$ ##TITLE= Audit trail, XWIN-NMR		Version 3.5
$$ ##JCAMPDX= 5.01
$$ ##ORIGIN= Bruker BioSpin GmbH
$$ ##OWNER= she
$$ F:/spectra/data/she/nmr/H-F/1/audita.txt
$$ ##AUDIT TRAIL=  $$ (NUMBER, WHEN, WHO, WHERE, WHAT)
(   1,<2020-09-04 10:25:02.00 +0400>,<she>,<DPX200>,
      <created by zg, POWCHK disabled, PULCHK disabled
       configuration hash MD5:
       00 E9 B6 7A A2 85 ED C7 34 08 36 98 17 FE 4E 26
       data hash MD5: 16K
       5D 89 FA F2 FF A8 28 2A 88 C6 FF 74 1E 72 E4 EF>)
$$ ##END=
$$ 
$$ hash MD5
$$ 45 4F E7 E4 99 F2 26 FD 1E 7D 3A 39 DE D3 AA 80
##$RELAX= 
##$RELAX= 
##$RELAX= 
##$RELAX= 
##$RELAX= 
##$RELAX= 
$$ Bruker specific parameters
$$ --------------------------
##$DU= <F:/spectra>
##$EXPNO= 1
##$NAME= <H-F>
##$PROCNO= 1
##$TYPE= <nmr>
##$USER= <she>
##$AMP= (0..31)
100 100 100 100 100 100 100 100 100 100 100 100 100 100 100 100 100 100 
100 100 100 100 100 100 100 100 100 100 100 100 100 100 
##$AQSEQ= 0
##$AQ_mod= 1
##$AUNM= <au_zg>
##$AUTOPOS= <>
##$BF1= 200.13
##$BF2= 200.13
##$BF3= 200.13
##$BF4= 200.13
##$BF5= 200.13
##$BF6= 200.13
##$BF7= 200.13
##$BF8= 200.13
##$BYTORDA= 1
##$CFDGTYP= 0
##$CFRGTYP= 5
##$CHEMSTR= <none>
##$CNST= (0..31)
1 1 145 1 1 1 1 1 1 1 1 1 1 1 1 1 1 1 1 1 1 1 1 1 1 1 1 1 1 1 1 1 
##$CPDPRG= <>
##$CPDPRG1= <>
##$CPDPRG2= <>
##$CPDPRG3= <>
##$CPDPRG4= <mlev>
##$CPDPRG5= <mlev>
##$CPDPRG6= <mlev>
##$CPDPRG7= <mlev>
##$CPDPRG8= <mlev>
##$CPDPRGB= <>
##$CPDPRGT= <>
##$D= (0..31)
0 1.2 0 0 0 0 0 0 0 0.06 0 0.03 0 0 0 0 0.0002 0 0 0 0 0 0 0 0 0 0 0 0 
0 0 0 
##$DATE= 1599200701
##$DBL= (0..7)
120 120 120 120 120 120 120 120 
##$DBP= (0..7)
150 150 150 150 150 150 150 150 
##$DBP07= 0
##$DBPNAM0= <>
##$DBPNAM1= <>
##$DBPNAM2= <>
##$DBPNAM3= <>
##$DBPNAM4= <>
##$DBPNAM5= <>
##$DBPNAM6= <>
##$DBPNAM7= <>
##$DBPOAL= (0..7)
0.5 0.5 0.5 0.5 0.5 0.5 0.5 0.5 
##$DBPOFFS= (0..7)
0 0 0 0 0 0 0 0 
##$DE= 6
##$DECBNUC= <off>
##$DECIM= 32
##$DECNUC= <off>
##$DECSTAT= 4
##$DIGMOD= 1
##$DIGTYP= 9
##$DL= (0..7)
0 120 120 120 120 120 120 120 
##$DP= (0..7)
150 150 150 150 150 150 150 150 
##$DP07= 0
##$DPNAME0= <>
##$DPNAME1= <>
##$DPNAME2= <>
##$DPNAME3= <>
##$DPNAME4= <>
##$DPNAME5= <>
##$DPNAME6= <>
##$DPNAME7= <>
##$DPOAL= (0..7)
0.5 0.5 0.5 0.5 0.5 0.5 0.5 0.5 
##$DPOFFS= (0..7)
0 0 0 0 0 0 0 0 
##$DQDMODE= 0
##$DR= 18
##$DS= 0
##$DSLIST= <SSSSSSSSSSSSSSS>
$$ [...]
##$SUBNAM2= <"">
##$SUBNAM3= <"">
##$SUBNAM4= <"">
##$SUBNAM5= <"">
##$SUBNAM6= <"">
##$SUBNAM7= <"">
##$SUBNAM8= <"">
##$SUBNAM9= <"">
##$SW= 16.880792210976
##$SWIBOX= (0..15)
0 0 2 0 0 0 0 0 0 0 0 0 0 0 0 0 
##$SW_h= 3378.37837837838
##$TD= 16384
##$TD0= 1
##$TE= 0
##$TE2= 300
##$TE3= 300
##$TEG= 300
##$TL= (0..7)
0 120 120 120 120 120 120 120 
##$TP= (0..7)
150 150 150 150 150 150 150 150 
##$TP07= 0
##$TPNAME0= <>
##$TPNAME1= <>
##$TPNAME2= <>
##$TPNAME3= <>
##$TPNAME4= <>
##$TPNAME5= <>
##$TPNAME6= <>
##$TPNAME7= <>
##$TPOAL= (0..7)
0.5 0.5 0.5 0.5 0.5 0.5 0.5 0.5 
##$TPOFFS= (0..7)
0 0 0 0 0 0 0 0 
##$TUNHIN= 0
##$TUNHOUT= 0
##$TUNXOUT= 0
##$USERA1= <user>
##$USERA2= <user>
##$USERA3= <user>
##$USERA4= <user>
##$USERA5= <user>
##$V9= 5
##$VALIST= <valist>
##$VCLIST= <CCCCCCCCCCCCCCC>
##$VD= 0
##$VDLIST= <DDDDDDDDDDDDDDD>
##$VPLIST= <PPPPPPPPPPPPPPP>
##$VTLIST= <TTTTTTTTTTTTTTT>
##$WBST= 1024
##$WBSW= 4
##$XGAIN= (0..3)
0 0 0 0 
##$XL= 0
##$YL= 0
##$YMAX_a= 155878
##$YMIN_a= -143318
##$ZGOPTNS= <>
##$ZL1= 120
##$ZL2= 120
##$ZL3= 120
##$ZL4= 120
##$ABSF1= 10
##$ABSF2= 0
##$ABSG= 5
##$ABSL= 3
##$ALPHA= 0
##$AQORDER= 0
##$ASSFAC= 0
##$ASSFACI= 0
##$ASSFACX= 0
##$ASSWID= 0
##$AUNMP= <proc_1d>
##$AZFE= 0.1
##$AZFW= 0.1
##$BCFW= 1
##$BC_mod= 2
##$BYTORDP= 1
##$COROFFS= 0
##$CY= 11.3945322036743
##$DATMOD= 1
##$DC= 2
##$DFILT= <>
##$DTYPP= 0
##$F1P= 16.9975609425685
##$F2P= -3.02152046262296
##$FCOR= 0.5
##$FTSIZE= 0
##$FT_mod= 4
##$GAMMA= 1
##$GB= 0.15
##$INTBC= 1
##$INTSCL= 1
##$ISEN= 128
##$LB= 0.24
##$LEV0= 0
##$LPBIN= 0
##$MAXI= 10000
##$MC2= 0
##$MEAN= 0
##$ME_mod= 0
##$MI= 1.114404
##$NCOEF= 0
##$NC_proc= 0
##$NLEV= 6
##$NOISF1= 3.799351
##$NOISF2= 2.8
##$NSP= 1
##$NTH_PI= 0
##$NZP= 0
##$OFFSET= 15.70392
##$PC= 1
##$PHC0= -9972.699
##$PHC1= 12.2009
##$PH_mod= 1
##$PKNL= yes
##$PPARMOD= 0
##$PSCAL= 0
##$PSIGN= 0
##$REVERSE= no
##$SF= 200.130013532006
##$SI= 16384
##$SIGF1= 3
##$SIGF2= 2
##$SINO= 400
##$SIOLD= 16384
##$SREGLST= <1H.CDCl3>
##$SSB= 0
##$STSI= 0
##$STSR= 0
##$SW_p= 3612.71676300578
##$SYMM= 0
##$S_DEV= 0
##$TDeff= 0
##$TDoff= 0
##$TI= <>
##$TILT= no
##$TM1= 0
##$TM2= 0
##$TOPLEV= 0
##$USERP1= <user>
##$USERP2= <user>
##$USERP3= <user>
##$USERP4= <user>
##$USERP5= <user>
##$WDW= 1
##$XDIM= 8192
##$YMAX_p= 0
##$YMIN_p= 0
$$ End of Bruker specific parameters
$$ ---------------------------------
##NTUPLES= NMR FID
##VAR_NAME=  TIME,          FID/REAL,        FID/IMAG
##SYMBOL=    X,             R,               I
##VAR_TYPE=  INDEPENDENT,   DEPENDENT,       DEPENDENT
##VAR_FORM=  AFFN,          ASDF,            ASDF
##VAR_DIM=   8192,          8192,            8192
##UNITS=     SECONDS,       ARBITRARY UNITS, ARBITRARY UNITS
##FACTOR=    0.000296,      1,               1
##FIRST=     0,             0,               0
##LAST=      2.424536,      0,               0
##MIN=       0,             -143318,         0
##MAX=       2.424536,      155878,          0
$$ Real data points
##PAGE= N=1
##DATA TABLE= (X++(R..R)), XYDATA
0@%%%%%%%%%%%%%%%qJ6j6J6j6K4l2L2m0M8n6O4p2Q8j02J16j34J53j73J97k22K50
$$ 0 0 0 0 0 0 0 0 0 0 0 0 0 0 0 0 -8 8 -8 8 -8 16 -16 16 -24 24 -32 32 -40 48 -54 62 -72 81 -92 105 -117 133
37A33k83L16l54L97m42M92n49O09o72P43q21R05r97J099j210J332j469J621j789
$$ 133 -150 166 -188 209 -233 259 -290 319 -353 390 -431 474 -523 576 -634 698 -771 850 -939
56i39J978k190K432k713L041l430L901m485N235o240P674r937J4319m2351Q5249
$$ -939 1039 -1151 1281 -1432 1609 -1821 2080 -2405 2830 -3410 4264 -5673 8646 -33705 51544
71E1544r2188j02674J13060K5547p3480M1984m686m3769J19135m1249r5073Q4079
$$ 51544 -40644 -143318 -30258 -4711 -78191 -36207 -40893 -84662 34473 -6776 -101849 -17770
83a7770J17622j54935m434J41130n2056l7819N2050n216k4227R4529p2724n6774
$$ -17770 99852 -55083 -59517 81613 29557 -8262 43788 38572 14345 108874 36150 -20624
95b0624J39953n271j26399M4403J20089j14897j4614O1655l4726J158K9275o8474
$$ -20624 119329 114058 -12341 32062 152151 37254 22640 84295 49569 50727 80002 11528
107A1528j6550J28662r9603q4856J14008K7225j20934J1920Q0680p2139J7730
$$ 11528 -5022 123640 24037 -60819 53189 80414 -40520 -28600 52080 -20059 -2329
118b329M730m8106L8078O2704j06986k5065J51629o5646q2054P4199M9403p0438
$$ -2329 2401 -45705 -7627 55077 -51909 -76974 74655 9009 -73045 1154 50557 -19881
130a9881K4191K0756m2848P5118p200p7278M5015J04827j06168l9906J21331k6768
$$ -19881 4310 25066 -17782 57336 50136 -27142 17873 122700 16532 -23374 97957 71189
142G1189n3638L0680J9092l6489N5460l7537n9513R3256O956j04662J2734J07446
$$ 71189 17551 48231 67323 30834 86294 48757 -10756 82500 89456 -15206 -2472 104974
154A04974q7088m0685O0125j9477j9200J9850l3244l0956R5927n6566q1364Q3649
$$ 104974 17886 -22799 37326 17849 -1351 18499 -14745 -45701 50226 -6340 -87704 -4055
166d055M0218r6672o886Q6956n3560l256K0267l0215J5777N4311o4570l9542J24075
$$ -4055 36163 -60509 -67395 19561 -33999 -37255 -16988 -47203 -31426 22885 -41685 -81227 42848
179D2848l2438q0754N3977N7873o2725J150L9817l9594M2440P027n9181J5662
$$ 42848 10410 -70344 -16367 41506 -21219 -20069 19748 -19846 22594 29621 -29560 -13898
191a3898Q9220p1636n7845J02995p925o1823J7579L3754m0838K9232o921n6405
$$ -13898 75322 3686 -54159 48836 40911 -20912 -3333 30421 -10417 18815 11894 -44511
203d4511O3059K1808q1342q389J01101n6604n4951O1014L36k7977J4264l630l5354
$$ -44511 18548 40356 -40986 -49375 51726 -4878 -59829 1185 1521 -26456 -12192 -15822 -51176
216e1176P1192j9341p4529O0803N1883p4433k4948Q7883l3575k2542K7302j2578
$$ -51176 20016 675 -73854 -13051 38832 -35601 -60549 27334 -6241 -28783 -1481 -14059
228a4059l86M0867l2416m8967R5072o853p8334L3475O2343n2112k0874M7647l0048
$$ -14059 -14445 26422 -5994 -54961 40111 33258 -45076 -11601 50742 -1370 -22244 25403 -4645
241d645J6088J3368m0247j767P1486m2367o5404Q2492R620n9849M899M4632l3553
$$ -4645 11443 24811 -15436 -17203 54283 11916 -53488 29004 38624 -21225 -16326 28306 -5247
254e247P514J1483m5460M0568K7403n8374k0471Q8465l1126o2343N1923J5405
$$ -5247 2267 13750 -31710 8858 36261 -22113 -42584 45881 14755 -47588 4335 19740
266A9740l0482L542J3308l2596M6577j061o5588L9609N1540n6236l7400P9259
$$ 19740 -10742 -7200 6108 -26488 20089 19028 -46560 -6951 44589 -11647 -49047 30212
278C0212j8110l5665K4058j353r226K6158j2816m9954P0608P472p0788J7452O1209
$$ 30212 12102 -23563 495 -858 -10084 16074 3258 -46696 23912 31384 -39404 -21952 39257
291C9257l8410l3687M9634j8853O57J5426k5842r501N6999j9708o5272O6361K1764
$$ 39257 847 -32840 16794 -2059 -1402 14024 -11818 -21319 35680 15972 -49300 17061 38825
304C8825n5734l416M9011k5121q316K2541l5599K2786K8726m1890k8647P4428
$$ 38825 -16909 -20325 28686 3565 -4751 17790 -17809 4977 33703 -8187 -36834 37594
316C7594j1955o6420M3062K3962l2427o431K3509k9281K5926J2937n6536K2526
$$ 37594 25639 -40781 2281 26243 -6184 -12615 10894 -18387 7539 20476 -36060 -13534
328a3534M9764m0176m5399O9531k202m4537K1631R929j4017J4523M388m6189M9071
$$ -13534 36230 -3946 -49345 20186 17984 -26553 -4922 5007 -9010 5513 9901 -36288 12783
341A2783K1661o0605M824N9366k4736m3526M8384n703j2931J4520j0660j5674
$$ 12783 34444 -26161 -21337 38029 13293 -30233 18151 12448 -483 14037 3377 -12297
353a2297M0510k029o2918M6961L0938m9549j4982M8542j5928k4266K5157k3113
$$ -12297 28213 26184 -36734 10227 41165 -8384 -23366 25176 9248 -15018 10139 -12974
365a2974O074K4503k5762l3549N6384L864o5558K9523L1823k8882j6213K9507
$$ -12974 -6900 17603 -8159 -41708 14676 18540 -47018 -17495 14328 -14554 -30767 -1260
377a260j9583P213J9951m0934Q471M4381k2018m7725N6975J2346m5940J5258K0061
$$ -1260 -20843 -13630 6321 -34613 -26142 18239 -3779 -51504 5471 17817 -28123 -12865 7196
390G196j2480K494J4854l5428K9186K6630m6777n113N1896j1194m7290L9794N730
$$ 7196 -5284 -2790 12064 -23364 5822 32452 -14325 -19438 32458 21264 -26026 13768 19498
403A9498k0209Q557r27j5484K3691Q131n4257K9782L2512m0324k1776M3803n276
$$ 19498 -711 7846 6919 -8565 15126 23257 -31000 -1218 31294 -9030 -30806 12997 7721
416G721l1850K3422j1341k681J8107j2167l0998M0916J4985n7587J9565L5041
$$ 7721 -24129 -707 -12048 -14729 3378 -8789 -39787 1129 16114 -41473 -21908 13133
428A3133k1745k1079L0894q544m804K2313k6460K98L6338q186m4712M3350K2360
$$ 13133 -8612 -29691 1203 -7341 -12145 10168 -16292 -15994 20344 12158 -32554 10796 33156
441C3156m3647P761K4645r607p641J8828k5225J3071K7554l5019j2641M2195K6
$$ 33156 -10491 -2730 21915 12308 4667 23495 -1730 11341 38895 3876 -8765 33430 33456
454C3456m8908K9575J5976k4264K281P053j3553J0483J5604m3545J5067L4330
$$ 33456 -15452 14123 30099 5835 8116 15169 1616 12099 27703 -15842 -775 33555
466C3555k9049k6189L7222O310l6153J9609R31p921J2324j163k6806K5767K3025
$$ 33555 4506 -21683 15539 21849 -14304 5305 6236 -1685 10639 9476 -17330 8437 31462
479C1462m7956Q004L5698j4428k6651K7277J287j5067J8600j4460o733K5315O00
$$ 31462 -16494 -8490 27208 12780 -13871 13406 14693 -374 18226 3766 -2967 22348 22948
492B2948m1237K6618K7233l9867k070K5097n882j6877J7254j4888j25K3005k3473
$$ 22948 -18289 8329 35562 -4305 -6375 18722 12840 -4037 13217 -1671 -1796 21209 -2264
505b264j6409L0843Q334m5700J8907K2162k2178m493J1167o700L38J6950l0258
$$ -2264 -18673 12170 20504 -25196 -6289 15873 -6305 -10798 369 -6331 -5993 10957 -19301
518a9301M969L1020j7820k6387K8533J5549l4967J2472R430q565M927M607j9305
$$ -19301 -14332 16688 -1132 -27519 1014 16563 -18404 -5932 3498 -5067 -140 4467 -14838
531a4838J2355K4650l6947j152L1301p077k7768J9703R360j9663J2283o165q688
$$ -14838 -2483 22167 -14780 -15932 15369 8292 -19476 227 9587 -10076 2207 -3958 -12646
544a2646J5332O068l3660J4095K8583l2385p433K2621l29j9858J4171m592o096
$$ -12646 2686 8754 -24906 -10811 17772 -14613 -22046 575 246 -19612 -5441 -10033 -16129
557a6129J8842j3620j4951K1924J4038l7674J0749K6066j7991p472J2812m40n537
$$ -16129 2713 -10907 -25858 -3934 10104 -27570 -16821 9245 -8746 -16218 -3406 -3846 -9383
570i383J6455j9133q04K6956j0309k3822K0586K0222l1621N930J4369q203n56
$$ -9383 7072 -12061 -12865 14091 3782 -20040 546 20768 -10853 -4923 9446 1243 687
583F87O925j3462L698K3455k7518o733K7002k004k7524J3954J4660k0524P471
$$ 687 7612 -5850 -2152 21303 -6215 -12948 14054 12050 -15474 -1520 13140 -7384 87
596H7L21p942Q236R164k5531N205K8032k3940j1160K0309N241k1073J1026L316
$$ 87 408 -7534 702 9866 -15665 -10460 17572 -6368 -17528 2781 8022 -13051 -2025 1291
610A291r491J4459n819j2908J3974J6441k9866K841K6567j3538j0794J1987M076
$$ 1291 -8200 6259 440 -12468 1506 17947 -11919 -9078 17489 3951 -6843 5144 9220
623I220j0748J3086r813n889K0596m491k1522J2137K1829k7396o27J6289o635
$$ 9220 -1528 11558 1745 -4144 16452 11961 -9561 2576 24405 -2991 -3618 12671 6036
636F036n094O045o147l462J9689j8329j0414K1542K592k4769P259J8350j8564
$$ 6036 942 6987 840 -2622 17067 -1262 -11676 9866 12458 -12311 -5052 13298 -5266
649e266K083M530n753K535R307j6894j859K5324j6013j3470J6449Q726j9674N541
$$ -5266 -3183 1347 -4406 -1871 7436 -9458 -11317 14007 -2006 -15476 973 9699 -9975 -4434
663d434Q673j0365R047j567j0377O941J6203k2387l135K4273q934j3002R000Q010
$$ -4434 4239 -6126 2921 1354 -9023 -2082 14121 -8266 -11401 12872 3938 -9064 -64 7946
677G946j2149Q419k924q375J5127l01j7346N674K1517k1322m924J6667l440p876
$$ 7946 -4203 4216 1292 -7083 8044 7743 -9603 -3929 17588 -3734 -8658 8009 4569 -3307
691c307N752n84p174J6301j0596j1109J6564N730k0545K597J9852j5648j712O647
$$ -3307 2445 1861 -5313 10988 392 -10717 5847 11577 -8968 -6371 13481 -2167 -3879 2768
705B768k956j501Q129r706o288K1993j0534j3760J2395J0362j8043J277J1534
$$ 2768 -188 -1689 6440 -3266 -9554 12439 1905 -11855 540 10902 -7141 -5864 5670
718E670r534M397J057p349J872J4795j5516p917K1694n035j3671O697J0479j2520
$$ 5670 -3864 533 1590 -5759 -3887 10908 -4608 -12525 9169 4134 -9537 -2840 7639 -4881
732d881M707K256q494J0106K468j3288R82K0105j5520p936J5553m59r338L835
$$ -4881 -174 2082 -6412 3694 6162 -7126 -6144 13961 -1559 -9495 6058 5599 -3739 96
746I6M065q876J1857m244j1465J1815P381j6217k051J9573j1818n593P632n48
$$ 96 4161 -4715 7142 2898 -8567 3248 10629 -5588 -7639 11934 116 -5477 2155 1607
760A607m254N997l889q494J6856n010j3304Q465J1650j4502l175J3673p654K23
$$ 1607 -2647 3350 -539 -9033 7823 2813 -10491 -2026 9624 -4878 -8053 5620 -2034 -1811
774a811K680l729j474J1899q592r852J8037j679j2331L523J1965j0673N07N728
$$ -1811 869 -2860 -4334 7565 -1027 -10879 7158 5479 -6852 -3329 8636 -2037 -1530 4198
788D198p170N490L670q970k464J7042r813j0440J3425J501r177J405O336q463
$$ 4198 -2972 2518 6188 -2782 -5246 11796 1983 -8457 4968 6469 -2708 -1303 5033 -3430
802c430P080p00r507P390O987j1435n238J7480p623p619O794K035n539L386P02
$$ -3430 3650 2950 -6557 833 7820 -3615 -8853 8627 1004 -6615 179 2214 -3325 61 763
817G63q597J2542j198j1137M806J1655j0539n608J3224m636k339K909p94k745
$$ 763 -7834 4708 3510 -7627 -2821 8834 -1705 -7313 5911 1275 -1064 1845 1051 -1694
831a694Q933l896j0045J3829R62j0889J043J2009q314k977O976n715K441L127
$$ -1694 7239 3343 -6702 7127 8089 -2800 -1757 10252 1938 -1039 5937 222 2663 5790
845E790n303m511J3426n409j1407J0756L100q572j336P896p117K715K096p802
$$ 5790 487 -4024 9402 3993 -7414 3342 6442 -2130 -3466 4430 -2687 28 2124 -5678
859e678M023O388p316p480J4839l848r240O029L767n272J131L353p642P985J276
$$ -5678 -1655 4733 -2583 -10063 4776 928 -8312 -2283 1484 -3788 -2657 696 -6946 1039 2315
874B315q933K195J0255o734p574J2129k281m315K702J164l320N191j75r869J0000
$$ 2315 -6618 -4423 5832 -902 -8476 3653 1372 -2943 -241 923 -2397 2794 2619 -7250 2750
889B750K648q753j471J0937n194n717P146l479j4K266k097n437R701j523j0840
$$ 2750 5398 -3355 -4826 6111 917 -4800 2346 -1133 -1147 1119 -978 -6415 3286 1763 -9077
904i077Q101M322o666l288Q549m574p73L652n757J730N521l646p464J1879q47
$$ -9077 -976 3346 -3320 -6608 1941 -2633 -3406 246 -5511 -3781 1740 -1906 -9370 2509 1662
919A662q811M448M682l964j254M794n703M385K456o367K82Q599l628q551J0447
$$ 1662 -7149 -2701 1981 -1983 -3237 1557 -4146 239 2695 -3672 -3390 5209 1581 -6970 3477
934C477m56m900J732K495l079K582J891q228O524L248o716k666R498k832o734
$$ 3477 3021 -1879 -147 2348 -731 1851 3742 -4486 2038 5286 -1430 -4096 5402 2570 -4164
949d164O732j486j559J846l33m762O654P85r543N512N048n249m267P839k484k868
$$ -4164 2568 1082 -477 1369 1036 -3726 2928 3713 -5830 -318 4730 -519 -4786 3053 569 -2299
965b299M428l476J96M052j192p327Q992J427q631L035M828l088k832N575m374
$$ -2299 2129 -1347 -1151 2901 1709 -5618 3374 4801 -3830 -795 4033 945 -1887 3688 -686
980f86J710L171m880q35O226q39q703Q138J285n434J128L096k987M73L302o644
$$ -686 1024 4195 -685 -1520 4706 3867 -4836 3302 4587 -847 281 3377 390 863 4165 -2479
996b479L647L780m875l535Q060j119p409N961J06k232N18J283m303M184K275q101
$$ -2479 1168 4948 73 -3462 4598 3479 -3930 2031 2137 -95 423 1706 -2597 1587 3862 -4239
1012d239L790M538l796m888P012q66m123L617j785k97K391L09o819O316K621p420
$$ -4239 -449 4089 293 -4595 2417 1551 -2572 1045 -740 -1037 1354 1663 -5156 1160 3781 -3639
1028c639J437M515j719m130N232k489k87K953l007j797M632R24p898N780K741
$$ -3639 -2202 2313 594 -3536 1696 -793 -1080 1873 -1134 -2931 1701 2625 -5273 507 3248
1043C248m920j07L338j612j397L909m864J858L715l399k954N405J065p318M818
$$ 3248 -1672 -1779 1559 -53 -1450 2459 -2405 -547 3168 -231 -3185 2220 3285 -4033 785
1058G85J156k449j20K215l009J916K836o582K542L897k348m758N884L52m722L064
$$ 785 1941 -508 -628 1587 -1422 494 3330 -3252 -710 3187 839 -3919 1965 2317 -2405 659
1074F59m80q36R90J472n400M215L262o652R58L926o34m761M431r59j546K801j981
$$ 659 179 -657 333 1805 -3595 620 3882 -2770 -1812 2114 1480 -3281 1150 191 -1355 1446 -535
1091e35j301K926J703o829M019L411m589o78L261p21k501L793l227K68L131j878
$$ -535 -1836 1090 2793 -4036 -17 3394 -1195 -1873 1388 667 -1834 1959 -1268 -1000 2131 253
1107B53l255L978K016o896L494K146k451p55K514k154m4L410n007R84L902j300
$$ 253 -3002 976 2992 -3904 -410 1736 -715 -1470 1044 -1110 -1154 2256 -2751 -1767 2135 835
1123H35m775M296K098n048K242O21r99J21J814l651J887L762n238M5L547J04m825
$$ 835 -3940 356 2454 -2594 -352 269 -730 -609 1205 -2446 -559 3203 -2035 -1990 1557 1661 -3164
1140c164L896L88k152J956j042r76J451K416n834K681L163l384j050K467O55l590
$$ -3164 732 1120 -1032 924 -118 -1094 357 2773 -3061 -380 2783 -601 -1651 816 1471 -2119
1156b119L401j681p49K270j040k510K312L011n770J846K568j798j515K309n91
$$ -2119 1282 -399 -1148 1122 82 -2428 -116 2895 -2875 -1029 1539 -259 -1774 535 -56
1171e6j468L392l516L2L067m83m031K819K818m667J862J076o86q26K154k509M24
$$ -56 -1524 1868 -1648 -1616 1451 968 -3063 -244 2574 -2093 -231 845 159 -667 1487 -1022 -598
1188e98L590l771o44K839J180m773K743J277k272J156l76l12K26K316m202J133
$$ -598 2992 -779 -1423 1416 2596 -2177 566 1843 -429 727 351 39 265 2581 -1621 -488
1204d88L397l008j367K212J302l841K687o26j054J987p05k173J320L357m962Q95
$$ -488 2909 -99 -1466 746 2048 -1793 894 268 -786 1201 496 -1677 -357 3000 -1962 -1067
1220a067K791j236k023J709O05k266L072k337m37K190N43l684J730L135l995P90
$$ -1067 1724 488 -1535 174 779 -1487 1585 -752 -1189 1001 1544 -2140 -410 2725 -1270 -480
1236d80J350k88j709K133j461q15L601k803j297K192J483m192J432K169k625J302
$$ -480 870 582 -1127 1006 -455 -1270 2331 -472 -1769 423 1906 -2286 -854 1315 -1310 -8
1252hl12k75o23K619l191r9L176j763j702J496J919l583J696O57j522J259J71
$$ -8 -320 -595 -1218 1401 -1790 -1889 1287 -476 -2178 -682 1237 -2346 -650 7 -1515 -256 -85
1269h5j341K78L311l748J25K907q07j958J384J347k440K350j177q34J676O29k534
$$ -85 -1426 -1148 2163 -1585 -1460 1447 640 -1318 66 1413 -1027 1323 146 -688 988 1617 -917
1286i17P64L133l149k17J443R1j592J406l19j270K725j983q66J280J481l306O81
$$ -917 -153 2980 -169 -386 1057 1148 -444 962 643 -627 2098 115 -751 529 2010 -1296 -615
1303f15K502k288L36J68L6r99K064j579j059L329j815j279J047K062l059R78J061
$$ -615 1887 -401 -65 103 139 -860 1204 -375 -1434 1895 80 -1199 -152 1910 -1149 -171 890
1320H90j181Q55L66q87m95L116l031n2K219j83k036R41J536k225J780p26r08R89
$$ 890 -291 564 930 43 -452 2664 -367 -419 1800 1617 -419 522 2058 -167 1613 887 -21 968
1338I68O51j958M2L078k855k84J192J69j529P45N69k031K679j592p39P43J577
$$ 968 1619 -339 -297 2781 -74 -358 834 1003 -526 219 788 -1243 1436 -156 -895 -152 1425
1355A425k660O0K614k032k26Q50j64q63J733r68j155K636j067j205M82K168k756
$$ 1425 -1235 -1175 1439 -593 -819 31 -133 -996 737 -231 -1386 1250 183 -1022 -540 1628 -1128
1372a128N75J573j203N34M6k76p71K550k268o91K148j37j766N77J834k398J161
$$ -1128 -553 1020 -183 351 397 121 -650 1900 -368 -1059 1089 952 -814 -237 1597 -801 360
1389C60j04q59N14N59j102j127L063k276n35J519J99j791N98J056k031J976m80
$$ 360 256 -603 -89 470 -632 -1759 1304 -972 -1507 12 211 -1580 -982 74 -1957 19 -461
1406d61j248M84J924j908p81K778j364o83Q33M52j425J538M2j511J934l85j024
$$ -461 -1709 -1225 699 -1209 -1990 788 -576 -1259 -426 26 -1399 139 181 -1330 604 219 -805
1423h05K42K212k243j39J771q97l30M82L47j410K142j150j068J780j40j167m7
$$ -805 -563 1649 -594 -733 1038 141 -189 293 640 -770 1372 222 -846 934 794 -373 -420
1440d20K116k062N9Q53o53j99N46m60j199K597j607q63J199O13j368o9J395j904
$$ -420 1696 -366 -307 546 -107 -306 240 -220 -1419 1178 -429 -1292 -93 520 -848 -917 478 -1426
1458a426J421k62q77K78J504j530q20K289j032l80M39Q36j265O98L10j403J773
$$ -1426 -5 -267 -1144 -866 638 -892 -1712 577 -455 -835 -396 440 -825 -127 183 -1220 553
1475E53k57o59o03K170j522o70J734r77M8J38N08j430J774o43r62J177K60r40
$$ 553 296 -363 -966 1204 -318 -988 746 -231 -183 -45 463 -967 807 164 -798 379 639 -301
1493c01o90K079j620kQ42p77K55K76n2j447K429j125r09P00P44r31n79J928j769
$$ -301 -991 1088 -532 -534 308 -469 -214 62 10 -1437 992 -133 -1042 -342 402 -529 -1108 820 -949
1512i49R47K70l32l29R45m33j212K406j042o40K71J043j165J17O94j190J395j17
$$ -949 -2 268 -64 -393 552 119 -1093 1313 271 -369 -98 945 -220 -103 591 -599 796 679
1530F79n62o58K098j169j201J735l90m50K97P00j159R78K82j261Q13J77k04j176
$$ 679 117 -541 1557 388 -813 922 532 82 379 1079 -80 898 1180 -81 732 909 705 -471
1548d71J988j296l12R15m24J23j56N19j350J515l70j108P77N20m56r76J931j450
$$ -471 1517 221 -91 824 400 523 367 886 -464 1051 681 -427 350 870 414 -562 1369 -81
1566h1L93J56j88m25N75M6j399K073q30p68J66J195q23n74J350j173N31K68j87
$$ -81 312 468 280 -145 430 476 -923 1150 320 -448 -282 913 90 -484 866 -307 224 492 305
1585C05p14J333m7j487J763o48j84l30Q54r96N33O67j478O18L41j80j147J696
$$ 305 -409 924 877 -610 1153 505 321 -9 845 -151 382 1049 -429 189 530 350 -797 899
1603H99q14p30R02k62m34J44M75j316J139k15r80P07J26j26r43J540j097k42Q04
$$ 899 85 -645 257 -5 -439 -295 180 -1136 3 -212 -1192 -485 -359 -485 -1428 112 -985 -1227 -423
1622d23m77p4M41K82j329J510l48m90J66R21o13k60J000r70O57K13k12o17J190
$$ -423 -900 -974 -533 -251 -1580 -70 -418 -908 -742 179 -434 -694 306 -664 -7 206 -6 -623 567
1641E67j9j451J687n00M9k28Q24r27J3Q18j242M32N74r4j167J380p20l98N76j53
$$ 567 548 -903 784 284 333 105 929 2 15 833 -409 23 597 503 -664 716 -4 -402 174 21
1661B1j18m01J156j390O01N68j214N31K28J23j215J411m45k76N13j49Rj23O57
$$ 21 -97 -498 658 -732 -131 437 -777 -246 -18 105 -1110 301 -144 -420 93 -56 -47 -170 487
1680D87j231J081J82m91j22P29k10n80J156r29L54J78p3n90M30O94j511J043m43
$$ 487 -744 337 519 28 -94 635 425 -155 1001 72 426 604 531 -59 371 1065 -446 597 154
1699A54j6j93O33m37n52J114j341P99k3Qr69Q07O5j110Q94p7J05o10Q14o67kM06
$$ 154 138 -55 578 141 -411 703 -638 161 138 146 -823 -16 49 -1061 -167 -244 -139 -749 65 -602 -604 -198
1721a98p03O59j78N37j090J067j68l12L18J72j60m29J091j331J009l8j57k25M09
$$ -198 -901 -242 -420 117 -973 94 -74 -386 -68 104 -56 -485 606 -725 284 246 89 -136 273
1740B73K08r67J174o03k19kK48l19K42M34j412Q80L1j62m24O94k03p50J022p94
$$ 273 481 -486 688 85 -134 -136 112 -207 35 469 -943 -63 -32 -194 -618 76 -127 -877 145 -649
1760f49J51j37N90q99O56M47j104Q50m37M30p08J118r27K65Q86q45MJ94M63j129
$$ -649 -498 -635 -45 -944 -288 159 -945 -95 -532 -102 -810 308 -619 -354 532 -313 -309 -115 348 -781
1780g81J172j72m84L59L2m1m32R16p81L73M65n28j25L03K04r00Q74m27oJ94l2
$$ -781 391 219 -265 94 126 85 -347 569 -212 161 626 98 -27 276 480 -420 454 27 21 215 183
1801A83o2k16N36j047R27N4j60k38M84K6q35R73n53K86kK22o11j46J116p92N88
$$ 183 121 -95 441 -606 321 375 215 -23 461 487 -348 625 72 358 356 578 -33 -179 937 145 733
1822G33l52k37l93R65m48m90Q90p97L07l29O08p12M97p8o33O43l03j9l70Q22q11
$$ 733 381 144 -249 716 268 -222 668 -129 178 -151 457 -255 242 164 -469 174 -129 -148 -518 304 -507
1843e07M13L5m1k21O6O13j301J060l6k70J41J80k28j30J035r99N34q5j18J2J69
$$ -507 -94 -59 -100 -321 -255 358 -943 117 81 -189 -48 132 -96 -226 809 -190 344 259 141 153 322
1864C22J83n74R62o19P0R8J54o52J06O74j008N58j11K15m38K46Qo08Q87p04K95
$$ 322 505 -69 893 274 344 442 596 -56 50 724 -284 274 163 378 -60 186 194 -414 473 -231 64
1885F4n93P57p64K92M37r78P33k28L13l70P99j007M56N87o68J73nN15p81P79k51
$$ 64 -529 228 -536 -244 193 -785 -52 -280 33 -337 462 -545 -89 498 -170 3 -2 513 -268 511 260
1906B60j59M64k11K59o18J121r50J93K27p0j26j75P89j256J107n27j83j02J71
$$ 260 101 565 354 613 -5 1116 166 359 586 516 390 215 1004 -252 855 328 145 43 214
1925B14j75m80Q57o29J36l48K90m95M37Qp57P24j54j42l8M06o10K95L96l95L19
$$ 214 39 -441 416 -213 -77 -425 -135 -630 -193 -185 -942 -218 -372 -514 -552 -146 -756 -461 -65 -460 -141
1946a41J00J82o85M65j35j10N59l58L52l61R81j019M47J51k80Q7j60L59n06O50
$$ -141 -41 141 -544 -79 -214 -324 235 -123 229 -132 849 -170 277 428 148 235 75 434 -72 578
1966E78p93M13O2k54m17N5O32j054M66k0L0k72N8M6l51P65q84M93j33J27m49K11
$$ 578 -215 198 260 6 -411 -356 276 -778 -312 -332 -302 -574 -516 -470 -821 -56 -940 -447 -580 -453 -902 -691
1988f91M70q11P38j99J53l43P85n34j55Q22o13L48m57O64n60Q07k92j99K68l30
$$ -691 -221 -1032 -294 -493 -340 -683 102 -432 -587 235 -378 -30 -487 177 -383 424 132 -67 201 -129
2008a29L98k00P05j014L33J05m03M52k38K61m79L63m67J60J99q1Kn0N78p50O12
$$ -129 269 69 774 -240 93 198 -205 247 9 270 -209 154 -313 -153 46 -35 -33 -83 495 -255 357
2029C57k56k50J29K13km33Q10p28N04k28L55j87J8K28n38Q02n97N96r11O57j33
$$ 357 101 -149 -20 193 191 -242 568 -160 344 116 471 284 302 530 -8 794 197 793 -118 539 406
2050D06k22O13p16K67j65L29p07M56K12n40L12l33L13o48N24m93O6K68l17M40
$$ 406 184 797 81 348 183 512 -195 261 473 -67 245 -88 225 -423 101 -392 -326 -58 -375 65
2070F5k18K26m78O61m46k1J77j22O5l41R70r96N92j55L10J00k00J24m99P62n60
$$ 65 -153 73 -405 256 -190 -211 -34 -156 -91 -432 538 -458 134 -21 289 389 189 313 -186 576 16
2091A6L25j38K74n8k89O74r24P12m52Jk83K05J84l79N56q85M28k44K79m37N4J31
$$ 16 341 203 477 419 130 804 -120 592 140 141 -142 63 247 -132 424 -461 -33 -277 2 -435 -381 -250
2113b50k04L94k27J37n49O02m58K9M77l18L05l04L54l53L81k40m0K74l05O37o19
$$ -250 -454 -60 -287 -150 -699 -97 -555 -526 -49 -367 -62 -366 -12 -365 16 -224 -264 10 -295 342 -277
2134b77P52o09K55rk68N79m35K93p58P52o37J91P1J45J05n06O65j006R91n12l2
$$ -277 475 -134 121 112 -156 423 -12 281 -477 275 -362 -171 -100 45 150 -356 309 -697 294 -218 -250
2155b50j4J75L2n02R08q89O57l08K08k07k8O91o33N99m26N60o08J50J13l29N08
$$ -250 -264 -89 -57 -559 349 -540 117 -191 17 -190 -218 473 -160 439 13 573 -35 115 228 -101 407
2176D07m96N99n37O28m93J96K93m52M38m81M11n97O07n56O5J68l79L45l38M55
$$ 407 -89 510 -27 601 108 304 597 145 583 102 513 -84 523 -33 32 200 -179 166 -172 283
2196B83o84M50j97k08L21m39N00m89O80p22P47m17J21J8l28O81p82P01m31M49
$$ 283 -401 49 -148 -356 -35 -474 26 -463 217 -505 242 -175 -54 -36 -364 317 -465 236 -195 254
2216B54m91M89j64j22M66n47L55l67M21m84M96j85j17J65m19L59l43J62k43L15
$$ 254 -237 252 88 -34 432 -115 240 -127 294 -190 306 121 4 169 -250 109 -234 -72 -315 0
2236@L33o54K38r8N19p82M81j39q1J34m19M54l25M77m59L60k02P9n3j34O69p17
$$ 0 333 -321 -83 -181 338 -444 37 -102 -183 -49 -468 -14 -339 138 -321 39 -163 -84 -137 -271 398 -319
2258c19O75o01K21J43j87K31k16K49o34P77l20R0k52l5L79n33M90k99J08j7l06
$$ -319 356 -245 -24 119 -68 163 -53 196 -438 339 19 109 -143 -178 201 -332 158 -141 -33 -50 -356
2279c56K03J72P9m11M59n92L82j71J76m0j87M10l55K22k90N25l62L32q5k76K86
$$ -356 -153 19 98 -313 146 -446 -64 -235 -59 -99 -286 124 -231 -9 -299 226 -136 196 111 -165 121
2300A21j98L83m40M80m67M23Jj54K98l68L07m34N84n82L8J39k69K97n30P00p70
$$ 121 -77 306 -134 346 -121 302 303 149 447 79 386 -48 536 -46 -8 131 -138 159 -371 329 -441
2321d41M24l15J34J9q6L68o19P30m92L66k22K68k11L6K99k10K57k30L05m38L31
$$ -441 -17 -332 -198 -179 -265 103 -516 214 -278 88 -134 134 -77 -41 258 48 305 75 380 -58 273
2342B73K2k74N33k07L2j08J0k34L57j60k26N94p29M57m04L31j00J2O5l35J99l23
$$ 273 295 21 554 347 379 271 281 47 404 244 18 612 -117 340 -64 267 167 179 244 -91 108 -215
2364b15M59n86K05j27l15K24j48M95o69N90m34N7J07k07K16j2L20m36O21m03N32
$$ -215 244 -342 -137 -264 -579 -355 -503 -8 -677 -87 -521 -464 -357 -564 -348 -360 -40 -476 145 -258 274
2385B74l07O0k9k6M99n44M10m17N97j52j21J81j67L75k42Kj25N8Q2k73K90m33
$$ 274 -33 27 -2 -28 471 -73 337 -80 517 365 244 425 258 633 391 393 268 326 408 135 425 -8
2407hK13k06L02n16L31k03k39M53m54J85m26J65J2J40m30M13K99o62N72l57M48
$$ -8 205 -1 301 -215 116 -87 -326 127 -327 -142 -568 -403 -391 -251 -681 -268 31 -631 -59 -416 32
2428C2l29k5J88j02K31p1L8m37M77k01N3K31p6K68p13Q35m75L63m08J65lN6km25
$$ 32 -297 -322 -134 -236 -5 -76 -38 -475 2 -199 -146 85 9 277 -436 399 -76 287 -121 44 41 97 95 -330
2452c30P56o23N9j16L68k34j31N44m60Q3m45P01p41L56M4k7J19j35L4j05K38k34
$$ -330 426 -197 -138 -254 114 -120 -251 293 -167 -84 -529 172 -569 -213 -169 -196 -77 -212 -178 -283 -45 -279
2474b79L12P6n8o5m1M06o37M79M7k08J02j73L69j74K15l84K02j32m5M7M2R7l26
$$ -279 33 109 51 -14 -55 351 -286 193 240 32 134 -39 330 156 371 -13 189 57 12 59 101 198 -128
2497a28M34k93j41n4l7K78k42L87m77K73k61L97q5j53J30k68L99m87M37k43K21
$$ -128 306 13 -128 -182 -219 59 -183 204 -273 0 -261 136 51 -102 28 -240 159 -328 109 -134 87
2518H7k44J38K75l10L66m04M62l35L97l15j1K21k44L70l71L35j15R4O4n50M01
$$ 87 -157 -19 256 -54 312 -92 370 35 432 117 106 327 83 453 82 417 302 396 460 -90 311
2539C11K8N4m80K75k82J61R9M0k3k27J8k36L62l88M38j12j7o9l4K60k40M22n76
$$ 311 339 393 -87 188 -94 67 166 206 183 -44 -26 -262 100 -288 150 38 21 -48 -82 178 -62 360 -216
2562b16M12m29K71n0o6R7k53N02l66P0j33K28j83o7L00l8K0k25J25L78n12M94
$$ -216 196 -233 38 -12 -78 19 -234 268 -98 -28 -161 67 -116 -183 117 79 99 -126 -1 377 -135 359
2584C59l96N81o97K84k61J13L4n9L02m24L17k41K55k93Q6J25l88L29k26M03m94
$$ 359 -37 544 -153 131 -130 -17 17 -42 260 -164 153 -88 167 -126 -40 85 -303 26 -200 203 -291
2605b91M71m20J86j51j43N84m94R9l21M71j69o7l2j67M06j51J12n8J61j57J10
$$ -291 180 -240 -54 -205 -348 236 -258 -159 -480 -9 -178 -245 -277 -444 -38 -189 -77 -135 26 -131 -21
2626b1O1k29L48m75K36j83K71k87L67J1j29J68j98L71k28K25l27J67J5j96K97
$$ -21 40 -189 159 -316 -80 -263 8 -279 88 99 -30 138 -60 311 83 308 -19 148 163 -33 264
2647B64p8Q1l51L39k09n8J26j88K40n6o8j96J30R2l02K42r8O2l32K12J9J39k33
$$ 264 186 267 -84 255 46 -12 114 -74 166 110 42 -154 -24 68 -234 8 -90 -28 -360 -148 -129 10 -223
2670b23R4J89l39K54l54L13j87K50r5j16K29l74M89J7J6j28K95k15J06r0l4K90
$$ -223 -129 60 -279 -25 -379 -66 -253 -3 -98 -214 15 -359 130 147 163 35 330 115 221 131 97 387
2692C87k1k73p7M36l63J07J17j87l9N8K57k72r8J59p8J52m99J84q9K65m14J82
$$ 387 366 93 16 452 89 196 313 126 87 145 402 130 32 191 113 265 -234 -50 -139 126 -288 -106
2714a06q0O6N3j51L15k84J07j10J08J54m23N72k36M20l96J09L1M7k59j29L02k61
$$ -106 -186 -120 -67 -218 97 -187 -80 -190 -82 72 -351 221 -15 405 9 118 149 196 -63 -192 110 -151
2736a51L19k14J54q3L06l41J5N7j50K58m53L63j42O4J05l48J59j96k2K20N4j10
$$ -151 168 -46 108 25 331 -10 5 62 -88 170 -283 80 -62 2 107 -241 -82 -278 -300 -80 -26 -136
2758a36k5K18l59M15m05J06k79L31J7j40K67k90P7J43o4j46M62lRL48n63M43m01
$$ -136 -161 57 -302 113 -292 -186 -465 -134 -117 -257 10 -280 -203 -60 -124 -270 192 189 198 546 -17 426 25
2781B5L58m57R8J83k05K46j40K04o97M62%Rj33n0K17k98N13o51K16J19J16l46
$$ 25 383 -74 24 207 2 248 108 312 -385 77 77 86 -47 -97 120 -178 335 -316 -100 19 135 -211
2803b11K15j56j43K97l66K05m3L6j1P7J00k13K63j92K32j53l8J68l9M42l71pK2
$$ -211 4 -152 -295 2 -364 -159 -202 -166 -177 -100 0 -213 50 -142 90 -63 -101 67 28 470 99 92 114
2826A14J84l77K14J4j34M16k33P8j99J14l6L6Q1r2mj18O7o4j0j71j25M88n23K62
$$ 114 298 -79 135 149 15 431 198 276 77 191 155 191 272 180 176 58 125 61 51 -120 -245 243 -280 -18
2850a8p0J75m9k66K91k73L7N4K62m57L48j60m5l1K51J03k26L99l43J92j10n5o9
$$ -18 -88 87 38 -228 63 -210 -173 -119 143 -314 34 -126 -171 -202 49 152 -74 325 -18 174 64 9 -60
2873f0M3J08j94N07l78O5p4M10m06j25M01k8o4N4j68k22K40o8k3R0n5N2k78K30
$$ -60 -17 91 -103 404 26 91 17 427 21 -104 297 269 205 259 91 -131 109 41 18 108 53 105 -173 57
2897E7K11l57P5l7o6O5J64l51M80n01J87L88m56M4J60m0P1r5r0J31J31j36m5k70
$$ 57 268 -89 -14 -51 -117 -52 112 -239 241 -260 -73 315 -141 -97 63 23 94 -1 -91 40 171 35 -10 -280
2921b80M91j19j76j70M33k78K60k41R6N7k23P8k6K48j60k12L10k26R3r5M04l37
$$ -280 211 92 -84 -254 179 -99 161 -80 16 73 -150 -72 -98 150 -10 -222 88 -138 -45 -140 264 -73
2943g3K7L28o74K67L1M09n80L36j17P4%o4RJ72P3j17k65j15J23L85l9k22J32K20
$$ -73 -46 282 -392 -125 -94 315 -265 71 -46 28 28 -36 -27 145 218 101 -164 -279 -156 229 190 -32 100 320
2967C20o21K44q8j04J35Q8J47m65O31l61J97k88K92o8k79M18m10L93l21J60j60
$$ 320 -301 -57 -145 -249 -114 -26 121 -344 287 -74 123 -165 127 59 -220 198 -212 181 -140 20 -140
2988a40L23q7l43M48l59J16m8L09m30K63J88k76J23j4j05j8K9j94Q0K63K1L6k48
$$ -140 183 96 -247 201 -158 -42 -90 219 -211 52 240 -36 87 73 -32 -50 -21 -215 -135 128 149 185 -63
3011f3lK7J64l2l56L41j92K59j61J82Jk22L0J60j16J03L47m92J79j4k82L74K22
$$ -63 -66 -39 125 93 -263 78 -114 145 -16 166 167 -55 -25 135 19 122 469 -23 156 142 -140 234 456
3034D56k55j72J30l3m8K78m65J36Q0Qj52J57O9j85j67j07M19m24L52l62J83j17
$$ 456 201 29 159 126 78 356 -109 27 107 115 -37 120 189 4 -163 -270 149 -275 77 -285 -102 -219
3056b19Q8l03L77j77kK11k10K80l56K70p0K66P3l92R6O4J22j42K27k9k66K14O5
$$ -219 -131 -434 -57 -234 -236 -25 -235 45 -311 -41 -111 155 228 -164 -68 -4 118 -24 203 174 -92 122 187
3079A87j66o3K60l15K70J84k59j43K32J6j80j4j46J66K23j60j02o7L52k26q0p5
$$ 187 21 -42 218 -97 173 357 98 -45 187 203 23 9 -137 29 252 92 -10 -77 275 49 -31 -106
3101a06k32J68J01J71l51K88m35K52O4p6j17M1L45k24o2K28k91J46JM9J04J32
$$ -106 -338 -170 -69 102 -249 39 -396 -144 -80 -156 -273 -232 113 -111 -173 55 -236 -90 -89 -40 64 196
3123A96k03J08pO5l4kj61Q9M1k42L65l67L00l40J30K16k23oQ1J70l25K32j83j06
$$ 196 -7 101 94 159 125 123 -38 51 92 -150 215 -152 148 -192 -62 154 -69 -75 6 176 -149 83 -100 -206
3147b06J25qL3r3K45k02J78J01k78j54L88l32L6M26m78M52N1M0m84L94L26k86
$$ -206 -81 -89 -56 -149 96 -106 72 173 -105 -259 129 -203 -167 259 -219 233 284 324 -160 234 560 274
3169B74j21K28k18j46J53PJ0J05n02J65J31o7j80M7M07n78P9K71n6k46M29m54
$$ 274 153 381 163 17 170 177 187 292 -210 -45 86 19 -161 -114 293 -285 -206 65 9 -237 192 -262
3191b62K31J01j57j25M6Q3r0L6Q2j91M20k27K11l66L88k73j3L13j58j22K24K45
$$ -262 -31 70 -87 -212 -166 -83 -173 -137 -55 -246 174 -53 158 -208 180 -93 -106 207 49 -73 151 396
3213C96n59L19k77J14o7J93J68m01L82m78L00L0R2k03J54J59n00K55j78M1k9L06
$$ 396 -163 156 -121 -7 -74 119 287 -114 268 -210 90 120 212 9 163 322 -178 77 -101 -60 -89 217
3235B17j05j50J68l09K4M2K13l70K05K07k01K34k92K4p3K84k05n4K42k83K79q7
$$ 217 112 -38 130 -179 -155 -113 100 -270 -65 142 -59 175 -117 -93 -166 118 -87 -141 101 -182 97 10
3257A0O8%Kj46j37L17o6j00J83J12j37J55l26NK33k42O9l7L97m87J70j05j50M96
$$ 10 78 78 80 -66 -203 114 48 -52 131 243 106 261 -65 -60 173 -69 0 -37 360 -127 43 -62 -212 284
3281B84k66j3k16M38M7k61r6K08j85k11M60j05j99j15K80k13K26qk65M61k49j41
$$ 284 18 5 -211 227 274 13 -83 125 -60 -271 189 84 -115 -230 50 -163 63 55 -210 251 2 -139
3303a39J52K79k31m77M67k28K47J2j31j4L94j82m21M20p9q9r8N27k98n6K22j21
$$ -139 13 292 61 -416 51 -177 70 82 -49 -63 331 149 -272 148 69 -20 -118 409 111 55 277 156
3325A56j76j32K88j91M11j25k97J76k33L55j89J62j86R5q0j66K24J2R2l23L27
$$ 156 -20 -152 136 -55 356 231 -66 110 -123 232 43 205 19 114 34 -132 92 104 196 -127 200
3346B00j58j40m3j2M3r5M11n53L50NJ61o08K41L50n22M36K3k0j40K42K52k47J43
$$ 200 42 -98 -141 -153 -110 -205 206 -347 3 8 169 -439 -198 152 -370 66 89 69 -71 171 423 176 319
3369C19m08O7P0m3m6K09j84r4L10k30J39j78L39m54K04J64l65K63M7o3k78N38
$$ 319 -89 -22 48 5 -41 168 -16 -110 200 -30 109 -69 270 -184 20 184 -181 82 129 66 -212 326
3391C26m30L77j50j05J86j84L35n18K50J39k66J32J75l89lL03k05P8j29L8Q3n0
$$ 326 -104 273 123 18 204 20 355 -163 87 226 -40 92 267 -122 -125 178 -27 51 -78 -40 43 -7
3413gJ87m09M79j25n1m8K12k85l4L65m44P2K82k47j56K74k2o03N50k7j47K00N0
$$ -7 180 -229 250 125 74 26 238 -47 -81 284 -160 -88 194 -53 -209 65 43 -560 -10 -37 -184 16 66
3436F6k67K1J69l11K05R5k23k49K87J53l7j1M1J10k37K05k43K93j22j16J05K30
$$ 66 -201 -180 -11 -322 -117 -22 -245 -494 -207 -54 -91 -102 -61 49 -188 17 -226 67 -55 -171 -66 164
3458A64Q7k50J19j8k15M15m21J33LP4k36L18j4k69k8K24k81K53K57o78M09m7o9
$$ 164 251 1 120 102 -113 302 -119 14 17 91 -145 173 159 -110 -138 86 -195 58 315 -363 46 -1 -70
3481g0j98K17K45l73J64j5J56k93J80k66P9J58r1j55K47J87j67q2J81l88L02M3
$$ -70 -268 -51 194 -179 -15 -30 126 -167 13 -253 -174 -16 -107 -262 -15 172 5 -77 104 -284 18 61
3503F1l1j5J72l81R7K56rj64o4L76j41J6j06J18L36k35l58K88Nn01L71J99j70
$$ 61 30 15 187 -194 -97 159 150 -14 -78 298 157 173 67 185 521 286 -72 216 221 -280 91 290 120
3526A20k05J32J81l11M15l48m9J54Kk75K55J84n83K92J80k39j38L60j50Q0K19
$$ 120 -85 47 228 -83 332 -16 -65 89 91 -184 71 255 -328 -36 144 -95 -233 127 -23 57 276
3547B76n33J29J93J94m32P7L98j16p9J33j45l0J23k48l07O30l46l3K30K77m82
$$ 276 -257 -128 65 259 -173 -96 302 186 107 240 95 65 188 -60 -367 263 -83 -116 114 391 -91
3568i1N8J53j86P9L0RlJ73m96K25L80n31n4j4K62k64K64M8L2j02o1l9J89K75m29
$$ -91 -33 120 -66 13 43 52 49 222 -274 -49 331 -200 -254 -268 -6 -270 -6 42 74 -28 -89 -128 61 336 -93
3593i3j23J49J13j48P1J00k82N91o24j4N10k60l86L48K58m24K51m1k26J76L42
$$ -93 -216 -67 46 -102 -31 69 -213 378 -246 -260 250 -10 -396 -48 210 -214 37 -4 -230 -54 288
3614B88k97j79M65k44j81J29J35m14J55J18L2M11n97L50m75M80k46j20J20N42
$$ 288 -9 -188 277 33 -148 -19 116 -298 -143 -25 7 418 -179 171 -304 176 -70 -190 -70 472
3634D72o03K83K45m40R2k46K42K7N4j19p6N08q13L04J95p0j08K59p5l50L01j73
$$ 472 -131 152 397 -43 49 -197 45 72 126 7 -69 439 -374 -70 125 55 -53 206 131 -219 82 -91
3656i1n4Q9J04j12J10P1j92j18K45L1k52J42k18NK95o6l0p8K11k72K68L4j15L1
$$ -91 -145 -56 48 -64 46 117 -75 -193 52 83 -169 -27 -245 -240 55 -11 -41 -119 92 -180 88 122 7 38
3680C8L6k44N4L70l65k00M92k26l19K97K77k75J25j6m1K1K43k24j95L45j98q9
$$ 38 74 -170 -116 254 -111 -311 181 -45 -364 -67 210 -65 60 44 3 24 267 43 -152 193 -5 -94
3702i4J87qj91O9K90j58O9l52R6RJ89m7k31M40l12M4j08J40l22L12K06l26K8O9
$$ -94 93 85 -106 -37 253 95 164 -188 -92 -83 106 59 -172 268 -44 0 -108 32 -290 22 228 -98 -70 -1
3726aj75j91L57j96m1J10k1MM9k7n8J7J36o0J73r3q0q3K59q6j37K40j24J22J68
$$ -1 -176 -367 -10 -206 -247 -137 -158 -154 -105 -132 -190 -173 -37 -97 76 -17 -97 -180 79 -7 -144 96 -28 94 262
3751B62j86j03J30j00j61L34P9m48K44O3p6q9m0J39l90N99l93K3J68j14J05p3
$$ 262 76 -27 103 3 -158 176 255 -193 51 114 38 -51 -91 48 -342 257 -136 -113 55 -59 46 -27
3773b7J73o3k73J1J49K22kl79L1L41K23q20N55o6j46J05R0k67Q8j09q5M38l93
$$ -27 146 83 -190 -179 -30 192 190 -189 -158 183 406 -414 141 75 -71 34 124 -143 -55 -164 -249 189 -204
3796b04K95j85O1O7j72N4K62j64J70m15M1M06k67k83J27K92j7k80L24j44l9R4
$$ -204 91 -94 -33 34 -138 -84 178 14 184 -231 -190 216 -51 -334 -207 85 68 -212 112 -32 -71 23
3818B3j62K9J31Q2j60l1M4K3K1J5L9j91J86N8p6K27n36J31L07j06j83K42k3%m9
$$ 23 -139 -110 21 103 -57 -88 -44 -21 0 15 54 -137 49 107 31 258 -278 -147 160 54 -129 113 90 90 41
3843D1Q5j52K05j24l1J27j95L08k52JJ70l55K67q1j2p2J06k89M02N2m67K60R2
$$ 41 126 -26 179 55 24 151 -44 264 12 13 183 -172 95 14 2 -70 36 -253 149 201 -266 -6 86
3866H6q8k86L24%k97L03k16K05j50K0m6OL64k18k69O00l19o8Q5n5P3J61k83k49
$$ 86 -2 -288 36 36 -261 42 -174 31 -119 -99 -145 -139 225 7 -262 338 19 -49 36 -19 54 215 -68 -317
3890c17N70n2m75L05J63j72K10p8j90j30K12k68N75l60Q2k47J71M1l11N22j80
$$ -317 253 201 -274 31 194 22 232 154 -36 -166 46 -222 353 -7 75 -172 -1 40 -271 251 71
3911G1o3j34L26l80J49K65l28l03N58j06j96K41o1k78L22j10KN0r1k15M02Q4l28
$$ 71 8 -126 200 -180 -31 234 -94 -397 161 55 -141 100 39 -239 83 -27 -25 25 -66 -281 121 205 -123
3934a23J13k3L71m47pL37j78J8N5k53J78J74n77J06N64k49j78J49qj09R6k1M8
$$ -123 -10 -33 338 -109 -116 221 43 61 116 -137 41 215 -362 -256 308 59 -119 30 22 -87 9 -12 36
3957C6%K18l54J92J42l29K46m20M76j0k28j13J19J77j74j1J39j4Rj09J03j75P
$$ 36 36 254 -100 92 234 -95 151 -269 207 197 -31 -144 -25 152 -22 -33 106 92 101 -8 95 -80 -73
3980g3q5R4j9J6p0J13K84l65m2J07oj77J61J97j65O4L16m51K73P7l75J99J38n5
$$ -73 -158 -64 -83 -67 -137 -24 260 -105 -147 -40 -46 -223 -62 135 -30 34 350 -101 172 249 -126 73 211 156
4004A56j07m7N4p6J68k19MK76K9m53L42L4l12M98m24O4k2K42j48J39n5m13J56
$$ 156 49 2 56 -20 148 -71 -67 209 238 -215 127 161 -151 347 -77 -13 -35 207 59 198 143 -270 -114
4027a14K79Q8k05j58J98j66L9P3K07l10p1p7j36L45j4j54K07n2j89K1K10j34K66
$$ -114 165 253 48 -110 88 -78 -39 34 241 -69 -140 -217 -353 -8 -22 -176 31 -21 -210 -189 21 -113 153
4050A53q5p0o2Q1k47L83J08k30J66k1j0k29k65K82Q2N7l65N73q6k37Q8p6J20j58
$$ 153 68 -2 -64 17 -230 153 261 31 197 176 166 -63 -328 -46 36 93 -272 301 215 -22 66 -10 110 -48
4074d8k6K53j22m4J34j39j20K76J9l99K97j5j24R3O0P2l95N31l82K3m1L8q3Q6
$$ -48 -74 179 57 13 147 8 -112 164 183 -216 81 66 -58 35 95 167 -228 303 -79 -56 -97 -59 -142 -56
4098e6K17k73o0O4J41k75L52l20n5K58j83R3m0K71j33J71j9K3k47J36l6J7l1k34
$$ -56 161 -112 -172 -108 33 -242 110 -210 -265 -7 -190 -97 -137 134 1 172 153 176 -71 65 29 46 15 -219
4122b19J2M14l08J69j16J22j16p4rn6J13k34K62j09K47j1k04J39p1O6L8J4j29
$$ -219 -207 207 -101 68 -48 74 -42 -116 -125 -181 -68 -302 -40 -149 98 87 -117 22 -49 17 55 69 -60
4145f0K11j53r4K73j93J18j03l9K02m9Q3k72L5J30Ol00J34K44j76p9J67Q3k17
$$ -60 151 -2 -96 177 -16 102 -1 -40 162 113 196 -76 -41 89 95 -205 -71 173 -3 -82 85 168 -49
4168d9J84k59nK44j66K56j80N2K21k29k10K59j00O9j48M6J86k85J62j13J20o5
$$ -49 135 -124 -129 115 -51 205 25 77 298 69 -141 118 18 87 -61 -15 171 -114 48 -65 55 -10
4190a0j2P8k20K41K2j44QJ24j91J66Q3o6J31j6k59l9k5L59m04L01l36P9p0M0k3
$$ -10 -22 56 -164 77 99 -45 -37 87 -104 62 145 79 210 194 -65 -104 -129 230 -174 127 -209 -130 -200 -160 -183
4215a83K79N4j48K42p5j28j53J03qN8J06k01J84j23O7j81L21R3k87Q8j48K11j80
$$ -183 96 150 2 244 169 41 -112 -9 -17 41 147 -54 130 7 74 -107 214 307 20 108 -40 171 -9
4238ij04J33j05L46m32J77K6M1j44M7J00O3l89J38J36k4M5k5O4j36j90K33p8o7
$$ -9 -113 20 -85 261 -171 6 32 73 -71 -24 76 139 -250 -112 24 0 45 20 84 -52 -242 -9 -87 -154
4262a54p3K62Q2q4LP0k06K42l35K76j51Q3P5k09K85k66K14o3k1j44L17l6q7k54
$$ -154 -227 35 117 33 36 106 -100 142 -193 83 -68 15 90 -119 166 -100 114 51 30 -114 203 167 80 -174
4286a74L97j21j12N1J23r7k0m9L7J77j31j38P6O5M8l4k6k27k2J33J47r3R3j37
$$ -174 223 102 -10 41 164 67 47 -2 35 212 81 -57 19 84 132 98 72 -155 -177 -44 103 10 103 -34
4310c4j5O2j33P9J1j79J96J12j84J32R9j09L3j83n6J7J72j21J31K35j80q3o2r9
$$ -34 -49 13 -120 -41 -30 -209 -13 99 -85 47 146 37 70 -113 -169 -152 20 -101 30 265 85 2 -60 -159
4334a59j81M82j17J27Q7l37K38j73J4r0j5Q9J84k49k2K70k5k8j50R6R9j56j27
$$ -159 -340 142 25 152 239 -98 140 -33 -19 -109 -124 -35 149 -100 -122 148 123 95 -55 41 140 -16 -143
4357a43J65o6K08k46r6K58o2m8N6J32k40J97k18R3j04q3mK55p9J47k08Q7J2j28
$$ -143 22 -44 164 -82 -178 80 18 -30 26 158 -82 115 -103 -10 -114 -197 -201 54 -25 122 -86 1 13 -115
4381a15O6o0N6L4k04K45r4K20j12j41L00k61J84p5j08K0Q8j84L37j08k0k09K23
$$ -115 -49 -109 -53 -19 -223 22 -72 148 36 -105 195 -66 118 43 -65 -45 43 -141 196 88 68 -141 82
4404H2j53K3K3J35j23Q9l4l00J43J69k14L09P2l60K29l59K02O6J3NR9k44L4L09
$$ 82 -71 -48 -25 110 -13 76 42 -258 -115 54 -160 149 221 -139 90 -269 -67 -1 12 17 116 -128 -94 215
4428B15l8l3Q2j67k04pJ12m9p9M53k34N5O8k1l66L59qj27k72K54j16K42p1j41
$$ 215 177 144 226 59 -145 -152 -40 -89 -168 285 51 106 174 153 -213 146 138 11 -261 -7 -123 119 48 -93
4452i3k16K45K22N2j81p8K24k98J50O7L4k43J54K5l23M11l88J87N9j04k8K56q
$$ -93 -309 -64 158 210 29 -49 175 -123 27 94 128 -115 39 64 -259 152 -236 -49 10 -94 -122 134 126
4475A26k69L11p1j15M6OM6R4k81K00N8j96j43K17J77k89J23k10LL93j87k52J59
$$ 126 -143 168 97 -18 28 34 80 174 -107 93 151 -45 -188 29 206 -83 40 -170 -167 226 39 -213 -54
4498e4J22m6P3N7J4J20j35k36j08J61l0K44j19l05L52j74L29l84J95n4m0j37J40
$$ -54 68 22 95 152 166 286 151 -85 -193 -32 -62 182 63 -242 110 -64 265 -119 76 22 -18 -155 -15
4521a5J87K02k69j53J38j41J99J8o4J5Q9l09K21j36J26N0l36K61j66J99k1M7p3
$$ -15 172 374 105 -48 90 -51 148 166 102 117 206 -103 118 -18 108 158 -178 83 -83 116 95 142 69
4544F9k57Q4K78j30J1M9j12j58N7J1J74k08j16J08K16k7j97J91n1k26K82J77k24
$$ 69 -188 -104 174 44 55 104 -8 -166 -109 -98 76 -132 -248 -140 76 49 -148 43 -8 -234 48 225 1
4567Aj74kK51J5rk10K60Q4p7k43L32k40r6m2qJ55r5K44l54L30K21k51l2P2k07
$$ 1 -173 -175 76 91 82 -128 132 216 139 -104 228 -12 -108 -150 -158 -3 -98 146 -208 122 343 92 60 132 -75
4592g5o9K18q9j67j0K34o7K79k37p8j07M06k99L53k25j6l06J71m2J79j83L5k5
$$ -75 -144 74 -15 -182 -192 42 -25 254 17 -61 -168 238 -61 292 67 51 -255 -84 -126 53 -130 -95 -120
4615a20J09j54k0K07j61J22j64K08k53K60P7k31L94k17j07J53L13l76RQ6k27N0
$$ -120 -11 -165 -185 22 -139 -17 -181 27 -226 34 111 -120 274 57 -50 103 416 40 49 135 -92 -42
4637d2j1J0j04p5N58l02r9M9J21m16M48K4k17j4k44J45J25L01m83N08j32q9q8
$$ -42 -53 -43 -147 -222 336 34 -65 -16 105 -311 137 161 -56 -70 -314 -169 -44 257 -226 282 150 61 -27
4660b7K82k77M1K15k95N8N0j1K7l1J18j91l9K67R2m21J79n7m2Q0J8J65M0k30j35
$$ -27 255 -22 19 234 -61 -3 47 36 63 32 150 -41 -80 187 279 -142 37 -20 -62 18 36 201 241 11 -124
4685a24J2M11k97l7P5J1q7J81k33k01K28p8j14L43k12l9r0L20k26Q5K3j10J8m3
$$ -124 -112 299 2 -35 40 51 -36 145 -88 -289 -61 -139 -253 90 -122 -161 -251 69 -157 -72 -49 -159 -141 -184
4709a84J43j11J8l1k3J06J66k06J87j40M4N1J33M3k66J18pnJ26j55M8p4P4j84
$$ -184 -41 -152 -134 -165 -188 -82 84 -122 65 -75 -31 20 153 196 -70 48 41 36 162 7 55 -19 55 -129
4733a29R6M1K11r4K10n79N08k32r5J18k75O0q6N78k68j91L12r7l9J91k77j23L2
$$ -129 -33 8 219 125 335 -244 264 32 -63 55 -220 -160 -246 332 64 -127 185 88 49 240 -37 -160 -128
4756a28K36k56L0R9O8l02K35o3K85k0k12k67M23P3l04K26J48m76L33M5k55O8K60
$$ -128 108 -148 -118 -19 49 -253 -18 -81 204 184 -28 -295 128 201 -103 123 271 -205 128 173 -82 -14 246
4779B46m56K17K15K33o03R1p0P9J00p5M7Q6p7j16J36K16l47l3J31M5k76M39J7
$$ 246 -210 7 222 455 -148 -57 -127 -48 52 -23 24 110 33 -83 53 269 -78 -111 20 65 -211 228 245
4802B45k21j11Jj24j53O08k67o3J87j38k10K88q8k22J36j8J30Om9q6K34O1j78
$$ 245 24 -87 -86 -210 -363 245 -22 -85 102 -36 -246 42 -46 -268 -132 -150 -20 -14 -63 -149 85 146 -32
4825c2L7K3K%j34n1J26K97j96j76K20j62J9J87o3k38K32Q5r6k10Q1r4O1L02m29
$$ -32 5 28 30 30 -104 -155 -29 268 72 -104 116 -46 -27 160 97 -141 91 176 80 -130 -49 -143 -82 220 -209
4850b09J56k4K62l1k1j54j42K68j30nr8M43l78N4p8lJ78j42J59l58K98l09J79
$$ -209 -53 -77 185 154 133 -21 -163 105 -25 -30 -128 315 -63 -9 -87 -90 88 -54 105 -253 45 -264 -85
4873h5K29k22J67j04Q6j30J7M6r6j0K63p5J12k84N7j18J19K82k45J6N5R9p3J25
$$ -85 144 -78 89 -15 71 -59 -42 4 -92 -102 161 86 198 -86 -29 -147 -28 254 9 25 80 179 106 231
4897B31j55L5K39l52n1M1J85m34P1M31k16J5l4k18R0M6j69M6O94m26k40J45o7
$$ 231 76 111 350 -2 -53 -12 173 -261 -190 241 25 40 6 -212 -122 -76 -245 -199 495 69 -171 -26 -93
4920i3J8RL45m52L27k44r7L60j71r4Q3J70k51l23N57j17k4L92m03k17L09l06K87
$$ -93 -75 -66 279 -173 154 -90 -187 173 2 -92 -9 161 -90 -413 144 27 3 395 -8 -225 84 -222 65
4943F5L3J45k16o9K70k34n4J89j4j82K15k76j70M22J46m36J17K25j88j30M45l28
$$ 65 98 243 27 -42 228 -6 -60 129 115 -67 148 -128 -298 124 270 -166 -49 176 -12 -142 303 -25
4965b5n8K8j29K43P6k83J03J93q2Q1o9l0j38J99j60L1j4n7K25j3o8R9l29N16j70
$$ -25 -83 -55 -184 59 135 -148 -45 148 66 147 78 48 -90 109 -51 -20 -34 -91 134 121 53 152 -177 339 169
4990A69l36P7m4jJ64j12P4J69k27o5L3L95l27o4Q6K78k76M3j60N2K61j18o6j72
$$ 169 -167 -90 -134 -135 29 -83 -9 160 -67 -132 -99 296 -31 -95 -9 269 -7 36 -124 -72 189 71 5 -167
5014a67M48m77j79M99j05K4R6j27l8J05j81k3M38k90J02j05K50j97N8J17m20N6
$$ -167 281 -196 -375 124 19 43 139 12 -26 79 -102 -125 313 23 125 20 270 73 131 248 -172 -116
5036a16J35M4j82L79k57j37J57j21L09o57M50k31N2L34l31J79j18n8k62N15k31
$$ -116 19 63 -119 260 3 -134 23 -98 211 -446 4 -227 -175 159 -172 7 -111 -169 -431 84 -147
5057a47O8k14K58j77J9L0k27L23j76K20k4K18j95j42M61l31K09k23J33r4j01J37
$$ -147 -79 -293 -35 -212 -193 -163 -390 -67 -243 -23 -47 171 -24 -166 295 -36 173 -50 83 -11 -112 25
5079B5j84M21j53j31q6K36j74j95M40j82kO2K0k63K68n5p1J62j76Q1j99M89n33
$$ 25 -159 262 109 -22 -108 128 -46 -241 199 17 15 77 97 -166 102 47 -24 138 -38 43 -156 333 -200
5102b00M04K4m06K26Q2l79j5L97m7j83j12K34p2N1J14m19J97N1m4j89M13K7l97
$$ -200 204 228 -178 48 130 -249 -264 133 86 -97 -209 25 -47 4 118 -301 -104 -53 -97 -286 127 154 -243
5125b43L32J29l14J44n8K01k9J6p7k08L36l10J44p7J60n9J82l14R9R9j24j19R5
$$ -243 89 218 -96 48 -10 191 162 178 101 -107 229 -81 63 -14 146 87 269 -45 54 153 29 -90 5
5148EJ96l97J3K75J05m33L79j15j34K17k82l4L57j33j86J86O7j60j89K47p1j1
$$ 5 201 -196 -183 92 197 -236 143 28 -106 111 -171 -205 152 19 -167 19 86 -74 -263 -16 -87 -98
5170i8Q1Q3k6j17J54j95K75l37R2o7L24j9k60oK6r7J86j04J4J62O3j36Q8K9k23
$$ -98 -17 66 40 -77 77 -118 157 -180 -88 -155 169 150 -110 -116 -90 -187 -1 -105 -91 71 134 -2 86 115 -108
5195a08M9r6N1l6J09K7K76l14kM2J24Pk0j81L2k14L91j44Q9J71j69j40L27j64
$$ -108 -59 -155 -104 -140 -31 -4 272 -42 -44 -2 122 129 109 -72 -40 -254 137 -7 82 253 84 -56 271 107
5219A07j70Q2j59M0%J79l87J93K17q3l14K30K59o33N19J6j26J04N3j85k45L61
$$ 107 -63 19 -140 -100 -100 79 -308 -115 102 19 -295 -65 194 -439 80 96 -30 74 127 -58 -303 58
5241E8n5K7j2J14q0p5J07k38J56Q7p4pN7J71l19L9j64j7K77Q6l03K47m4k11K09
$$ 58 3 30 18 132 52 -23 84 -154 2 89 15 8 65 236 -83 -44 -208 -225 52 138 -165 82 38 -173 36
5266C6p2R1J1j85R2Q4m1j31L91l03L06l27n7R5r9O8J51k61K15L32n57K56j37Q2
$$ 36 -36 55 66 -119 -27 57 16 -115 276 -27 279 -48 -105 -10 -109 -41 110 -151 64 396 -161 95 -42 40
5290D0o2p5K28k11n9J68k69M41k29j60L7J47j22K91L8j12k92L42k42J30O5p9K3
$$ 40 -22 -97 131 -80 -139 29 -240 201 -28 -188 -151 -4 -126 165 203 91 -201 141 -101 29 94 15 38
5313C8P1j53j84M69m5k73J81LnM8j32l60M40R2k32j00J14K15k99K71j03j34K50
$$ 38 109 -44 -228 241 196 -77 104 107 102 150 18 -342 98 190 -42 -142 -28 187 -112 159 56 -78 172
5336A72j97j34K13K57m84J53J86l04J07OR6j67PM3p4J82kj39K58l7m47Q2J42j16
$$ 172 -25 -159 54 311 -173 -20 166 -138 -31 -25 71 -96 -89 -46 -120 62 60 -79 179 142 -305 -223 -81 -197
5360a97J50J81j47k72K01j67K34R9L1j23j59K20r3J3K48j32k03n0L7J47L18O0
$$ -197 -47 134 -13 -285 -84 -251 -17 82 113 -10 -169 51 -42 -29 219 87 -116 -166 -129 18 336 396
5382C96p44M47l5j01j38J85N9n1O20o42L0R0l94L80k6j80O9j53K36j55J74j48
$$ 396 -348 99 64 -37 -175 10 69 18 638 -4 26 116 -278 102 76 -104 -35 -188 48 -107 67 -81
5404h1j89L35k22j48K61J04k33J73l3j45J45L5J93k51K59L7l43K64j78K2q8K13
$$ -81 -270 65 -157 -305 -44 60 -173 0 -33 -178 -33 2 195 -56 203 240 -103 161 -17 5 -83 130
5426A30l42M76k63K36j70j4j65q4M12l24J69n1N8Kk19Q4J79p7k66Q3j28K14m4
$$ 130 -212 264 1 237 67 53 -112 -196 216 -108 61 10 68 70 -149 -65 114 37 -229 -146 -274 -60 -104
5449a04j66M42K3k11j33K47mj39J73n8N1j05j11J53L77l65KJ05q3r9pl8l3K04
$$ -104 -270 172 195 -16 -149 98 94 -45 128 70 121 16 -95 58 435 70 72 177 94 -5 -12 -50 -83 121
5473A21j26J65j3j7j67QK18k46m6J61k59M41j78L5k66K52j63J74k50L05j97K1
$$ 121 -5 160 147 130 -37 -29 189 -57 -103 58 -201 240 62 97 -169 83 -80 94 -156 149 -48 -27
5495b7J08K5j02m0N2P2j8j5n8K23o1j87j75K11J08k4k5P3k11N5K5r8J53k5O1j90
$$ -27 81 106 4 -36 16 88 70 55 -3 220 159 -28 -203 8 116 92 67 140 -71 -16 9 -89 64 39 100 -90
5521i0K05j14OO7J25j43K13k46l1r4K61l18K00M8k60L77k77j02L20j20j16N6J92
$$ -90 115 1 7 74 199 56 269 23 -8 -102 159 -159 41 89 -171 206 -71 -173 147 27 -89 -33 159
5544A59j65J19j89j25K05M1q0j7L50l35N7R9jm32O70m08N4K33j65L4k23K40l2
$$ 159 -6 113 -76 -201 4 45 -35 -52 298 -37 20 119 118 -314 356 -52 2 235 70 104 -119 121 89
5567H9j43j02K32j80L15j11k34R6J8j49j21K17j69K20J64O2l34Q1K6KK2j16M4
$$ 89 -54 -156 76 -104 211 100 -134 -38 -20 -169 -290 -73 -242 -22 142 204 -130 -49 -23 -21 1 -115 -71
5590g1p6L34l5o1p5P5k25P2O1k1K50j58j6Q9k63K6K7q3J70q2M5l25J80P2J11j37
$$ -71 -147 187 152 91 16 91 -134 -62 -1 -22 228 70 54 143 -120 -94 -67 -150 20 -62 -17 -342 -162 -90 21 -116
5616a16%J64O4j05j0k45K38M5M4j40K06k74K24k47L32n63M28R5j08P0j35o7K3
$$ -116 -116 48 112 7 -3 -248 -10 35 79 -61 145 -129 95 -152 180 -383 45 140 32 102 -33 -100 -77
5639g7J87j52P4k2k11L68r2L0r8n9r3J91J53l26K35k00N1j63K39K7m9o1p2K23
$$ -77 110 -42 32 10 -201 167 75 105 7 -52 -145 46 199 -127 108 -92 -41 -204 35 62 13 -48 -120 103
5663A03j89Q9J4j88K10K21j66j89J16j17M14m37l6O8J47o5J45j51M6m0k42K93
$$ 103 -86 3 17 -171 39 260 94 -95 21 -96 318 -119 -155 -87 60 -5 140 -11 35 -5 -247 46
5685D6j0j28M9J62k88m6L20M3k22jJ82qO9j3p2Pj18n1L6P5k44J58j18K53R4m8
$$ 46 36 -92 -43 119 -169 -215 105 148 -74 -75 107 99 168 155 83 90 -28 -79 -43 32 -212 -54 -172 81 175 127
5711A27j19L9O0j26M74m62L9j27J57j54K13m47L26J58p2j72K47M0k96R5N3j25
$$ 127 8 47 107 -19 455 -7 32 -95 62 -92 121 -326 0 158 86 -86 161 201 -95 0 53 -72
5733g2K0j03j22M03K0R9l33R2j53K43o8q0k5J63j00J19o4J25k74K51m1o7mk62
$$ -72 -52 -155 -277 126 146 245 -88 4 -149 94 26 -54 -79 84 -16 103 39 164 -110 141 100 33 29 -233
5757b33K13K29k46K10k81J69m9k27K59Q7l55L98moj11L10m32K01k66M50m35J95
$$ -233 -20 209 -37 173 -108 61 12 -215 44 131 -224 174 170 164 53 363 -69 132 -134 316 -119 76
5779G6L0q9N2j57j5K9L69o19l1K95J4r4o6k3K78O0j35L34l64J78j66J85k09K6
$$ 76 106 17 69 -88 -103 -74 295 -324 -355 -60 -46 -140 -206 -229 49 109 -26 308 -56 122 -44 141 -68 -42
5803d2%N3l0Q6k16K74j24K2j08J55Qj57k5K53l43j29M85k06J63l28K93J51j73
$$ -42 -42 11 -19 67 -149 125 1 23 -85 70 78 -79 -104 149 -194 -323 162 -44 119 -209 84 235 62
5826F2J17j88J46k16Q8j71j22L19j04K12k95J34p0q6J49J63j01j67J10R4N0j48
$$ 62 179 -9 137 -79 9 -162 -284 35 -69 143 -152 -18 -88 -174 -25 138 37 -130 -20 74 124 -24
5848b4k3J9J14q3j3J18l02J11J09QJ5j44j8LJ58r7J95Rk04j26L39m5l48K54k15
$$ -24 -47 -28 86 3 -10 108 -194 -83 26 34 49 -95 -113 -110 48 -49 146 155 -49 -175 164 119 -229 25 -190
5873a90J64J1J63j77P9j10NL24j46N7r9k33K47j54J06mk71J88r9L08j91R6j5m5
$$ -190 -26 -15 148 -29 50 -60 -55 269 123 180 81 -152 95 -59 47 43 -228 -40 -139 169 -22 74 59 14
5897A4o4lO5j85L12%Qj24q2K69k26L29k83m7Q8P8j00p4m5J06j51Q8J07j97J10
$$ 14 -50 -53 12 -173 139 139 147 23 -59 210 -16 313 30 -17 71 149 49 -25 -70 36 -115 -27 80 -117 -7
5922gJ7K54j72l35OJ42J13K17l50P3Q7j61J32J61k15P0o2o5J08J09k76K22qj25
$$ -7 10 264 92 -243 -237 -95 18 235 -115 -42 45 -116 16 177 -38 32 -30 -95 13 122 -154 68 60 -65
5946f5j98K16j25L46N5l82J07l08K69J39j91J95k43J99K44pl02L0K3K72j78o2
$$ -65 -263 -47 -172 174 229 -153 -46 -354 -85 54 -137 58 -185 14 258 251 -51 -21 2 274 96 34
5968C4j72J38K17l09J64j75J42j9P2p6k70J74J49q4L1qj46k1L9J73j6j21j09P5
$$ 34 -138 0 217 -92 72 -103 39 20 92 16 -254 -80 69 -15 16 8 -138 -159 -120 53 37 -84 -193 -118
5992a18J47j31k4K59k09Q3j72J91o3L29k66r6J9rJ78q1K13l73L72l56K2J83j70
$$ -118 29 -102 -126 133 -76 7 -165 26 -37 292 26 -70 -51 -60 118 37 250 -123 249 -107 -85 98 -72
6015g2J88l42L76q6j04J31q4J0k14J88Oj29J39l8L06l78R8J68q4j06nJ73k58J25
$$ -72 116 -226 150 64 -40 91 7 17 -197 -9 -3 -132 7 -31 275 -103 -5 163 79 -27 -32 141 -117 8
6039Hj9J44j60j13K28k10M5j14J10N7l4Q2L9n8M2k49J85q5Lj4J38m4J02KL6k08
$$ 8 -11 133 -27 -140 88 -122 -77 -191 -81 -24 -58 24 63 5 47 -202 -17 -102 -99 -113 25 -19 83 85 121 -87
6065h7J07n8J71p9j53j27L32j25J33j91J62J22q6j14p7O7Q7o6J10Ll03J93P7o8
$$ -87 20 -38 133 54 -99 -226 106 -19 114 -77 85 207 121 7 -70 -3 84 18 128 131 -172 21 98 30
6089C0l1Q9k59J12J54q9j15K20J29k48J78l04J96j20R1n6l2J55j38O2j85K08j19
$$ 30 -1 88 -171 -59 95 6 -109 111 240 -8 170 -134 62 -58 33 -23 -55 100 -38 24 -161 47 -72
6112g2j18L23j91j6M1k02J58P1J90k37J06k55J20Q9k88K10K02K2j4j27j6j48K31
$$ -72 -190 133 -58 -74 -33 -235 -77 -6 184 -53 53 -202 -82 7 -281 -71 131 153 139 12 -4 -152 79
6135G9j03J65k49j11K45j47J66J9N7l83K73J92p2j78J07j70J61J00r8j00K89k31
$$ 79 -24 141 -108 -219 26 -121 45 64 121 -262 11 203 131 -47 60 -110 51 151 53 -47 242 11
6157A1J1j59K75q9J71o7k61K49k03J22k42j56K98j22J24LK20k57m6Q7J37j64K19
$$ 11 22 -137 138 49 220 153 -108 141 -62 60 -182 -338 -40 -162 -38 -35 185 -72 -118 -31 106 -58 161
6180A61l2l50J68m2L47k25J2O8q6J55l16qJ41o0Q7m1q1Q3k7Q1j66L54q3j33J69
$$ 161 129 -221 -53 -95 252 27 39 107 21 176 -140 -148 -7 -67 20 -21 -102 -19 -46 35 -131 223 140 7 176
6205A76L0P0l79K17n0K30r7j70j32L2j1K87J0k84R9j14j63K41J39k09l5J31j68
$$ 176 206 276 -103 114 64 294 197 27 -105 -73 -84 203 213 -71 28 -86 -249 -8 131 -78 -113 18 -150
6228a50PL9O8l9m5K79j58J49j01nj71J33JL24l05o9n1Q7L4l8R9q6J5l46L48nQ3
$$ -150 -143 -104 -36 -75 -120 159 1 150 49 44 -127 6 7 331 26 -43 -94 -7 27 -11 88 2 17 -329 19 14 97
6255I7O3k37J0L1j07K09k32n7K25k05K31M6O0l3r8N9l2r2M1L92l95L0k18L20N5
$$ 97 160 -77 -67 -36 -143 66 -166 -223 2 -203 28 74 134 101 3 62 30 -62 -21 371 -24 6 -212 108 163
6280A63l65k3J26j87K02Op4J1O9k3L4j55K08l2j41L36k02R8k1jk14L36k62K65
$$ 163 -202 -225 -99 -286 -84 -78 -152 -141 -72 -95 -61 -216 -8 -40 -181 155 -47 51 30 29 -185 151 -111 154
6304A54j2j99r3L32j60J01k1j1J9q2Qj49j01K67j33L70m26O4J86LO8j87l4q1J11
$$ 154 142 -57 -150 182 22 123 102 91 110 28 36 -113 -214 53 -80 290 -136 -72 114 117 185 -2 -36 -117 -6
6329frJ00k8k03R3qJ06k13J13k11L42p1J1n5J21k94L56p0p4N8j1j93L38r2j41
$$ -6 -15 85 57 -146 -53 -61 45 -168 -55 -266 76 5 16 -39 82 -212 144 74 0 58 47 -146 192 100 -41
6354d1NJ88j04k09P2K41r7j36J33p9P4j11K4o1j62L20k24L57l07QK90k01J7k5
$$ -41 -36 152 48 -161 -89 152 55 -81 52 -27 47 -64 -40 -101 -263 57 -167 190 -117 -109 181 -20 -3 -28
6378b8P3MN2k5k81K09J17q6R0l5j16K79j41k95L72n6J55j43r4j40p1O6K41r9L9
$$ -28 45 49 101 76 -205 4 121 35 125 90 -26 253 112 -183 189 133 288 145 51 -89 -160 -94 147 48 87
6403H7j05l7J16m1R9k41k4J81j54O7J11oj15K05l84L01k32N26n30%Q1K28j30o0
$$ 87 -18 -55 61 20 119 -122 -146 35 -119 -52 59 53 -62 143 -241 60 -172 354 -176 -176 -95 133 3 -57
6427e7m8J45P3r5p9R3r2k3K80k52J08j16J10l11O2K17j25J4M5K66m72J86J15K58
$$ -57 -105 40 113 18 -61 32 -60 -83 197 -55 53 -63 47 -264 -202 15 -110 -96 -51 215 -257 -71 44 302
6451C02j86j80n6k8K63j33jn2j40J54K69j52q5j08k76L59j41L68j16o9j50l6J28
$$ 302 116 -64 -120 -148 115 -18 -19 -71 -211 -57 212 60 -25 -133 -409 -50 -191 177 61 -8 -158 -194 -66
6474f6QJ47j62M40k79k05K75p0L6l18M3J48J28l3k89qK28k95L09o6j06K7L0K1
$$ -66 -58 89 -73 367 88 -117 158 88 124 -194 -151 -3 125 92 -197 -205 23 -272 37 -29 -135 -108 -78 -57
6498e7O6j6N3Q7k56L12j1o2k06J81N3m03N80l32q6j46J05K95l23K08j87L76Ol96
$$ -57 9 -7 46 133 -123 189 178 116 -90 91 144 -259 321 -11 -97 -243 -138 157 -166 42 -145 231 237 -159
6522a59K70j71mo7J94r7k49Q6R8K84m11L57k88K56p3n6j92K38N3l27L19j95J91
$$ -159 111 -60 -64 -131 63 -34 -283 -197 -99 185 -226 131 -157 99 26 -30 -222 16 69 -258 61 -134 57
6545E7J48L1l57P5L0j09j7K85j37nj50L24j53L7j45o8J9P2j9J87j80J65L1o5J71
$$ 57 205 236 -121 -46 -16 -125 -142 143 6 1 -149 175 22 59 -86 -154 -135 -63 -82 105 -75 90 121 56 227
6570B27k21J19l04L04l2M9l8k14K13l16J03J12j1J07j97O2J80r7m9m8PR6R4m7
$$ 227 6 125 -179 125 93 142 104 -110 103 -213 -110 2 -9 98 -99 -37 143 46 -3 -51 -44 52 146 99
6594I9k44L37k95O9L9K0J26k66J34L12k64k32L51k29N7j68J28n0L7n8O5J88k47
$$ 99 -145 192 -103 -34 5 25 151 -115 19 331 67 -165 186 -43 14 -154 -26 -76 -39 -97 -32 156 -91
6617i1K35Oo9p2lM9k86L27R8j18k38K85j43J09q8l9l9J11l2K2Oj88K35j61L6L9
$$ -91 144 150 81 9 6 55 -231 96 194 76 -162 123 -20 89 1 -38 -77 34 2 24 30 -158 77 -84 -48 -9
6643iq0K23l7J48j53j77m6N2M1Q5J89k29Q7r4J93k7n0M3o5N2j74NO5R6j53j07
$$ -9 -89 134 97 245 92 -85 -131 -79 -38 47 236 7 94 0 193 166 116 159 94 146 -28 -23 42 138 -15 -122
6669a22K38l6j78j86M08k53J42o7p6K88j24jm6K0r7R2K1j11J56M8l84lK43l0K52
$$ -122 116 80 -98 -284 124 -129 13 -54 -130 158 34 33 -13 7 -90 2 23 -88 68 116 -268 -271 -28 -58 194
6694A94k42J17q7j01J71k02n3R5M0p1J93p9m6nq8L13l04K27r4K8K7K32j84k1o7
$$ 194 -48 69 -18 -119 52 -150 -203 -108 -68 -139 54 -25 -71 -76 -164 149 -155 72 -22 6 33 265 81 60 -7
6719gq8J9K02j24k1J03o4K90l43m3L0J23N3k05Q0j60J82n7K86l51p9L08k04Q6
$$ -7 -95 -76 126 2 -19 84 20 310 -33 -76 -46 77 130 -75 5 -155 27 -30 256 -95 -174 134 -70 16
6743A6k9N1k39J73p4K99R6k65K0n5j73L17l53L87j13q7R3M2Kk64J40J56m4j14
$$ 16 -13 38 -201 -28 -102 197 293 28 48 -7 -180 137 -216 171 58 -29 64 106 108 -156 -16 140 96 -18
6767a8k6K36j40J06l11J61l7K90l99j26K77J92j63J8L1q0K15n06L23j16j68K74
$$ -18 -44 192 52 158 -153 8 -29 261 -138 -264 13 205 42 60 91 11 226 -280 43 -73 -241 33
6789C3R6j84L9l80R5L72P1k0j86j13n7K51k36K91q5R9j92l2J19R5J19j07k64K24
$$ 33 129 -55 -16 -396 -301 71 142 122 -64 -177 -234 17 -219 72 -13 86 -106 -138 -19 76 195 88 -176 48
6813D8k7k27J20r3k5N1J67K2j40R7J09p7j13L57k10k36L23k7q6n8N2J0j31O7J7
$$ 48 21 -206 -86 -179 -204 -153 14 36 -104 -7 102 25 -88 269 59 -177 146 119 33 -25 27 37 -94 -27 -10
6838a0J30n7%m5p2J88p4o7J42j01k93K78k87L02k2J37k60J65k44NJ7J37L3L1o5
$$ -10 120 63 63 18 -54 134 60 -7 135 34 -259 19 -268 34 12 149 -111 54 -190 -185 -168 -31 2 33 -32
6863c2k12L90k41N6N6M4Jj51K4J05N6k21M5r1J72K02j10j08j40l3O0j7J80J71
$$ -32 -244 146 -95 -39 17 61 62 -89 -65 40 96 -125 -80 -171 1 203 93 -15 -155 -188 -128 -145 35 206
6887B06j96N4K24k14J05k38Nk84M05j69n0Q8k10L33K7P4k15R6oQ6O3l62L05k84
$$ 206 10 64 288 74 179 -59 -54 -338 67 -102 -152 -64 -274 59 86 160 -55 41 35 121 184 -178 127 -157
6911a57m6J69N8o6J52kJ03l24M28j63k31J01m2L2J21jm29K01K5K4P9p3K28n31
$$ -157 -203 -34 24 -42 110 108 211 -113 315 152 -79 22 -20 12 133 132 -297 -96 -71 -47 32 -41 187 -344
6935c44K41j24N36l98J19m8o8k7J99j84J14R8j64M3j92K97J16m99N16k69J79k35
$$ -344 -103 -227 309 -89 30 -18 -86 -113 86 -98 16 114 -50 -7 -199 98 214 -285 231 -38 141 -94
6957i4P7M3k36K39j33Q7MR5j13R2l59M00j90L8j98L53J84k54pl0J33l81K19J96
$$ -94 -17 26 -210 29 -104 -17 -13 82 -31 61 -298 102 -88 -50 -248 105 289 35 28 -2 131 -250 -31 165
6981A65j49J19l02K08J63l76J66QQ1O8j65J4JM0q2K06L4m65K99Q8K26q0j98j6
$$ 165 16 135 -167 41 204 -172 -6 2 83 151 -14 0 1 41 -41 165 199 -266 33 121 347 267 69 53
7005E3oK10j40k88P6J66J14l21R6J4RJ41k64J80k88K60R2j69O7l4kK07j17k28
$$ 53 47 257 117 -171 -95 71 185 -136 -40 -26 -17 124 -140 40 -248 12 104 -65 2 -32 -34 173 56 -172
7029a72J77j1J83l32mL28M7j97l67K12M65m51K69rl17J42Nq1k45L96J37j44p1
$$ -172 5 -6 177 -155 -159 169 216 19 -348 -136 329 -122 147 138 -179 -37 -32 -113 -358 38 175 31 -40
7052d0P6l74L95j50L4M55m24J7K30k51N9rj34JK79ok28m7J98j29j08O9K08K1k09
$$ -40 36 -338 57 -93 -59 396 -28 -11 219 -32 27 18 -116 -115 164 158 -70 -117 81 -48 -156 -87 121 142 -67
7077f7k22K38J37k53J42j13K84k68K11j05nPk12L54O7j35j77K44Q0j09j78P1N
$$ -67 -289 -51 86 -167 -25 -138 146 -122 89 -16 -21 -14 -226 128 195 60 -117 127 207 98 -80 -9 -4
7100dK1j80J46J9K5m0LK43j86k66J06J63J1k06L31j57q5K3N1K6j65J54j29q8L03
$$ -4 17 -163 -17 2 27 -13 -10 233 47 -219 -113 50 61 -145 186 29 -56 -33 18 44 -121 33 -96 -184 119
7125A19j70J04l5j40K37l21K21j3L3R2l56L55j84K8j49L96k62K65m32K73Q6k16
$$ 119 -51 53 18 -122 115 -206 15 2 35 127 -229 126 -58 -30 -179 217 -45 220 -212 61 147 -69
7147f9M9O2l4po5P7Q0j82K2K27j20j69p6L71j58j24J8L86l59P1K31o0j04j34j3
$$ -69 -20 42 8 1 -64 13 93 -89 -67 160 40 -129 -205 166 8 -116 -98 288 -71 0 231 171 67 -67 -80
7172h0L3R1j59K38k53K24m4J37l07J88j60O8m2J55m4n5P3J59k87P7Q5j0m6J25
$$ -80 -47 44 -115 123 -130 94 50 187 -120 68 -92 -24 -66 89 45 -10 63 222 -65 12 97 87 41 166
7196A66k74K14o5j39J36j16o8Q8J48j57j0JP2M2Q6q8J05L1l34J50J89po1r0J1
$$ 166 -108 106 41 -98 38 -78 -146 -58 90 -67 -77 -76 -4 38 124 36 141 172 -162 -12 177 170 109 19 30
7221C0R6j02Pj97K21J9q4p5K11k04R3K67j59k0J59l48K79j53n7j08K47l9k19J56
$$ 30 126 24 31 -166 55 74 -10 -85 126 -78 15 282 123 103 262 -86 193 40 -17 -125 122 83 -136 20
7245B0L3k94K18j46J93J05m1j15qJ07j64n8J01j43K51j54J14J39j7j44j19J79
$$ 20 53 -241 -23 -169 24 129 88 -27 -35 72 -92 -150 -49 -192 59 -95 19 158 141 -3 -122 57
7267E7j17P6N2j03N4j19j59R8K08M3r2J36r0R6J12k02k53J94m8j00M12k50M3P3
$$ 57 -60 16 68 -35 19 -100 -259 -161 47 90 -2 134 44 140 252 50 -203 -9 -57 -157 255 5 48 121
7291A21M1l44J48J16m1K39k25r3p1K3j2O0ON5j74l6J07K07m9j41k3l3J9L70l8
$$ 121 162 -182 -34 82 41 280 55 -38 -109 -86 -98 -38 -32 23 -151 -187 -80 127 78 -63 -86 -119 -100 270 232
7316B32j89K47l26J01M7j20k3k9N2K0P5k3K06j55r0J27j15j54L21k10J95k25K1
$$ 232 43 290 -36 65 112 -8 -31 -60 -8 12 87 64 270 115 25 152 37 -117 204 -6 189 -36 -15
7339a5J14j81R2k05L57k01N4p3J50R5k00o8L42k79K37k77l1L5K06j90k03L23r6
$$ -15 99 -82 10 -195 162 -39 15 -58 92 187 -13 -81 261 -18 219 -58 -89 -54 152 -38 -241 82 -14
7362a4Q3p4m9j13K29j77P6K24j36J5P0j74J97j33K85l17k24J71R5k79K52J75j98
$$ -14 69 -5 -54 -167 62 -115 -39 185 49 64 134 -40 157 24 309 -8 -232 -61 34 -245 7 182 -16
7385a6k2N5k33N1K04j2j95J23O2j28K6K97k12Q0k64K73k48K3K47j0o1p6M6j31
$$ -16 -38 17 -216 -165 39 27 -168 -45 17 -111 -85 212 0 80 -184 89 -159 -136 111 101 40 -36 10 -121
7409a21M00k57p6J07n3K2j23J03M8j62K24o7j25J00j78K53m2L01k37k60n9L18
$$ -121 279 22 -54 53 0 22 -101 2 50 -112 112 45 -80 20 -158 95 53 354 117 -143 -202 116
7431A16l4J04k05L5K5j57K76j45M8J15j23O3Q2l4l57M03l93J68r0N3j18M20k20
$$ 116 82 186 -19 16 41 -116 160 15 63 178 55 118 200 166 -191 212 -181 -13 -103 -50 -168 252 32
7454C2j80L12j41l0j55J72k03K72k81K34m4Q5o2O1j50L08l76L83n28J55L8K00
$$ 32 -148 164 23 -7 -162 10 -193 79 -202 32 -12 73 11 72 -78 230 -146 237 -291 -136 -98 102
7476A02mM5m69L20n5K28j66O8k10J58J17k02M1l2J99j02k2R8q0k0q0J66R0j96
$$ 102 98 143 -326 -6 -61 167 1 69 -141 17 134 -68 -27 -59 140 38 16 114 34 14 -66 100 190 -6
7500fj7j22kM1Q0q3r8M4P3J29o0q0J44k05L4J73J77k55J77m12L78j48R6J31k46
$$ -6 -23 -145 -147 -106 -26 -109 -207 -163 -90 39 -21 -101 43 -162 -128 45 222 -33 144 -268 110 -38 58 189 -57
7525e7P3j45P8J14p0j09J97j25j14L67k48j6j53L65j59j81K43J91j34K1p3j16
$$ -57 16 -129 -51 63 -7 -116 81 -44 -158 209 -39 -55 -208 157 -2 -183 60 251 117 138 65 -51
7547e1k1m8K33J7k24O5%J1K3J68j2Nj77J8j28Q8k5J52j75J01K5j4j82m0K15j18
$$ -51 -72 -120 113 130 -94 -29 -29 -18 5 173 161 166 -11 7 -121 -33 -58 94 -81 20 45 31 -151 -191 24 -94
7573i4P2l8J25l8M9j90Q2K14j77Q8O9k58j21J00K89m3j76j30M21k23j56J50p4
$$ -94 -22 -60 65 27 76 -114 -32 182 5 93 162 -96 -217 -117 172 129 -47 -177 244 21 -135 15 -59
7596e9j1J15K5j65j21M41q9k61J00J8J01j16j37K14k5j66L30m54L48j11RJ09j23
$$ -59 -70 45 70 -95 -216 225 136 -125 -25 -7 94 -22 -159 55 30 -136 194 -260 88 -23 -14 95 -28
7619b8O5oO1k1r0Q8N2l13J98L2M5O2j28k7j35K56j12J10M4j89J31j2j95M7N2M9
$$ -28 37 31 92 71 -19 69 121 -192 6 38 83 145 17 -10 -145 111 -1 109 153 -36 95 83 -112 -65 -13 36
7645C6m7L4R3Q6k14N5l7j9K0O1n3j14J13k86J82k6r6L55k42Q9j31J03O5k5J07
$$ 36 -11 23 116 202 -12 43 6 -13 7 68 15 -99 14 -272 -90 -116 -212 143 -99 -10 -141 -38 27 2 109
7670A09p6q1Nj23J69L0Q0Q7j54j45J80j17K86k09j48N9j12L20r2l3J08R3k26R5
$$ 109 33 -48 -43 -166 3 33 113 200 46 -99 81 -36 250 41 -107 -48 -160 160 68 35 143 236 10 105
7694A05Q8k32M8N2k12L70q4m01O11k33O5Jj64J11j86J21K28l52N1J46k20K47m76
$$ 105 193 -39 9 61 -151 219 135 -266 345 112 177 178 14 125 -61 60 288 -64 -13 133 -87 160 -316
7717c16N05l08K19q8Q8l9L7j0KqO8j04P0k03r4K95j15j7J35k01o4J12r2L00q5
$$ -316 189 -119 100 12 100 61 98 88 90 82 150 46 116 -87 -181 114 -1 -18 117 -84 -148 -36 -128 172 87
7742H7j78J46j45j08J26P7O9N5j02k8j31J50K7j26m5J01J35j33nP2J2j91K41j73
$$ 87 -91 55 -90 -198 -72 5 74 129 27 -1 -132 18 45 -81 -126 -25 110 -23 -28 44 56 -135 106 -67
7766f7K40j22L5j90R8j01J84j94L50l40Q3k11J39J22J0j16J76n0L0j64K0J09m8
$$ -67 173 51 86 -104 -6 -107 77 -117 233 -107 -24 -235 -96 26 36 -80 96 46 76 -88 -68 41 -7
7789gJ6j21q0J58P7j74K43J4j78k1l9k5J66%j00K6J56m2Mj14J29q5R8m7j86r5
$$ -7 9 -112 -192 -34 43 -131 112 126 -52 -73 -112 -137 29 29 -71 -45 111 69 73 -41 88 3 101 54 -132 -227
7815b27J58j60M12k69J09k57L29k27O7j55K83n2O1l16p1K75J4Jk48K83j9Q9O7
$$ -227 -69 -229 183 -86 23 -234 95 -132 -65 -220 63 11 72 -244 -315 -40 -26 -25 -273 10 -9 80 147
7838A47n1m9j78J52k04j69K33O3p9n6K91j90J99q0M3k09Q0k6M0K8K04k96Q1j15
$$ 147 96 47 -131 21 -183 -352 -119 -56 -135 -191 100 -90 109 29 72 -137 -57 -83 -43 -15 189 -107 -26 -141
7862a41K41l9k37J26j2K00k02J12n6O2J22k22P4J40j54m6O0J3j57Q8J2J8n8r6
$$ -141 100 61 -176 -50 -62 138 -64 48 -8 54 176 -46 28 168 14 -32 28 41 -116 -28 -16 2 -56 -152
7886a52J11j17J21j42K75N9l32J31J33J42j79k25K11r3O0n2k2M8K24p1k08j6J81
$$ -152 -41 -158 -37 -179 96 155 -177 -46 87 229 50 -175 36 -57 3 -49 -71 -23 201 130 -78 -94 87
7909H7j2J1k28K16n6j50p2M1K95q6J64l30k4J0K73j53K41k54p0L31j74O6k66O4
$$ 87 75 86 -142 74 18 -132 -204 -163 132 46 210 -120 -144 -134 139 -14 227 -27 -97 234 60 126 -140 -76
7933g6J97N9k14J62K2k30k3K1j02M8M4K7R3j21NJ53m7m9j80R7J45r5Q2j42M23
$$ -76 121 180 -34 128 150 -80 -103 -82 -184 -136 -92 -65 28 -93 -88 65 18 -31 -211 -114 31 -64 18 -124 299
7958B99m01L17k87J20P4r0J28l40J45N6j43J95j26J21j51q2K31k7j45Q5M7j42
$$ 299 -102 215 -72 48 122 32 160 -180 -35 21 -122 73 -53 68 -83 -165 66 39 -106 -21 26 -116
7980a16O9KN0l75M23mj08k4L66m49L10j3n5k7j62p5Q1J24j61J62j13k4K61k83
$$ -116 -47 -45 5 -370 53 49 -59 -83 283 -166 144 131 76 49 -113 -188 -107 17 -144 18 -95 -119 142 -141
8004a41L75l42K1J16J38j28j6j00J57j47k5K86j51J66l60K45Op0P3l42J79L81
$$ -141 234 -108 -87 29 167 39 23 -77 80 -67 -92 194 43 209 -151 94 100 30 103 -239 -60 321
8026C21k17k40j9L94k27j72J13K8N5j4J17o1PL5L3k99L25k03l0j4L4j05M7k7J00
$$ 321 104 -136 -155 239 12 -160 -47 -19 36 22 139 78 85 120 153 -146 179 -24 -54 -68 -34 -139 -92 -119 -19
8051a9L07l91L52o8o6J00j65j27o5J55p3J01J73k40J10j87R1R2j17L50j97l66
$$ -19 288 -103 249 181 115 215 50 -77 -142 13 -60 41 214 -26 84 -103 -12 80 -37 313 116 -250
8073b50J05J65l06L06P9k23Nj32L03P1j09L2k27L28k00j15K16j0L5k0j8r7j53
$$ -250 -145 20 -286 20 99 -124 -119 -251 52 123 14 46 -181 147 -53 -168 48 38 73 53 35 -62 -215
8096b15L38l01J41N1R3r4l2J39j66m0lp4K81j62q7N3L1j54K13R9o6M7k99K37j01
$$ -215 123 -178 -37 14 107 13 -19 120 -46 -86 -89 -163 118 -44 -131 -78 -47 -201 12 111 45 92 -207 30 -71
8121g1Q1r6j19O2o0K16M3m8j20M9k07K78k7J18J01p0k36k09K67j27J72R7j81R2
$$ -71 10 -86 -205 -143 -203 13 56 8 -112 -63 -270 8 -19 99 200 130 -106 -315 -48 -175 -3 94 -87 5
8145EK0j41k9K64j21L04j34k20M3m0J39k53J33J1L3j81j25N13N5k45j49Q6m1J09
$$ 5 25 -116 -145 119 -2 302 168 -52 -9 -49 90 -163 -30 -19 14 -167 -292 221 276 31 -118 -32 -73 36
8169C6j52J07K7l1P1j79L17k34p2L67k67L3rj36Q8J79m1J0j54K54j2k91
$$ 36 -116 -9 18 -13 58 -121 196 -38 -110 257 -10 23 14 -122 -34 145 104 114 -40 214 202 -89
8191h9
$$ Imaginary data points
##PAGE= N=2
##DATA TABLE= (X++(I..I)), XYDATA
0@%%%%%%%%%%%%qJ6j6J6k4L2l5M3n1N9p2Q8j04J20j37J61j87K12k43K78l17L61
$$ 0 0 0 0 0 0 0 0 0 0 0 0 0 -8 8 -8 8 -16 16 -19 24 -27 32 -40 48 -56 64 -73 88 -99 113 -130 148 -169 192
34A92m08M60n15N77o47P20q02Q92r90J098j215J343j482J632j797J980k181K402
$$ 192 -216 244 -271 306 -341 379 -423 469 -521 577 -638 705 -777 855 -942 1038 -1143 1259
52A259k647K918l223L565l951M397m911N510o226P098q182R579j1453J4110j8200
$$ 1259 -1388 1530 -1693 1872 -2079 2318 -2593 2917 -3309 3789 -4393 5186 -6267 7843 -10357
67a0357K5378m1637J45043L7451j78599J35929L4252q3634j4048N2845p9488P7964
$$ -10357 15021 -26616 118427 155878 -22721 113208 147460 63826 49778 102623 23135 101099
79A01099j6958j11486N0686J07013j28172p7782J61415m3699q9481N1043J3609
$$ 101099 84141 -27345 23341 130354 2182 -75600 85815 42116 -47365 3678 17287
90A7287m4428M9616j3666r5348J26879J7466j26623K0885J37223q2447o8576J07852
$$ 17287 -27141 22475 8809 -86539 40340 57806 -68817 -47932 89291 6844 -61732 46120
102D6120k0620j8240L2862k3983l2032J11933l7520j16827J23154M8294j12406
$$ 46120 25500 7260 40122 16139 -15893 96040 58520 -58307 64847 113141 735
113G35j6531J13826n5836l1472M3706m6283J8843M8084o8908o4475J40251l1492
$$ 735 -15796 98030 42194 10722 54428 8145 26988 75072 6164 -58311 81940 50448
125E0448j26360P3400N6809p4885k3626N6313n3194L3044J5455q1785K5201R0517
$$ 50448 -75912 -2512 54297 -20588 -44214 12099 -41095 -8051 7404 -74381 -49180 41337
137D1337p1306q6302J30915l955q4059L1881L9903l5227J8984J2627p0722Q0030
$$ 41337 -29969 -116271 14644 10689 -73370 -41489 -1586 -36813 -17829 -5202 -75924 4106
149D106L1160r4571P26J14473m8477q1165Q9216N4l4002J7854r42l5176O8978
$$ 4106 35266 -59305 -58579 55894 7417 -73748 15468 15522 -18480 -626 -1568 -36744 32234
162C2234q815j02249P9871N3249q7452l3123J00715l2618m9206M3892k4395R49
$$ 32234 23419 -78830 1041 54290 -33162 -66285 34430 1812 -47394 -3502 -27897 -26948
174b6948L6951l3218o0434J03737J350j08968N0450O6038n4741l5100O5480l0637
$$ -26948 10003 -23215 -83649 20088 21438 -87530 -37080 28958 -25783 -60883 4597 -26040
186b6040P331K8302n3285Q321P5197l5029q3500J02693K0910q0882J6647M9775
$$ -26040 -18709 9593 -43692 -35371 39826 4797 -78703 23990 44900 -35982 -19335 30440
198C0440k7924n162K9904n5019M3637L7832p1614j8142R4598k2057q8745P0416
$$ 30440 2516 -2646 27258 -27761 15876 53708 -17906 -36048 58550 36493 -52252 18164
210A8164J8295m2449L703J5774l1277L6248J4580q5729M7678N8332o5582m5725
$$ 18164 36459 -5990 -2287 13487 -17790 18458 33038 -52691 -5013 53319 -12263 -57988
222e7988Q8123p580o0917L9719k493j0134K3048q021n4122P0063K4041r3318K7532
$$ -57988 30135 22555 -38362 1357 -1136 -11270 11778 3757 -50365 19698 43739 -49579 -22047
235b2047O7871l8269m8795O1617j1221j4649K7548l2027m924N3317j2103p9655
$$ -22047 45824 7555 -41240 20377 9156 -5493 22055 -9972 -14896 38421 26318 -53337
247e3337P1759L5148p3744m5N1981j8047k5727L2981l6958J8282L6136n0362k5986
$$ -53337 18422 53570 -20174 -20219 31762 13715 -12012 20969 -15989 2293 38429 -11933 -37919
260c7919P3093q79q6221N1283L2694l9975p647K5086k1020J3317K4480o6447K6808
$$ -37919 35174 34295 -51926 -643 32051 -7924 -15571 9515 -11505 1812 26292 -40155 -13347
273a3347N5927m5233m9412P2318J0142o4152K9968J1130j3476J0232N111m5069
$$ -13347 42580 -2653 -52065 20253 30395 -33757 -3789 7341 -6135 4097 9208 -35861
285c5861M3544L3542p8387J0530O3266k4075n4551N2713K873k6769K2826j7607
$$ -35861 7683 41225 -37162 -26632 36634 12559 -41992 10721 13594 -13175 9651 -7956
297g956r802L7868K955p0463M9464M4125o4262r673N1555p724l5064L4005k0631
$$ -7956 -17758 20110 23065 -47398 2066 46191 -18071 -27744 23811 16087 -18977 15028 -5603
310e603K415L4379l3255k8460N7098J4778q0091L5691M2097l8120j5918K9608
$$ -5603 -3188 31191 -2064 -30524 26574 41352 -38739 -3048 39049 929 -14989 14619
322A4619j1807m446K9691n0120Q024N1314l0408n2442N6364K3525o5979J9267
$$ 14619 2812 -1634 28057 -22063 -14039 37275 6867 -45575 10789 34314 -31665 -12398
334a2398K1753j6899j306J3395l4736K0998L9201o2362l826N7610j1139n7782
$$ -12398 9355 -7544 -8850 4545 -30191 -9193 30008 -32354 -36180 21430 10291 -47491
346d7491M2733J8534l4395J6836j733j2308K2758J4874n7714K8290N0280n1492
$$ -47491 -4758 13776 -20619 -3783 -5516 -17824 4934 19808 -37906 -9616 40664 -10828
358a0828j9163M8780L676m2815K9278l346r953K6935j7467k8556L7887K5225o9955
$$ -10828 -29991 18789 22465 -20350 8928 5582 -4371 22564 5097 -23459 14428 39653 -30302
371c0302J7616M7230l1427k4648K9024j163j7916K6867l1314m270M1234j4427
$$ -30302 -12686 34544 3117 -21531 7493 6330 -11586 15281 -16033 -20303 20931 6504
383F504m8979L9069L4042n9015P482L0217j2234j0843J8182k0117M761L8841m3364
$$ 6504 -42475 -3406 30636 -28379 -20897 9320 -2914 -13757 4425 -15692 -10931 27910 -15454
396a5454j1444M9006K129n3626K9936L0087l4177P920Q204r265R342J8932m3529
$$ -15454 -26898 22108 24237 -29389 547 30634 -3543 4377 12581 3316 12658 31590 -11939
409a1939J2049M6799l8717k4706L9697J1914m4960J9645P616j6188J6849p587
$$ -11939 110 46909 8192 -16514 23183 35097 -9863 9782 17398 1210 18059 10472
421A0472k4709K2124K8119n7419N027M5666k3458k8886K5764Q494k4481K1809
$$ 10472 -14237 7887 36006 -21413 -16386 29280 5822 -23064 2700 11194 -13287 8522
433H522j5056r751L1807l017m1050K5262L9777m9114j634L4071o800j6327J7933
$$ 8522 -6534 -16285 15522 12505 -28545 -3283 36494 -12620 -14254 19817 13017 -3310 14623
446A4623p393n627L4130k7911j7047L8448R906m8720J6281L5678l2324l075J2931
$$ 14623 7230 1603 35733 7822 -9225 29223 39129 -9591 6690 42368 10044 6969 19900
459A9900p035k659J8085l0795l284M1594k7816l0159K9163J8458m4017Q156J7204
$$ 19900 12865 10206 28291 -2504 -5788 35806 7990 -22169 6994 25452 -18565 -10409 6795
472F795j8758O828L38j9599Q112K9916m2881p083M3056j3525l0201J9807J7883
$$ 6795 -11963 -5135 -4797 -24396 -16284 13632 -29249 -36332 6724 -6801 -37002 -17195 688
485F88k6449J4971r53j2071K1783N382l1854J1571M1271l7500j0187L3242n24
$$ 688 -25761 -10790 -11743 -23814 -2031 3351 -28503 -16932 24339 -13161 -23348 9894 9370
498I370k0905J3508L321j2208K4719j4967j8023K5899J4418m0560L770L7431k6677
$$ 9370 -11535 1973 5294 -6914 17805 2838 -15185 10714 25132 -15428 -11658 25773 -904
511i04j0823J4278o99j0215J3910j7452r994L3407j5602k8092J9781K3656l6375
$$ -904 -11727 2551 1852 -8363 5547 -11905 -21899 11508 -4094 -32186 -12405 11251 -25124
524b5124m36K3099j4330L12N053j0150L30K7302k6917j2161L7330m051k7432J3087
$$ -25124 -25560 -2461 -16791 -16479 -11426 -21576 -21246 6056 -20861 -33022 4308 257 -27175 -14088
538a4088K3754k3123O522P405j0538J2714Q978k2555J932L6935k6559j5292K8186
$$ -14088 9666 -13457 -6935 470 -10068 2646 11624 -10931 -8999 27936 1377 -13915 14271
551A4271L898k1506P093J0503j4812J5857o213j6794J6576J5849l1545m130L5301
$$ 14271 18169 -3337 3756 14259 -553 15304 9091 -7703 8873 24722 -6823 -10953 24348
564B4348j9578j4677J3592M054j2131R716o226j2316K6097p254k4241J3055K5437
$$ 24348 4770 -9907 3685 7739 -4392 5324 -902 -13218 12879 5625 -18616 -5561 19876
577A9876k8835o637K5784j0398m481O348l742m409K2802j6605j5739L0120J423
$$ 19876 -8959 -15596 10188 -210 -4691 1657 -2085 -6494 16308 -297 -16036 14084 15507
590A5507k5688O296K5364k0650q94J1122r474N359Q495j5345n739L1409j7641
$$ 15507 -10181 -3885 21479 829 -65 11057 1583 6942 15437 92 -5647 25762 8121
603H121j9394K2949P357k1518J925J4554j4684Q040M27j4324Q786J5412k2003
$$ 8121 -11273 11676 19033 -2485 -560 13994 -690 7350 7777 -6547 2239 17651 -4352
616d352j0053L2073j2159j7235J1881Q306j3013M770J642j2901J8515j245j9701
$$ -4352 -14405 17668 5509 -11726 155 8461 -4552 218 1860 -11041 7474 6229 -13472
629a3472O599K4037k1445j2054K5165n690r277N477J619q188J5836p352j7225
$$ -13472 -6873 17164 -4281 -16335 8830 3140 -6137 -660 959 -7229 8607 1255 -15970
642a5970K2734M588k1555m9K4844j5686p437J2782n724k68O918p811r113K4823
$$ -15970 6764 11352 -10203 -10252 14592 -1094 -8531 4251 -1473 -1741 5177 -2634 -11747 13076
656A3076r079j9918J7382J0594j7517l462J7601j1941K401M282j0123M114J3977
$$ 13076 3997 -15921 1461 12055 -5462 -8924 8677 -3264 -863 3419 -6704 -2590 11387
669A1387j3680j2781K7052n434j7638Q847J1337j1850K37O957j1552J1956K435
$$ 11387 -2293 -15074 11978 6544 -11094 -2247 9090 -2760 -2523 4434 -7118 4838 7273
682G273j5561J947K0728j3862j4561K1556k014j0653L659N320q749R758j104j5906
$$ 7273 -8288 -6341 14387 525 -14036 7520 5506 -5147 -1488 3832 -4917 4841 3737 -12169
696a2169J5808O894j7565l438K2948j1169j0427J2529k361l017M756k293j0173
$$ -12169 3639 10533 -7032 -10470 12478 1309 -9118 3411 1050 -1967 2789 496 -9677
709i677J8752l274j8647J2653J1305j4302o606J7883q366k617N862o443M39J0684
$$ -9677 9075 5801 -12846 -193 11112 -3190 -9796 8087 -279 -2896 2966 -3477 -3038 7646
723G646p201j4103K1639o51j7493N658J2373r709l729R835r744O168M662j1151
$$ 7646 445 -13658 7981 7330 -10163 -4505 7868 -1841 -5570 4265 -5479 689 5351 -5800
737e800j717J7626p666j6220J8800J420j1078J474Q345p790L973L948j3722J0392
$$ -5800 -7517 10109 2443 -13777 5023 6443 -4635 -3161 5184 -2606 1367 5315 -8407 1985
751A985Q114j2759o353K0043o000j3282J1777P81m780J942K162r675J1836J585
$$ 1985 10099 -2660 -9013 11030 5030 -8252 3525 4306 -474 1468 3630 -6045 5791 7376
765G376j6704P908J1737j0767r452J6459m563o479N711k895j816P138k247j3314
$$ 7376 -9328 -1420 10317 -450 -9902 6557 1994 -4485 1226 -1669 -3485 3653 1406 -11908
779a1908J5807K699j5093K664J2444o874p388J0616n734J538M763o567l272J3156
$$ -11908 3899 6598 -8495 -5831 6613 -261 -7649 2967 -2767 -1229 3534 -3033 -6305 6851
793F851k172j5660J4097M670j0254r42R526n692k64N892j0279N385P722q464p760
$$ 6851 4679 -10981 3116 7786 -2468 -3410 6116 424 160 6052 -4227 1158 8880 416 -7344
808g344J5773j417j3836R220K684m861q26M719q121O394M015j3410M270J0021
$$ -7344 8429 7012 -6824 2396 5080 219 -607 4112 -4009 2385 6400 -7010 -2740 7281
822G281o405j0860J3784q95q169M791j06k638L815J648j1940J0505N541j2856
$$ 7281 876 -9984 3800 2905 -5264 -473 -579 -3217 598 2246 -9694 811 6352 -6504
836f504L15J1222l901q769J0013k974j474M216l669m093R237J267j4811J0233
$$ -6504 -6189 5033 1132 -7637 2376 -598 -2072 2144 -1525 -5618 3619 4886 -9925 308
850C08N957r150k654R219l239l954O911p593J947O413n201q110J1725K203j3971
$$ 308 6265 -2885 -5539 3680 441 -3513 3398 -4195 -2248 4165 -1036 -9146 2579 4782 -9189
865i189O480M933m676k447N573n267K223N586j0299J812Q886l044j0937J1150
$$ -9189 -2709 2224 -2452 -4899 674 -4593 -2370 3216 -7083 -5271 3615 571 -10366 784
879G84K342q880L944K127k165R86L681r092O417O359r927j259R596p66j0048Q779
$$ 784 3126 -5754 -1810 317 -1848 -862 2819 -6273 144 6503 -3424 -4683 4913 4147 -5901 2878
895B878m33l119L132j211l968N395L670j2538O286O903p138m296P882n41n892
$$ 2878 2445 -674 2458 1247 -2721 2674 6344 -6194 92 6995 -143 -4439 3443 2902 -2990
910b990N999m314j68M865k221p272P851M332j1856M342N263l285l907N693k535
$$ -2990 3009 -1305 -1473 3392 1171 -6101 1750 6082 -5774 -1432 3831 546 -3361 2332 -203
925b03o33N237o789K52O841o20r764Q111M243q414K134L064j577r89M294o766
$$ -203 -836 4401 -2388 -2136 4705 4085 -5679 2432 6675 -1739 395 3459 1882 893 5187 -1579
941a579K880O311p527k273P374R69r783O112J851m078J859J79l051K604M062j0168
$$ -1579 1301 7612 85 -2188 5186 6155 -3628 2484 4335 257 2116 2295 -756 1848 5910 -4258
957d258L259O846n522m541O394J063o697N001j819j290L403n68o140N164N436
$$ -4258 -999 5847 325 -4216 2178 3241 -3456 1545 -274 -1564 1839 1271 -4869 295 5731
972E731j0350K277N689k227m222M707p90k368N112m419j189M902J189q984N349
$$ 5731 -4619 -2342 3347 1120 -3102 1605 815 -1553 3559 -860 -2049 2853 4042 -4942 407
987D07N428p712J052L046p18k826M081l815k4N862n657k651N405K646r409M527
$$ 407 5835 -1877 -825 2221 1503 -1323 2758 -1057 -1081 4781 -876 -3527 1878 4524 -4885 -358
1003c58L360m872P70J389k041j12M829p583J293O358l998m637M923L055o949L627
$$ -358 3002 -1870 -1100 289 -1752 -1864 2965 -4618 -3325 3033 -965 -5602 -679 2376 -4573 -946
1019i46L06k042K255N12m485K680N825p837J98N641q85m686L432J351l350L939
$$ -946 -640 -2682 -427 85 -4400 -1720 4105 -3732 -3534 2107 1222 -3464 -32 1319 -2031 1908
1035A908k338j471L188K125o866K590O179o597k36L376O3l241L290j799j399M818
$$ 1908 -430 -1901 1287 3412 -3454 -864 5315 -1282 -1518 1858 1921 -1320 1970 171 -1228 3590
1051C590l291l018L976L078p668K481M172m137j17J703r52j119M063n022l41N165
$$ 3590 299 -2719 1257 4335 -3333 -852 3320 -817 -934 769 -183 -1302 2761 -2261 -2602 2563
1067B563k191m436L389L825o684K260J552j489O19J041k752N51N538o718l16M759
$$ 2563 372 -4064 -675 3150 -3534 -1274 278 -1211 -592 449 -2303 -1752 3786 -2932 -3248 1511
1083A511k88m586K645K743m002K814q11j839K020K297n429J165N999n523q11L007
$$ 1511 1223 -3363 -718 2025 -1977 837 26 -1813 207 2504 -2925 -1760 4239 -1284 -2095 912
1099I12J008l736K660l69j907L883k039k509K394L696o700J266M474l430q34J809
$$ 912 1920 -1816 844 475 -1432 2451 412 -2097 297 3993 -2707 -1441 3033 -397 -1231 578
1115E78J62k493L975l288j294M501j262l777J908M491n987R75K650j776q3J393
$$ 578 740 -1753 2222 -1066 -2360 2141 879 -2898 -990 3501 -2486 -1511 1139 -637 -720 673
1131F73j724j014N257m472j490M258N27m627J686L539m224K001q5j033Q40K334
$$ 673 -1051 -2065 3192 -1280 -2770 1488 2015 -2612 -926 2613 -1611 390 305 -728 112 2446
1147B446l607l61N558m152j442K559J634l890J691R86k350K821j020j770P37L659
$$ 2446 -1161 -1522 4036 -116 -1558 1001 2635 -1255 436 1422 -928 1893 873 -897 -160 3499
1163C499m776l72M453k624j367J379J339k885K668j577j825L579n38l418J036
$$ 3499 -1277 -1649 2804 180 -1187 192 1531 -1354 1314 -263 -2088 1491 953 -2465 -1429
1178a429M318m575L3K659q95r45J093k30j858M207k928j448L099P77l319O10L925
$$ -1429 2889 -1686 -1653 1006 111 -834 259 29 -1829 2378 -550 -1998 1101 1878 -1441 -831 3094
1195C094l896J007L68l83j44K165k266j337M836k935j672J924J851l348N65K042
$$ 3094 -802 205 573 190 46 2211 -55 -1392 3444 509 -1163 761 2612 -736 -171 1871
1211A871k732J815n18j517K36L015l257j348M108k038j685J101J714k759J885
$$ 1871 -861 954 436 -1081 -845 2170 -1087 -2435 1673 -365 -2050 -949 765 -1994 -109
1226a09j85k250K711j42k136p3M238l669q28K717m60j055O86O06k270L783j650
$$ -109 -294 -2544 167 25 -2111 -2184 2054 -1615 -2443 274 -186 -1241 -555 51 -2219 1564 -86
1243h6j960K781Q49k536m47M268k952M0J123l36p53J662r94k023M257j998j885
$$ -86 -2046 735 1584 -952 -1399 2869 -83 -43 1080 744 -9 1653 659 -1364 2893 895 -990
1260i90J497J979k871J5K203k157J009j0j067k93K955k267k086L961j190j953
$$ -990 507 2486 -385 -370 1833 -324 685 675 -392 -685 2270 3 -2083 1878 688 -1265
1276a265O59K054k645Q87R60k196J970M01j497j145M206k504j476K791m28r07
$$ -1265 -606 1448 -1197 -310 650 -1546 424 825 -672 -1817 2389 -115 -1591 1200 772 -135
1292a35K81J330k022K228o86j794J997P77k005r69L618k155o38J493m78p47R10
$$ -135 146 1476 -546 1682 996 -798 1199 1976 -29 -998 2620 465 -173 1320 842 95 1005
1309A005r0k036L044j115j802J052J544j732j216K768k146N43J16m86p18K035
$$ 1005 915 -1121 1923 808 -994 58 1602 -130 -1346 1422 -724 -181 -65 -551 -1269 766
1325G66r58k331L277l23j880J76K240j921O1J340j789J210K28o79j059K899j449
$$ 766 -192 -2523 754 431 -1449 -1273 967 -954 -893 447 -1342 -132 96 -583 -1642 1257 -192
1342a92j624K613n1j220q9J598k001J503K4j813J304R72j165j383L433j860j002
$$ -192 -1816 797 746 -474 -563 1035 -966 537 561 -1252 52 1024 -141 -1524 1909 49 -953
1359i53Q99Q0p96L83P20k410K422l18j536M50J572j398j292K715j676M6O77l01
$$ -953 -54 26 -770 -387 333 -2077 345 27 -1509 -1059 513 -885 -2177 538 -1138 -1092 -415 -716
1377g16q28J381N5k258K662k85j268q7K098j514n21J802j406O91M81k23j428K618
$$ -716 -1544 -163 -108 -2366 296 11 -1257 -1344 754 -760 -1281 521 -885 -194 287 64 -1364 1254
1395A254o97j853J873j08p33l67J781j629M42R77j715P31R48o95j916L442j360
$$ 1254 557 -1296 577 469 -264 -631 1150 -479 -37 940 -775 -44 904 209 -1707 1735 375
1412C75j419J328K26p22k2J153j902J840r4j307L19J217m04k160K695j147k62
$$ 375 -1044 284 510 -212 -234 919 -983 857 763 -544 -225 992 588 -1572 1123 -24 -286
1429b86L30K36q20Q49O19k549K318l11r90m33K061q73j076J772j219K6O02m3j280
$$ -286 44 280 -540 309 928 -1621 697 386 -604 -1037 1024 151 -925 847 -372 -346 256 213 -1067
1448a067J638k08j852J701K47n74r41J836j196KR60j441P03N83L4k090K385l9
$$ -1067 571 363 -1489 212 459 -115 -1056 780 -416 -414 546 -895 -192 391 425 -1665 720 681
1466F81j860J212L29n67j86J300j677J073M35j161K04J249l54j964K494o23p57
$$ 681 -1179 33 362 -205 -391 909 -768 305 740 -421 -217 1032 678 -1286 1208 585 -172
1483a72L37N12o04R2J057j815J161K94q70n22J584m99j214J561m82k44L2L49j074
$$ -172 165 677 73 165 1222 -593 568 862 -8 -530 1054 555 -659 902 420 176 208 557 -517
1502e17R89O34k112J546M49p31q93K008j065m27J040r92K18O21L63j937K261m54
$$ -517 472 1106 -1006 540 989 258 -635 1373 308 -119 921 -71 147 768 1131 -806 1455 1001
1520A001j441J087K75l34q59J483j144M45M76q51k25Q14K1j755J950l35r15N68
$$ 1001 -440 647 922 588 -271 1212 68 513 989 138 -87 727 748 -1007 943 608 -307 261
1538B61K11n10l69J118j542P95N73n52r94J233K06j572J553n65l9q0N10q31L26
$$ 261 472 -38 -407 711 -831 -36 537 -15 -1009 224 430 -1142 411 -154 -193 -273 237 -594 -268
1557b68Q45j631J156N66o60q63J768q82n68R78n69p6J89O88j749J196N92j645
$$ -268 577 -1054 102 668 8 -855 913 31 -537 441 -128 -204 -15 673 -1076 120 712 -933
1575i33P62L91k01p84J157r78j18Q40p55l04M07Q21k012J542j82p59L71L04j14
$$ -933 -171 220 19 -765 392 -586 -704 136 -619 -923 -516 305 -1707 -165 -347 -1106 -735 -431 -545
1594e45n54J265j631P55N09m47o90J062N32j781J341l52j0o4O02m90K39O56j337
$$ -545 -1099 166 -1465 -710 -201 -648 -1338 -276 256 -1525 -184 -536 -546 -610 -8 -498 -259 397 -940
1613i40Q09J42k2r08J295k41q20J402q12J3k62R58j512J056L81j172M65M29L64
$$ -940 -131 11 -11 -919 376 135 -685 717 -95 -82 -344 614 -898 158 539 -633 -168 261 625
1632F25j323J327p77r2N19l57J50j51J016j683J266K35n07m6L59o8r24J464j090
$$ 625 -698 629 -148 -240 279 -78 72 -79 937 -746 520 755 248 202 561 493 -431 1033 -57
1651e7J25N76k69l41L28P07j744J377j52n88l0N37k81m76J090j184L09M02J45
$$ -57 68 644 375 34 362 1069 -675 702 550 -38 -68 469 188 -288 802 -382 -73 329 474
1670D74j042P12J38r85Q18j81J38m89R20j162L42O47r72L91L27M54j365J213j81
$$ 474 -568 144 282 -703 115 -66 72 -417 503 -659 -317 330 -642 -251 76 530 -835 378 197
1689A97p03O99m42J77r7R95j603Q16O79r31O6K14N11j024R73o06k45M52j25k03
$$ 197 -506 193 -249 -72 -169 826 -777 39 718 -213 -147 67 578 -446 527 -79 -324 128 3 -200
1709b00O9O64j154M99J28l83j90K31j8p34J304r22O6L11N1p11L03J036j086N37
$$ -200 -131 533 -621 -122 6 -377 -567 -336 -354 -1088 216 -706 -640 -329 -278 -989 -686 350 -736 -199
1729a99q7L14o59P22m04j34Q87r29N49K7P26j268Q32K36q84Q54o28L79j09P52
$$ -199 -286 28 -631 91 -313 -447 440 -489 60 87 813 -455 377 613 -271 583 -45 334 225 977
1749I77r98K04M86p98R7K31K91r12J006m47j80J32j82K14l31R10j514N61M58n53
$$ 977 -21 183 669 -129 -32 199 490 -422 584 137 -43 89 -93 121 -210 700 -814 -253 205 -348
1769c48m6O47k06o25J052n07J92j18J39m94M36R81j373P65M5r7l66P86j43p34
$$ -348 -394 253 47 -578 474 -33 159 41 180 -314 122 1103 -270 495 540 443 77 863 720 -14
1789a4J359q78o2N4R01j034M62ko01Q21n30O5l94O57o25k21N09n51m7L9M08j177
$$ -14 1345 467 405 459 1360 326 788 786 185 1006 476 541 147 804 179 -42 467 -84 -131 -92 316 -861
1811h61R24l83k51K51J13l72k38J067j227N73K00p3j39J23N82r68O77k89K47M6
$$ -861 63 -320 -571 -320 -207 -579 -817 250 -977 -404 -204 -277 -416 -293 289 -679 -2 -291 -44 2
1831BO1j08l75J340j297R17k77j09n7L25n5l60R09o84j50M2N68q08J1P15p78L78
$$ 2 63 -45 -420 920 -377 540 263 154 97 422 367 7 916 232 82 124 692 -116 -105 610 -168 210
1853B10k17J98o39P01m09l80P78p28M52m34Q22q31K16O9l60O60l78M92n04Q74
$$ 210 -7 191 -448 253 -156 -536 242 -486 -34 -468 354 -477 -261 -192 -552 108 -270 222 -282 592
1873E92j108O63J4k56K57l06N92j113R50q4k02qL83j42m86J014j006K88j4Pj97
$$ 592 -516 147 161 -95 162 -144 448 -665 285 201 -1 -9 374 232 -254 760 -246 42 28 35 -162
1894a62M0M40o98O89o34J24k46O28k86m74R10q89M97j70J46l90L81J14n21O78
$$ -162 -122 318 -380 309 -325 -201 -447 181 -105 -579 331 -558 -61 -231 -85 -475 -94 20 -501 177
1914A77m11K07j79O44o24j07N91p26L31j29N87o42O09o25j33L48k24M18o61R50
$$ 177 -234 -27 -206 438 -186 -293 298 -428 -97 -226 361 -281 328 -297 -430 -82 -306 112 -549 401
1934D01r90M85j42J1o1j12L34q49J271r34K86J28p0q6j20O97r44O08k37L41k42
$$ 401 -589 -104 -246 -235 -296 -408 -74 -923 348 -586 -300 -172 -242 -328 -448 249 -695 -87 -324 17 -225
1955b25J29n8l83J048r17N78r3L93o25N35m5o50Q15q03O60n03K63n0j01N28p28
$$ -225 -96 -154 -537 511 -406 172 79 472 -153 382 337 -313 502 -301 359 -144 119 69 -32 496 -232
1976b32L63k97L52o77O92n23r7M46n15N13p99Q63n75M06R8m42k0K30K86n92J103
$$ -232 131 -166 186 -491 201 -322 -419 27 -488 25 -774 89 -486 -80 18 -424 -444 -214 72 -520 583
1997E83o54J09N0q3N4J4J006j163P45k93L09k25K74J09m58Q12p55M03l74N30n86
$$ 583 -71 38 88 5 59 73 1079 -84 661 368 677 452 726 835 377 1189 434 837 463 993 407
2018D07L23k7m21M37m96K04m18P52q48PM05o44K49l61M58n88N22m1l09J09l79
$$ 407 730 703 282 719 223 427 9 761 -87 -80 325 -319 -70 -431 27 -561 -39 -80 -389 -280 -659
2039f59O47q29J094q40M89K04n11L53j86N81q26Q55o38l9N88j55R2k62N51p04
$$ -659 -12 -841 253 -587 -98 106 -405 -52 -238 343 -483 372 -266 -305 283 128 220 -42 509 -195
2059a95P37l33J6k63J28K01n76Q14q53N09o43N16q9m80N53o24P57n42J77m95L05
$$ -195 542 209 225 -38 90 291 -285 529 -324 185 -458 58 -31 -511 42 -582 175 -367 -190 -685 -380
2080c80O0m84R02o69L84m40N48n31M33j45p9L87k90M18m85P94n53L16J2j67K10
$$ -380 -320 -804 98 -571 -187 -627 -79 -610 -177 -322 -401 -14 -304 114 -371 423 -130 186 198 31 241
2101B41k94O82q45M51n7p9K7l07M85p16N72k85N07n56J4K5l4L36o20M22l37M62
$$ 241 -53 629 -216 235 178 99 126 -181 304 -412 160 -125 382 -174 -160 -135 -169 167 -453 -31 -368 94
2123I4l64O3J12m82N85p61Q13l53K06k7J92j5j66K10n40O82k36M19k28J8K50k84
$$ 94 -270 -207 -95 -577 8 -753 60 -293 -87 -114 78 63 -103 107 -433 249 13 432 204 222 472 188
2145A88L98l20M89o15N27l94j47K27j39K39m23L46n26N13j45K9j43j51L98n21
$$ 188 586 266 755 140 667 273 126 353 214 453 30 376 -150 363 218 247 104 -47 351 -170
2165a70P10p64L27J62l64lj04L75o57O90n91L44k1J58J30k39J63l59j2J13L67
$$ -170 540 -224 103 265 -99 -102 -206 169 -488 202 -389 -45 -66 92 222 -17 146 -213 -225 -112 255
2186B55l42J21p5k68M66m18N39m02M35k79p9K17m98N98m48K09m20M34l71K7N45
$$ 255 -87 34 -41 -309 157 -261 278 -124 311 32 -47 170 -328 270 -178 31 -389 45 -326 -299 246
2207B46q02N47l87N57o45J27K77l59N81o91R45n88K45l91J82M6J31Mk26N40q43
$$ 246 -556 -9 -396 161 -484 -357 -80 -439 142 -549 396 -192 53 -338 -156 -110 21 25 -201 339 -504
2228e04N48j11J27K96l86J55m17N79n97O15m14J93j94k04P39o93M65r62O79j91
$$ -504 44 -67 60 356 -30 125 -292 287 -310 305 -109 84 -110 -314 425 -268 197 -765 -86 -277
2248b77J88j70o8L57n64N63m67M64q3m0p6L7L90m06N43n72N53l44K10l1j44M34
$$ -277 -89 -259 -327 30 -534 29 -438 26 -57 -97 -173 -136 254 -152 391 -181 372 28 238 207 63 497
2270D97l43K34n04O81l03k2R1l29M02l93K41k27K70k61J96kl28M52p79N36m80
$$ 497 154 388 -116 565 262 240 331 2 404 11 252 25 295 34 230 228 -100 352 -427 109 -371
2291c71J67j36L22m1l46M08n44O04n66L35o0J46J58l10M23o26N61m72N02k20K42
$$ -371 -204 -340 -18 -59 -405 3 -541 63 -503 -168 -228 -82 76 -234 189 -437 124 -348 154 -66 176
2312A76L5k70O60m98O0k2L39j68m7J71j05K19m95M07k24m2J59l86K91j55P9m82
$$ 176 211 -59 601 103 163 141 480 312 265 436 331 550 55 462 238 196 355 -31 260 105 184 -298
2334b98J74m04M28K61l77N0l49L63l00L71j97K10k99J05K78m97M77l65M66l58
$$ -298 -124 -528 -100 161 -216 -166 -515 -152 -452 -81 -278 -68 -367 -262 16 -481 -4 -369 97 -261
2354b61P7M7R4k13r7M81k42J48j86M46m6k96M42n14N18o87N33j94K03j41r3K76
$$ -261 -184 -137 -43 -256 -353 128 -114 34 -152 294 248 -48 394 -120 398 -289 244 50 253 112 19 295
2376B95o25L96l77M63j85j8P1j66K02l91M34m31M51j08k22L25l41K32l08M82m83
$$ 295 -330 66 -311 152 -33 -51 20 -146 56 -335 99 -332 119 11 -211 114 -227 5 -303 179 -304
2397c04M75L4m93L29j13L9LK77l81L70j87j92L62j24M93q13M68l08M7k14j6K46
$$ -304 171 205 -288 41 -72 -33 -30 247 -134 236 49 -143 219 95 588 -225 243 -65 -18 -232 -248 -2
2419bl30L50m00L41j50o4k09K02P7r2O7l6J07l35K66r5K61J66m07K98k65M90l01
$$ -2 -332 18 -382 -41 -191 -255 -464 -262 -185 -277 -210 -246 -139 -474 -208 -303 -42 124 -283 15 -250 240 -61
2442f1L19j89k25L58k12K58l55O38m71L45Pk18K44l06M66o61N57n44K04R9N5k64
$$ -61 258 69 -156 202 -10 248 -107 531 60 405 412 194 438 132 598 -63 494 -50 154 253 308 44
2464D4j41M57l95L50m86J74M2N5j49j75L52l48K80j72j09M70j83K10n30J77j52
$$ 44 -97 360 -35 315 -171 3 45 100 -49 -224 128 -220 60 -112 -221 249 66 276 -254 -77 -229
2485b29K62m48N18k7K6J58m52K56jQ6j62L56j67L8o1j04L33n33L16k34K04L42
$$ -229 33 -415 103 76 102 260 -192 64 63 149 -13 343 176 214 153 49 382 -151 165 -69 135 477
2507D77m83L46l16Q3j01J65j91J37R3k16N1l64M66n14L31L8m0j88K19N14o70K30
$$ 477 -6 340 24 107 6 171 -20 117 210 -6 45 -319 147 -367 -36 2 -38 -226 -7 507 -163 67
2529F7p5J78m91N90q4l60M95m64K57k9J37l49J88q5r8J47l66K27N5K07k99o3K61
$$ 67 -8 170 -321 269 185 -175 320 -144 113 84 221 -128 60 -25 -123 24 -342 -115 -60 147 -152 -215 46
2552D6l39L44p9J1k44R2kJ19L55n42M52m23K18j45J80J4m50M05k74J90j44L89
$$ 46 -293 51 -28 -17 -261 -169 -171 -52 303 -239 213 -210 8 -137 43 57 -393 12 -262 -72 -216 173
2574A73l65M42j54j15K60l26L05q10P94l84K79n15N00l23L19n1l32K82r7k6lP4
$$ 173 -192 250 96 -19 241 -85 220 -590 204 -180 99 -416 84 -239 80 29 -303 -21 -118 -144 -147 -73
2596g3rk21L14r2o3K9J22p4j44M8j02M73m79L27M7k7l29L6N16j83J15k26K29j93
$$ -73 -82 -303 11 -81 -144 -115 7 -67 -211 -163 -265 208 -271 56 103 76 -253 -217 299 116 231 5 234 41
2620D1k3K39j46kj49M42j92J73l58J72r0m41L66k41N84o45M24l18Q0O8O3L6l45
$$ 41 18 257 111 109 -40 402 210 383 25 197 107 -334 32 -209 375 -270 154 -164 -84 -16 47 83 -262
2643b62O49p06J24P5K18l01N6K73j64J47l55L10Q4L1k35j84N05l10K74l95J73
$$ -262 387 -319 -195 -120 98 -203 -147 126 -38 109 -246 64 148 179 -56 -240 265 -45 229 -166 7
2664GL6P6Jr9j99N2K25j94L02o5j97L26o61K71l25O02k41Q3q6J9K23m35J29o3
$$ 7 43 119 120 21 -178 -126 99 -95 207 142 -55 271 -390 -119 -444 158 -83 0 -86 -67 156 -279 -150 -213
2688b13M67k71J4qj56J87Nm0J13K30n41K97J4J82k29N6K71m69K59j86P8O8m5J31
$$ -213 254 -17 -3 -11 -167 20 25 -15 98 328 -213 84 98 280 51 107 378 -91 168 -18 60 128 83 214
2712B14m54L62l42K43J09L7k67l2Lp7K26m94N85m15L41j59k15J89k31J42j54K33
$$ 214 -240 122 -220 23 132 169 -98 -130 -127 -204 22 -472 113 -302 39 -120 -335 -146 -377 -235 -389 -156
2734a56k55M18o0M0N2m9j7k15M20j49P2J53J9j78P4J82k81L20q3j33K36l45J00
$$ -156 -411 7 -53 -13 39 -10 -27 -242 178 29 101 254 273 95 169 351 70 390 307 174 410 65 165
2757A65q7K77j79k6k1m1j03J26J49m04J57p0J05K62m12o6j96L50k19K11n7j59
$$ 165 78 355 176 150 129 88 -15 111 260 -144 13 -57 48 310 -102 -168 -364 -14 -233 -22 -79 -238
2779b38K06l29M66n85M70J0L3Q2L3k38Q2pKJ84p3J34j25K14m61p9J74K33P9j64
$$ -238 -32 -361 105 -480 -10 0 33 115 148 -90 -8 -15 -13 171 98 232 107 321 -140 -219 -45 188 267 103
2803A03K07k71N6n6R0k37Q6L8r3L67k77R6n9j01p7L22k0l45K58j31j84L88j01
$$ 103 310 39 95 39 129 -108 -22 16 -77 290 13 109 50 -51 -128 194 174 -171 87 -44 -228 160 59
2826E9K8j59J63k75L97j10Q9k00M8K49m71M88M2j09j03ok04J58l5n1K08k42J16
$$ 59 87 -72 91 -184 213 103 192 -8 40 289 -182 306 348 239 136 130 -74 84 49 -2 206 -36 80
2849H0j46J08j0K9Rj02m2k7M42l79Lm6k69M91m9k31k2K7l4O8O1j02R0N7J22j98
$$ 80 -66 42 32 61 70 -32 -74 -101 341 -38 -35 -81 -350 141 92 -139 -161 -134 -168 -100 -39 -141 -51 6 128 -70
2875g0j2K29j48o5J13rj55P2K51j99j00R0J14j88J74l05N75l76M3k85K77J25k80
$$ -70 -82 147 -1 -66 47 38 -117 -45 206 7 -93 -3 111 -77 97 -208 367 -9 34 -251 26 151 -129
2898a29L01l38J47k87L82j19J9O8l08O54n16L0K5N4n1p1J51l07M07j55j58K12
$$ -129 172 -166 -19 -306 76 -43 -24 44 -264 390 -126 -96 -71 -17 -68 -139 12 -295 112 -43 -201 11
2920A1J44j55l52L04j08J41k80M47j64RK17k48P0Q6K7l99K61q5o7L96n48J47m4
$$ 11 155 0 -352 -48 -156 -15 -295 152 -12 -3 214 -34 36 122 149 -250 11 -74 -141 255 -293 -146 -190
2943a90N51n84M81m2j62j37J07J48l13K86j18M2o0K96l16j20M91n22J53l1J68
$$ -190 361 -223 258 216 54 -83 24 172 -141 145 27 69 9 305 -11 -131 360 -162 -9 -40 128
2964A28l04K87J62m78M03l87L3J13J17j53O8L04n30L16k54K11J06q4o4PR4N3j75
$$ 128 -176 111 273 -205 198 -189 -156 -43 74 -79 -11 293 -237 79 -175 36 142 58 -6 1 95 148 -27
2987b7J4M26o89M41k29K0O9Q2k8k22O09n76L23r4M2N9l47L75l38K57o8J01N4k05
$$ -27 -13 413 -276 165 -64 -44 25 107 79 -143 466 -110 213 119 161 220 -127 248 -90 167 99 200 254 49
3011D9L4j40M50o21K04l4K02m14K12o8o4J09Q8r6j01J86k84K48K14j24j32l4J73
$$ 49 83 -57 393 -228 -24 -58 144 -270 -58 -126 -190 -81 7 -89 -190 -4 -288 -40 174 50 -82 -116 57
3034E7l66M15j13j56K36n9J06J7J23n16J97K67k41Nk5Qk24J48K17k28L75k43j40
$$ 57 -309 106 -7 -163 73 14 120 137 260 -256 -59 208 -33 -28 -53 -45 -269 -121 96 -132 243 0 -140
$$ [...]
8191B06
##END NTUPLES=NMR FID
##END=
