##TITLE=1H_CA-8755-1
 CDCl3, 8 sc, 
 1.9.2020
##JCAMPDX= 6.0         $$ Bruker NMR JCAMP-DX V2.0
##DATA TYPE= NMR FID
##DATA CLASS= NTUPLES
##ORIGIN= UXNMR, Bruker Analytische Messtechnik GmbH
##OWNER= root
$$ XWIN-NMR		Version 3.5
$$ Tue Sep  1 11:07:32 2020 Russian Standard Time (UT+4h)  she@DPX200
##.OBSERVE FREQUENCY= 200.1315066352
##.OBSERVE NUCLEUS= ^1H
##.DELAY= (6, 6)
##.ACQUISITION MODE= SIMULTANEOUS
##.ACQUISITION SCHEME= undefined
##.AVERAGES= 8
##.DIGITISER RES= 18
##SPECTROMETER/DATA SYSTEM= spect
##.PULSE SEQUENCE= zg30
##.SOLVENT NAME= CDCl3
##.SHIFT REFERENCE= (INTERNAL, CDCl3, 0, 15.7039)
##AUDIT TRAIL= $$ (NUMBER, WHEN, WHO, WHERE, WHAT)
$$ ##TITLE= Audit trail, XWIN-NMR		Version 3.5
$$ ##JCAMPDX= 5.01
$$ ##ORIGIN= Bruker BioSpin GmbH
$$ ##OWNER= she
$$ F:/spectra/data/she/nmr/H-F/1/audita.txt
$$ ##AUDIT TRAIL=  $$ (NUMBER, WHEN, WHO, WHERE, WHAT)
(   1,<2020-09-01 11:06:17.03 +0400>,<she>,<DPX200>,
      <created by zg, POWCHK disabled, PULCHK disabled
       configuration hash MD5:
       00 E9 B6 7A A2 85 ED C7 34 08 36 98 17 FE 4E 26
       data hash MD5: 16K
       BC 7F 5A EB BA D4 0C E6 9D 1E 4E 06 DF 98 10 C3>)
$$ ##END=
$$ 
$$ hash MD5
$$ 7B 19 B4 8E 32 C4 83 4D 6F FE 0A F4 19 38 71 C4
##$RELAX= 
##$RELAX= 
##$RELAX= 
##$RELAX= 
##$RELAX= 
##$RELAX= 
$$ Bruker specific parameters
$$ --------------------------
##$DU= <F:/spectra>
##$EXPNO= 1
##$NAME= <H-F>
##$PROCNO= 1
##$TYPE= <nmr>
##$USER= <she>
##$AMP= (0..31)
100 100 100 100 100 100 100 100 100 100 100 100 100 100 100 100 100 100 
100 100 100 100 100 100 100 100 100 100 100 100 100 100 
##$AQSEQ= 0
##$AQ_mod= 1
##$AUNM= <au_zg>
##$AUTOPOS= <>
##$BF1= 200.13
##$BF2= 200.13
##$BF3= 200.13
##$BF4= 200.13
##$BF5= 200.13
##$BF6= 200.13
##$BF7= 200.13
##$BF8= 200.13
##$BYTORDA= 1
##$CFDGTYP= 0
##$CFRGTYP= 5
##$CHEMSTR= <none>
##$CNST= (0..31)
1 1 145 1 1 1 1 1 1 1 1 1 1 1 1 1 1 1 1 1 1 1 1 1 1 1 1 1 1 1 1 1 
##$CPDPRG= <>
##$CPDPRG1= <>
##$CPDPRG2= <>
##$CPDPRG3= <>
##$CPDPRG4= <mlev>
##$CPDPRG5= <mlev>
##$CPDPRG6= <mlev>
##$CPDPRG7= <mlev>
##$CPDPRG8= <mlev>
##$CPDPRGB= <>
##$CPDPRGT= <>
##$D= (0..31)
0 1.2 0 0 0 0 0 0 0 0.06 0 0.03 0 0 0 0 0.0002 0 0 0 0 0 0 0 0 0 0 0 0 
0 0 0 
##$DATE= 1598943976
##$DBL= (0..7)
120 120 120 120 120 120 120 120 
##$DBP= (0..7)
150 150 150 150 150 150 150 150 
##$DBP07= 0
##$DBPNAM0= <>
##$DBPNAM1= <>
##$DBPNAM2= <>
##$DBPNAM3= <>
##$DBPNAM4= <>
##$DBPNAM5= <>
##$DBPNAM6= <>
##$DBPNAM7= <>
##$DBPOAL= (0..7)
0.5 0.5 0.5 0.5 0.5 0.5 0.5 0.5 
##$DBPOFFS= (0..7)
0 0 0 0 0 0 0 0 
##$DE= 6
##$DECBNUC= <off>
##$DECIM= 32
##$DECNUC= <off>
##$DECSTAT= 4
##$DIGMOD= 1
##$DIGTYP= 9
##$DL= (0..7)
0 120 120 120 120 120 120 120 
##$DP= (0..7)
150 150 150 150 150 150 150 150 
##$DP07= 0
##$DPNAME0= <>
##$DPNAME1= <>
##$DPNAME2= <>
##$DPNAME3= <>
##$DPNAME4= <>
##$DPNAME5= <>
##$DPNAME6= <>
##$DPNAME7= <>
##$DPOAL= (0..7)
0.5 0.5 0.5 0.5 0.5 0.5 0.5 0.5 
##$DPOFFS= (0..7)
0 0 0 0 0 0 0 0 
##$DQDMODE= 0
##$DR= 18
##$DS= 0
##$DSLIST= <SSSSSSSSSSSSSSS>
$$ [...]
##$SUBNAM2= <"">
##$SUBNAM3= <"">
##$SUBNAM4= <"">
##$SUBNAM5= <"">
##$SUBNAM6= <"">
##$SUBNAM7= <"">
##$SUBNAM8= <"">
##$SUBNAM9= <"">
##$SW= 16.880792210976
##$SWIBOX= (0..15)
0 0 2 0 0 0 0 0 0 0 0 0 0 0 0 0 
##$SW_h= 3378.37837837838
##$TD= 16384
##$TD0= 1
##$TE= 0
##$TE2= 300
##$TE3= 300
##$TEG= 300
##$TL= (0..7)
0 120 120 120 120 120 120 120 
##$TP= (0..7)
150 150 150 150 150 150 150 150 
##$TP07= 0
##$TPNAME0= <>
##$TPNAME1= <>
##$TPNAME2= <>
##$TPNAME3= <>
##$TPNAME4= <>
##$TPNAME5= <>
##$TPNAME6= <>
##$TPNAME7= <>
##$TPOAL= (0..7)
0.5 0.5 0.5 0.5 0.5 0.5 0.5 0.5 
##$TPOFFS= (0..7)
0 0 0 0 0 0 0 0 
##$TUNHIN= 0
##$TUNHOUT= 0
##$TUNXOUT= 0
##$USERA1= <user>
##$USERA2= <user>
##$USERA3= <user>
##$USERA4= <user>
##$USERA5= <user>
##$V9= 5
##$VALIST= <valist>
##$VCLIST= <CCCCCCCCCCCCCCC>
##$VD= 0
##$VDLIST= <DDDDDDDDDDDDDDD>
##$VPLIST= <PPPPPPPPPPPPPPP>
##$VTLIST= <TTTTTTTTTTTTTTT>
##$WBST= 1024
##$WBSW= 4
##$XGAIN= (0..3)
0 0 0 0 
##$XL= 0
##$YL= 0
##$YMAX_a= 540311
##$YMIN_a= -541523
##$ZGOPTNS= <>
##$ZL1= 120
##$ZL2= 120
##$ZL3= 120
##$ZL4= 120
##$ABSF1= 10
##$ABSF2= 0
##$ABSG= 5
##$ABSL= 3
##$ALPHA= 0
##$AQORDER= 0
##$ASSFAC= 0
##$ASSFACI= 0
##$ASSFACX= 0
##$ASSWID= 0
##$AUNMP= <proc_1d>
##$AZFE= 0.1
##$AZFW= 0.1
##$BCFW= 1
##$BC_mod= 2
##$BYTORDP= 1
##$COROFFS= 0
##$CY= 11.3945322036743
##$DATMOD= 1
##$DC= 2
##$DFILT= <>
##$DTYPP= 0
##$F1P= 16.9975609425685
##$F2P= -3.02152046262296
##$FCOR= 0.5
##$FTSIZE= 0
##$FT_mod= 4
##$GAMMA= 1
##$GB= 0.15
##$INTBC= 1
##$INTSCL= 1
##$ISEN= 128
##$LB= 0.24
##$LEV0= 0
##$LPBIN= 0
##$MAXI= 10000
##$MC2= 0
##$MEAN= 0
##$ME_mod= 0
##$MI= 1.114404
##$NCOEF= 0
##$NC_proc= 0
##$NLEV= 6
##$NOISF1= 3.799351
##$NOISF2= 2.8
##$NSP= 1
##$NTH_PI= 0
##$NZP= 0
##$OFFSET= 15.70392
##$PC= 1
##$PHC0= -9970.493
##$PHC1= 9.40092
##$PH_mod= 1
##$PKNL= yes
##$PPARMOD= 0
##$PSCAL= 0
##$PSIGN= 0
##$REVERSE= no
##$SF= 200.130013532006
##$SI= 16384
##$SIGF1= 3
##$SIGF2= 2
##$SINO= 400
##$SIOLD= 16384
##$SREGLST= <1H.CDCl3>
##$SSB= 0
##$STSI= 0
##$STSR= 0
##$SW_p= 3612.71676300578
##$SYMM= 0
##$S_DEV= 0
##$TDeff= 0
##$TDoff= 0
##$TI= <>
##$TILT= no
##$TM1= 0
##$TM2= 0
##$TOPLEV= 0
##$USERP1= <user>
##$USERP2= <user>
##$USERP3= <user>
##$USERP4= <user>
##$USERP5= <user>
##$WDW= 1
##$XDIM= 8192
##$YMAX_p= 0
##$YMIN_p= 0
$$ End of Bruker specific parameters
$$ ---------------------------------
##NTUPLES= NMR FID
##VAR_NAME=  TIME,          FID/REAL,        FID/IMAG
##SYMBOL=    X,             R,               I
##VAR_TYPE=  INDEPENDENT,   DEPENDENT,       DEPENDENT
##VAR_FORM=  AFFN,          ASDF,            ASDF
##VAR_DIM=   8192,          8192,            8192
##UNITS=     SECONDS,       ARBITRARY UNITS, ARBITRARY UNITS
##FACTOR=    0.000296,      1,               1
##FIRST=     0,             0,               0
##LAST=      2.424536,      0,               0
##MIN=       0,             -541523,         0
##MAX=       2.424536,      540311,          0
$$ Real data points
##PAGE= N=1
##DATA TABLE= (X++(R..R)), XYDATA
$$ [...]
$$ plain form
2177 -280 1115 1201 1326 585 2265 2401 -546 829 2066 2542 -827 805 1965 615 548 933 1805 -1027
2195 -1027 1061 404 538 -756 -393 611 -1237 -153 -767 852 -1219 -1877 -758 74 -604 -2566 -428
2212 -428 -1219 -1163 -816 244 -1684 -3122 1036 512 -1202 -2903 387 157 -1041 161 -704 -1344 -1093
2229 -1093 2161 -150 -1986 -1448 850 1535 -1351 -174 -988 284 -231 871 179 -1983 -238 1257
2245 1257 1936 -1975 -118 1478 1166 -463 495 2360 -1163 933 2797 1500 -1421 1215 3542 -152
2261 -152 167 1828 2358 -610 1050 2382 360 -115 786 1916 -1106 241 665 469 -565 -520 762
2278 762 -553 228 -1352 65 -104 -442 -621 -461 -462 -1469 952 -426 -1749 -1495 239 -279 -1894 -600
2296 -600 -1529 -822 -1752 -345 -1342 -2665 -1127 -558 -790 -3061 -731 -794 -887 -981 -855 56 -1223 126 307
$$ packed form
2177b80J395Q6J25p41J680J36k947J375J237M76l369J632J160j350o7L85Q72k832
2195a027K088o57J34j294L63J004j848J084o14J619k071o58J119Q32o78j962K138
2212d28p91N6L47J060j928j438M158n24j714j701L290k30j198J202q65o40K51
2229a093L254k311j836N38K298O85k886J177q14J272n15J102o92k162J745J495
2245A257O79l911J857J596l12j629R58J865l523K096J864j297k921K636K327l694
2261a52L19J661N30k968J660J332k022m75R01J130l022J347M24j96j034M5J282
2278G62j315P81j580J417j69l38j79J60jj007K421j378j323K54J734n18j615J294
2296f00r29P07r30J407r97j323J538N69k32k271K330o3r3r4J26R11j279J349J81
$$ plain form
2315 307 1221 -1096 -114 2592 1233 -494 378 3532 -4 304 2538 1831 -229 672 3262 330 -105
2332 -105 1439 2888 -70 87 2740 678 254 1107 2331 -366 300 2022 990 269 335 1293 -356
2349 -356 448 -173 105 -365 -1684 246 -496 -1354 -2195 146 -1519 -2205 -871 -1277 -1754 -2287 -135 -1295
2367 -1295 -1718 -1924 -241 -194 -2196 -581 -628 -907 -1295 494 -583 -1341 -37 -358 156 -376 -28 -851
2385 -851 925 436 -560 852 351 493 216 1660 1135 416 1025 1829 2118 377 1917 1445 1062 1217
2403 1217 2278 1375 -129 1518 995 1106 177 646 -1 283 720 -611 165 -1020 135 80 111 -1169
2421 -1169 -971 154 -692 -123 -617 -294 -1339 10 639 -1184 -1385 -622 1054 -1135 -686 463 -532
2438 -532 -1163 -168 1181 -1803 -586 -1 508 -1302 -1024 201 -711 -810 -1126 314 -940 -1589 -424 215
$$ packed form
2315C07R14k317R82K706j359j727Q72L154l536L08K234p07k060R01K590k932m35
2332a05J544J449k958J57K653k062m24Q53J224k697O66J722j032p21O6R58j649
2349c56Q04o21K78m70j319J930p42q58q41K341j665o86J334m06m77n33K152j160
2367a295m23k06J683M7k002J615m7k79l88J789j077p58J304l21N14n32L48q23
2385h51J776m89r96J412n01J42k77J444n25p19O09Q04K89j741J540m72l83J55
2403A217J061r03j504J647n23J11r29M69o47K84M37j331P76j185J155n5L1j280
2421a169J98J125q46N69m94L23j045J349O29j823k01P63J676k189M49J149r95
2438e32o31R95J349k984J217N85N09j810K78J225r12r9l16J440j254o49J165O39
$$ plain form
2456 215 -864 -1650 201 -447 -765 -536 790 -183 -1122 997 971 310 -487 1799 1201 244 1349 1796
2474 1796 549 -30 2353 1270 567 802 1395 1243 165 1304 391 469 -18 1147 823 -769 206 234
2492 234 944 -627 132 165 107 -346 66 333 -1047 -360 -370 305 -1237 -1059 215 -626 -775 -1039 165
2511 165 -1530 -1156 -631 -437 -856 -1675 3 -882 -626 -1011 284 -800 -976 348 -146 -357 -1065 972
2529 972 120 -415 -145 334 322 -883 738 -76 20 -599 759 597 -795 553 242 373 -705 635
2547 635 466 -147 159 379 1215 -363 1023 1192 1178 339 1073 1562 326 1208 831 1516 151 989 1175
2566 1175 370 763 386 944 -83 375 367 412 -225 -612 395 -896 -377 -1048 -154 -750 -1239 -591 -829 -562
2586 -562 -1531 -666 -1200 -1379 -1433 -375 -527 -2191 -569 -891 -963 -1352 -265 -324 -1350 -105 3 165 -1281
$$ packed form
2456B15j079p86J851o48l18K29J326r73r39K119k6o61p97K286n98r57J105M47
2474A796j247n79K383j083p03K35N93j52j078J139r13P8m87J165l24j592R75K8
2492B34P10j571P59L3n8m53M12K67j380O87j0O75j542J78J274q41j49k64J204
2511A65j695L74N25J94m19q19J678q85K56l85J295j084j76J324m94k11p08K037
2529I72q52n35K70M79j2j205J621q14R6o19J358j62j392J348l11J31j078J340
2547F35j69o13L06K20Q36j578J386J69j4q39P34M89j236Q82l77O85j365Q38J86
2566A175q05L93l77N58j027M58qM5o37l87J007j291N19o71Q94n96m89O48k38K67
2586e62r69Q65n34j79n4J058j52j664J622l22p2l89J087n9j026J245J08J62j446
$$ plain form
2605 -1281 240 166 -24 -106 37 624 -159 683 251 920 200 635 1316 616 691 139 1852 -109 478 1300
2625 1300 1003 280 423 1844 -219 95 784 1199 -477 -83 1476 -68 -172 -96 1131 -575 -35 847
2643 847 -81 -301 -241 1080 -563 -378 -51 299 -37 -752 122 -402 156 -431 431 -664 -1108 -223 -235 -523
2663 -523 -1895 43 -264 -772 -1214 -1061 -617 -1282 -57 -1049 -980 -1192 361 -486 -1308 -362 -722 -268 -502
2682 -502 417 -722 134 952 200 346 -132 894 -28 854 664 -114 552 956 801 -245 1152 782 575
2701 575 662 1016 780 -372 1715 739 610 -123 1622 1192 534 992 569 1379 -206 1136 521 247 256
2720 256 89 906 -776 -125 -158 302 -1188 -987 -14 -1020 -1222 -601 256 -2124 -1026 488 -1038 -1855
2738 -1855 -888 666 -1978 -688 57 -456 -1566 -388 415 -1628 -927 13 403 -1357 -281 366 -957
$$ packed form
2605a281J521p4j90q2J43N87p83Q42m32O69p20M35O81p00P5n52J713j961N87Q22
2625A300k97p23J43J421k063L14O89M15j676L94J559j544j04P6J227j706N40Q82
2643H47r28k20O0J321j643J85L27L50l36p15Q74n24N58n87Q62j095m44Q85j2k88
2663e23j372J938l07n08m42J53M44o65J225r92O9k12J553q47q22R46l60M54k34
2682e02R19j139Q56Q18p52J46m78J026r22Q82j90p78O66M04j55j046J397l70k07
2701E75Q7L54k36j152K087r76j29p33J745m30o58M58m23Q10j585J342o15k74R
2720B56j67Q17j682O51l3M60j490K01R73j006k02O21Q57k380J098J514j526q17
2738a855R67J554k644J290P45n13j110J178Q03k043P01R40L90j760J076O47j323
$$ plain form
2755 -957 -191 -567 386 -595 110 -4 431 334 -341 1066 590 730 241 1537 503 412 1337 792 804 116
2775 116 1822 598 558 1127 947 275 319 1687 -110 426 570 923 -76 175 998 -432 141 307 140
2794 140 -798 91 276 -978 -79 -569 -284 -801 219 -992 -1043 86 -612 -679 -1327 243 -708 -617 -195
2813 -195 -321 -443 -833 223 -655 -420 -724 137 4 -878 -977 -635 673 -1031 -314 -10 -381 -693 -60
2832 -60 875 -1308 -174 631 730 -828 132 1385 -157 510 977 726 -848 1443 1510 -152 254 1242
2850 1242 1299 -326 1044 1014 -96 -95 1367 965 -545 768 913 778 -86 473 1324 434 336 -237 1261
2869 1261 52 127 566 435 -738 -959 1219 -655 -1410 -800 289 -1572 -1643 -285 -1476 -1068 -1065 -242
2887 -242 -1794 -1211 -164 -541 -1068 -941 43 -861 176 -99 -575 -389 395 751 -838 430 -114 154
$$ packed form
2755i57P66l76R53r81P05j14M35r7o75J407m76J40m89J296j034r1R25n45J2o88
2775A16J706j224m0N69j80o72M4J368j797N36J44L53r99K51Q23j430N73J66j67
2794A40r38Q89J85j254Q99m90K85n17J020j211n1J129o98o7o48J570r51R1M22
2813a95j26j22l90J056q78K35l04Q61j33q82r9L42J308j704P17L04l71l12O33
2832f0R35k183J134Q05R9j558R60J253j542O67M67k51j574K291O7j662M06R88
2850A242N7j625J370l0j110JJ462m02j510J313J45j35q64N59Q51q90r8n73J498
2869A261j209P5M39j31j173k21K178j874p55O10J089j861p1J358j191M08LQ23
2887b42j552N83J047l77n27J27R84r04J037k75m76J86P84L56j589J268n44K68
$$ plain form
2905 154 297 17 -139 -157 795 -179 509 74 106 240 562 1101 -573 768 704 1019 42 712 1006 232
2925 232 784 616 1182 -98 764 414 464 367 160 652 197 606 -456 592 383 -114 23 285 316 -993
2945 -993 517 -36 -183 -347 312 86 -1053 302 -210 -321 -877 266 -288 -910 100 -605 -517 -1153 3
2964 3 -792 -776 -252 -1012 -741 -1268 -216 -732 -453 -882 -338 -206 -546 -99 -367 7 -614 17 153 230 -49
2985 -49 411 1105 -394 568 724 902 181 956 1181 -31 869 973 1018 187 1026 790 339 706 341 885
3005 885 542 1119 367 332 723 701 506 -99 717 -86 314 165 71 -357 -278 665 -765 170 -651 -308 -419
3026 -419 -507 -294 -1045 -303 -749 -525 -923 -663 -708 -572 -207 -1140 -567 -770 -190 -729 -276 -454 -872 -69 -391
3047 -391 -155 -834 367 -141 -444 -25 27 143 -582 898 141 15 154 571 357 -146 870 364 608
$$ packed form
2905A54J43k80j56j8R52r74O88m35L2J34L22N39j674J341o4L15r77O70K94p74
2925B32N52j68N66j280Q62l50N0r7k07M92m55M09j062J048k09m97J37K62L1j309
2945i93J510n53j47j64O59k26j139J355n12j11n56J143n54o22J010p05Q8o36J156
2964Cp95J6N24p60K71n27J052n16K79m29N44J32l40M47k68L74o21O31J36P7k79
2985d9M60O94j499R62J56J78p21P75K25j212R00J04M5q31Q39k36m51L67l65N44
3005H85l43N77p52l5L91k2j95o05Q16q03M00j49r4m28P9R43j430R35q21L43j11
3026d19q8K13p51P42m46K24l98K60m5J36L65r33N73k03N80n39M53j78m18Q03l22
3047c91K36o79J201n08l03M19N2J16p25J480p57j26J39M17k14n03J016n06K44
$$ plain form
3066 608 -21 589 558 593 646 389 986 99 1022 804 397 427 628 946 95 588 304 887 133 396 638
3087 638 -191 151 61 1236 -711 -15 98 15 -287 -628 85 -1000 -210 -430 -335 -964 -907 -46 -933 -595
3107 -595 -963 86 -688 -735 -182 -540 -632 -841 162 -754 -452 -384 131 -264 -828 178 -349 -254 -604 371
3127 371 -18 -801 400 184 217 -385 738 27 -15 211 565 353 -491 886 363 533 53 904 516 74
3147 74 1008 721 937 13 944 545 505 297 413 1016 -307 976 356 305 -273 177 472 -363 196 -163
3167 -163 340 -787 249 77 -409 -633 -88 242 -695 -452 -313 -245 -717 -502 -339 -1127 -263 -609 -222 -850
3187 -850 -529 -126 -510 -285 -727 -24 -883 -401 -402 -290 -496 -698 169 -697 251 -181 356 135 -80 263 33
3208 33 500 -201 657 11 461 597 545 485 80 1042 55 520 243 656 548 245 927 238 750 88 778
$$ packed form
3066F08o29O10l1L5N3k57N97q87R23k18m07L0K01L18q51M93k84N83p54K63K42
3087F38q29L42r0J175j947O96J13q3l02l41P13j085P90k20R5o29N7Q61q87L38
3107e95l68J049p74m7N53l58r2k09J003r16L02O8N15l95n64J006n27R5l50R75
3127C71l89p83J201k16L3o02J123p11m2K26L54k12q44J377n23J70m80Q51l88m42
3147G4R34k87K16r24R31l99m0k08J16O03j323J283o20n1n78M50K95q35N59l59
3167a63N03j127J036j72m86k24N45L30r37K43J39O8m72K15J63p88Q64l46L87o28
3187h50L21M03l84K25m42P03q59M82jJ12k06k02Q67q66R48m32N37k21k15L43k30
3208C3M67p01Q58o46M50J36n2o0m05R62r87M65k77M13j08l03O82o89N12o62O90
$$ plain form
3229 778 216 230 404 376 445 0 727 -151 210 41 37 108 5 388 -220 57 -601 -75 -246 -609 -176 -641
3251 -641 -145 -804 -319 -766 -872 -430 -558 -192 -929 -48 -817 -393 -671 -212 -353 -731 73 -346 -89 -602
3271 -602 -157 -373 -371 -9 -123 -5 -396 710 58 274 -66 414 306 -410 591 21 443 167 769 502
3291 502 230 590 541 820 150 697 621 370 395 850 1073 -223 571 305 560 30 436 345 -194 393 344
3312 344 373 -629 27 323 -217 -418 -301 264 -588 -84 179 -222 -620 -335 297 -822 -177 -520 4 -922
3332 -922 -540 -335 -805 -702 -758 135 -1091 -352 -575 -175 -596 -757 95 -807 -268 -336 -11 -430 -206 381
3352 381 -151 216 -199 541 252 103 410 160 411 39 693 422 811 258 553 810 229 755 276 676
3372 676 -33 963 558 206 262 164 766 -349 712 423 341 -75 215 649 -203 328 23 392 -480 271
$$ packed form
3229G78n62J4J74k8O9m45P27q78L61j69mP1j03L83o08K77o58N26j71l63M33m65
3251f41M96o59M85m47j06M42j28L66p37Q81p69M24k78M59j41l78Q04m19K57n13
3271f02M45k16KL62j14J18l91J106o52K16l40M80j08p16J001n70M22k76O02k67
3291E02k72L60m9K79o70N47p6k51K5M55K23j296P94k66K55n30M06r1n39N87m9
3312C44K9j002O56K96n40k01J17N65q52N04K63m01l98K85O32j119O45l43N24r26
3332i22L82K05m70J03n6Q93j226P39k23M00m21j61Q52r02N39o8L25m19K24N87
3352C81n32L67m15P40k89j49L07k50K51l72O54k71L89n53K95K57n81N26m79M00
3372F76p09R96m05l52N6r8O02j115J061k89q2m16K90M34q52N31l05L69q72P51
$$ plain form
3392 271 287 -454 -159 -337 -19 -808 -255 -440 -317 -495 -595 -261 -862 -255 -407 30 -780 -538 -102 -979
3412 -979 -478 -658 164 -632 -489 -163 -343 -542 -574 248 -799 -399 -316 471 -268 -167 393 -312 -55 11 729
3433 729 -21 -177 647 638 212 16 1090 196 223 563 781 418 142 1149 388 529 -27 1010 338 178
3453 178 922 113 -3 -168 883 -342 -166 291 348 76 -546 547 -606 -404 -4 593 -827 -842 565
3472 565 -396 -749 -524 249 -637 -776 -103 -210 -605 -1058 216 -539 -775 -669 -177 -219 -909 180 -203 -369
3492 -369 -584 21 -307 -553 -132 36 -158 -489 373 97 -182 128 182 420 -282 898 35 -154 237 910
3512 910 276 -381 837 608 541 105 1029 276 8 907 515 668 -199 1067 389 424 -51 495 490 8 483
3533 483 53 567 -328 348 138 -381 -366 -54 297 -457 78 -267 -387 -230 -295 -361 -798 -85 -509 -671 -938
$$ packed form
3392B71J6p41K95j78L18p89N53j85J23j78j00L34o01O07j52M37q10K42M36q77
3412i79N01j80Q22p96J43L26j80j99l2Q22j047M00Q3P87p39J01N60p05K57O6P18
3433G29p50j56Q24rm26j96J074q94K7L40K18l63k76J007p61J41n56J037o72j60
3453A78P44q09j16j65J051j225J76M57N7k72o22J093j153K02M00N97j420j5J407
3472E65r61l53K25P73q86j39O73j07l95m53J274p55k36J06M92m2o90J089l83j66
3492c69k15O05l28k46M21J68j94l31Q62k76k79L10N4K38p02J180q63j89L91O73
3512I10o34o57J218k29o7m36R24p53k68Q99l92J53q67J266o78L5m75N46nm82M75
3533D83m30N14q95O76k10n19J5L12L51p54N35l45j20J57o5o6m37P13m24j62k67
$$ plain form
3554 -938 -138 -485 -793 -211 -429 -526 -546 194 -217 -607 -61 -347 -30 -473 -100 -454 41 -464 -272 -266 -75
3575 -75 306 -412 381 -225 80 -37 370 340 -258 723 535 366 279 815 764 144 690 418 604 312 553
3596 553 493 318 441 511 732 25 532 151 189 155 54 444 -231 326 19 441 -350 -53 247 -240 -142 -1
3618 -1 69 -774 -41 54 -529 -607 -296 260 -1274 -346 87 -363 -1060 -589 23 -799 -408 -410 62 -1066 -146 5
3640 5 -431 -367 -356 179 -658 118 -15 11 -304 -35 341 -299 161 -16 147 -316 31 530 -43 -70 106 721
3662 721 -204 40 900 351 80 400 1128 -81 262 757 909 -49 182 1097 -229 256 123 764 -119
3681 -119 -56 757 78 -225 22 661 -475 -156 -21 228 -6 -537 162 -383 -204 -151 77 -802 -542 -141
3701 -141 -301 -502 -896 309 -410 -846 -434 -114 -599 -1070 438 -495 -776 -425 242 -357 -660 219 -268
$$ packed form
3554i38Q00l47l08N82k18r7k0P40m11l90N46k86L17m43L73l54M95n05J92OJ91
3575g5L81p18P93o06L05j17M07l0n98R81j88j69q7N36n1o20N46k72J86k92K41
3596E53o0j75J23P0K21p07N07l81L8l4j01L90o75N57l07M22p91K97L00m87R8J41
3618aP0q43P33R5n83p8L11N56j534R28M33m50o97M71O12q22L91kM72j128R20J51
3640Em36O4J1N35q37P76j33K6l15K69L76o40M60j77J63m63L47M99n73k7J76O15
3662G21r25K44Q60n49k71L20P28j209L43M95J52r58K31R15j326M85j33O41q83
3681a19O3Q13o79l03K47O39j136L19J35K49k34n31O99n45J79N3K28q79K60M01
3701a41j60k01l94J205p19m36M12L20m85m71J508r33k81L51O67n99l03Q79m87
$$ plain form
3720 -268 -210 -195 725 -184 -290 155 644 -31 -498 678 104 273 257 427 252 -66 658 548 712 148 629
3741 629 558 44 266 559 471 -60 407 414 23 171 392 617 -273 393 482 415 -284 550 397 -302 17 96
3763 96 110 -317 259 127 -342 -469 -4 74 -565 -90 -294 46 -692 -640 -162 -667 -274 -689 -75 -777 -673
3784 -673 -200 -254 -683 -597 289 -707 -606 -481 -31 -339 -606 201 -241 -256 -145 546 -143 -40 235 93 62
3805 62 76 549 -61 390 406 542 512 -124 654 255 614 406 786 501 97 589 492 514 84 741 366 73
3827 73 124 415 376 -154 511 232 62 50 473 188 -202 88 -172 27 -343 266 -38 -525 -242 -27 -92 -894
3849 -894 83 -375 -322 -390 -255 -371 -854 -492 -478 -426 -935 -117 -332 -515 -487 -371 -54 -582 -36 -96 -121 -192 60
3872 60 420 -224 297 325 539 -160 441 603 -53 185 278 687 -145 448 628 64 291 312 716 -100 448
$$ packed form
3720b68N8J5R20r09j06M45M89o75m67J176n74J69j6J70j75l18P24j10J64n64M81
3741F29p1n14K22K93q8n31M67Pl91J48K21K25q90O66Q9o7o99Q34j53o99L19P9
3763I6J4m27N76j32m69j27M65P8o39M75k04L40p38N2M78n05L93m15O14p02J04
3784f73M73n4m29Q6Q86r96J01J25M50l08k67Q07m42j5J11O91o89J03K75j42l1
3805F2J4M73o10M51J6J36l0o36P78l99L59k08L80k85m04M92r7K2m30O57l75k93
3827G3N1K91l9n30O65k79j70j2M23k85l90K90k60J99l70O09l04m87K83K15o5q02
3849h94R77m58N3o8J35j16m83L62J4N2n09Q18k15j83K8J16L17n28N46o0k5p1K52
3872F0L60o44N21K8K14o99O01J62o56K38R3M09q32N93J80n64K27K1M04q16N48
$$ plain form
3893 448 443 345 -96 254 489 36 433 148 465 -15 182 482 -12 -143 -183 455 -422 37 -165 -143 -581 -256
3915 -256 262 -500 -324 -244 94 -741 -316 335 -262 -427 -444 9 -560 -423 27 -20 -604 -462 191 -455 -408
3936 -408 -173 243 -433 -638 85 -313 -174 -398 209 -309 -487 51 -331 125 -278 637 10 126 68 556
3956 556 208 -280 858 431 165 25 747 181 10 326 482 452 -414 665 211 -35 267 273 428 -214
3976 -214 583 225 305 -321 416 510 -321 100 314 280 -312 274 510 -26 -253 -85 446 -702 -173 -218 -244
3997 -244 -685 -502 192 -928 -400 -262 -88 -747 -453 -215 -538 -598 -515 210 -719 -454 -173 -25 -314 -259 209
4018 209 -368 -94 -97 395 -66 -408 187 -170 -167 -61 457 -124 -9 481 298 99 -127 665 -60 257 305 327
4040 327 444 88 675 403 440 113 739 395 63 521 531 420 -399 569 622 243 -23 60 341 -374 194
$$ packed form
3893D48nr8m41L50K35m53L97k85L17m80J97L00m94j31m0O38q77M59k02K2m38L25
3915b56N18p62J76Q0L38q35M25O51n97j65j7M53n69J37M50m7n84J42O53o46M7
3936d08K35M16o76k05P23l98J39k24O07n18j78N38l82M56m03R15o27J16n8M88
3956E56l48m88J138m27k66j40P22n66j71L16J56l0q66J079m54k46L02OJ55o42
3976b14P97l58Q0o26P37R4q31M21K14l4n92N86K36n36k27J68N31j148N29m5k6
3997b44m41J83O94j120N28J38J74o59K94K38l23o0Q3P25r29K65K81J48k89N5M68
4018B09n77K74lM92m61l42N95l57LJ06N18n81J15M90j83j99k26P92p25L17M8K2
4040C27J17l56N87k72L7l27O26l44l32M58J0j11q19R68N3l79k66Q3K81p15N68
$$ plain form
4061 194 -235 -46 -475 30 -270 -488 -184 -264 -8 -590 -20 -354 -198 -453 -174 -324 -664 -258 -197 -384 -399
4082 -399 -217 -193 -718 -408 -102 -272 -872 -207 34 -209 -80 -112 113 -640 29 59 11 -177 100 502 -111
4103 -111 254 289 413 -132 344 600 288 436 304 565 -71 705 457 627 192 336 618 -32 502 493 204
4124 204 84 208 254 -161 193 229 291 -357 59 173 -27 -235 -103 310 -415 -38 -154 286 -525 -449 228
4145 228 -425 -258 -443 -60 -522 -454 25 -376 -203 -574 142 -636 -352 -169 -126 -424 -273 -34 -480 -160 -166
4166 -166 -54 -509 -61 247 -344 -188 -436 426 -322 -73 242 13 -20 -170 656 212 109 340 801 171
4186 171 70 696 504 386 118 664 552 65 361 454 575 -37 554 398 84 -40 393 452 -72 185 -17
4207 -17 131 -79 94 -34 -125 53 -196 40 -512 -49 -258 -176 -328 -390 94 -560 -253 -143 -282 -879 -385
$$ packed form
4061A94m29J89m29N05l00k18L04q0K56n82N70l34J56k55K79j50l40M06O1j87j5
4082c99J82K4n25L10L06j70o00O65K41k43J29l2K25p53O69L0m8j88K77M02o13
4103a11L65L5J24n45M76K56l12J48j32K61o36P76k48J70m35J44K82o50N34rk89
4124B04j20J24M6m15L54L6O2o48M16J14k00k08J32M13p25L77j16M40q11P6O77
4145B28o53J67j85L83m62O8M79m01J73l71P16p78K84J83M3k98J51K39m46L20o
4166a66J12m55M48L08n91J56k48Q62p48K49L15k29l3j50Q26m44j03K31M61o30
4186A71j01O26j92j18k68N46j12m87K96R3J21o12N91j56l14j24M33N9n24K57k02
4207a7J48k10J73j28r1J78k49K36n52M63k09Q2j52o2M84o54L07J10j39n97M94
$$ plain form
4228 -385 36 -677 -570 -291 117 -961 -495 116 -140 -446 -639 646 -541 -143 112 392 -318 42 306
4247 306 155 -12 -152 752 122 -11 290 329 225 -184 485 255 71 10 750 280 -89 781 251 344 158
4268 158 673 249 11 629 374 -17 -72 765 403 -259 372 432 -260 -458 335 92 -304 -528 477 36
4288 36 -538 -101 -20 -261 -866 140 213 -561 -626 -31 132 -639 -229 -251 -261 -660 -40 -255 -691 -61 -171 -227
4310 -227 -490 50 7 -399 -9 81 -52 -559 416 -100 -274 -67 160 366 -532 202 90 239 91 379 685
4331 685 -269 503 369 755 -150 132 465 86 77 228 390 -348 271 67 165 298 374 435 -134 326 -130 211
4353 211 -151 107 270 26 -71 196 153 -267 139 111 -342 -202 83 -157 -701 -23 -227 -242 -640 -49 -190
4374 -190 -779 -148 -333 -20 -784 -244 -148 -281 -389 -111 -75 -439 -198 -252 -185 -118 -187 36 -288 -138 -105 221
$$ packed form
4228c85M21p13J07K79M08j078M66O11k56l06j93J285j187L98K55K80p10L60K64
4247C06j51j67j40R04o30j33L01L9j04m09O69k30j84o1P40m70l69Q70n30R3j86
4268A58N15m24k38O18k55l91n5Q37l62o62O31O0o92j98P93k43l96k24J005m41
4288C6n74M37Q1k41o05J006P3p74o5N95J63p71M10k2j0l99O20k15m36O30j10n6
4310b27k63N40m3m06L90R0j33n07R75n16j74K07K27K06q98P34j12J49j48K88L06
4331F85r54P72j34L86r05K82L33l79rJ51J62p38O19k04R8J33P6O1n69M60m56L41
4353B11l62K58J63k44r7K67m3m20M06k8m53J40K85k40n44O78k04j5l98N91j41
4374a90n89O31j85L13p64N40R6j33j08K78L6l64K41n4O7O7o9K23l24J50L3L26
$$ plain form
4396 221 -319 -349 49 74 -50 -162 389 -29 211 189 390 430 178 573 129 402 280 329 308 260 518 223
4418 223 220 180 527 56 -6 204 400 218 -134 377 107 118 -227 291 142 -465 148 -147 -96 -479 123 214
4440 214 -372 -447 48 81 -666 -305 39 -119 -636 -86 -155 -512 -151 -393 -140 -629 -403 -30 -325 -450 -277
4461 -277 233 -594 -240 -21 -60 -329 -55 382 -422 -265 297 312 -246 -132 506 75 62 252 611 -29 -114
4482 -114 658 511 -127 13 781 201 -100 246 543 4 149 667 306 -72 -163 689 92 6 449 216 -7
4503 -7 -152 344 -240 -248 53 286 46 -400 254 -35 -32 -558 24 -434 -425 97 -52 -207 -656 144 -277 -579 -391
4526 -391 260 -238 -586 96 -302 -308 -570 189 -117 -558 -337 -45 268 -419 391 -91 40 -47 42 292 -80
4547 -80 218 311 30 26 399 552 231 12 362 551 67 149 212 190 369 341 407 119 341 422 246 72 33 346
$$ packed form
4396B21n40l0L98K5j24j12N51m18K40k2K01M0k52L95m44K73j22M9k1m8K58k95
4418B23lm0L47m71o2K10J96j82l52N11k70J1l45N18j49o07O13k95N1l83O02R1
4440B14n86p5M95L3p47L61L44j58n17N50o9l57L61k42K53m89K26L73k95j25J73
4461b77N10q27L54K19l9k69K74M37q04J57N62J5n58J14O38m31j3J90L59o40q5
4482a14P72j47o38J40P68n80l01L46K97n39J45N18l61l78r1Q52n97q6M43k33k23
4503gj45M96n84qL01K33k40m46O54k89Ln26N82m58RN22j49j55m49Q00m21l02J88
4526c91O51m98l48O82l98ok62P59l06m41K21K92L13o87Q10m82J31q7Q9K50l72
4547h0K98R3k81mL73J53l21k19L50J89m84Q2O3k2J79k8O6k88K22Q1j76j74l9L13
$$ plain form
4571 346 -117 -140 -69 432 76 196 238 32 28 -194 293 -57 -338 -38 -127 -92 -349 42 -253 -11 -89 -183 -422
4594 -422 -227 24 -130 -291 -247 10 -331 -502 -153 -342 6 -253 263 -340 -332 -102 129 -330 -101 187 -537
4615 -537 21 -180 208 -310 8 118 127 260 -62 534 31 303 205 179 131 293 501 -66 255 423 517 120
4637 120 -39 434 69 152 -105 390 -46 -179 165 497 -33 44 141 81 -5 -78 480 -174 -156 371 -30 -162
4659 -162 -135 314 -106 -371 -64 22 -225 -597 188 164 -386 -158 -236 -225 -561 19 -286 -285 -616 17 41 -787 -265
4682 -265 -52 -62 -697 -29 -109 -164 -421 34 66 -487 -90 40 162 -247 87 409 -21 -112 -250 259 -255 137
4704 137 510 -255 174 83 640 1 108 127 359 -65 43 424 -113 132 110 593 -7 147 437 174 -184
4725 -184 146 564 26 -29 329 178 60 -131 418 15 106 -149 5 -251 -561 -86 22 -458 -211 89 -219
$$ packed form
4571C46m63k3P1N01l56J20M2k06mk22M87l50k81L00q9L5k57L91k95K42p8r4k39
4594d22J95K51j54j61M4K57l41j71L49j89L48k59N16o03QK30K31m59K29K88p24
4615e37N58k01L88n18L18J10RJ33l22N96n03K72r8k6m8J62K08n67L21J68R4l97
4637A20j59M73l65Q3k57M95m36j33L44L32n30P7R7o0q6p3N58o54J8N27m01j32
4659a62K7M49m20k65L07Q6k47l72P85k4n50K28p8J1l36N80l05Jl31O33K4q28N22
4682b65K13j0o35O68q0n5k57M55L2n53L97J30J22m09L34L22m30r1j38N09n14L92
4704A37L73p65M29r1N57o39J07J9K32m24J08L81n37K45k2M83o00J54K90k63l58
4725a84L30M18n38n5L58j51j18j91N49m03R1k55J54k56l10M75J08m80K47L00l08
$$ plain form
4746 -219 -391 -91 -258 -253 -758 87 -131 -618 -407 -108 -266 -560 -207 -42 -446 -484 95 -156 -229 -167 -26 118
4768 118 -335 278 283 209 -42 236 516 -28 492 397 325 -78 149 119 230 177 325 479 -44 280 160 406
4790 406 190 259 395 -105 159 154 86 44 -31 314 31 -29 -139 -16 -313 -11 10 -180 -38 -326 305 -211 72
4813 72 -278 -234 -443 -229 -80 -227 39 -396 -19 -424 -186 -121 -280 -226 -189 31 -350 -322 -53 -141 -228 -368 -34
4836 -34 -145 -55 -99 216 44 -202 124 -69 57 28 97 -32 125 424 290 217 4 386 22 374 203 225
4858 225 120 -9 440 37 245 -65 531 -33 -78 220 273 12 66 376 98 -45 89 173 -128 254 120
4879 120 -76 -187 -163 -34 -185 -153 -50 46 -46 -546 126 -117 -233 -430 -110 -250 -463 -169 -87 -408 -554 -35
4901 -35 -444 -350 -183 -161 -329 -262 -73 -138 -397 -100 -5 -191 -369 182 21 -18 -267 -21 366 41 104 172 97
$$ packed form
4746b19j72L00j67Nn05Q45k18m87K11K99j58k94L53J65m04l8N79k51p3O2J41J44
4768A18m53O13Np4k51K78K80n44N20r5p2m03K27l0J11n3J48J54n23L24j20K46
4790D06k16O9J36n00K64no8m2p5L45k83o0j10J23k97L02K1j90J42k88O31n16K83
4813G2l50M4k09K14J49j47K66m35L77m05K38O5j59N4L7K20l81K8K69q8q7j40L34
4836c4j11R0m4L15j72k46L26j93J26k9O9j29J57K99j34p3k13L82l64L52j71K2
4858B25j05j29M49m03K08l10N96n64m5K98N3k61N4L10k78j43J34Q4l01L82j34
4879A20j96j11K4J29j51L2J03R6r2n00O72k43j16j97L20j40k13K94Q2l21j46N19
4901c5m09R4J67K2j68O7J89o5k59K97R5j86j78N51j61l9k49K46L87l25O3O8p5
$$ plain form
4924 97 -27 225 271 41 199 398 567 -235 226 346 239 -181 248 565 156 -93 193 337 -97 282 366
4945 366 122 20 219 342 -337 -7 307 114 -302 -168 305 -200 -132 -268 114 -589 -182 -109 -158 -284 -100
4966 -100 183 -261 -401 -87 -74 -499 -336 287 -105 -240 -432 292 37 -512 301 -114 -288 -118 408 -80
4986 -80 -309 -2 38 139 -53 414 51 27 51 530 396 -255 449 259 278 -63 296 372 -203 141 318 349
5008 349 36 539 47 -113 108 66 234 -27 271 350 389 -291 276 143 -216 117 251 161 67 -38 344 52
5030 52 -20 -207 374 -156 -119 -120 254 -114 -133 -135 -239 -257 -342 62 -587 -385 -208 -291 -211 -297 40 -198 -74 -114 35
5055 35 -320 -293 -160 -347 -40 -168 36 -222 -128 185 -34 109 -76 299 126 -121 223 128 358 -136 411
5076 411 210 98 300 214 232 37 268 68 144 -90 393 93 115 312 101 332 30 152 -72 -19 181 323
$$ packed form
4924I7j24K52M6k30J58J99J69q02M61J20j07m20M29L17m09k49K86J44m34L79Q4
4945C66k44j02J99J23o79L30L14j93m16J34M73n05O8j36L82p03M07P3m9j26J84
4966a00K83m44j40L14J3m25J63O23l92j35j92P24k55n49Q13m15j74J70N26m88
4986h0k29L07M0J01j92M67l63k4K4M79j34o51P04j90J9l41L59P6n75L44J77L1
5008C49l13N03m92j60K21m2J68k61K98P9L9o80N67j33l59L33J34r0r4j05L82k92
5030E2p2j87N81n30L7jL74l68j9kj04j8q5M04o49K02J77q3Q0q6L37k38J24m0J49
5055C5l55K7J33j87L07j28K04k58R4L13k19J43j85L75j73k47L44r5K30m94N47
5076D11k01j12K02q6J8j95K31k00P6k34M83l00K2J97k11K31l02J22k24N3K00J42
$$ plain form
5098 323 101 91 -49 -258 -193 46 186 -147 -166 315 -140 -15 -257 151 -82 -315 -335 61 -201 -382 145
5119 145 -232 -204 -362 -172 -274 -187 -221 -200 -236 -335 5 -158 -432 -142 190 18 -141 109 -207 64 -29 84
5141 84 4 -303 87 178 -68 -168 130 -169 -27 118 235 307 -241 320 137 199 -73 257 532 32 357 394
5163 394 400 11 405 228 -114 72 144 69 -278 -124 298 65 -89 133 362 -332 27 177 58 -214 -51
5184 -51 229 -300 -252 16 191 -452 -329 -41 -247 -148 -181 -16 -448 -464 -134 56 -281 -433 143 -256 -572 -70
5206 -70 203 -241 -415 -150 -154 -290 -232 362 -141 -341 -16 258 -91 -460 270 -17 181 -117 595 356 -190
5227 -190 175 107 245 -167 621 123 137 98 263 293 -14 326 254 28 275 331 354 -63 65 145 186 -77 194
5250 194 242 -81 -89 128 246 -419 -135 -202 -160 -235 -144 125 -224 -140 132 104 -382 -77 -90 7 -170 -147 134 -312
$$ packed form
5098C23k22j0j40k09O5K39J40l33j9M81m55J25k42M08k33k33k0L96k62j81N27
5119A45l77K8j58J90j02Q7l4K1l6r9L40j63k74K90L32j72j59K50l16K71r3J13
5141H4q0l07L90R1k46j00K98k99J42J45J17P2n48N61j83O2k72L30K75n00L25L7
5163C94Ol89L94j77l42J86P2p5l47J54M22k33j54K22K29o94L59J50j19k72J63
5184e1K80n29M8K68J75o43J23K88k06R9l3J65m32j6L30J90l37j52N76l99l16N02
5206g0K73m44j74K65mj36N8N94n03k00L25K74l49l69P30k87J98k98P12k39n46
5227a90L65o8J38m12P88m98J4l9J65L0l07L40p2k26K47N6K3m17J28Q0M1k63K71
5250A94M8l23qK17J18o65K84o7M2p5R1K69l49Q4K72k8m86L05j3R7j77K3K81m46
$$ plain form
5274 -312 -303 -224 65 14 -335 40 -41 31 -19 121 -157 -168 0 -133 -17 16 200 8 -254 87 161 121 -21 54
5298 54 216 325 149 184 135 -63 283 321 193 65 106 50 147 134 183 353 69 309 -335 136 -89 216 305
5321 305 -88 76 -30 -21 -4 177 -140 69 252 -167 -1 -24 -110 -428 53 -183 -346 -136 -187 101 -152 -99
5343 -99 -452 54 -255 -99 -5 -340 -136 -226 -75 -287 -205 -87 -154 -219 -174 54 -73 -158 144 -23 63 68 326 -43
5367 -43 196 139 87 261 126 256 365 262 61 372 357 230 138 275 205 1 177 231 205 -104 490 429 -210
5390 -210 2 284 413 -231 -21 -41 -214 -54 301 306 -297 85 174 -57 54 -22 206 -155 -88 -231 90 -234
5412 -234 61 143 -386 -502 -87 13 -285 -159 198 14 -249 -47 224 -201 -299 -301 -110 -86 -361 -106 -294 -226
5434 -226 -240 433 -351 -315 354 269 -42 -133 228 59 6 -83 337 216 51 379 520 481 133 441 322 -58
$$ packed form
5274c12RP9K89n1l49L75q1P2n0J40k78j1J68j33J16L3J84j92k62L41P4m0j42P5
5298E4J62J09j76L5m9j98L46L8j28j28M1n6R7j3M9J70k84K40o44M71k25L05Q9
5321C05l93J64j06RJ7J81l17K09J83m19J66k3q6l18M81k36j63K10n1K88k53N3
5343i9l53N06l09J56R4l35K04r0J51k12Q2J18o7o5M5K28j27q5L02j67Q6NK58l69
5367d3K39n7n2J74j35J30J09j03k01L11j5j27r2J37p0k04J76N4k6l09N94o1o39
5390b10K12K82J29o44K10k0j73J60L55No03L82Q9k31J11p6K28l61O7j43L21l24
5412b34K95Q2n29j16M15J00k98J26L57j84k63K02K71m25r8kJ91K4k75K55j88O8
5434b26j4O73p84L6O69q5l11r1L61j69n3q9M20j21j65L28J41l9l48L08j19l80
$$ plain form
5456 -58 247 497 214 -42 359 106 -27 57 392 220 -67 313 181 -36 -196 122 24 28 -52 127 -168 -518
5478 -518 54 -11 -213 -278 -157 -27 -605 -185 10 -80 -484 -207 -1 -201 -260 -183 218 -504 -370 253 -201 -124
5500 -124 47 -60 -241 -93 -103 77 -26 -69 19 -81 151 -15 109 115 -73 177 -141 -65 87 155 -23 92
5522 92 163 173 -56 -122 301 -6 33 5 343 23 117 281 237 -73 -114 153 96 -268 33 -49 43 -129 76 141
5546 141 92 -155 -78 -122 99 -24 -138 373 -124 13 -325 -161 -279 -201 -74 -263 95 -376 -255 -290 -132 -57
5568 -57 -350 -15 -216 -151 -351 58 -253 -44 -155 0 71 -54 -167 -134 -153 -172 -184 193 -18 164 -180 95
5590 95 -22 49 48 -164 222 39 224 -63 447 -86 -94 209 224 -201 161 396 34 58 19 161 194 -34 174
5613 174 335 327 42 83 237 34 278 50 241 -196 249 112 -148 61 -142 50 -354 -189 -130 -332 -212
$$ packed form
5456e8L05K50k83k56M01k53j33Q4L35j72k87L80j32k17j60L18r8Mq0J79k95l50
5478e18N72o5k02o5J21J30n78M20J95r0m04K77K06k00n9P7M01p22J34O23m54P7
5500a24J71j07j81J48j0J80j03m3Q8j00K32j66J24Oj88K50l18P6J52O8j78J15
5522I2P1J0k29o6M23l07L9k8L38l20R4J64m4l10m1K67n7l64L01q2R2j72K05O5
5546A41m9k47P7m4K21j23j14N11m97J37l38J64j18P8J27j89L58m71J21l5J58P5
5568e7k93L35k01O5k00M09l11K09j11J55P1j25j13L3j9j9j2L77k11J82l44K75
5590I5j17P1jk12L86j83J85k87N10n33qL03J5m25L62K35l62K4l9J42L3k28K08
5613A74J61qk85M1J54k03K44k28J91m37M45j37k60K09k03J92m04J65N9k02J20
$$ plain form
5634 -212 47 -21 -366 -340 -168 -347 -312 -375 44 -227 -358 -327 -35 -420 -78 132 -20 -520 -97 41 -47 238
5656 238 -138 182 -161 -4 249 237 -277 9 329 -136 121 27 212 42 5 483 -295 -103 175 431 2
5677 2 -149 282 175 117 91 225 -12 -50 58 108 49 -48 240 45 -46 30 283 66 -337 384 151 -242 -451
5700 -451 319 -5 -32 81 284 -171 -288 147 -83 -114 -459 -124 121 -350 -47 -42 41 -340 -44 -49 -409 41
5722 41 -30 -53 -139 -84 140 32 -161 -205 -121 -332 -114 -42 67 -227 -34 77 -52 -168 -202 347 -212 232 133
5745 133 -46 46 64 309 -43 422 351 294 300 -70 526 -96 285 224 361 219 419 -7 385 62 -130 294
5767 294 -175 156 -9 14 17 -5 -94 92 49 -180 121 13 -310 -260 -295 -150 -342 -91 -361 -312 -136 -31 -122
5790 -122 -208 86 -122 -98 -344 41 130 -22 14 -351 -86 -167 -76 18 -94 -150 -219 96 23 -38 110 126 -147 169
$$ packed form
5634b12K59o8l45K6J72j79L5o3M19k71j31L1K92l85L42K10j52n00M23J38q8K85
5656B38l76L20l43J57K53j2n14K86L20m65K57r4J85j70l7M78p78J92K78K56m29
5677Bj51M31j07n8k6J34k37l8J08N0n9r7K88j95r1P6K53k17m03P21k33l93k09
5700d51P70l24k7J13K03m55j17M35k30l1l45L35K45m71L03NQ3l81K96nl60M50
5722D1p1k3q6N5K24j08j93m4Q4k11K18P2J09k94J93J11j29j16l4N49n59M44r9
5745A33j79R2J8K45l52M65p1n7Ol70N96o22L81o1J37j42K00m26L92l23j92M24
5767B94m69L31j65K3Lk2q9J86m3k29L01j08l23N0l5J45j92K51k70M9J76J05r1
5790a22q6K94k08K4k46L85Q9j52L6l65K65q1R1R4j12n6o9L15p3o1J48J6k73L16
$$ plain form
5814 169 46 53 225 -65 161 -22 96 -169 20 160 179 273 123 118 -251 87 185 173 255 338 131 -66 366
5837 366 -35 -132 -13 319 153 260 -103 -209 46 -211 -245 -63 155 -22 -101 122 -54 -160 -9 -170 -18
5858 -18 -286 209 -224 80 -396 -117 -189 -276 -129 -62 -207 -36 -53 -175 -327 -112 -258 136 -5 -233 -180 45
5880 45 -56 7 69 -192 -183 -59 141 -132 115 86 122 -364 66 332 -118 80 104 372 2 190 515 -105 330
5903 330 158 265 -171 164 295 171 -45 276 583 -211 53 -70 146 -13 -260 -14 31 -217 74 -59
5923 -59 -165 -67 125 51 -93 -179 82 -249 -260 -145 -99 -5 -186 -76 -234 -148 -348 28 148 -435 -101 -15 91
5946 91 -224 -239 -144 -59 -263 91 159 -275 42 -223 45 -220 103 268 -173 -147 305 180 -138 317 154 -16
5968 -16 54 -31 232 342 92 228 136 -134 -241 189 -40 28 164 508 146 184 327 -24 -4 -33 408 -48 -134
$$ packed form
5814A69j23PJ72k90K26j83J18k65J89J40J9R4j50nl69L38R8j2Q2Q3k07j97M32
5837C66m01r7J19L32j66J07l63j06K55k57l4J82K18j77p9K23j76j06J51j61J52
5858a8k68M95m33L04m76K79p2q7J47O7j45J71j7j22j52K15j46L94j41k28N3K25
5880D5j01O3O2k61RJ24K00k73K47k9L6m86M30K66m50J98K4K68l70J88L25o20M35
5903C30j72J07m36L35J31j24k16L21L07p94K64j23K16j59k47K46M5k48K91j33
5923e9j06R8J92p4j44q6K61l31j1J15M6R4j81J10j58Q6k00L76J20n83L34Q6J06
5946I1l15j5R5Q5k04L54O8m34L17k65K68k65L23J65m41K6M52j25l18M55j63j70
5968a6P0q5K63J10k50J36r2k70j07M30k29O8J36L44l62L8J43l51K0k9M41m56q6
$$ plain form
5991 -134 -59 -47 -7 -51 138 -97 108 -170 -45 -107 -114 65 -178 40 -152 -18 -198 -315 -59 200 -150 -96 60
6014 60 -317 -44 -93 -133 14 -490 -121 -14 82 -276 -134 -333 -139 -10 -111 32 -234 -11 -53 -7 -70 -99 147
6037 147 132 282 40 38 -16 327 342 99 186 266 228 53 406 -13 124 336 88 233 60 252 -96 44 4
6060 4 -159 298 32 88 -10 48 -38 88 -124 32 162 158 8 -176 130 -253 36 -135 195 78 -197 55 -149
6083 -149 8 -16 -165 -93 61 213 -9 10 -107 -30 -31 -327 -182 -216 -144 -344 -135 -271 137 91 -151 -224 -258 65
6107 65 36 -103 -77 97 41 -98 110 90 177 -117 255 252 -113 -136 96 196 88 277 254 -63 -11 130 184 -48
6131 -48 195 119 135 62 44 50 102 -26 -135 370 -24 73 56 97 -314 -171 244 -15 -126 -165 135 -249 -66 23
6155 23 83 -363 -111 82 -310 102 -138 243 -369 -152 35 81 -97 -188 165 -1 103 38 -20 -120 -413 171
$$ packed form
5991a34P5J2M0m4J89k35K05k78J25o2pJ79k43K18j92J34j80j17K56K59l50N4J56
6014F0l77K73m9m0J47n04L69J07R6l58J42j99J94J29j01J43k66K23m2M6o3k9K46
6037A47j5J50k42kn4L43J5k43Q7Q0l8j75L53m19J37K12k48J45j73J92l48J40m0
6060Dj63M57k66N6r8N8q6J26k12J56J30mj50j84L06l83K89j71L30j17k75K52k04
6083a49J57k4j49P2J54J52k22J9j17P7jk96J45l4P2k00K09j36M08m6k42p3l4L23
6107F5k9j39K6J74n6j39K08k0Q7k94L72ll65k3K32J00j08J89k3l17N2J41N4k32
6131d8K43p6J6p3j8ON2j28j09N05l94R7j7M1m11J43M15k59j11l9L00l84J83Q9
6155B3O0m46K52J93l92M12k40L81o12K17J87M6j78r1L53j66J04o5n8j00k93N84
$$ plain form
6177 171 23 -218 -43 262 193 -33 78 132 -111 -135 174 174 -54 26 113 344 -152 286 239 -115 -160 -39 305
6200 305 -251 -17 65 183 -104 -204 325 -143 80 129 11 -225 -157 144 66 10 -201 217 -359 25 -117 163
6222 163 -260 169 158 -121 46 -88 97 -127 -225 -72 13 -251 -345 -107 -163 -90 32 128 -196 -355 -289 10 13
6245 13 -183 -120 17 39 77 180 -336 -216 242 79 -273 246 38 215 -11 8 -74 68 -132 156 119 66 164
6268 164 -87 363 85 6 213 158 53 172 223 -124 -60 136 311 101 150 69 -67 319 -165 93 60 -157
6290 -157 196 -64 -42 117 38 -203 191 -258 -137 -33 -2 58 -274 -198 -90 -63 -217 -117 -220 -252 -114 -334
6312 -334 -144 -111 -57 117 -146 -175 -124 73 -64 -70 -102 -16 -339 -196 -118 -286 28 -115 124 -87 -42 90 -143
6335 -143 -76 192 164 -336 192 -18 85 63 -24 52 -109 145 91 224 -103 207 43 91 303 92 -80 194
$$ packed form
6177A71j48k41J75L05o9k26J11N4k43k4L09%k28Q0Q7K31m96M38m7l54m5J21L44
6200C05n56K34Q2J18k87j00N29m68K23M9j18k36O8L01p8n6k11M18n76L84j42K80
6222A63m23M29j1k79J67j34J85k24r8J53Q5k64r4K38n6P3J22R6l24j59O6K99L
6245A3j96O3J37K2L8J03n16J20M58j63l52N19k08J77k26J9q2J42k00K88l7n3R8
6268A64k51M50k78p9K07n5j05J19N1l47O4J96J75k10M9q1j36L86m84K58l3k17
6290a57L53k60K2J59p9k41L94m49J21J04L1O0l32P6J08K7j54J00j03l2J38k20
6312c34J90L3N4J74k63k9N1J97j37ol2Q6l23J43P8j68L14j43K39k11M5J32k33
6335a43O7K68k8n00N28k10J03k2q7P6j61K54n4J33l27L10j64M8K12k11j72K74
$$ plain form
6357 194 18 68 5 -32 146 -206 74 229 126 142 -25 -317 23 -155 -132 -12 24 -234 -102 -119 -348 -368 -263
6380 -263 252 -64 -47 -59 -1 -328 -424 -36 -337 -165 -286 -48 -152 -235 -59 72 -286 -144 150 -114 1 -1
6402 -1 -62 188 -110 74 99 -27 -24 78 13 -107 213 288 97 -111 489 156 -116 212 -95 225 51 -13 144
6425 144 178 -58 298 83 -11 244 155 -44 -226 95 291 273 0 190 299 -6 184 161 179 -110 -90 270
6447 270 -77 -113 -79 -122 -40 -324 -124 -224 -166 -83 -151 -285 -5 -22 -292 -417 -229 -163 -286 -80 -254 -196 -430
6470 -430 -85 -118 -65 126 39 128 -101 -94 -181 -173 124 -237 0 -57 62 -180 40 244 21 -19 19 174 -85 241
6494 241 50 36 274 303 305 52 70 187 352 306 119 21 -2 199 118 160 -74 295 -63 133 223 -77 36 -129
6518 -129 11 -66 29 -192 138 -333 -62 -2 -259 -14 19 -9 -319 -127 -171 -287 57 -315 -301 -42 -118 -347 223
$$ packed form
6357A94j76N0o3l7J78l52K80J55j03J6j67k92L40j78K3J20L6k58J32j7k29k0J05
6380b63N15l16J7j2N8l27r6L88l01J72j21K38j04q3J76J31l58J42K94k64J15k
6402ao1K50k98J84K5j26LJ02o5j20L20P5j91k08O00l33k72L28l07L20j74o4J57
6425A44L4k36L56k15r4K55q9j99j82L21J96j8k73J90J09l05J90k3J8k89K0L60
6447B70l47l6L4m3Q2k84K00j00N8Q3o8j34K80j7k70j25J88O6j23K06j74N8k34
6470d30L45l3N3J91q7Q9k29Pq7QK97l61K37n7J19k42K20K04k23m0L8J55k59L26
6494B41j91j4K38K9Kk53J8J17J65m6j87r8k3K01q1M2k34L69l58J96R0l00J13j65
6518a29J40p7R5k21L30m71K71O0k57K45L3k8l10J92m4j16L44l72J4K59p6k29N70
$$ plain form
6541 223 1 -323 65 55 -40 -163 99 -69 -34 29 -114 44 -38 -74 -176 146 2 -15 168 254 128 -57 230
6564 230 230 52 178 -53 24 -120 229 2 178 33 73 211 187 162 49 412 92 11 121 -10 65 -72 168
6587 168 177 -114 72 17 148 61 99 -137 -245 -181 89 150 -180 -10 -32 -30 -40 -437 56 -48 116 110 161 -291 -47
6612 -47 -180 -89 -140 -165 -63 81 -140 -369 -98 -366 -260 124 -136 -260 -112 70 -105 -160 200 128 -226 4
6634 4 95 34 -45 75 214 167 8 229 -18 188 -38 40 113 249 128 -29 230 88 224 152 82 116 -71 -58
6658 -58 31 284 68 166 -182 -34 34 -68 -140 -123 20 -95 147 142 345 -56 -72 100 -179 13 38 -47 68 -146
6682 -146 -88 -14 -5 -50 -118 -108 88 -53 -169 37 -184 103 -27 -197 -78 210 -153 -182 146 -169 -60 52 185
6705 185 -72 86 -127 -226 -76 95 161 -178 50 47 125 135 236 298 107 177 57 78 138 -30 50 296 133 85
$$ packed form
6541B23k22l24L88j0r5j23K62j68L5O3j43J58q2l6j02L22j44j7J83Q6j26j85K87
6564B30%j78J26k31P7j44L49k27J76j45M0J38k4k5j13L63l20q1J10j31P5j37K40
6587A68Rk91J86n5J31q7L8k36j08O4K70O1l30J70k2Kj0l97M93j04J64oN1m52K44
6612d7j33R1n1k5J02J44k21k29K71k68J06L84k60j24J48J82j75n5L60p2l54K30
6634DR1o1p9J20J39m7j59K21k47K06k26P8P3J36j21j57K59j42J36p2p0L4j87J3
6658e8Q9K53k16R8l48J48O8j02p2J7J43j15K42nK03m01j6J72k79J92K5q5J15k14
6682a46N8P4Rm5o8J0J96j41j16K06k21K87j30j70J19K88l63k9L28l15J09J12J33
6705A85k57J58k13r9J50J71O6l39K28lP8J0J01O2j91P0j20K1O0j68Q0K46j63m8
$$ plain form
6729 85 84 52 242 20 -52 9 16 248 -1 213 -134 168 -115 -29 -82 -43 32 -379 1 -105 56 -13 -155 95
6753 95 -14 -70 -341 -110 -366 -141 -200 -122 -162 -160 106 -226 -205 -321 -92 -46 -130 22 -215 39 -151 204 55
6776 55 39 -15 58 140 -57 128 -126 -19 -80 263 -113 -61 -30 165 293 166 211 100 100 92 -27 241 137 271
6800 271 -23 215 78 223 230 -284 77 89 -92 -295 64 200 -83 13 -192 -91 -10 -50 -22 -81 -200 -126 -146
6823 -146 17 -34 -234 73 -93 -37 123 -141 -128 -384 8 -166 -176 -153 -147 -182 -305 -181 -137 -51 -163 -100 267 -48
6847 -48 -329 -65 -151 6 -9 -174 116 31 -199 146 -93 155 19 112 -162 66 225 158 147 342 474 92
6869 92 248 88 110 141 84 157 174 100 -190 35 179 277 127 -14 155 -10 -4 135 -224 -195 4 -24 -248 238
6893 238 -106 -26 -23 162 98 -161 1 -8 -103 -110 43 -202 -289 -362 -30 13 -206 -33 66 -249 -64 116 -36 -196
$$ packed form
6729H5jl2J90k22p2O1PK32k49K14l47L02k83Q6n3L9P5m11L80j06J61o9j42K50
6753I5j09n6k71K31k56K25n9P8m0KK66l32K1j16K29M6q4J52k37K54j90L55j49
6776E5j6n4P3Q2j97J85k54J07o1L43l76N2L1J95J28j27M5j11%qj19K68j04J34
6800B71k94K38j37J45Pn14L61J2j81k03L59J36k83R6k05J01Q1m0K8n9j19P4k0
6823a46J63n1k00L07j66N6J60k64J3k56L92j74j0K3Ol5j23J24M4Q6j12O3L67l15
6847d8k81K64q6J57j5j65K90q5k30L45k39K48j36R3k74K28J59o7j1J95J32l82
6869I2J56j60K2L1n7P3J7p4k90K25J44R8j50j41J69j65OJ39l59K9J99k8k24M86
6893B38l44Q0LJ85o4k59J62rr5pJ53k45q7p3L32M3k19J73R9l15J85J80j52j60
$$ plain form
6917 -196 160 -323 197 -112 -117 3 -67 253 117 57 -254 -205 82 222 27 152 100 90 95 249 107 61 -250
6940 -250 126 176 139 -156 -5 119 -61 128 108 240 -119 172 106 -47 -143 65 41 -17 105 -4 26 -211 -58
6963 -58 -122 191 -25 -126 342 85 -25 -244 -262 21 -144 62 -161 41 -394 -148 -308 51 -87 -265 16
6984 16 -50 -80 86 -163 -25 -61 -329 -253 106 -169 42 -401 156 -237 -151 228 91 -32 239 27 -43 -213
7006 -213 -27 37 139 172 388 137 369 124 69 -136 147 74 46 68 -97 214 65 170 -80 526 343 -186
7028 -186 306 -117 76 -15 52 175 -94 -14 -23 -116 33 -99 44 -43 -3 -78 -55 43 -53 -63 14 -188 99 -274 -142
7053 -142 -164 -106 -145 -91 -308 172 -174 -174 -300 -186 -148 -76 -25 -202 -172 -154 -11 73 95 -88 -53 42 -323 11 96
7078 96 -53 98 174 -82 145 33 302 408 30 109 -53 286 1 -130 150 263 190 231 -34 109 252 203
$$ packed form
6917a96L56m83N20l09nJ20p0L20j36o0l11M9K87J40j95J25n2j0NJ54j42m6l11
6940b50L76N0l7k95J51J24j80J89k0J32l59K91o6j53r6K08k4n8J22j09L0k37J53
6963e8o4L13k16j01M68k57j10k19j8K83j65K06k23K02m35K46j60L59j38j78K81
6984A6o6l0J66k49J38l6k68P6L59k75K11m43N57l93Q6L79j37j23K71k12p0j70
7006b13J86O4J02L3K16k51K32k45n5k05K83p3k8K2j65L11j49J05k50O06j83n29
7028a86M92m23J93r1O7J23k69Q0rr3J49j32J43q7M0p5K3R8r6j0P7k02K87l73J32
7053a42k2N8l9N4k17M80l46%j26J14L8P2N1j77L0J8J43Q4K2j83L5R5l65L34Q5
7078I6j49J51P6k56K27j12K69J06l78P9j62L39k85j31K80J13p3M1k65J43J43m9
$$ plain form
7100 203 -5 214 -270 -139 -75 -116 -272 83 145 -79 20 -50 -57 163 7 -161 -84 20 -122 -52 -183 -22 179
7123 179 -30 -303 159 -221 -153 11 -218 24 -42 -85 -125 24 85 -9 -127 -189 -235 -83 -202 -202 160 59 -54
7146 -54 110 -15 -149 -145 17 28 28 -12 49 162 -3 -31 -33 22 82 130 126 118 219 -295 -210 71 232 188 42 157 81
7173 81 117 -61 -33 78 64 -212 133 8 13 2 56 289 -165 -173 37 -79 -192 -121 110 -24 77 8 141 -157
7197 -157 -78 183 -167 -140 -252 78 -207 -213 -173 -212 -219 -57 0 52 -186 -135 12 -98 -351 72 -294 33 -184 54
7221 54 402 95 180 -2 78 177 -76 35 190 227 27 118 -41 -29 106 167 -9 -47 18 10 132 -28 -37 -21 -129
7246 -129 421 226 49 -308 177 207 101 194 233 335 -42 -88 21 -65 -162 -301 -214 -148 -73 -312 13 -19 -3 -93
7270 -93 127 105 -184 127 -2 -62 -107 43 49 -90 -214 36 -154 -166 -259 -126 -100 -53 -32 3 81 119 -88 -197 -39
$$ packed form
7100B03k08K19m84J31O4m1j56L55O2k24R9p0pK20j56j68P7J04j42P0j31J61K01
7123A79k09k73M62l80O8J64k29K42o6m3m0J49O1r4j18o2m6J52j19%L62j01j13
7146e4J64j25j34MJ62J1%m0O1J13j65k8kN5O0M8mqJ01n14Q5K81J61m4j46J15p6
7173H1L6j78K8J11j4k76L45j25Nj1N4K33m54qK10j16j13P1K31j34J01o9J33k98
7197a57P9K61l50K7j12L30k85oM0l9pJ62N7N2k38N1J47j10k53M23l66L27k17K38
7221E4L48l07Q5j82Q0R9k53J11J55L7k00R1j59J2J35O1j76l8O5qJ22j60rJ6j08
7246a29N50j95j77l57M85L0j06R3L9J02l77m6J09q6r7j39Q7O6P5k39L25l2J6r0
7270i3K20k2k89L11j29o0m5J50Oj39j24K50j90j2r3J33K6M7K1L5P8L8k07j09J58
$$ plain form
7295 -39 12 -20 78 -88 -1 -95 165 107 -112 153 -37 -12 147 37 194 2 -187 80 -4 141 69 -86 -9 74
7319 74 -93 -88 141 30 -166 -101 30 -41 404 -20 204 -32 -33 13 -98 -98 -221 -34 -220 94 6 -24 93 -117
7343 -117 -20 -91 -152 -94 61 -117 -222 244 -71 -158 -104 -92 -236 -78 -84 -49 -176 -223 -12 -65 15 -9 -206 -269 -92
7368 -92 26 27 168 39 -26 -166 27 -1 -12 96 -193 -60 -101 56 253 130 -56 -72 240 240 237 81 232 192
7392 192 259 235 -100 154 -98 227 51 138 191 7 -24 -38 221 101 161 -84 67 173 -49 -2 -21 -38 33 146
7416 146 67 -222 15 4 322 -193 30 257 -97 -91 -136 228 -6 79 -383 108 -234 -47 -135 17 129 31 -42
7439 -42 210 -26 -17 113 102 0 2 -150 -91 -8 -129 108 65 -41 90 52 -70 96 283 97 180 99 183 -24
7463 -24 251 291 119 -78 64 -40 -239 438 320 160 191 -77 24 88 2 -123 286 38 44 -210 36 -131
$$ packed form
7295c9N1l2R8j66Q7r4K60n8k19K65j90K5J59j10J57j92j89K67q4J45p2j55P7Q3
7319G4j67NK29j11j96O5J31p1M45m24K24k36jM6j11%j23J87j86L14q8l0J17k10
7343a17R7p1o1N8J55j78j05M66l15q7N4J2j44J58oL5j27m7K11n3Q0k4j97o3J77
7368i2J18JJ41j29o5j40J93k8j1J08k89J33m1J57J97j23j86j6L12%lj56J51m0
7392A92O7k4l35K54k52L25j76Q7N3j84l1j4K59j20O0k45J51J06k22M7j9j7P1J13
7416A46p9k89K37j1L18n15K23K27l54Om5L64k34Q5m62M91l42J87q8J52J12r8p3
7439d2K52k36RJ30j1j02Kj52N9Q3j21K37m3j06J31l8j22J66J87j86Q3q1Q4k07
7463b4K75M0j72j97J42j04j99O77j18j60L1k68J01O4q6j25M09k48Ok54K46j67
$$ plain form
7485 -131 118 52 129 -119 -66 -167 -299 140 48 -223 83 -192 -211 -150 -183 42 98 -94 -283 54 -169 56 -45
7508 -45 -125 -99 -104 -171 -115 83 -208 185 -190 -70 -23 -51 -101 -199 277 -106 120 45 -87 191 236 304 -6 -134 166
7533 166 -69 -12 225 -72 -118 -122 -89 168 -197 84 188 -2 122 112 49 -15 118 -45 3 -91 120 45 54 30 -177
7558 -177 147 -20 -57 -172 127 130 -128 12 -348 16 -274 -98 -300 -69 -13 -85 58 -161 -135 -208 -156 -113 -187
7581 -187 -63 -67 -308 -151 -42 -74 -365 -21 -183 15 118 90 -99 -45 -4 8 190 -210 43 -94 12 55 124
7604 124 199 53 120 15 11 157 57 137 169 72 190 188 296 301 -137 -18 -41 19 -112 -62 20 27 71 70 34 -16 -23 51
7632 51 -93 247 81 12 -159 118 76 197 135 -64 -23 -166 66 -74 -136 46 77 73 26 55 -248 -89 -81 167
7656 167 149 -205 -268 -13 -152 -68 -46 -79 184 -338 165 118 -132 -176 29 78 12 150 51 24 43 32 10 76 -88
$$ packed form
7485a31K49o6P7k48N3j01j32M39r2k71L06k75j9O1l3K25N6j92j89L37k23K25j01
7508d5q0K6no7N6J98k91L93l75J20M7k8n0r8M76l83K26p5j32K78M5O8l10j28L00
7533A66k35N7K37k97m6mL3K57l65K81J04j90J24j0o3o4J33j63M8r4K11p5Rk4k07
7558a77L24j67l7j15K99Lk58J40l60L64k90J76k02K31N6p2J43k19K6p3N2M3p4
7581a87J24mk41J57J09l2k91L44j62J98J03k8j89N4M1J2J82m00K53j37J06M3O9
7604A24P5j46O7j05mJ46j00Q0L2r7J18kJ08Nm38J19k3O0j31N0Q2PM4jl6n0pP4
7632E1j44L40j66o9j71K77m2J21o2j99M1j43K32j40o2J82L1mm7K9l03J59QK48
7656A67j8l54o3K55j39Q4K2l3K63n22N03m7k50m4K05M9o6J38r9k7J9j1k2O6j64
$$ plain form
7681 -88 -27 -84 130 287 238 99 203 119 -80 147 221 95 -54 8 -19 88 121 208 64 -241 121 -94 284
7704 284 -98 194 -118 130 106 -89 -40 -319 -10 -18 -152 13 -42 -58 -297 -112 -140 -111 -72 181 -183 -65 58
7727 58 -156 -226 -132 -84 64 55 -135 -134 -163 -33 -305 119 90 97 126 -55 -28 104 -64 -37 116 -104 -6 -42 234 368
7753 368 325 146 67 155 126 216 -115 166 -177 -31 -117 -97 26 -48 131 39 276 156 115 84 148 -2 43 199
7777 199 -222 33 -1 173 -215 12 38 -236 34 4 63 42 126 -13 246 -133 -156 -47 69 -154 -138 -163 66
7800 66 -119 -182 -222 -204 -173 -85 -38 104 -171 -142 -121 -120 -89 -87 188 289 56 -182 -34 -29 5 -95 124 -171 -66 -41
7826 -41 -25 4 92 243 213 -117 54 206 132 39 49 287 100 -78 231 54 11 89 91 -61 -55 -214 -47 86 170
7851 170 -116 148 56 79 -115 -64 -166 198 150 68 -75 -58 -155 172 -158 -203 -319 -157 -146 102 -65 -276 59
$$ packed form
7681h8O1n7K14J57m9j39J04q4j99K27P4j26j49O2k7J07L3Q7j44l05L62k15L78
7704B84l82K92l12K48k4j95M9k79L09qj34J65n5j6k39J85k8K9L9K53l64J18J23
7727E8k14p0R4M8J48rj90Jk9J30k72M24k9PK9j81K7J32j68K7J53k20R8l6K76J34
7753C68m3j79p9Q8k9R0l31K81l43J46q6K0J23p4J79r2K37j20m1l1O4j50M5J56
7777A99m21K55l4J74l88K27K6k74K70l0N9k1Q4j39K59l79k3J09J16k23J6k5K29
7800F6j85o3m0J8L1Q8M7J42k75K9K1JL1KK75J01k33k38J48NL4j00K19k95J05K5
7826d1J6K9Q8J51l0l30J71J52p4r3J0K38j87j78L09j77m3P8Kj52Oj59J67J33Q4
7851A70k86K64r2K3j94N1j02L64m8q2j43J7r7L27l30m5j16J62J1K48j67k11L35
$$ plain form
7874 59 -45 0 16 -21 148 -122 -26 -145 -34 119 -158 170 -42 -78 -130 -46 120 199 92 -36 -153 107 -51
7897 -51 35 275 -51 84 -87 155 126 113 251 6 204 -193 160 43 118 158 -49 140 33 -10 116 207 188
7920 188 176 -53 6 -112 -133 -208 -230 -5 -152 51 57 -92 -58 -192 -191 -87 -60 -7 -337 -156 81 10 -112 -45 -113
7945 -113 26 -252 -131 -120 -62 -2 -75 2 -20 -54 -186 -44 -160 -161 -76 -70 -62 9 210 5 -200 -162 -200 103 -10 148
7971 148 -6 77 82 -200 181 131 206 123 -63 78 -34 -202 115 97 -46 250 -26 111 132 -119 -14 81 93
7994 93 -44 209 118 -40 60 -107 -44 -101 97 -51 -24 160 -69 47 -113 -141 -233 -157 -257 5 -80 280 -378
8017 -378 -173 -5 -80 -144 -172 150 -10 44 100 -279 159 165 19 -220 27 62 -53 -97 -236 -67 -39 75 74 -133
8041 -133 22 -22 125 -132 76 -33 223 234 150 30 96 265 -168 -17 -69 171 132 -244 -47 -28 118 -208
$$ packed form
7874E9j04M5J6l7J69k70R6j19J11J53k77L28k12l6n2Q4J66P9j07j28j17K60j58
7897e1Q6K40l26J35j71K42k9j3J38k45J98l97L53j17P5M0k07J89j07m3J26R1j9
7920A88j2k29N9j18k1p5k2K25j47K03Oj49L4j34JJ04K7N3l30J81K37p1j22O7o8
7945a13J39k78J21J1N8O0p3P7k2l4j32J42j16jQ5OQP1K01k05k05L8l8L03j13J58
7971A48j54Q3Nk82L81n0P5q3j86J41j12j68L17j8j43K96k76J37K1k51J05R5J2
7994I3j37K53r1j58J00j67O3n7J98j48K7J84k29J16j60k8r2P6j00K62q5L60o58
8017c78K05J68p5o4k8L22j60N4N6l79M38Oj46k39K47L5j15m4j39J69K8J14jk07
8041a33J55m4J47k57K08j09K56J1q4j20O6J69m33J51n2K40l9l76J97J9J46l26
$$ plain form
8063 -208 211 -113 -35 328 273 177 -141 180 -79 123 34 200 117 -118 98 -314 -156 -33 -8 -370 -13 6
8085 6 -151 -63 -153 6 -80 153 -34 -324 -185 -3 -353 -338 -112 40 -221 14 88 -103 17 -79 -176 -16 -87
8108 -87 -20 -20 -45 48 -146 226 -134 -4 73 -13 136 -15 111 -144 -56 21 -71 85 -196 -94 148 51 122 46 99
8133 99 76 -91 128 -83 -170 334 -6 22 61 253 105 -155 -59 199 -19 -116 97 -103 -106 0 -13 207 -256
8156 -256 -133 -263 -17 12 47 -18 -59 232 -150 -295 -213 308 -11 -2 79 -141 210 -292 78 113 -107 -11 20 -124
8180 -124 -198 -99 -243 177 -13 -160 112 -23 32 -15 110
$$ packed form
8063b08M19l24P8L63n5r6l18L21k59K02q9J66q3k35K16m12J58J23K5l62L57J9
8085Fj57Q8r0J59q6K33j87k90J39J82l50J5K26J52k61K35P4j91J20r6r7J60p1
8108h7O7%k5R3j94L72l60J30P7q6J49j51J26k55Q8P7r2J56k81J02K42r7P1p6N3
8133I9k3j67K19k11q7N04l40K8L9J92j48k60R6K58k18r7K13k00lJ06j3K20m63
8156b56J23j30K46K9L5o5m1K91l82j45Q2N21l19RQ1k20L51n02L70L5k20R6L1j44
8180a24p4R9j44M20j90j47K72j35N5m7J25
8191A10
$$ Imaginary data points
##PAGE= N=2
##DATA TABLE= (X++(I..I)), XYDATA
$$ plain form
0 0 0 0 0 0 0 0 -8 8 -8 8 -8 16 -24 24 -32 40 -48 59 -72 88 -107 128 -147 176 -207 243 -282 323 -371 428
30 428 -488 557 -630 712 -806 907 -1017 1138 -1271 1417 -1575 1750 -1942 2149 -2377 2620
46 2620 -2894 3191 -3516 3872 -4264 4697 -5178 5715 -6317 6997 -7771 8664 -9703 10931
60 10931 -12414 14236 -16545 19575 -23736 29832 -39623 57865 -103175 445967 480985 -487488
72 -487488 326294 491182 -74113 115886 391245 -48763 -42172 127882 201970 47609 -271674
83 -271674 -72852 291683 -169888 -326453 205917 -107599 -408298 218327 51402 -466176
93 -466176 -575 217795 -265688 -103147 103178 -101734 -42128 2267 -49361 43525 -59395
104 -59395 -101108 164612 -58766 -229157 200461 78906 -272198 40883 173509 -156159
$$ packed form
0@%%%%%%qJ6j6J6j6K4m0M8n6P2q8J07j31J60j95K35k75L23l83M50n25O05o94P99
30D28r16J045j187J342j518J713j924K155k409K688k992L325l692M091m526M997
46B620n514O085o707P388q136Q961r875J0893j2032J3314j4768J6435j8367K0634
60A0931k3345K6650l0781L6120m3311N3568o9455R7488j61040N49142L5018r68473
72d87488Q13782J64888n65295J89999K75359m40008O591J70054P4088j54361l19283
83b71674J98822L64535m61571j56565N32370l13516l00699O26625j66925n17578
93d66176M65601K18370m83483J62541K06325k04912N9606M4395n1628R2886j02920
104e9395m1713K65720k23378j70391M29618j21555l51104L13081J32626l29668
$$ plain form
114 -156159 5031 133726 -128930 7047 174321 -17200 -38588 79253 27516 87814
124 87814 55721 -37204 91322 14737 -35448 158579 19988 -221677 101748 179757 -208652
135 -208652 -68821 138456 -108809 -125475 113914 -26156 -155760 1208 47395 -6089
145 -6089 -66626 -24442 58821 14990 -52403 72162 64463 -96052 69712 129809 -71842 -9601
157 -9601 133778 -28097 -45279 107725 4571 -53372 20541 34909 -7321 -16459 -18024 11577
169 11577 15229 -57484 17425 38073 -65369 -29716 67356 -11158 -60181 22961 -5552 -8104
181 -8104 9033 -22997 -23780 2695 -10676 -13034 2429 -53695 -11172 13673 -29158 -12094 -13253
194 -13253 -46564 4126 54055 -58025 -49528 51169 18677 -35636 12346 30559 -29246 16212
$$ packed form
114a56159J61190J28695k62656J35977J67274j91521k1388J17841n1737O0298
124H7814l2093r2925J28526p6585n0185J94027j38591k41665L23425P8009l88409
135b08652J39831K07277k47265j6666K39389j40070j29604J56968M6187n3484
145f089o0537M2184Q3263m3831o7393J24565p699j60515J65764O0097k01651O2241
157i601J43379j61875j7182J53004j03154n7943P3913J4368m2230r138j565K9601
169A1577L652p2713P4909K0648j03442L5653R7072p8514m9023Q3142k8513k552
181h104J7137l2030p83K6475j3371k358J5463n6124M2523K4845m2831J7064j159
194a3253l3311N0690M9929j12080Q497J00697l2492n4313M7982J8213n9805M5458
$$ plain form
206 16212 45224 13612 -24446 35 57102 19977 -22787 5198 35715 -13809 14475 29684
218 29684 -32229 -6406 34694 -278 -31642 21613 55 -22358 15127 5543 -16016 -3224
230 -3224 22449 -12661 -4127 13157 10456 4799 -5614 11143 10347 18178 9041 3957 -13248 22257
244 22257 46678 -21193 -18221 23376 16641 -16646 15645 4232 -42862 -5186 30976 3111
256 3111 -57925 -30673 13868 13831 -37489 -45577 7823 -20639 -32163 11703 5760 -70180 -25602
269 -25602 53484 -1160 -50118 -15625 35284 -4123 -13813 23602 15151 -29975 1414 71424
281 71424 1148 -39222 25230 50413 -14623 -1327 47406 -10117 -20140 28811 38304 -19761
293 -19761 -21120 18126 20344 -7857 -18777 23877 -5445 -27469 10241 29323 -19023 -36585
$$ packed form
206A6212K9012l1612l8058K4481N7067l7125m2764K7985L0517m9524K8284J5209
218B9684o1913K5823M1100l4972l1364N3255k1558k2413L7485r584k1559J2792
230c224K5673l5110Q534J7284k701n657j0413J6757p96P831r137n084j7205L5505
244B2257K4421o7871K972M1597o735l3287L2291j1413m7094L7676L6162k7865
256C111o1036K7252M4541l7n1320q088N3400k8462j1524M3866n943p5940M4578
269b5602P9086n4644m8958L4493N0909l9407r690L7415q451m5126L1389P0010
281G1424p0276m0370O4452K5183o5036J3296M8733n7523j0023M8951R493n8065
293a9761j359L9246K218k8201j0920M2654k9322k2024L7710J9082m8346j7562
$$ plain form
305 -36585 19326 20463 -10656 -25201 17441 12599 -25393 -1187 33403 1426 -45667 23705
317 23705 42078 -20717 -21335 35807 17601 -30956 18324 35077 -3552 -26985 22813 36025
329 36025 -16374 -14027 18971 10353 -30863 7691 18781 -27171 -35609 4843 13997 -39863 -31354
342 -31354 -6638 -9130 -32835 -16746 372 -33748 -32203 5690 18679 -38166 -25589 24864
354 24864 11545 -13731 1104 26965 -5282 2206 31297 24378 -14002 -1394 42394 15178
366 15178 -9691 547 27136 3560 -4637 16990 8052 -7075 -624 29187 5140 -8728 5382
379 5382 24907 15367 -8183 14720 18382 6550 -1731 19086 6920 -14499 2839 9249 -5773
392 -5773 -29923 -3963 -2989 -23526 -25820 -12212 -11552 -32280 -13154 -6859 -13957 -21757 2313 8560
$$ packed form
305c6585N5911J137l1119j4545M2642m842l7992K4206L4590l1977m7093O9372
317B3705J8373o2795o18N7142j8206m8557M9280J6753l8629k3433M9798J3212
329C6025n2399K347L2998q618m1216L8554J1090m5952q438M0452R154n3860Q509
342c1354K4716k492k3705J6089J7118l4120J545L7893J2989n6845J2577N0453
354B4864j3319k5276J4835K5861l2247P488K9091o919l8380J2608M3788k7216
366A5178k4869J0238K6589k3576q197K1627q938j5127O451K9811k4047j3868J4110
379E382J9525r540k3550K2903L662j1832q281K0817j2166k1419J7338O410j5022
392e773k4150K5960R74k0537k294J3608O60k0728J9126O295p098p800K4070O247
$$ plain form
406 8560 -10417 3530 13502 17907 3033 15531 23929 16826 10125 12547 22511 2219 6624 5638
420 5638 500 -10610 -7888 -808 -17826 -21254 -22094 -7985 -18275 -23160 -19689 -15322 -9482 -11875
434 -11875 -10 -13721 -6555 7209 12156 3513 -1510 10560 11282 20031 6471 5257 5001 12174
448 12174 16554 1842 85 74 12801 2897 6396 3818 -3977 9474 17946 11747 -8260 17488
462 17488 23736 7757 6884 19887 16369 -155 17617 14458 -41 -8875 14155 7752 -28956
475 -28956 -13215 6963 -9277 -41257 -14840 -5841 -29781 -25004 -9068 -20531 -40025 -2609
487 -2609 6353 -21447 -33977 2233 22868 -12010 -13657 6801 12852 -6738 15026 21033 -16448
500 -16448 -8339 30375 27513 -24207 -11728 22250 16642 -9452 -4157 12001 -10121 540 19523
$$ packed form
406H560j8977J3947R972M405j4874J2498Q398p103o701K422R964k0292M405r86
420E638n138j1110K722P080j7018l428q40J4109j0290m885L471M367N840k393
434a1875J1865j3711P166J3764M947q643n023J2070P22Q749j3560j214k56P173
448A2174M380j4712j757j1J2727r904L499k578p795J3451Q472o199k0007K5748
462A7488O248j5979q73J3003l518j6524J7772l159j4499q834K3030o403l6708
475b8956J5741K0178j6240l1980K6417Q999k3940M777J5936j1463j9494L7416
487b609Q962k7800j2530L6210K0635l4878j647K0458O051j9590K1764O007l7481
500a6448Q109L8714k862n1720J2479L3978n608k6094N295J6158k2122J0661J8983
$$ plain form
513 19523 7352 -28226 -1509 37148 1999 -21297 956 22682 -167 -851 5293 425 -1865
526 -1865 3707 16262 -7503 -13846 3640 21819 -3726 -22507 7011 14496 537 -11294 7106
539 7106 5569 -1525 5873 12475 1006 -15580 18950 26478 -8434 -20867 22024 23730 -17102
552 -17102 -3196 11335 -1439 -13613 10231 4838 -24933 -15966 13314 6606 -37264 -18210 11761
565 11761 -4726 -31671 -7576 6882 -27997 -14128 10024 -4353 -32802 -4943 19532 -8844
577 -8844 -23457 1230 21342 -13684 -10647 19408 8279 -18028 6658 31605 -9746 -10224 21981
590 21981 21259 -10936 974 26402 6080 -4347 7986 23909 -212 -4487 16930 16169 -4788
603 -4788 -1329 23570 1787 -5750 7777 14665 -1601 -8022 10347 7805 -2355 -10773 8237
$$ packed form
513A9523j2171l5578K6717L8657l5149k3296K2253K1726k2849o84O144m868k290
526a865N572J2555k3765o343J7486J8179k5545j8781K9518P485j3959j1831J8400
539G106j537p094P398O602j1469j6586L4530P528l4912j2433M2891J706m0832
552a7102J3906J4531j2774j2174K3844n393k9771Q967K9280o708m3870J9054K9971
565A1761j6487k6945K4095J4458l4879J3869K4152j4377k8449K7859K4475k8376
577h844j4613K4687K0112l5026L037L0055j1129k6307K4686K4947m1351m78L2205
590B1981p22l2195J1910K5428k0322j0427J2333J5923k4121m275K1417p61k0957
603d788L459K4899k1783p537J3527O888j6266o421J8369k542j0160q418J9010
$$ plain form
616 8237 5821 -11688 -5064 7600 -3520 -19536 7054 3661 -15819 -13413 6020 1272 -18757
629 -18757 -5980 -259 -2012 -13926 -2508 1759 -12926 -7920 5948 2505 -21388 -2385 10479
642 10479 -1813 -12729 -2649 6777 -5543 726 -201 -562 -8215 1000 12859 -4756 -13985 509
656 509 17453 -6115 -8102 2689 701 -801 5098 5724 -12853 400 11183 8812 -5069 -6512
670 -6512 9262 9707 6002 -1803 5513 1719 9328 14905 692 -2078 7368 16935 2701 4721 1447
685 1447 3391 11168 5879 622 -3785 6728 3894 3519 -4817 -4676 4232 -305 -2646 -5407 -1927
700 -1927 -8034 2598 -437 -14392 -6309 1457 409 -13735 -6749 -3229 -2207 -6347 -7446 -2350
714 -2350 -12076 -4273 3675 -2208 -21306 -4610 11695 -7798 -13649 -3518 3380 -11443 -1402
$$ packed form
616H237k416j7509O624J2664j1120j6016K6590l393j9480K406J9433m748k0029
629a8757J2777N721j753j1914J1418M267j4685N006J3868l443k3893J9003J2864
642A0479j2292j0916J0080R426j2320O269r27l61p653R215J1859j7615r229J4494
656E09J6944k3568j987J0791j988j502N899O26j8577J3253J0783k371j3881j443
670f512J5774M45l705p805P316l794P609N577j4213k770R446R567j4234K020l274
685A447J944P777n289n257m407J0513k834l75q336J41Q908m537k341k761L480
700a927o107J0632l035j3955Q083P766j048j4144O986L520J022m140j099N096
714b350r726P803P948n883j9098J6696J6305j9493n851J0131O898j4823J0041
$$ plain form
727 -1402 5694 -7965 -14631 2388 18460 -9944 -15474 8046 15008 -8400 -593 18378 -4450
740 -4450 -5860 19064 23940 -11723 -4860 27722 18002 -4433 3939 25299 2073 273 23385
753 23385 17695 -13166 -127 33269 6396 -14519 2706 20018 -4440 -8859 11341 -457
765 -457 -15346 -4968 16202 -11031 -24707 88 9748 -15032 -22640 4973 -3913 -17387 -8399
778 -8399 4933 -13370 -18733 6334 1639 -16028 -14876 10879 1488 -16082 -4709 6763 -1157
791 -1157 -10771 5674 -186 -8116 -2456 8578 3 -13517 -183 6937 4802 -11080 -3500 7535
805 7535 2971 -2320 751 8550 -2929 4865 13108 9020 -3136 5456 22205 10489 1650 5862
819 5862 20848 9301 3372 14193 10186 364 3905 18064 -1004 -9487 1828 8384 -4782
$$ packed form
727a402P096j3659o666J7019J6072k8404n530K3520O962k3408P807J8971k2828
740d450j410K4924M876l5663O863L2582r720k2435Q372K1360k3226j800K3112
753B3385n690l0861J3039L3396k6873k0915J7225J7312k4458m419K0200j1798
765d57j4889J0378K1170k7233j3676K4795R660k4780p608K7613q886j3474Q988
778h399J3332j8303n363K5067m695j7667J152K5755r391j7570J1373J1472p920
791a157r614J6445n860p930N660J1034q575j3520J3334P120k135j5882P580J1035
805G535m564n291L071P799j1479P794Q243m088j2156Q592J6749j1716q839M212
819E862J4986j1547n929J0821m007r822L541J4159j9068q483J1315O556j3166
$$ plain form
832 -4782 -15136 -2635 -4388 -10725 -14538 -1896 -11075 -23865 -5894 2937 -14343 -25684 2707
845 2707 2878 -14428 -8412 6878 -1316 -13829 10641 14066 -6538 -11717 19345 18992 -10866 187
859 187 17232 6525 -7459 14895 11738 -10642 -2074 16572 8984 -14269 -1892 8710 3274
872 3274 -8817 178 4963 -11602 -3972 6744 523 -17836 -3099 7630 -5849 -9556 -2187
885 -2187 2279 -11178 -2863 4708 -2904 -12205 244 10967 -8966 -5224 8263 4893 -10094 4326
899 4326 14410 -2618 -2243 7472 9910 -2345 6155 9295 637 -1187 6775 12792 -1984 -687
913 -687 2632 6167 4027 2193 364 -4641 5799 4767 2676 -4126 -2380 1481 3895 5326 -5057
928 -5057 -4245 -3414 6834 3438 -6862 -9419 -1682 5691 -6234 -4633 -6244 -7144 -6984 1984 -1139
$$ packed form
832d782j0354J2501j753o337l813J2642r179j2790J7971Q831j7280j1341K8391
845B707J71j7306O016J5290q194j2513K4470L425k0604n179L1062l53k9858J1053
859A87J7045j0707j3984K2354l157k2380Q568J8646p588k3253J2377J0602n436
872C274j2091Q995M785j6565P630J0716o221j8359J4737J0729j3479l707P369
885b187M466j3457Q315P571p612r301J2449J0723j9933L742J3487l370j4987J4420
899D326J0084j7028L75R715K438j2255Q500L140q658j824P962O017j4776J297
913f87L319L535k140j834j829n005J0440j032k091o802J746L861K414J431j0383
928e057Q12Q31J0248l396j0300k557P737P373j1925J601j611r00J60Q968l123
$$ plain form
943 -1139 -17946 -10325 1920 1690 -14650 -7029 -393 -7245 -3805 3238 -22 -13812 1821 9370
957 9370 -947 -5270 4444 6411 -3710 6832 8518 2101 -3663 8723 11918 14 2298 6524
971 6524 8338 -2527 6524 12031 1163 -4768 5676 15399 -2193 -3912 6217 8803 -4471 156
985 156 12441 -2165 -8712 3970 15229 -7572 -10559 8019 5690 -7912 -4993 8693 -6500
998 -6500 -9539 2295 5091 -10134 -11413 4596 -1615 -8462 -7634 2171 -6194 -10261 -797 -541 -6925
1013 -6925 -11442 2068 -789 -7471 -5755 1842 -1180 -8667 3569 4499 -3442 -7175 8873 7670
1027 7670 -6419 -384 8471 5480 -6100 7581 8739 -3334 -1535 10719 8404 -8763 910
1040 910 9204 5315 -6210 659 7542 -1838 -2060 3053 6111 -8244 -2503 9485 3242 -8752
$$ packed form
943a139j6807P621J2245k30j6340P621O636o852L440P043l260j3790J5633P549
957I370j0317m323R714J967j0121J0542J686o417n764J2386L195j1904K284M226
971F524J814j0865R051N507j0868n931J0444R723j7592j719J0129K586j3274M627
985A56J2285j4606o547J2682J1259k2801k987J8578k329j3602K919J3686j5193
998f500l039J1834K796j5225j279J6009o211o847Q28R805q365m067R464K56o384
1013f925m517J3510k857o682J716P597l022p487J2236R30p941l733J6048j203
1027G670j4089O035Q855k991j1580J3681J158j2073J799J2254k315j7167R673
1040I10Q294l889j1525O869O883r380k22N113L058j4355N741J1988o243j1994
$$ plain form
1054 -8752 -3947 11815 228 -5230 955 7189 -3242 -2915 11048 2400 -7956 -678 15729 -418
1068 -418 -8762 5843 7565 -3129 -2769 10782 -1871 -8255 2372 9584 -3964 -10958 4373 2508
1082 2508 -7021 -7413 5242 -5224 -14425 -51 2912 -8497 -15163 749 -1210 -10089 -7037 709
1096 709 -4721 -13275 1776 4866 -5687 -11811 4745 6185 -5026 164 3903 1533 -3734 9544
1110 9544 8393 -3046 -2199 8588 11378 -1593 2181 5242 4497 1858 8087 6673 -3525 2226
1124 2226 7833 9835 -1031 505 5659 4988 3627 3475 5919 -2902 1859 5838 4804 -1944 -3852
1139 -3852 1564 307 360 -5905 -2427 -5708 -6807 -1849 -2841 -8256 -12186 -2338 -3895 -4666 -6478 -6129
1155 -6129 -4241 -3228 1215 -1630 -2234 -5714 3817 5814 -648 320 433 2121 1859 7123 -2039 -3656
$$ packed form
1054h752M805J5762j1587n458O185O234j0431L27J3963q648j0356P278J6407j6147
1068d18q344J4605J722j0694L60J3551j2653o384J0627P212j3548o994J5331j865
1082B508r529l92J2655j0466r201J4374K963j1409o666J5912j959q879L052P746
1096G09n430q554J5051L090j0553o124J6556J440j1211N190L739k370n267J3278
1110I544j151j1439Q47J0787K790j2971L774L061p45k639O229j414j0198N751
1124B226N607K002j0866J536N154o71j361j52K444q821M761L979j034o748j908
1139c852N416j257N3o265L478l281j099M958r92n415l930R848j557p71j812L49
1155f129J888J013M443k845o04l480R531J997o462R68J13J688k62N264r162j617
$$ plain form
1171 -3656 892 1356 2288 -2428 -4768 -5953 2522 -1611 -3619 -2583 -5319 -553 1670 2582 -3673 -312
1187 -312 1495 6505 7309 -1416 3521 7136 6644 3596 8499 2205 510 7851 4685 2938 -1373 531
1203 531 1485 4640 -3607 -4721 5060 -2313 -3846 1834 3893 -6087 -846 5696 741 -1375 -241
1218 -241 7119 -157 -2744 2694 6119 -4485 -5840 6817 -2921 -7706 -1733 -56 -10588 -6676
1232 -6676 -169 -7545 -8690 -7830 -811 -4129 -7504 -5010 1180 -1564 -6320 5365 1785 -4534 732
1247 732 10137 2331 -5055 4980 7733 2197 -4793 6052 5679 -5048 -1127 8697 460 -11927
1261 -11927 5682 8297 -5950 -5777 6986 3825 -5051 3520 5332 1783 -1991 7194 8753 -443
1275 -443 -1089 6530 9633 -2094 1199 4931 2013 -1732 2323 5345 -5099 -4832 2614 6410 -7489
$$ packed form
1171c656M548M64R32m716k340j185Q475m133k008J036k736M766K223R12o255L361
1187c12J807N010Q04q725M937L615m92l048M903o294j695P341l166j747m311J904
1203E31R54L155q247j114R781p373j533N680K059r980N241O542m955k116J134
1218b41P360p276k587N438L425j0604j355J2657r738m785N973J677j0532L912
1232f676O507p376j145Q60P019l318l375K494O190k744m756J1685l580o319N266
1247G32R405p806p386J0035K753n536o990J0845l73j0727L921R824q237j2387
1261a1927J7609K615j4247J73J2763l161q876Q571J812l549l774R185J559r196
1275d43o46P619L103j1727L293L732k918l745M055L022j0444K67P446L796j3899
$$ plain form
1290 -7489 -7737 4816 246 -6743 -1119 4937 -9381 -4951 7968 1278 -11072 -4345 8016 -3041
1304 -3041 -6384 -601 994 -7073 -3469 4730 -4240 -8876 -3539 5316 -3404 -7054 -2295 755 -954
1319 -954 -5046 2013 551 -3006 -2930 5996 2892 -6737 2164 7150 298 -5501 7743 6166 -4923
1334 -4923 387 8214 3353 -4904 6195 4821 -2466 936 8784 2503 -6227 3791 6298 2546
1348 2546 -2045 1674 1829 577 3876 1073 -317 -3779 2242 4474 1246 -5042 -4322 5348 2633
1363 2633 -2276 -3691 1358 -2080 -258 5209 -2800 -7007 -81 8236 -2824 -5775 156 5 -1604
1378 -1604 -285 1141 -7540 -3084 2423 391 -5689 -4430 -95 -2706 -255 -3602 -3239 -2252 362
1393 362 -1624 -2836 1188 -3022 -580 1250 850 -4070 1334 4596 -2892 -947 3183 3363 -3141 1406
$$ packed form
1290g489k48J2553m570o989N624O056j4318M430J2919o690j2350O727J2361j1057
1304c041l343N783J595q067L604Q199q970m636N337Q855q720l650M759L050j709
1319i54m092P059j462l557P6Q926l104r629Q901M986o852n799J3244j577j1089
1334d923N310P827m861q257J1099j374p287L402P848o281q730J0018K507l752
1348B546m591L719J55j252L299k803j390l462O021K232l228o288P20R670k715
1363B633m909j415N049l438J822N467q009m207O926Q317j1060k951N931j51j609
1378a604J319J426q681M456N507k032o080J259M335k611K451l347L63R87K614
1393C62j986j212M024m210K442J830m00m920N404L262p488J945M130J80o504M547
$$ plain form
1409 1406 3542 399 1625 2873 2617 -1351 4529 3676 1584 1594 2197 3013 3128 5559 -1601 1460 5799
1426 5799 3646 -928 2433 4220 -2268 3415 4432 -1420 -3574 3672 3089 -4666 -398 819 -1621
1441 -1621 -4340 1700 -1345 -5741 -1762 -284 -2989 -5885 -167 -3199 -4355 -2009 -2210 -2658 -3620 -1454
1457 -1454 -3201 785 -2700 -4282 331 980 -2684 -2587 4141 -2304 -2664 3105 3823 -3607 -2727 6834
1473 6834 1914 -2563 -202 5225 34 -1082 4490 551 -2091 1248 5987 -1338 -1961 643 2060
1488 2060 3098 -1067 -1506 704 4730 -1001 24 3144 -1099 140 5131 4424 -5732 1071 7973
1503 7973 2138 -3169 2080 5723 -2822 1020 5091 -968 -6543 3369 5587 -7619 -5463 2553 1042
1518 1042 -7932 -2320 289 -4580 -4553 -622 697 -6296 -3201 2490 2516 -4966 -3484 7170 2334 -3899
$$ packed form
1409A406K136l143J226J248k56l968N880q53k092J0O03Q16J15K431p160L061M339
1426E799k153m574L361J787o488N683J017n852k154P246n83p755M268J217k440
1441a621k719O040l045m396L979J478k705k896N718l032j156K346k01m48r62K166
1457a454j747L986l485j582M613O49l664R7O728o445l60N769P18p430Q80R561
1473F834m920m477K361N427n191j116N572l939k642L339M739p325o23K604J417
1488B060J038m165m39K210M026n731J025L120m243J239M991p07j0156O803O902
1503G973n835n307N249L643q545L842M071o059n575R912K218j3206K156Q016j511
1518A042q974N612K609m869K7L931J319o993L095N691K6p482J482J0654m836o233
$$ plain form
1534 -3899 -194 6913 -622 -3202 4917 2929 -5408 -2901 8844 -1932 -10060 -110 6323 -5413
1548 -5413 -8232 3668 -1798 -6396 814 5181 -6140 -5085 7461 3993 -3048 -1528 6722 2932
1562 2932 1242 3854 3213 447 413 6797 2076 -2681 -1869 4621 2581 -4999 -2091 1336 640 -4338
1578 -4338 1524 1046 -4402 -1146 5318 2249 -6277 2827 6684 802 -1920 4656 4083 -1446 3225
1593 3225 3455 -7 -1923 3523 1630 -3429 -1528 -577 -301 -3628 -1603 -3289 -1790 -804 -2843 -1767
1609 -1767 -2019 -381 -2127 815 -1747 -2932 199 911 -1196 -4115 665 -1131 -2326 -2160 -1831 -3494
1625 -3494 -4032 -61 -3096 -3883 -3357 -85 -1490 -1819 -215 -933 2088 1327 2469 2427 4351 3485 3892
1642 3892 7429 3780 3721 5763 8011 2801 2868 6624 3571 1320 2496 4882 -1112 -324 2279 912
$$ packed form
1534c899L705P107p535k580Q119j988q337K507J1745j0776q128R950O433j1736
1548e413k819J1900n466m598P210M367j1321J055J2546l468p041J520Q250l790
1562B932j690K612o41k766l4O384m721m757Q12O490k040p580K908L427o96m978
1578d338N862m78n448L256O464l069q526R104L857n882k722O576n73n529M671
1593C225K30l462j916N446j893n059J901R51K76l327K025j686J499R86k039J076
1609a767k52J638j746K942k562j185L131P12k107k919M780j796j195J66L29j663
1625c494n38L971l035p87N26L272j405l29J604p18L021p61J142m2J924q66M07
1642C892L537l649n9K042K248n210O7L756l053k251J176K386n994P88K603j367
$$ plain form
1658 912 -2572 -1983 2124 -2571 -2419 -999 -310 -3265 -2078 268 -2988 -1763 -2120 -357 -2115 -2216
1674 -2216 -2401 -1767 -858 -4082 -1306 -1816 -2664 -3678 -769 -1370 -4372 -1081 -1279 -1235 -3708 -805 -587
1691 -587 -1737 -1624 -541 529 -2652 631 333 -294 -805 1279 1704 -145 1943 409 2407 2386 1560
1708 1560 1461 3539 3184 292 4935 3453 1192 1698 5082 2840 -58 3631 2766 1584 -681 3246
1724 3246 1775 -1958 101 2667 416 -4497 1785 1035 -2632 -2354 1432 -397 -4350 208 437 -739
1740 -739 -4463 -319 1917 -2874 -3492 895 1650 -5554 -874 2731 -2456 -5029 750 2146 -4917 -2076
1756 -2076 875 108 -4450 -1266 3099 -2491 -3714 878 3636 -4607 -1690 3684 -172 -3121 1331
1771 1331 3707 -2741 -1084 2198 2578 -1722 -1568 3340 671 -1091 216 4272 -1352 -2267 3593 2106
$$ packed form
1658I12l484N89M107m695J52J420O89k955J187K346l256J225l57J763j758j01
1674b216j85O34R09l224K776n10q48j014K909o01l002L291j98M4k473K903K18
1691e87j150J13J083J070l181L283k98o27n11K084M25j849K088j534J998k1q26
1708A560r9K078l55k892M643j482k261N06L384k242k898L689q65j182k265L927
1724C246j471l733K059K566k251m913O282p50l667K78L786j829l953M558K29j176
1740g39l724M144K236m791o18M387P55p204M680L605n187k573N779J396p063K841
1756b076K951p67m558L184M365n590j223M592K758q243K917N374l856k949M452
1771A331K376o448J657L282L80m300J54M908k669j762J307M056n624r15N860j487
$$ plain form
1787 2106 -1481 -953 3978 841 -156 842 3302 719 -1653 3486 3002 -258 -1394 4475 2072 -1421
1803 -1421 1921 2541 848 -1246 3489 1899 -1063 -1309 2383 2329 -2808 73 1097 -341 -3166 936
1819 936 792 -3996 -2370 111 187 -4975 -2089 -239 -2064 -3990 -1526 142 -5332 -3146 51 -543
1835 -543 -4846 -2167 1496 -1762 -2391 -764 1575 -2574 -876 2404 648 -1833 -11 3955 -138
1850 -138 262 1908 2980 285 911 4126 1145 902 884 4035 920 620 2609 1673 762 576 3348
1867 3348 184 254 1183 2193 1387 -433 1580 768 1392 -491 1154 565 -1350 479 858 -60 -2474
1884 -2474 537 -320 -433 -1559 -1859 -342 -1451 -809 -1896 -631 -2216 -1009 171 -1918 -1229 -1630
1900 -1630 659 -1238 -873 -1579 -71 426 -2178 -500 -723 -122 -1829 604 -311 -2110 -358 150 375
$$ packed form
1787B106l587N28M931l137r97R98K460k583k372N139m84l260j136N869k403l493
1803a421L342O20j693k094M735j590k962k46L692n4n137K881J024j438k825M102
1819I36j44m788J626K481P6n162K886J850j825j926K464J668n474K186L197n94
1835e43m303K679L663l258o29J627K339m149J698L280j756k481J822L966m093
1850a38M00J646J072k695O26L215k981k43j8L151l115l00J989r36r11j86K772
1867C348l164P0R29J010q06j820K013q12O24j883J645n89j915J829L79r18k414
1884b474L011q57j13j126l00J517j109O42j087J265j585J207J180k089O89m01
1900a630K289j897L65p06J508M97k604J678k23O01j707K433r15j799J752N08K25
$$ plain form
1917 375 -2178 55 204 -43 -1179 -168 1601 -894 526 699 1198 -873 1515 2003 -438 555 1201
1934 1201 2846 -842 257 1787 2266 284 -302 2115 -366 394 1872 2183 -2005 -494 4028 1342
1950 1342 -690 -606 2971 674 349 1228 554 -1134 -353 4143 56 -2731 -692 2917 121 -2515
1966 -2515 -351 -1265 -961 -1495 845 -2415 -3716 -919 697 -974 -4615 -772 -589 -1244 -1792 -172
1982 -172 -872 -2866 568 309 -764 -2747 422 1163 -1255 -1126 -256 1045 -1879 20 893 179 -1172
1999 -1172 -12 1392 -946 914 979 1508 -1188 267 2928 1347 -65 -461 3500 1282 1077 1644
2015 1644 1576 406 890 4340 986 -786 -127 4093 1690 -1217 675 784 779 -306 2497 -622 -2202
2032 -2202 259 2892 116 -4003 472 1275 -334 -2124 427 -442 -2975 528 984 -1250 -4588 414
$$ packed form
1917C75k553K233J49k47j136J011J769k495J420J73M99k071K388M88k441R93O46
1934A201J645l688J099J530M79j982n86K417k481P60J478L11m188J511M522k686
1950A342k032Q4L577k297l25Q79o74j688P81M496m087k787K039L609k796k636
1966b515K164r14L04n34K340l260j301K797J616j671l641L843J83o55n48J620
1982a72p00j994L434k59j073j983L169P41k418J29Q70J301k924J899Q73p14j351
1999a172J160J404k338J860O5N29k696J455K661j581j412l96L961k218k05N67
2015A644o8j170M84L450l354j772O59M220k403k907J892J09nj085K803l119j580
2032b202K461K633k776m119M475Q03j609j790K551q69k533L503M56k234l338N002
$$ plain form
2048 414 1045 -2497 -2537 -571 -236 -3447 -138 524 -2014 -3380 486 1397 -3161 -1737 443 523 -2866
2065 -2866 -282 1667 -1376 -1665 408 2052 -2089 -414 1954 747 -1357 574 3249 -1095 -227
2080 -227 1984 2632 -1138 378 3069 448 14 1101 3219 -689 148 2417 1762 -59 16 2309 -118
2097 -118 769 984 1393 -517 -270 1876 -5 378 -1264 911 284 -580 -221 -44 154 -1377 630 -621
2115 -621 -657 -1515 219 -35 -1911 -774 -1265 -271 -1824 -755 -1023 -1559 -943 -967 -290 -2480 -857 -1275
2133 -1275 -132 -922 -2016 -649 -599 290 -2149 -90 -683 -865 139 608 -162 -1937 1578 881 112
2150 112 -482 690 743 -9 2027 800 402 -67 2655 1605 -40 645 1002 2408 630 1633 560
2167 560 896 1406 1415 1852 -398 466 1252 2861 -302 -157 1379 526 236 120 1540 -1969 -438 1022
$$ packed form
2048D14O31l542m0J966L35l211L309O62k538j366L866R11m558J424K180Q0l389
2065b866K584J949l043k89K073J644m141J675K368j207k104J931K675m344Q68
2080b27K211O48l770J516K691k621m34J087K118l908Q37K269o55j821P5K293k427
2097a18Q87K15M09j910K47K146j881L83j642K175o27q64L59J77J98j531K007j251
2115f21l6q58J734k54j876J137m91R94j553J069k68n36O16k4O77k190J623m18
2133a275J143p90j094J367N0Q89k439K059n93j82J004M69p70j775L515o97p69
2150A12n94J172N3p52K036j227l98m69K722j050j645O85L57J406j778J003j073
2167E60L36N10RM37k250Q64P86J609l163J45J536q53k90j16J420l509J531J460
$$ plain form
2185 1022 371 -1927 -1564 931 -1145 -1553 -783 8 -2139 -1622 135 -1885 -1420 -1596 -136 -1859 -1060
2202 -1060 -743 -473 -783 -2393 126 -343 -129 -2194 -242 402 -907 308 16 -143 -1966 1848 1921
2219 1921 -993 -1244 1120 2259 -847 711 -70 -118 58 2246 1517 -1903 229 1308 2352 -631
2235 -631 -145 841 875 1099 614 1194 -1344 840 2214 2155 -975 -617 2900 1472 131 -55 2468 -576
2253 -576 -15 2624 510 -1661 -321 3056 -893 -1702 621 1042 -1605 -1260 1166 -1260 -1649 -893 483
2270 483 -1918 -1949 421 -1318 -1618 -1475 271 -1215 -1070 -987 -1005 -30 -1428 -397 -888 -323 -1667 364
2288 364 101 -2126 -770 172 332 -1964 -56 -315 -460 -197 -144 300 -1216 809 1075 709 -1030 1050
2306 1050 1943 642 1446 848 2075 1117 1846 1870 1841 1053 308 3652 1789 -211 682 3095 536 -1129
$$ packed form
2185A022o51k298L63K495k076m08P70P91k147N17J757k020M65j76J460j723P99
2202a060L17K70l10j610K519m69K14k065J952O44j309J215k92j59j823L814P3
2219A921k914k51K364J139l106J558p81m8J76K188p29l420K132J079J044k983
2235f31M86R86L4K24m85N80k538K184J374n9l130L58L517j428j341j86K523l044
2253e76N61K639k114k171J340L377l949q09K323M21k647L45K426k426l89P56J376
2270D83k401l1K370j739l00J43J746j486J45Q3j8R75j398J031m91N65j344K031
2288C64k63k227J356R42J60k296J908k59j45K63N3M44j516K025K66l66j739K080
2306A050Q93j301Q04n98J227r58P29K4k9p88p45L344j863k000Q93K413k559j665
$$ plain form
2324 -1129 2034 785 -577 -350 2530 -455 -1749 583 1174 -542 -2177 1286 -276 -1637 -598
2339 -598 596 -1444 -2319 702 -1126 -1572 -2147 -484 -1623 -1527 -1029 -1979 -1027 -2446 -533 -1025 -1658 -1586
2357 -1586 -280 -270 -2133 -226 -356 -669 -857 1066 641 -953 186 798 1290 -993 902 1431 146
2374 146 328 1315 1482 -404 1792 1000 1048 910 954 1154 1396 2109 289 1846 1425 1142 933 1516 1366
2393 1366 -56 1255 978 1101 -381 276 743 -802 -105 -63 -133 -2182 34 -629 -1386 -985 -1480 -878
2411 -878 -1486 -211 -1494 -1038 -1233 -885 19 -954 -934 -1697 285 -781 -381 -416 -561 -213 -202 1011 -1016
2430 -1016 -888 -36 1084 -135 -1165 931 -109 -656 -362 1349 -965 -1168 995 610 -425 -1126 868
2447 868 -70 -80 -321 571 345 -874 949 1114 414 -434 1422 1298 372 1195 1350 1325 -190 1679 1806
$$ packed form
2324a129L163j249j362K27K880k985j294K332N91j716j635L463j562j361J039
2339e98J194k040q75L021j828m46n75J663j139R6M98r50R52j419J913m92o33P2
2357a586J306J0j863J907j30l13j88J923m25j594J139O12M92k283J895N29j285
2374A46J82R87J67j886K196p92M8j38M4K00K42P13j820J557m21k83k09N83j50
2393A366j422J311k77J23j482O57M67j545O97M2p0k049K216o63p57M01m95O02
2411h78o08J275j283M56j95L48R04r73K0p63J982j066M00l5j45L48J1J213k027
2430a016J28Q52J120j219j030K096j040n47K94J711k314k03K163l85j035p01J994
2447H68r38j0k41Q92k26j219J823J65p00q48J856j24r26Q23J55k5j515J869J27
$$ plain form
2466 1806 859 68 1263 2010 -136 1160 992 387 -720 1148 897 -1191 -217 -133 154 -1263 -53
2483 -53 -280 -1001 -922 -765 53 -1798 -742 -570 -331 -1052 -952 -68 -1525 -627 -1183 -11 -1219 -1149 -470
2502 -470 -321 -668 -1750 667 -596 -589 -773 326 -315 -1125 576 196 -7 -449 1010 510 -159 494 768
2521 768 817 -529 1073 830 215 30 1228 970 -426 807 336 942 -429 819 852 -5 160 648
2539 648 1214 -642 559 973 299 15 536 1326 -84 367 611 1228 -97 215 1100 315 -44 -164 1175
2558 1175 -809 -453 266 -183 -567 -842 383 -1416 -865 -1049 -663 -1189 -1331 -677 -1540 -898 -1673 -340
2576 -340 -1424 -1333 -740 -830 -550 -1729 -379 -892 -399 -956 -45 159 -915 22 486 714 -905 455 973
2595 973 458 548 743 1435 -344 940 1202 1035 302 943 1969 412 1049 441 1389 438 835 1015 623
$$ packed form
2466A806r47p91J195P47k146J296j68o05j107J868k51k088R74Q4K87j417J210
2483e3k27p21P9J57Q18j851J056J72K39p21J00Q84j457Q98n56J172j208P0O79
2502d70J49l47j082K417j263Pj84J099o41q10J701l80k03m42J459n00o69O53K74
2521G68M9j346J602k43o15j85J198k58j396J233m71O06j371J248L3q57J65M88
2539F48N66j856J201M14o74k84N21P90j410M51K44O17j325L12Q85p85l59j20J339
2558A175j984L56P19m49l84k75J225j799N51j84L86n26j42O54q63O42p75J333
2576c40j084R1N93r0K80j179J350n13M93n57R11K04j074R37M64K28j619J360N18
2595I73n15R0J95O92j779J284K62j67p33O41J026j557O37o08R48r51L97J80l92
$$ plain form
2614 623 637 402 1421 350 -174 207 1057 -9 -928 567 24 -222 -571 696 -599 -1249 316 -306
2632 -306 -958 -1440 828 -452 -1151 -661 178 -620 -1171 414 -539 -758 -548 437 -603 -987 98 -287
2650 -287 -140 -1299 -212 -368 -581 -754 -403 103 -1226 -6 -154 -406 -1337 -277 373 -693 -324 -359
2668 -359 340 -623 722 321 -332 374 839 1096 -253 1173 867 763 735 826 1051 221 2133 538 567
2687 567 652 953 646 562 1111 -251 665 623 892 -253 458 1158 -255 509 329 737 -546 485 482 -699
2707 -699 -375 115 547 -1139 -584 -530 -363 -1108 -1032 -342 -1204 -754 -1002 -522 -1515 -1505 -413 -567 -996 -1651
2727 -1651 30 -824 -1060 -332 -10 -1006 -907 1400 -466 -957 117 1142 -651 -348 1139 155 -26 263
2745 263 1568 -664 -197 1102 724 45 70 1568 51 652 1143 1000 445 389 1304 673 1209 321 1421
$$ packed form
2614F23J4k35J019j071n24L81Q50j066r19J495n43k46l49J267j295o50J565o22
2632c06o52m82K268j280o99M90Q39p98n51J585r53k19K10R85j040l84J085l85
2650b87J47j159J087j56k13j73L51N06j329J220j48k52r31J060O50j066L69l5
2668c59O99r63J345m01o53P06M65K57j349J426l06j04k8R1K25q30J912j595K9
2687E67Q5L01l07q4N49j362R16m2K69j145P11P00j413P64j80M08j283J031lj181
2707f99L24M90M32j686N55N4J67p45P6O90q62M50k48M80r93J0J092j54m29o55
2727a651J681q54k36P28L22r96R9K307j866m91J074J025j793L03J487r84j81K89
2745B63J305k232M67J299l78o79K5J498j517O01M91j43n55n6R15o31N36q88J100
$$ plain form
2764 1421 1056 588 603 903 898 -480 1185 350 -84 53 669 -75 -981 147 -437 -222 -816 280 -632
2783 -632 -1112 -49 -260 -767 -1368 336 -1306 -997 -317 -1023 -925 -930 35 -1370 -327 -216 -464 -352 -338 -29
2803 -29 -964 680 -103 -243 -632 545 450 -722 351 -216 134 -458 658 189 -637 -24 299 706 -416
2822 -416 97 49 926 -53 -329 913 185 504 675 1618 -369 51 1859 845 -160 223 1887 -75
2840 -75 396 1086 514 -312 443 1779 -613 -167 438 777 -738 -45 741 -658 5 118 525 -1093 -306
2859 -306 641 -539 -664 -866 471 -744 -766 -996 2 -842 -1288 -387 -1021 -1119 -1875 90 -1163 -2100 -678
2878 -678 -14 -812 -1747 472 -437 -331 0 513 -87 -585 1485 426 308 -86 1105 462 426 1166 70
2897 70 451 850 1394 -10 478 897 408 873 257 898 -36 995 371 247 441 56 674 607 984 -227
$$ packed form
2764A421l65m68J5L00nj378J665q35m34J37O16p44r06J128n84K15n94J096r12
2783f32m80J063k11n07o01J704j642L09O80p06R8nR65j405J043J11k48J12J4L09
2803b9r35J644p83j40l89J177r5j172J073n67L50n92J116m69q26O13L23M07j122
2822d16N13m8Q77r79k76J242p28L19J71R43j987M20J808j014j005L83J664j962
2840g5M71O90n72q26P55J336k392M46O05L39j515O93P86j399O63J13M07j618P87
2859c06R47j180j25k02J337j215k2k30R98q44m46R01o34r8p56J965j253r37J422
2878f78O64p98r35K219r09J06L31N13o00m98K070j059j18l94J191o43l6P40j096
2897G0L81L99N44j404M88M19m89M65o16O41r34J031o24j24J94l85O18o7L77j211
$$ plain form
2917 -227 541 787 619 -26 -31 970 -564 -18 -92 286 -246 -226 7 -857 -45 -739 -506 -336 -236 -934 -503
2938 -503 191 -1351 -255 -393 -367 -1002 -505 -71 -768 -400 -300 160 -1302 -254 -87 -779 -490 -370 -112
2957 -112 -1168 47 -100 -255 -350 289 -11 -804 315 -138 250 -77 660 496 63 767 306 1046 115
2976 115 856 708 1002 809 729 1390 412 795 474 1251 236 445 1354 573 337 -72 1093 -172 240
2995 240 46 126 -314 -370 732 -769 42 -240 -197 -290 -606 -168 -1141 136 -416 -466 -1000 -371 -698 -788 -259
3016 -259 -1190 -500 -837 -86 -829 -785 -319 -864 -162 -692 -220 -815 -113 -79 -527 -331 -462 542 -288 343
3036 343 -338 65 129 245 408 105 639 -406 777 689 469 128 572 1059 -233 1032 662 870 62
3055 62 880 740 -57 874 629 668 10 865 499 163 391 79 823 32 172 -47 301 3 130 481 -398
$$ packed form
2917b27P68K46j68o45nJ001j534N46p4L78n32K0K33q64Q12o94K33J70J00o98M31
2938e03O94j542J096j38K6o35M97M34o97L68J00M60j462J048J67o92K89J20K58
2957a12j056J215j47j55r5O39l00p93J119m53L88l27P37j64m33P04m61P40r31
2976A15P41j48K94j93q0O61r78L83l21P77j015K09R09p81k36m09J165j265M12
2995B40j94Q0m40n6J102j501Q11k82M3r3l16M38r73J277n52n0n34O29l27r0N29
3016b59r31O90l37P51p43M4M66n45P02n30M72n95P02L4m48J96j31J004q30O31
3036C43o81M03O4J16J63l03N34j045J183q8k20l41M44M87j292J265l70K08q08
3055F2Q18j40p97R31k45L9o58Q55l66l36K28l12P44p91J40k19L48k98J27L51q79
$$ plain form
3076 -398 162 -142 565 -628 -647 -289 -230 -224 -1055 95 -996 -848 -449 -289 -1156 -1572 -132 -804 -798 -1040 45
3097 45 -833 -830 18 -270 -573 -841 435 -346 -164 -294 -120 137 -470 564 31 53 15 751 477 -367 439
3118 439 562 964 -411 864 408 125 443 759 726 -256 914 881 478 225 867 990 -109 709 485
3137 485 927 -364 671 786 36 242 291 496 -496 425 84 -26 -350 -103 237 -555 -280 -369 349 -515
3157 -515 -360 41 -712 -712 -867 346 -994 -474 -286 -220 -872 -587 -276 -1000 -666 -611 -112 -913 -779 -84 -735
3178 -735 -90 -713 379 -787 -383 306 -55 -47 -221 519 -155 105 -54 360 530 -65 717 335 771 -12
3198 -12 967 498 496 807 544 613 169 930 437 667 370 664 722 -106 886 274 411 -144 252 210 4 443
3220 443 115 121 -698 278 -58 -141 -366 -226 147 -496 12 -401 -244 -375 -243 -270 -863 -511 -1021 -193 -1053
$$ packed form
3076c98N60l04P07j193j9L58N9Oq31J150j091J48L99J60q67m16J440o72Ok42J085
3097D5q78LQ48k88l03k68J276p81J82j30J74K57o07J034n33K2l8P36k74q44Q06
3118D39J23M02j375J275m56k83L18L16l3r82J170l3m03k53O42J23j099Q18k24
3137D85M42j291J035J15p50K06M9K05r92R21l41j10l24K47L40p92K75q9P18q64
3157e15J55M01p53%j55J213j340N20J88O6o52K85L11p24L34N5M99q01J34O95o51
3178g35O45o23J092j166M04O89l61Qj74P40o74K60j59M14J70n95P82l82M36p83
3198a2R79m69kL11k63O9m44P61m93K30k97K94N8q28R92o12J37n55L96m2k06M39
3220D43l28Oq19R76l36q3k25J40L73o43N08m13J57j31J32k7n93L52n10Q28q60
$$ plain form
3241 -1053 -440 -891 -850 -445 -671 -205 -1238 -317 -561 -317 -385 -455 -170 -564 197 -213 36 -573 109 404
3261 404 76 519 37 679 -188 607 276 469 -70 76 918 255 598 668 836 196 498 918 228 667
3281 667 539 1140 60 656 987 434 218 259 820 -547 351 207 180 -21 -47 451 -499 -151 -60 163 -706
3302 -706 -360 97 -673 -511 -711 -15 -860 -384 -218 -397 -538 -649 3 -731 -510 -816 -114 -779 -534 -244
3322 -244 -677 -261 -456 352 -599 -350 -166 -12 95 -369 515 -327 124 51 601 308 -237 747 270 377
3342 377 -19 915 283 294 569 497 519 -93 868 464 534 445 567 580 64 876 199 676 177 629 319 109
3364 109 425 -136 539 -236 559 135 -2 15 -63 223 -716 -76 -327 36 -781 -579 39 -762 -238 -769 -99
3385 -99 -1043 -467 -357 -465 -991 -878 -130 -959 -484 -507 -133 -699 -675 -254 -639 -335 -680 202 -437 -222 -76
$$ packed form
3241a053O13m51M1M05k26M66j033R21k44K44o8p0K85l94P61m10K49o09O82K95
3261D04l28M43m82O42q67P95l31J93n39J46Q42o63L43P0J68o40L02M20o90M39
3281F67j28O01j080N96L31n53k16M1N61j367Q98j44k7k01k6M98r50L48R1K23q69
3302g06L46M57p70J62k00O96q45M76J66j79j41j11O52p34K21l06P02o65K45K90
3322b44m33M16j95Q08r51K49J84J54J07m64Q84q42M51p3N50k93n45R84m77J07
3342C77l96R34o32J1K75p2K2o12R61m04P0q9J22J3n16Q12o77M77m99M52l10k10
3364A09L16n61O75p75P95m24j37J7p8K86r39O40k51L63q17K02O18q01N24n31O70
3385i9r44N76J10j08n26J13P48q29M75k3L74n66K4M21l85L04l45Q82o39K15J46
$$ plain form
3406 -76 -145 111 -415 527 -135 149 54 486 137 21 865 42 202 178 1078 551 178 728 537 542 137 1051
3428 1051 236 220 571 670 228 -200 1026 514 192 -65 732 282 -373 596 261 263 -429 670 262 -272
3448 -272 21 94 -20 -827 190 -549 -622 -567 14 -331 -884 266 -241 -678 -802 36 -476 -867 -475 -240
3468 -240 -690 -1130 329 -26 -733 -276 222 -10 -859 230 -120 -43 -533 295 287 -431 135 593 445 -653
3488 -653 628 635 169 195 476 766 -286 944 653 124 -149 710 1074 229 521 572 606 132 555 768 67
3509 67 550 820 515 -475 730 293 2 -356 684 588 -561 809 237 -182 -641 207 543 -468 -443
3528 -443 -163 153 -683 -302 -427 -395 -420 -722 63 -810 -462 -595 -163 -609 -844 -256 -441 -236 -535 -205 -767
3549 -767 -236 -45 -424 -130 -214 274 -420 422 12 -305 182 243 407 -328 347 197 478 102 305 503 67
$$ packed form
3406g6o9K56n26R42o62K84r5M32l49j16Q44q23J60k4R00n27l73N50j91Nm05R14
3428A051q15j6L51R9m42m28J226n12l22k57P97m50o55R69l35Ko92J099m08n34
3448b72K93P3j14q07J017p39p3N5N81l45n53J150n07m37j24Q38n12l91L92K35
3468b40m50m40J459l55p07M57M98k32q49J089l50P7m90Q28qp18N66M58j48j098
3488f53J281Pm66K6K81K90j052J230k91n29k73Q59L64q45K92N1L4m74M23K13p01
3509F7M83K70l05r90J205m37k91l58J040r6j149J370n72m19m59Q48L36j011K5
3528d43K80L16q36L81j25L2k5l02P85q73L48j33M32m46k35N88j85K05k99L30n62
3549g67N31J91l79K94q4M88o94Q42m10l17M87O1J64p35O75j50K81l76K03J98m36
$$ plain form
3570 67 653 55 391 253 658 121 355 867 184 807 798 779 -189 833 788 93 245 285 660 -172 284 54
3592 54 -44 -59 -160 128 -390 -101 -380 263 -234 -422 -246 -462 -265 -690 -139 -394 -287 -461 -207 -457 -779
3613 -779 130 -492 -404 -349 86 -824 -864 385 -642 -615 -435 144 -655 -594 343 -302 -555 -370 794 -601
3633 -601 -54 608 478 19 24 861 20 486 194 761 -73 108 618 523 494 222 613 297 122 488 658
3654 658 340 13 919 337 1 271 688 100 -198 918 531 56 -122 896 -146 -414 354 519 -617
3673 -617 -625 693 -302 -543 -69 -6 -620 -967 139 -459 -435 -418 100 -519 -1140 -132 -567 -329 -670 -199 -341
3694 -341 -409 -341 -151 -334 -589 506 -78 -256 -356 252 236 -549 459 117 14 -457 829 365 -454 387
3714 387 544 599 -286 892 725 -67 289 685 560 -178 504 632 342 -37 866 644 77 357 323 450
$$ packed form
3570F7N86n98L36j38M05n37K34N12o83O23rj9r68J022m5o95J52M0L75q32M56k30
3592E4r8j5j01K88n18K89k79O43m97j88J76k16J97m25N51k55J07j74K54k50l22
3613g79R09o22Q8N5M35r10m0J249j027K7J80N79p99O1R37o45k53J85J164j395
3633f01N47O62j30m59NQ37q41M66k92N67q34J81N10r5k9k72L91l16j75L66J70
3654F58l18l27R06n82l36K70M17n88k98J116l87m75j78J018j042k68P68J65j136
3673f17qJ318r95k41M74O3o14l47J106n98K4J7N18o19o21J008m35K38l41M71j42
3694c41o8O8J90j83k55J095n84j78j00O08j6p85J008l42j03m71J286m64q19Q41
3714C87J57N5q85J178j67p92L56L96j25p38O82J28k90l79R03k22n67K80l4J27
$$ plain form
3734 450 -177 555 312 32 6 -112 341 -511 297 62 53 -385 -116 243 -538 -183 -208 121 -691 -332 -146
3755 -146 -186 -440 -470 133 -727 -538 -358 -223 -828 -335 -190 -747 -262 -469 -142 -492 -630 -47 -301 22 -683
3776 -683 126 -410 -107 -199 -6 -143 -441 83 -24 156 48 444 399 162 574 537 498 17 938 418 37
3797 37 602 583 543 27 1079 586 293 283 808 309 -126 447 278 674 22 638 -62 35 107 98 114 -334 144
3820 144 160 -38 -493 -13 -107 -552 -526 -175 -13 -587 -290 -185 -625 -387 -421 -302 -753 -422 -190 -188 -557 -426
3842 -426 -119 -599 -228 -323 -180 -650 -243 40 -472 -62 -322 187 -495 -69 124 77 -158 222 566 -45 464
3863 464 104 754 151 436 639 397 526 492 916 94 254 738 225 182 417 908 261 455 412 329 -136
3884 -136 -81 563 -294 125 11 148 -308 -88 410 -275 -157 -30 177 -416 -408 -300 -288 -373 -701 161 -598 -434
$$ packed form
3734D50o27P32k43k80k6j18M53q52Q08k35rm38K69L59p81L55k5L29q12L59J86
3755a46m0k54l0O03q60J89J80J35o05M93J45n57M85k07L27l50j38N83k54L23p05
3776f83Q09n36L03r2J93j37k98N24j07J80j08L96m5k37M12l7l9m81R21n20l81
3797C7N65j9m0n16J052m93k93j0N25m99m35N73j69L96o52O16p00R7P2rJ6m48M78
3820A44J6j98m55M80r4m45K6L51J62n74K97J05m40K38l4J19m51L31K32Kl69J31
3842d26L07m80L71r5J43m70M07K83n12M10k60N09o82M26J93m7k35L80L44o11N09
3863D64l60O50o03K85K03k42J29l4M24q22J60M84n13m3K35M91o47J94m3q3m65
3884a36N5O44q57M19j14J37m56K20M98o85J18J27K07n93QJ08J2q5l28Q62p59J64
$$ plain form
3906 -434 -501 76 -442 -641 165 -409 -121 -495 44 -167 -475 44 -122 -308 -653 463 -263 -285 50 82 128
3927 128 -664 189 -104 -70 -97 284 393 -236 311 386 219 -229 522 351 -104 212 409 579 -235 644 546
3948 546 438 68 628 677 125 430 279 263 -205 570 489 -253 259 197 478 -433 195 242 98 -322 -147 232
3970 232 -694 10 -42 279 -655 203 229 -27 -198 -391 118 -654 27 101 -175 -657 -481 101 -524 -585 -360
3991 -360 -53 -660 -438 77 -707 -318 -552 253 -427 -356 -121 -67 11 -441 449 -4 137 -189 392 -37 22
4012 22 745 347 80 -174 556 313 106 442 344 216 -242 824 488 228 230 610 373 -4 766 246 92
4033 92 57 943 386 -30 207 241 497 -325 477 230 21 -479 -41 104 -412 -81 -296 27 -626 -196 -46
4054 -46 -532 -343 -364 -165 -839 -243 -75 -445 -504 -204 2 -736 -251 -216 -138 -237 2 -45 -559 -199 -58 58
$$ packed form
3906d34o7N77n18j99Q06n74K88l74N39k11l08N19j66j86l45J116p26k2L35L2M6
3927A28p92Q53k93L4k7L81J09o29N47P5j67m48P51j71m55L16J97J70q14Q79r8
3948E46j08l70N60M9n52L05j51j6m68P75q1p42N12o2K81r11O28M7j44m20J75L79
3970B32r26P04n2L21r34Q58K6k56j71j93N09p72O81P4k76m82J76N82o25o1K25
3991c60L07o07K22N15p84L89k34Q05o80P1K35N4P8m52Q90m53J41l26N81m29N9
4012B2P23l98k67k54P30k43k07L36r8j28m58J066l36k60KL80k37l77P70n20j54
4033I2l5Q86n57m16K37L4K56q22Q02k47k09n00M38J45n16L31k15L23o53M30J50
4054d6m86J89k1J99o74N96J68l70n9L00K06p38M85L5P8r9K39m7n14L60J41J16
$$ plain form
4076 58 -464 -158 207 4 0 -166 480 -300 326 411 234 33 296 545 -163 293 267 575 79 322 599 310
4098 310 314 253 867 172 155 378 537 -80 83 598 -220 111 -30 371 -40 -59 170 -204 -27 -104 16 -623
4120 -623 35 85 -376 -58 -163 334 -380 -420 -14 -195 -455 -299 229 -637 -581 -406 306 -466 -616 -284 -142
4141 -142 -426 -770 209 -353 -410 -35 148 -340 -525 392 -251 -109 -209 410 -2 -178 137 -91 365 -170
4161 -170 340 -57 -50 377 163 -62 -27 808 124 -6 375 536 252 -83 716 316 346 81 632 552 -119 347
4183 347 523 334 -270 545 388 -101 -346 215 453 -567 144 136 32 -326 -43 97 -711 -417 -408 -94 -688
4204 -688 -100 -612 -357 -470 -578 -191 -427 -87 -448 -176 -513 -433 -155 -503 -267 -265 5 -787 -12 -36 -136
4225 -136 -263 -150 828 -52 -101 294 437 -330 -100 821 110 -73 -133 720 222 -16 655 342 226 -243 796
$$ packed form
4076E8n22L06L65k03mj66O46p80O26Q5j77k01K63K49p08M56k6L08m96K43K77k89
4098C10Mo1O14o95j7K23J59o17J63N15q18L31j41M01m11j9K29l74J77p7J20o39
4120f23O58N0m61L18j05M97p14m0M06j81k60J56N28q66N6J75P12p72j50L32J42
4141a42k84l44R79n62n7L75J83m88j85R17o43J42j00O19m12j76L15k28M56n35
4161a70N10l97PM27k14k25L5Q35o84j30L81J61k84l35P99m00L0k65N51q0o71M66
4183C47J76j89o04Q15j57m89k45N61K38j020P11qj04l58K83J40q08K94RL14n94
4204f88N88n12K55j13j08L87k36L40l61K72l37Q0K78l48K36KK70p92P75k4j00
4225a36j27J13R78q80m9L95J43p67K30R21p11j83o0Q53m98k38O71l13j16m69J039
$$ plain form
4246 796 415 90 175 617 556 -16 496 350 401 -244 333 373 193 308 375 209 -230 317 163 -40 -241 66
4268 66 69 -617 262 -23 -507 -627 29 -34 -719 -120 110 -200 -866 12 -35 -735 -739 -86 235 -877 -29 95
4290 95 -123 -394 -5 51 -525 -201 273 144 -456 57 245 -184 -242 -127 429 -264 99 400 195 -72 34
4311 34 706 -95 338 288 515 79 214 757 22 204 563 356 -121 634 632 187 -37 246 577 -220 166
4332 166 332 407 -353 -75 180 -378 -272 -140 371 -88 -322 78 -248 -203 -230 113 -254 -98 87 -68 -297
4353 -297 -301 21 -393 -228 -324 18 -531 -145 109 -636 -503 -382 162 -624 -282 -141 -387 -383 -272 176 -250 -144
4375 -144 -12 98 -76 48 451 -126 284 -46 350 -103 24 155 115 285 -36 523 146 153 79 572 222
4396 222 -75 503 244 190 264 502 302 111 519 151 445 -58 633 11 -107 192 85 144 -308 380 -4
$$ packed form
4246G96l81l25Q5M42o1n72N12j46N1o45N77M0j80J15O7j66m39N47j54k03k01L07
4268F6Lo86Q79k85m84j20O56o3o85N99K30l10o66Q78m7p00mO53L21j112Q48J24
4290I5k18k71L89N6n76L24M74j29o00N13J88m29n8J15N56o93L63L01k05k67J06
4311C4O72q01M33n0K27m36J35N43p35J82L59k07m77P55km45k24K83L31p97L86
4332A66J66P5p60K78K55n58J06J32N11m59k34M00l26M5k7L43l67J56J85j55k29
4353b97mL22m14J65r6L42n49L86K54p45J33J21N44p86L42J41k46MJ11M48m26J06
4375a44J32J10j74J24M03n77M10l30L96m53J27J31m0J70l21N59l77Pp4M93l50
4396B22k97N78k59n4P4K38k00j91M08l68K94n03O91o22j18K99j07N9m52O88l84
$$ plain form
4417 -4 -327 -322 94 -181 -355 -243 -156 -154 -728 137 132 -768 -323 -46 -40 -786 -53 -221 -100 -467 -169 18 -635 -235
4441 -235 -225 230 -472 -128 32 -366 -256 -249 266 -237 -82 272 135 -49 -117 580 27 60 344 416 5 -143
4463 -143 504 504 182 120 714 90 210 612 280 57 -49 658 321 -53 -37 477 -229 -232 309 271 -261 -214 526
4486 526 153 -319 81 168 -233 -397 241 -75 -367 -234 41 -236 -580 102 -64 -669 -572 -32 75 -733 -374
4507 -374 -237 63 -383 86 -271 -656 -178 -46 -109 -780 -52 -77 -32 -436 -137 117 -329 -62 163 217 -340
4528 -340 147 326 -26 -407 106 465 -225 260 376 350 -175 275 747 -149 146 212 574 128 330 488 327
4549 327 -2 -44 426 -15 435 -9 249 -90 49 185 -122 80 199 79 -156 -355 -26 -242 -204 -229 43
4570 43 -270 -288 -16 5 -264 -322 91 -527 -145 -153 88 -263 -351 -57 -524 -245 -555 51 -132 -395 232 -297
$$ packed form
4417dl23NM16k75j74J12Q7Kn74Q65nr00M45K77Op46P33j68J21l67K98J87o53M00
4441b35J0M55p02L44J60l98J10PN15n03J55L54j37j84o8O97n53L3K84P2m11j48
4463a43O47%l22o2N94o24J20M02l32k23j06P07l37l74J6N14p06lN41l8n32M7P40
4486E26l73m72M00Q7m01j64O38l16k92J33K75k77l44O82j66o05R7N40J07q08L59
4507c74J37L00m46M69l57l85M78J32o3o71P28k5M5m04K99K54m46K67K25N4n57
4528c40M87J79l52l81N13L59o90M85J16k6n25M50M72q96K95O6L62m46K02J58j61
4549C27l29m2M70m41M50m44K58l39J39J36l07K02J19j20k35j99L29k16L8k5K72
4570D3l13j8K72K1k69n8M13o18L82qK41l51q8K94m67K79l10O06j83k63O27n29
$$ plain form
4592 -297 -131 -284 262 -243 79 139 290 8 -157 169 -31 172 -173 246 167 204 153 99 375 -241 336 106
4614 106 52 426 132 172 91 549 335 99 43 6 26 -117 437 41 79 -174 520 69 -69 44 12 153 -142
4637 -142 449 135 -293 -173 19 69 -336 -157 -162 -68 -251 -37 -18 -392 -18 52 140 -445 -116 1 -415 -473 -33
4660 -33 156 -441 9 -176 30 -334 97 -24 -493 -135 -198 282 -412 -98 144 -259 -407 159 460 -345 -30
4681 -30 363 288 -190 196 594 -170 207 147 550 -40 68 661 271 181 48 621 -109 17 307 253 -57 -43
4703 -43 794 142 102 -30 538 67 -24 476 24 -512 -96 436 -4 -200 107 189 -162 -395 146 -38 -160
4724 -160 -348 288 -11 -478 35 -198 -404 -758 328 -154 -469 -251 -75 -55 -553 -122 -392 -463 -734 198
4744 198 -144 -551 -197 -30 -162 -225 12 257 -71 158 382 177 -69 94 269 75 251 721 704 3 293
$$ packed form
4592b97J66j53N46n05L22O0J51k82j65L26k00K03l45M19p9L7n1n4K76o16N77k30
4614A06n4L74k94M0q1M58k14k36n6l7K0j43N54l96L8k53O94m51j38J13l2J41k95
4637a42N91l14m28J20J92N0m05J79nR4j83K14J9l74L74P0Q8n85L29J17m16n8M40
4660c3J89n97M50j85K06l64M31j21m69L58o3M80o94L14K42m03j48N66L01q05L15
4681c0L93p5m78L86L98p64L77o0M03n90J08N93l90r0j33N73p30J26K90n4l10J4
4703d3Q37o52m0j32N68m71r1N00m52n36M16N32m40j96L07Q2l51k33N41j84j22
4724a60j88O36k99m67N13k33k06l54J086m82l15K18J76K0m98M31k70p1k71R32
4744A98l42m07L54J67j32o3K37K45l28K29K24k05k46J63J75j94J76M70j7p01K90
$$ plain form
4765 293 205 429 -49 353 602 -2 142 362 585 41 414 188 436 11 150 378 -96 189 108 26 -222
4786 -222 -272 54 -108 -40 -233 270 -558 -165 -106 -146 -270 -269 153 -340 -179 -493 245 -407 -248 -204 -235 -157 -387
4809 -387 50 -172 -278 24 -199 -166 -217 192 -351 -170 -194 300 -54 28 166 -115 201 -3 102 64 151 298
4831 298 119 181 77 233 174 155 207 154 149 153 46 -33 221 41 244 155 -32 274 292 -48 -66 389 -19 73 316
4856 316 360 -61 -35 242 -34 87 136 -8 -54 -15 29 -136 -75 31 -14 -340 -394 -148 -202 -173 -345 -10 -27 -245
4880 -245 -193 66 -155 -223 -116 -346 -317 -268 -146 -172 -508 2 -187 25 -291 232 115 -212 108 1 101 -323
4902 -323 203 308 138 8 118 391 -234 178 335 256 -185 277 391 21 200 511 692 134 26 459
4922 459 15 -11 -74 532 -257 -49 192 266 43 -199 322 39 -32 -245 318 -497 -412 198 -14 -322 -387 224
$$ packed form
4765B93q8K24m78M02K49o04J44K20K23n44L73k26K48m25J39K28m74K85q1q2k48
4786b22n0L26j62O8j93N03q28L93N9m0j24JM22m93J61l14P38o52J59M4l1P8k30
4809c87M37k22j06L02k23L3n1M09n43J81k4M94l54Q2J38k81L16k04J05l8Q7J47
4831B98j79O2j04J56n9j9N2n3nMj07p9K54j80K03q9j87L06J8l40j8M55m08R2K43
4856C16M4m21K6K77k76J21M9j44m6L9M4j65O1J06m5l26n4K46n4K9j72L35j7k18
4880b45N2K59k21o8J07k30K9M9J22k6l36N10j89K12l16N23j17l27L20j07J00m24
4902c23N26J05j70j30J10K73o25M12J57p9m41M62J14l70J79L11J81n58j08M33
4922D59m44k6o3O06p89K08K41P4k23k42N21k83p1k13N63q15Q5O10k12l08o5O11
$$ plain form
4944 224 -255 -438 21 -181 -343 -641 145 -392 -435 -270 1 -496 -482 -128 -195 -287 -367 300 -160 -32 -373 244
4966 244 -32 -434 41 246 6 -205 269 296 -309 317 536 296 -310 426 81 -159 -72 250 228 -57 224
4987 224 471 215 -55 377 398 -263 149 251 31 -259 370 185 154 -177 240 281 -96 91 196 223 -25
$$ packed form
4944B24m79j83M59k02j62k98P86n37m3J65K71m97J4L54o7r2q0O67m60J28l41O17
4966B44k76m02M75K05k40k11M74K7o05O26K19k40o06P36l45k40Q7L22k2k85K81
4987B24K47k56k70M32K1o61M12J02k20k90O29j85l1l31M17M1l77J87J05K7k48
$$ [...]
8191A49
##END NTUPLES=NMR FID
##END=
