##TITLE=1H_CA-8752-3
 CDCl3, 8 sc, 
 23.9.2020
##JCAMPDX= 6.0         $$ Bruker NMR JCAMP-DX V2.0
##DATA TYPE= NMR FID
##DATA CLASS= NTUPLES
##ORIGIN= UXNMR, Bruker Analytische Messtechnik GmbH
##OWNER= root
$$ XWIN-NMR		Version 3.5
$$ Wed Sep 23 08:32:58 2020 Russian Standard Time (UT+4h)  she@DPX200
##.OBSERVE FREQUENCY= 200.1315066352
##.OBSERVE NUCLEUS= ^1H
##.DELAY= (6, 6)
##.ACQUISITION MODE= SIMULTANEOUS
##.ACQUISITION SCHEME= undefined
##.AVERAGES= 8
##.DIGITISER RES= 18
##SPECTROMETER/DATA SYSTEM= spect
##.PULSE SEQUENCE= zg30
##.SOLVENT NAME= CDCl3
##.SHIFT REFERENCE= (INTERNAL, CDCl3, 0, 15.7039)
##AUDIT TRAIL= $$ (NUMBER, WHEN, WHO, WHERE, WHAT)
$$ ##TITLE= Audit trail, XWIN-NMR		Version 3.5
$$ ##JCAMPDX= 5.01
$$ ##ORIGIN= Bruker BioSpin GmbH
$$ ##OWNER= she
$$ F:/spectra/data/she/nmr/H-F/1/audita.txt
$$ ##AUDIT TRAIL=  $$ (NUMBER, WHEN, WHO, WHERE, WHAT)
(   1,<2020-09-23 08:31:46.21 +0400>,<she>,<DPX200>,
      <created by zg, POWCHK disabled, PULCHK disabled
       configuration hash MD5:
       00 E9 B6 7A A2 85 ED C7 34 08 36 98 17 FE 4E 26
       data hash MD5: 16K
       57 61 C2 AF 57 B1 FA 74 A4 78 DE 45 5B 8D 34 31>)
$$ ##END=
$$ 
$$ hash MD5
$$ 8E 9F F8 DF 89 3B 89 A7 BB 90 99 B3 04 40 5E C3
##$RELAX= 
##$RELAX= 
##$RELAX= 
##$RELAX= 
##$RELAX= 
##$RELAX= 
$$ Bruker specific parameters
$$ --------------------------
##$DU= <F:/spectra>
##$EXPNO= 1
##$NAME= <H-F>
##$PROCNO= 1
##$TYPE= <nmr>
##$USER= <she>
##$AMP= (0..31)
100 100 100 100 100 100 100 100 100 100 100 100 100 100 100 100 100 100 
100 100 100 100 100 100 100 100 100 100 100 100 100 100 
##$AQSEQ= 0
##$AQ_mod= 1
##$AUNM= <au_zg>
##$AUTOPOS= <>
##$BF1= 200.13
##$BF2= 200.13
##$BF3= 200.13
##$BF4= 200.13
##$BF5= 200.13
##$BF6= 200.13
##$BF7= 200.13
##$BF8= 200.13
##$BYTORDA= 1
##$CFDGTYP= 0
##$CFRGTYP= 5
##$CHEMSTR= <none>
##$CNST= (0..31)
1 1 145 1 1 1 1 1 1 1 1 1 1 1 1 1 1 1 1 1 1 1 1 1 1 1 1 1 1 1 1 1 
##$CPDPRG= <>
##$CPDPRG1= <>
##$CPDPRG2= <>
##$CPDPRG3= <>
##$CPDPRG4= <mlev>
##$CPDPRG5= <mlev>
##$CPDPRG6= <mlev>
##$CPDPRG7= <mlev>
##$CPDPRG8= <mlev>
##$CPDPRGB= <>
##$CPDPRGT= <>
##$D= (0..31)
0 1.2 0 0 0 0 0 0 0 0.06 0 0.03 0 0 0 0 0.0002 0 0 0 0 0 0 0 0 0 0 0 0 
0 0 0 
##$DATE= 1600835505
##$DBL= (0..7)
120 120 120 120 120 120 120 120 
##$DBP= (0..7)
150 150 150 150 150 150 150 150 
##$DBP07= 0
##$DBPNAM0= <>
##$DBPNAM1= <>
##$DBPNAM2= <>
##$DBPNAM3= <>
##$DBPNAM4= <>
##$DBPNAM5= <>
##$DBPNAM6= <>
##$DBPNAM7= <>
##$DBPOAL= (0..7)
0.5 0.5 0.5 0.5 0.5 0.5 0.5 0.5 
##$DBPOFFS= (0..7)
0 0 0 0 0 0 0 0 
##$DE= 6
##$DECBNUC= <off>
##$DECIM= 32
##$DECNUC= <off>
##$DECSTAT= 4
##$DIGMOD= 1
##$DIGTYP= 9
##$DL= (0..7)
0 120 120 120 120 120 120 120 
##$DP= (0..7)
150 150 150 150 150 150 150 150 
##$DP07= 0
##$DPNAME0= <>
##$DPNAME1= <>
##$DPNAME2= <>
##$DPNAME3= <>
##$DPNAME4= <>
##$DPNAME5= <>
##$DPNAME6= <>
##$DPNAME7= <>
##$DPOAL= (0..7)
0.5 0.5 0.5 0.5 0.5 0.5 0.5 0.5 
##$DPOFFS= (0..7)
0 0 0 0 0 0 0 0 
##$DQDMODE= 0
##$DR= 18
##$DS= 0
##$DSLIST= <SSSSSSSSSSSSSSS>
$$ [...]
##$SUBNAM2= <"">
##$SUBNAM3= <"">
##$SUBNAM4= <"">
##$SUBNAM5= <"">
##$SUBNAM6= <"">
##$SUBNAM7= <"">
##$SUBNAM8= <"">
##$SUBNAM9= <"">
##$SW= 16.880792210976
##$SWIBOX= (0..15)
0 0 2 0 0 0 0 0 0 0 0 0 0 0 0 0 
##$SW_h= 3378.37837837838
##$TD= 16384
##$TD0= 1
##$TE= 0
##$TE2= 300
##$TE3= 300
##$TEG= 300
##$TL= (0..7)
0 120 120 120 120 120 120 120 
##$TP= (0..7)
150 150 150 150 150 150 150 150 
##$TP07= 0
##$TPNAME0= <>
##$TPNAME1= <>
##$TPNAME2= <>
##$TPNAME3= <>
##$TPNAME4= <>
##$TPNAME5= <>
##$TPNAME6= <>
##$TPNAME7= <>
##$TPOAL= (0..7)
0.5 0.5 0.5 0.5 0.5 0.5 0.5 0.5 
##$TPOFFS= (0..7)
0 0 0 0 0 0 0 0 
##$TUNHIN= 0
##$TUNHOUT= 0
##$TUNXOUT= 0
##$USERA1= <user>
##$USERA2= <user>
##$USERA3= <user>
##$USERA4= <user>
##$USERA5= <user>
##$V9= 5
##$VALIST= <valist>
##$VCLIST= <CCCCCCCCCCCCCCC>
##$VD= 0
##$VDLIST= <DDDDDDDDDDDDDDD>
##$VPLIST= <PPPPPPPPPPPPPPP>
##$VTLIST= <TTTTTTTTTTTTTTT>
##$WBST= 1024
##$WBSW= 4
##$XGAIN= (0..3)
0 0 0 0 
##$XL= 0
##$YL= 0
##$YMAX_a= 474384
##$YMIN_a= -288872
##$ZGOPTNS= <>
##$ZL1= 120
##$ZL2= 120
##$ZL3= 120
##$ZL4= 120
##$ABSF1= 10
##$ABSF2= 0
##$ABSG= 5
##$ABSL= 3
##$ALPHA= 0
##$AQORDER= 0
##$ASSFAC= 0
##$ASSFACI= 0
##$ASSFACX= 0
##$ASSWID= 0
##$AUNMP= <proc_1d>
##$AZFE= 0.1
##$AZFW= 0.1
##$BCFW= 1
##$BC_mod= 2
##$BYTORDP= 1
##$COROFFS= 0
##$CY= 11.3945322036743
##$DATMOD= 1
##$DC= 2
##$DFILT= <>
##$DTYPP= 0
##$F1P= 16.9975609425685
##$F2P= -3.02152046262296
##$FCOR= 0.5
##$FTSIZE= 0
##$FT_mod= 4
##$GAMMA= 1
##$GB= 0.15
##$INTBC= 1
##$INTSCL= 1
##$ISEN= 128
##$LB= 0.24
##$LEV0= 0
##$LPBIN= 0
##$MAXI= 10000
##$MC2= 0
##$MEAN= 0
##$ME_mod= 0
##$MI= 1.114404
##$NCOEF= 0
##$NC_proc= 0
##$NLEV= 6
##$NOISF1= 3.799351
##$NOISF2= 2.8
##$NSP= 1
##$NTH_PI= 0
##$NZP= 0
##$OFFSET= 15.70392
##$PC= 1
##$PHC0= -9967.296
##$PHC1= 8.2009
##$PH_mod= 1
##$PKNL= yes
##$PPARMOD= 0
##$PSCAL= 0
##$PSIGN= 0
##$REVERSE= no
##$SF= 200.130013532006
##$SI= 16384
##$SIGF1= 3
##$SIGF2= 2
##$SINO= 400
##$SIOLD= 16384
##$SREGLST= <1H.CDCl3>
##$SSB= 0
##$STSI= 0
##$STSR= 0
##$SW_p= 3612.71676300578
##$SYMM= 0
##$S_DEV= 0
##$TDeff= 0
##$TDoff= 0
##$TI= <>
##$TILT= no
##$TM1= 0
##$TM2= 0
##$TOPLEV= 0
##$USERP1= <user>
##$USERP2= <user>
##$USERP3= <user>
##$USERP4= <user>
##$USERP5= <user>
##$WDW= 1
##$XDIM= 8192
##$YMAX_p= 0
##$YMIN_p= 0
$$ End of Bruker specific parameters
$$ ---------------------------------
##NTUPLES= NMR FID
##VAR_NAME=  TIME,          FID/REAL,        FID/IMAG
##SYMBOL=    X,             R,               I
##VAR_TYPE=  INDEPENDENT,   DEPENDENT,       DEPENDENT
##VAR_FORM=  AFFN,          ASDF,            ASDF
##VAR_DIM=   8192,          8192,            8192
##UNITS=     SECONDS,       ARBITRARY UNITS, ARBITRARY UNITS
##FACTOR=    0.000296,      1,               1
##FIRST=     0,             0,               0
##LAST=      2.424536,      0,               0
##MIN=       0,             -288872,         0
##MAX=       2.424536,      474384,          0
$$ Real data points
##PAGE= N=1
##DATA TABLE= (X++(R..R)), XYDATA
0@%%%%%%%%%%%nJ3j6J6k2L0l8M6n6P2q5R9j18J39j64J92k22K55k95L41l89M43
33B36n05N74o48P28q18R19j029J149j281J424j580J751j938K141k361K603k871
50a506L166l489L842m232M669n157N704o326P038p863Q833r991J1400j3163J5448
65H373j8543K3006l0121M3906j22779L11572j53807l50479K34637l8760j29691
76b22686J83876J24817k47383o3975J90862J01191o5538P327j82610L1034K24121
87H1036p7541j5480J41344j77468j35147L26788K4208l15360O8162K35846r7624
98E8764r3613K19361j16938k37696J91153J61605j97175p404J40809p3056j6724
109B9086m400k9740J3877M6791l2117r033Q7864q7936n9801J36432k5915k09056
$$ y = [0, 0, 0, 0, 0, 0, 0, 0, 0, 0, 0, 0, -5, 8, -8, 8, -14, 16, -22, 24, -32, 40, -45, 54, -64, 75, -89, 103, -119, 136, -159, 182, -207, 236, -269, 305, -343, 385, -433, 486, -543, 606, -675, 749, -831, 920, -1018, 1123, -1238, 1365, -1506, 1660, -1829, 2013, -2219, 2450, -2707, 2997, -3329, 3709, -4154, 4679, -5312, 6088, -7075, 8373, -10170, 12836, -17285, 26621, -96158, 215414, 61607, -288872, -54235, -92995, -222686, -38810, 86007, -161376, -225351, -34489, 66702, 1164, 8491, -174119, -143085, 81036, 3495, -11985, 129359, -48109, -183256, 143532, 167740, -147620, -79458, 156388, 58764, -34849, 184512, 67574, -170122, 21031, 182636, -14539, -21943, 118866, 45810, 29086, 24686, -5054, 8823, 55614, 23497, 14464, 102328, 14392, -45409, 91023, 65108, -143948]
121a43948J63924J76970j85456k1510J28906j06739j26737K19817N9271j99593
131c5095K1041J26416k8445k0640L8639j19215j2984J19283M9265j3468m8295
142G6502r8335O173J79769n1924j31631P1313M8439p7399Q6639Q3605k31506o5160
154a03515J95612M2265j02555N0092o533j20843O9341R3571n9369r4071L3159
165b846L8522N6585M242j21280j2926N6650j5117M432R5774q9316r7883J31201
177D8038L0345j44959P83J23531q2147k6106J14370k8345j15757L2283N8699o8593
189e7858K0897L2546j2526J340j2710l9747K6709K4093o8586N9572N3923q6522
201e8869k7663J24489l3787j55047R2209R4855q1537O923J04259j09829p6177
$$ y = [-143948, 19976, 196946, 11490, -10020, 118886, 12147, -114590, 105227, 164498, -35095, -14054, 112362, 83917, 63277, 101916, -17299, -30283, 89000, 138265, 124797, 76502, -21833, -15660, 164109, 112185, -19446, 51867, 100306, 22907, 109546, 193151, -38355, -103515, 92097, 134362, 31807, 81899, 75366, -45477, 23864, 117435, 58066, -36005, -2846, 35676, 92261, 96503, -24777, -37703, 18947, 3830, 8262, 104036, 14720, -83163, 48038, 78383, -66576, -65793, 57738, -24409, -50515, 63855, 35510, -80247, -47964, 10735, -57858, -36961, -4415, -16941, -15601, -28311, -68058, -41349, -17256, -85842, -26270, 27653, -58869, -86532, 37957, 4170, -150877, -58668, 36187, -45350, -38427, 65832, -43997, -120174]
212a20174J30397K2149p6840k712M8994j0391K9735O32n6980J023J0057K839O7322
225D6051M3014j46657m994J34695n9582p6465J03401L491j30174J15129J09409
236A37318j45406q8166J16531J3218o5743Q2036j103p8838J8297N0928k7278n840
248E954j6137k7753R0026J3109q5893J0454O0638r7663j2433J55547n0208j26649
260h1008R9649Q4246j54439j969J18805p3827n6506J07151K5359j01411K1068
271a2882K8433k8864J214R149K35L0498j308p2612N0506L2230r1150J4229J13363
284G3041o4824q2662J33218K623j39317L4653J06761q2476l1450J15887k8921
295C6533q4273L6037M6531m9437K185J7575o244L0770j3789k8332K0771K809o4544
$$ y = [-120174, 10223, 32372, -44468, -47180, 1814, -8577, 21158, 21790, -35190, -34167, -24110, -21271, 46051, 89065, -57592, -62586, 72109, 12527, -63938, 39463, 42954, -87220, 27909, 137318, -8088, -96254, 20277, 33495, -32248, 49788, 48685, -30153, -11856, 39072, 11794, 5954, -10183, -37936, 52090, 65199, -20694, -10240, 50398, -47265, -59698, 95849, 45641, -81008, 18641, 102887, -51552, -53521, 65284, -8543, -65049, 42102, 67461, -33950, -12882, 15551, -13313, -12099, -2950, -2715, 27783, 26475, -46137, 4369, 36599, -54551, -40322, 73041, 8217, -74445, 58773, 61396, -77921, -43268, 63493, -18983, -50433, 65454, 36533, -47740, -11703, 34828, -14609, -12424, 5151, -1093, 29677, 15888, -12444, 8327, 11136, -53408]
308e3408N7355P6133q6458l5299R2658j3963j03418P6618M5063r4754J6188R9278
320G5993m5562p3258N7468j597l5512K5505K6893k4139k257N510j9560K6754j9667
333c429l5522M4227M0435o3351P21O3626p2342l8434Q2419J0386q3543M7894N6435
346D9522p4811j4178N3895k2515m8105N6494J4634k8671O465l863q516N763k714
359a6600j5465M6097p270m3102L7826K3232p0475q226Q7641m0363m3354P3123
371B3064J1125q4930K1370O0508o0820j2009N5256j018l5439K4083j021k6314
383b6145J7713r623P374L0786j6193l7553N0318M356p4699L8086N8584n7724k3401
396c8121R6713l0257q4242O1746L4829o9733R553P2211m2308k3852L6320o822
$$ y = [-53408, 3947, 80080, -6378, -41677, 50981, 37018, -66400, 10218, 55281, -39473, -23285, 75993, 30431, -42827, 14641, 13044, -22468, 3037, 29930, 5791, 3534, 9044, -10516, 16238, -3429, -38951, 5276, 45711, -17640, -16919, 46707, -25635, -64069, 18350, 28736, -54807, -6913, 49522, -25289, -39467, 14428, -8087, -56192, 302, 14936, -13735, -7270, -11133, -19649, -13886, -16600, -32065, 14032, 6762, -36340, 1486, 24718, -45757, -53983, 33658, -6705, -50059, 23064, 34189, -50741, -29371, 31137, -29683, -41692, 13564, 12546, -22893, 1190, 169, -26145, -8432, -18055, -10681, 20105, 3912, -33641, 16677, 21033, -53666, -15580, 43004, -14720, -38121, 58592, 28335, -55907, 5839, 40668, -29065, -19512, 52699, 10391, -13461, 22859, 16037]
408A6037k5883J2397N646o297L2088k5644j9937M0090j4700n8518N0422M6479
420E2180q2452J4723P5605n5452o4636P8293J3392q4326M1492N5037n3866k0998
432c1008N5233k9468l2212L5080Q11n771J4007r532k2131L4356j6389l7177N3111
445H910J2622o3196L2209O5877q3246k8245Q0589j7017o1720N9834M3797q4594
457c4180M144O3559l4110l8772M5014K329k1242K8400j1341r279P961j4509n522
470a7548M2612l525m6554L6899K9615n6702r880P4087m2941m8186Q6847R741p3612
483a9147J9912M7159m9623j0297M8746k284l5408J6051K2471k8637M542l846m838
496D801K6679r712k3311L6295o26o3041L2255L9868m4482j7509N8633q163o1151
$$ y = [16037, -9846, 2551, 8197, 1900, 33988, 8344, -11593, 28497, 13797, -44721, 5701, 52180, -30272, -15549, 60056, 4604, -60032, 18261, 31653, -52673, -11181, 43856, -10010, -31008, 24225, -5243, -37455, -2375, -1564, -7335, 6672, -2860, -24991, 9365, -7024, -44201, 8910, 21532, -41664, -9455, 56422, -26824, -55069, 25520, 8503, -53217, 6617, 50414, -34180, -30036, 33523, -587, -39359, 5655, 7984, -13258, 15142, 3801, -5478, 2483, -12026, -17548, 25064, 21539, -25015, 11884, 41499, -15203, -25083, 49004, 6063, -42123, 44724, 54465, -19147, 765, 47924, -1699, -11996, 36750, 34466, -942, 15109, 37580, 8943, 13485, 9639, 4801, 31480, 21768, -1543, 34752, 34126, -28915, 3340, 43208, -1274, -18783, 39850, 31687, -29464]
509b9464L8779K9065n5549q753N8808j7660k8503K7338l365j5294j298O848L296
522D248R187j3788p95K2037j6710k2820K2069J9967m2214J3657M9270l6399l4607
535b6898M3220O821m9743K6609K8891k7316j0655K4473l539k3444R860M979R62
548D220k802k07L921O790k2386j5955M1093p340l2952K7795K2583m3494j738L7813
562A7341k6537k4344L1567J8586l7009P271K3307k5936r259J7168L362o881L240
575h124r507J2472L532k5201M418J9339j3100j3740M0846o484m7183K1825L5054
588A4147l9753j4335N0210j3439k7632K4446J3949l0655j954K3759q456K476N499
601a738o016J120O831j8023J1551K1337l2407M213M0614j3728m1955K9934K1271
$$ y = [-29464, 9315, 38380, -17169, -25922, 32886, 15226, -13277, 14061, 10696, -4598, -5896, 952, 4248, 13435, -353, -1148, 20889, 4179, -18641, 3428, 23395, -18819, -5162, 44108, 7709, -26898, 16322, 23143, -26600, 9, 28900, 1584, -9071, 15402, 11863, -11581, -1721, 3258, 4220, 1418, 1211, 5132, 11922, -10464, -26419, 14674, 7334, -25618, 2177, 24760, -18734, -20472, 17341, -9196, -33540, -1973, 16613, -20396, -13125, 10182, -15754, -25013, -7845, -4483, -11364, -8124, -17631, -5159, -1627, -26828, -22410, -3071, -16171, -29911, 10935, 4451, -42732, -20907, 14147, -25606, -39941, 10269, -3170, -30802, -6356, 7593, -23062, -25016, -1257, -9713, -7237, -1738, -7754, -6634, 197, -17826, -6275, 15062, -17345, -13132, 27482, 13754, -28201, 1733, 23004]
614B3004m1181R034M2238k7269k8025M6853m766l7111J8191J4988j3652J01J2604
627A5009r936M81j403q560Q355J3046j9722m915L7552k4454k7429L6226L77m1452
641b6825K8463L3201m4299q263L7635p393l6936K3318J7227k8102J1467J5579
653A5072j9707m679J4873j2562O310P472j8008J1997J5988k1066j4409K9561q435
666B407k6534L1692J8896m1631k186M2219k7424j9126L3406k876k7747K0942K1935
679B3973k8445q134J2197L839k238N463p717j171J2592j4467J118J4813j7597
692e774j3684L7737K505l7627J5838J8442k8505o417M0006j2818l2699K4979J7232
705A9215k3608m988J6154j3300L22J3068j659m331n772m217R263R852k2088O94
$$ y = [23004, -18177, -9143, 33095, 5826, -22199, 24654, 19888, -17223, 968, 15956, 2304, 2405, 15009, 5073, 5554, 4151, -4409, 3946, 16992, -2730, -7645, 29907, 5453, -21976, 14250, 14627, -26825, 1638, 34839, -9460, -17723, 19912, 12519, -24417, -1099, 16128, -11974, -507, 15072, -4635, -9314, 5559, -7003, -693, 6779, -11229, 768, 16756, -4310, -18719, 10842, 2407, -24127, 7565, 26461, -15170, -17356, 24863, -2561, -21687, 11719, 8843, -18904, 2038, 23973, -4472, -12606, -409, 3430, 1192, 6655, -1062, -2233, 10359, -4108, -2990, 11823, -5774, -19458, 18279, 20784, -16843, -1005, 17437, -11068, -17485, 22521, 9703, -22996, 1983, 19215, -4393, -9381, 6773, -6527, -6205, 6863, 5204, 873, -4899, -9116, 147, 9999, -12089, -11395]
719a1395K5226q954k1491K0633R761l7214J0666L0831j8799j7441K6975P34k6161
732a6629J1189J2495j0613p089J4036J069n333k884m142J0866oj3590O402K0647
746A6418j8276r404K3335r733k2009K0916K1247l0119m780K7339o998j8576J3518
759B878N712j8101R334J1209m406n857l813n59Q642K125j2585J0009M421j4711
773e702L752K0034j8604k2426L0032R212k2480M459J5704k1656m829K5310o805
786F001j6601P276J1480q240J965n71p508M585J390j151Q175J185k0965R288J7435
801A3744j8829p202K1500l470k0394K1546Q907k7633m67K3903r793j3519J9153
814G446j416j1462N201L552p153K981L416n367Q097j606r901O253R520j8379o47
$$ y = [-11395, 13831, 4877, -16614, 4019, 13780, -23434, -12768, 18063, -736, -18177, 8798, 9532, -16629, -5440, 7055, -3558, -10647, 3389, 4458, -875, -3759, -7901, 2965, 2959, -10631, -4229, 16418, -1858, -11262, 12073, 2340, -19669, 1247, 22494, -7625, -12405, 14934, 7936, -10640, 2878, 8590, -9511, -177, 11032, 6626, 769, -3044, -3603, 5039, 7164, -5421, 4588, 9009, -5702, -1950, 18084, -520, -22946, 7086, 16298, -6182, -1723, 13981, -7675, -12504, 12806, 6001, -10600, -3324, 8156, -84, 1881, 1310, -6198, -1613, -223, -1374, 6801, 7986, -12979, -3691, 13744, -5085, -12287, 9213, 5743, -14651, 6895, 15802, -11831, -12298, 11605, 1812, -11707, 7446, 6030, -5432, -231, 3321, -3832, -851, 2565, -2802, 5295, 3689, -6212, 41, 9561, -8818, -9465]
829i465K3853j0921j3084J7963K387k5838J0912J9285j7396o310J6451j239j3492
842f894J1550J063j2418L092Q218p62Q10k055j1052R462N772j1206J983J0532
856H095j1183m748K1505p876k0737J1309J3512j5495J320J7188j4992r748J5572
869C722M039j4424M048N554m717M295P29m419j831K068l371Q384M532j3492J105
884c778J2889p641j2184J7075J41j6383J0902J3577j5663q194J6345l729j0006
897f649P684P129q708k121O921l952n79j821J126N355j279p776O817O135j5647
912g365Q92J3275m892j1344J4510N151j8852J811J4470o724j0414J1993J986q907
926d410K409M815k301o029P43M089O503q008m207Q886j584j0143N534J1599j4242
$$ y = [-9465, 14388, 3467, -9617, 8346, 10733, -15105, -4193, 15092, -2304, -8614, 7837, 6598, -6894, 4656, 5719, -6699, -3607, 4611, 3849, 4659, 2604, -8448, 1014, 6786, -4420, -2437, 8095, -3088, -7836, 13669, 5793, -14944, -3635, 9877, -5618, -4298, 12890, -2102, -11850, 3722, 7761, -6663, -2615, 2939, -1778, 2517, 3246, -1173, -3004, -936, -4307, 4077, 8609, -4883, -3778, 9111, 1470, -10714, 6361, 6502, -9881, 1021, 14598, -1065, -9259, 7086, 3357, -6649, 1035, 8164, -544, -2665, 4256, 304, -275, -2096, -970, 4385, 3106, -4670, 2147, 8282, -7365, -6473, 6802, 1910, -9434, 5076, 10227, -8625, -6814, 7656, 932, -9482, 2511, 4497, -4410, -2001, 2814, 513, -5516, -4773, -684, 5819, -2189, -6396, 2490, 906, -9237, -3703, 7896, -6346]
941f346m381J7360p65j7063O405R909j2972R01J1212k594q621L122L828k001j348
956c354k070M273J800k832j837O929m208j1070J2414O919j3722K65J5444j0025
970a074r104J2580J070j1078K575J2018p157m442O392j627l848L098J96m07M973
985D165o792P57O506o153n590R454L945j2726N787R841j0562o553J3731k228j2209
1000h627J1344N222j0289k8Q044n998k942O545j855j338K711j045k874N205m756
1015f81m397J0039p22p737N608O524j3147l19J2520o354q703J1832L511j3753
1029e779N663O429q847j672P740j495m311M778j389k315J315m10k754N711K99
1044B963p551P659J994j0718K498R531q969l385J2628k582r674N353O830j0959
$$ y = [-6346, -10727, 6633, 5868, -11195, -4790, 5119, -7853, -6952, 4260, 1666, -6955, -3833, -5, -2006, -3354, -5424, -1151, 649, -2183, -4020, 2909, -1299, -12369, 45, 6964, -6758, -6493, 8951, -1074, -10178, 2402, 3472, -7606, -5031, 6987, -170, -4612, 1780, 153, -3695, -597, -401, -808, 4165, -2627, -1870, 4636, -1517, -7107, 2347, 6292, -6434, -647, 9194, -1368, -7921, 5810, 3582, -8627, 2717, 7939, -2350, -2378, 5666, -332, -3274, 3271, 1416, 78, 2789, 1744, -1130, 4075, -681, -5078, 4961, 4239, -3498, 2110, 8634, -4513, -4832, 7688, 1334, -7369, 4463, 7974, -5779, -116, 6313, -2534, -4206, 3534, 2039, -2272, 2506, 1117, -1198, 117, -293, -3047, 2664, 2963, -4588, 3071, 5065, -5653, -3155, 6376, -2593, -5978, 6650, 4068, -5606, -253, 6577, -4382]
1058d382J21R967m330m993O462M22o009L467j178q56L888j916j185L680j206p268
1074e316M967N061p462p02J0493m547r273J0115J455j0723L533Q331o247l067
1088c382P156k089m951J162L672j736J35M09q77K145k448k427M101R34p558N596
1104a58P404r316k807P858j567q090O980M983p725j814P744j502o587M173N87
1119A63j159R44Q88Q42j075m199R83O986m656l545N941K494p378R2Q034o595n297
1136f537R151L146q974K347N170n303j496L505J623l434K57J812J310j706l487
1151b616J915L380k717k904P716j052q784N109M696p218k080R208j578o724L433
1166b16M118n479j383M705k070p10J654M33p57j238k276K274L603m531N2M493
$$ y = [-4382, -4261, 5706, 1376, -3617, 2845, 3267, -2742, 725, -453, -1309, 2579, 663, -522, 3158, 1952, -5316, -349, 4712, -2750, -3452, 7041, 2494, -6779, 3336, 4791, -5932, -2399, 5932, -315, -3382, 3774, 1685, -3266, -2104, 1568, -168, -33, 376, -501, 1644, -804, -3231, 870, 1804, -5754, -158, 7246, -2070, -4877, 2981, 1414, -6676, 304, 5287, -2438, -4252, 3492, 1990, -4597, -424, 163, -996, -52, 836, 1678, 603, -3596, -2613, 4373, -283, -3828, 2113, 4607, -2771, -2679, 5355, -1240, -6537, 2614, 5760, -3214, -867, 4303, -1000, -2496, 1009, 2632, -802, -545, 1267, 2577, 871, -2616, -701, 2679, -38, -2942, 4774, 3722, -5062, 47, 4743, -2475, -4555, 4653, 3075, -3649, -216, 3902, -1577, -2960, 1745, -325, -1035, 619, 1052, 295, -943, -3219, -945, 2658, -1873, -1821, 2672]
1182B672k036n371N439K769q987J966P954l367m310N528j731n234M347L198l061
1197b24k221L652o47J51O6k793P22K699j044k94M152m713l513O087O84n640K149
1214g27N111o070J87N975k966o964N464L608m874J557K287k924j200L325j766
1229B3q90J795j336J219J309k434k137M149r74m659N354K335o196N35N976n597
1245a528k709N651O06m856K022L919m947o65L420r98k480J870J165j90Q86m079
1261b913N33L316j729j524L902m07m839M249L268o095k688P119k97m499M240J313
1277B949n348k40N093j552j813J099N65O57m96l65p68Q68j734J545M122l261m482
1294c161M347K838o582J626M382l672j701M838O61o455J251L542j694j276K550
$$ y = [2672, 636, -4735, 704, 3473, -5514, -3548, 4406, 1039, -3271, 2257, 526, -4708, -361, 2837, -224, -2445, 1207, 560, 711, 777, -2016, -1294, 1405, 361, 67, 4219, -494, -4007, 2080, 2764, -2876, -727, 4384, -1686, -1499, 4476, 1510, -5454, 10, 3618, -1256, 301, 2588, -336, -1536, 1789, 23, -867, 928, -408, 811, 2120, -314, -2451, 1698, 724, -3935, 1419, 3754, -2442, -1907, 4069, -1528, -4237, 1414, 2020, -2836, -814, 3105, -1842, -2507, 913, -85, -2565, -695, 470, 280, 1166, -2913, -2380, 936, -793, -2317, 1585, 1178, -3661, 588, 3856, -2239, -4927, 2192, 1895, -2604, 1636, 2949, -2399, -2639, 2454, 902, -911, 188, 753, 1410, 914, 549, -219, 649, -1085, 460, 4582, 1321, -3161, 1186, 4024, -2558, -932, 3450, -222, -1923, 2915, 3576, -2879, -1628, 1914, 220, -1056, 1494]
1309A494l13j876K10j72J449j043k106K259L150l831k019M401j611m078L234L876
1325C024n573n42O046k418m836L147K692l664Q97J966q40j156k25Q15l3o51j060
1342b411L360O41l958L77L862k876l529O359P43n780J529N706m032l704M749J65
1358A201k812K084K644l211j482K018R5M72j023m19K198P84l269O70L025m218
1374a243q63N472k88n816L411L264n087m29M533j707l955M494J389l541l85J288
1390E37r99L07J584j828J596K58k736J158K248l562r40N380j805l208L150J710
1406B850n512P58N443l486k622M392N83m516K142J712k911O57J791l92n61O93
1422A021j537K20J338k090O55K672j867k172M059k90n117K448L712m165o67N387
$$ y = [1494, 1181, -695, -485, -657, 792, -251, -2357, -98, 3052, -779, -2798, 1603, -8, -4086, -852, 3024, -2549, -3091, 2955, 537, -4299, -1152, 1540, -2124, -1227, 739, -101, -1257, -1482, -667, -700, -1351, -2411, 949, 1590, -2368, -1991, 1871, -1005, -4534, 1825, 2568, -3212, -1683, 4023, -9, -3713, 1036, 1201, -1611, 473, 3117, -94, -1576, 442, 537, 1009, -14, -433, 1765, 2549, -720, -50, 2975, -1243, -2106, 3366, 3078, -2738, 673, 3937, -1150, -1579, 2954, 1247, -2708, 1786, 3175, -366, -751, 537, -462, -155, 1429, -399, 1197, 1455, -1281, -123, 2125, -1437, -2377, 3003, 1198, -2010, 1140, 2850, -2662, -1904, 3539, 53, -2569, 1823, 2406, -2110, 32, 1744, -1167, -510, 1281, 889, 328, 1021, -516, -296, 1042, -1048, -393, 2279, 412, -1760, 2299, 2009, -3108, -660, 3052, -1113, -1780, 3607]
1438C607k485l920L359J456l466N20L071j872q63J316j94j245O49p65Q30K238
1454B236k997j05K661j923l152L890J523m069M41M020k137l760M489L19m316J564
1470a316L341j977j214J340o60l08q4O62R80q13j137J022K272l032j808L312P24
1487A304l173K223K805m716j243M561j98l586J911J984k450L28J487n97k242M48
1503a154J869J218j324j852J731K25j567L8L072k430k165M298Q57m201k23K979
1519A371j903r51L015M79l436L84K416j324r85J25R37K99p5p36J044o28l135L536
1537D33J468l069l76L359p53m084K580K416l420q69M480j752k436K563L6j722
1553a146j48J165N84m5j020J25P83j140p76K060J388m272R40M483k676k932L453
$$ y = [3607, 1122, -2798, 561, 2017, -1449, -929, 2142, 270, -593, 723, 529, -716, -67, -832, -2, 2236, -761, -866, 1795, -128, -3280, 610, 2133, -1936, -1495, 2525, 388, -3372, 1117, 1436, -2880, -1316, 2025, 48, -1166, 174, -486, -794, -878, -216, 764, -49, -1186, -164, 2108, -924, -2732, 580, 1304, -1869, 354, 3159, -1557, -2800, 1761, 1563, -2023, -112, 1872, -578, -250, 1237, 640, -1602, -1154, 715, 1933, 609, -1243, 488, 713, -854, -816, 2256, -174, -2339, 1959, 2816, -1385, -1608, 1371, -532, -1483, 1532, 2011, -1425, -1041, 1375, 51, -934, -809, 128, 427, 352, -384, 660, 32, -3103, 433, 1901, -1168, -1544, 1815, 1062, -3022, -442, 1974, -1446, -2315, 2165, 413, -2023, 540, 576, -1146, -1294, -129, 455, 410, -610, -485, 298, -842, -1618, 442, 1830, -2442, -1502, 2981, 305, -2627, 826]
1570H26J27m034L472L028l947k208L321R27k792J392N90j212K54J488o90j69j607
1587a234p72L675J79k817N41K526l047o80M632k092m548L813L702m520n43K990
1603A805k096j419K984J071l134K27Q49J77j02r20l25J110O59j903K106M46l703
1620b168L46L879j712l298M366P94m234J005L238k937k112M400l43k918J646J394
1636A346j894o36R02l98J510m51p26M12M32k138J325K850l401j632M143L59m015
1653b012K178J606m056N42M612j227l754J809J179j011k57J166j069m50J457J99
1669I12Q73k215j828K349K208k608m40L041k946j177L296J142m956P45M450j990
1685H56j674J980K4l145J557J782r10o36l95J212R8r51j016J334J07j800J731
$$ y = [826, 953, -3081, 391, 3419, -528, -2736, 585, 1512, -1280, 112, 702, -510, -256, 1232, 542, 373, -1234, -2006, 1669, 1848, -969, -428, 2098, -949, -1629, 3003, 911, -3637, 176, 3878, -642, -1185, 1805, -291, -1710, 1274, 2345, -789, -562, 287, 464, 362, -558, -883, 227, 886, -1017, 1089, 1535, -2168, -1822, 2057, 345, -2953, 1413, 2207, -2027, -1022, 2216, -721, -2833, 1567, 1224, -1694, -48, 1346, -548, -1184, -282, -680, 830, 379, -347, 65, 497, -1641, -316, 2534, -867, -2499, 1644, 2003, -2012, 166, 1772, -2284, -1742, 2870, 1643, -2111, -302, 877, -134, -391, 775, -294, -744, 713, 912, 1785, -430, -2258, 91, 2299, -309, -749, 2292, -654, -1831, 1465, 2607, -2349, -1604, 2846, 856, -818, 1162, 1186, -1959, -402, 1380, 470, -166, -561, 651, 749, -202, -1218, 116, 223, -1577, 154]
1702A54J926l087j678M174j090l257K739J935l255m33L106j538j958J794J237
1717G69j919K15J351o56M3j295L38J598m36j749K659K87l796J576L223k423k878
1734c093M010N29l423J914K106l232j252L799J8j922K49O57j28QK57n71M87q29
1752d16K84K728q81l664J296L660l392m76M231k457l333M167J532m766J86L439
1768B138r64k504L402l89k660L41J240L30j94j049j3J929r92k078K231K26k987
1785a993R27M463l513k942M702L02m850J672M611m260j216L415l14k868J001J839
1801I76j558J14N83K04O9j027p84K208J55l352K733K403l898j336N129j327m774
1818c482L489K550l650m72M181k307k935K600J234j642k73J198m55L23r17N7J211
$$ y = [154, 2080, -1007, -2685, 1489, 399, -2858, -119, 1816, -1439, -1872, 1234, -304, -2262, -468, 769, -1150, -935, 416, -240, -197, -1492, -1154, 444, 8, -1741, 918, 1205, -2591, -1015, 2208, -215, -3093, 917, 1446, -1977, -63, 2043, -1189, -2441, 1358, 1376, -546, -297, 360, 232, 240, 497, -74, 413, -416, -132, 2596, 1715, -1949, -653, 3007, -385, -861, 3370, 913, -2420, 1747, 3279, -1487, -1301, 2138, 1174, -1330, 2072, 1683, -977, -636, 604, 934, 740, -309, -322, 1607, 615, -1463, 768, 994, -1993, -1066, 3397, -116, -3058, 1644, 1946, -2904, -1232, 3379, -881, -2097, 1318, 1004, -1864, -863, 976, -582, -468, 115, 319, 388, -639, -1423, 785, 940, -2412, 321, 2724, -1174, -2510, 2619, 1292, -3482, 7, 2557, -1093, -1565, 2616, 309, -2626, -26, 1208, -434, -707, 491, 36, 359, -558, -501, 710]
1835G10o58j987K116K065l534l47L582j889k770M156O04m745J844L027k516k229
1851b571K592R34k356J215J006q94j266P40m21J139m92j308K627q09k190J949
1867a05J676l657m31L984l75k955J524K289l671K81L044j579j761K216P88j074
1883A94m03k15J078n44p33J361J095j665j676K919K01k910O30L180k334j721L968
1900B425j170l140J626K706k204j220J982L36j353l88R56p92J13n03R84Q67k172
1917i47J53J971j188l053L569J422l878N51L284k118k922L694L85k618L58K363
1933A026j382j673K033o92m76J48L97P43K73k390Q74K727k732r84L001O9l498
1950b536K607K949m758r48M721n66m087L597J671m105Q10K596j018j613J451J47
$$ y = [710, 52, -1935, 181, 2246, -1288, -1635, 1947, 58, -2712, 1444, 2048, -2697, -853, 2174, -342, -2571, 21, 955, -1401, -186, 820, -74, -1340, -600, -1021, 118, -374, -1682, 945, 136, -2054, -105, 1571, -2086, -2517, 1467, 1092, -1863, -339, 1950, -1721, -1440, 1604, 25, -1736, 480, 1268, 194, -209, -424, 654, 110, -623, 738, 1833, 168, -1508, 1411, 1612, -1298, -668, 2512, 178, -1543, 2425, 1255, -1885, -259, 2447, 243, -977, 1005, 1341, -12, -400, 556, -236, -123, -626, 358, 1225, -947, -794, 1177, -11, -3064, 505, 1927, -1951, -1400, 1884, -234, -3156, 538, 923, -1695, -1337, 1026, -356, -2029, 4, -688, -1164, -1016, -619, 124, 397, -1993, -1119, 1608, -1124, -2108, 893, 962, -2536, 71, 3020, -1738, -2686, 2035, 1469, -2618, 979, 2650, -1455, -645, 1951, 933, -680, 771, 918]
1966I18N44l98q49O38K58j032k66L640k399l430M524J640n522J63N440l733j974
1983a838M358L25n352J736L472k528j478K176M00j788Q14J14k32K37k057J364
1999b77K243k343k067M186k41n036K774L479m098k110O093j393n390L286L202
2014B308l941j027M033j351j504Q88N99o13j91l96J072J538l094l43L363n07m018
2031c184L168L030n508O44N146k206m791M042K135m070J136K376j285k181K377
2046H29L03j197l39M50J158j76j341m56K798k209j824L424M99l578P75M123l937
2063f98j608L779K64l896J891K836l378n88K120j40j631J002L18k32M00j380J359
2080D18M59j716m66K775q46k907L101O97l016n29M019k245k422L400O78l104O53
$$ y = [918, 1462, 1064, 215, 853, 1111, 79, -187, 3453, 1054, -2376, 2148, 3788, -1734, -1571, 3869, 136, -1838, 2520, 2845, -2507, -771, 2701, 173, -1305, 871, 1271, -517, 297, 411, 179, 416, -1641, -277, 1966, -377, -2444, 1742, 1501, -3535, -761, 2718, -1380, -3490, 2603, 1210, -4180, -894, 2308, -1633, -2660, 1373, 22, -1482, -594, 5, -608, -799, -1195, -123, 1415, -1679, -2022, 1341, 834, -3184, -16, 3014, -2494, -1850, 3296, 1090, -3701, 341, 2476, -1594, -458, 1918, 633, -1548, 829, 1132, -65, -404, 46, 1204, 1028, -313, -769, 2029, -180, -2004, 1420, 1919, -1659, -884, 3239, -698, -2306, 1473, 1737, -2159, -268, 2568, -810, -1398, 722, 582, -1049, -47, 271, 39, 439, -941, 418, 877, -839, -1305, 1470, 624, -2283, 818, 1515, -1501, -2030, 1989, -256, -2678, 722, 1400, -1704, -1051]
2097a051K314k448l18J592K61m77n15M47K6J2j236J325J044j721p50K981m32m015
2115b961L133J951l651j86M314j902k717K829P78k577l62L127q87j252R04j30
2131D11J90q00m90J293J132l424J292L489l413j892L391Q15m569K150L509l740
2147f56k055M414j02m478K909J491k008m14J299J5p48l02K55J551j070j161J436
2164C76J889l269j018M807k255l620L993K419n557K48M910k820k644K724K419
2179B602m104M98K907j632j371Q40R41m3o41j059K495J19l312J580K461k477k364
2196b560M925J23n177J617M743m143k392N351r86l755J994K937k817j700K045
2211B05P66n09j272Q40K57n80j484J868J959m239J12M081q05m768L701J979m626
$$ y = [-1051, 1263, -1185, -1503, 89, 350, -127, -642, -195, -169, -157, -1393, -68, 976, -745, -1495, 1486, 1054, -2961, 172, 2123, -1528, -1714, 2600, 698, -2019, 810, 1588, -989, -1351, 1776, 889, -363, 541, 411, 601, -199, -689, 604, 1736, -1688, -396, 3093, -320, -2212, 1179, 1994, -2575, -425, 3084, -656, -2711, 1703, 1601, -2877, 32, 1523, -485, -899, 400, 415, -333, -635, -380, 1171, 101, -1060, 376, 2265, -1004, -2022, 2785, 530, -3090, 903, 3322, -2235, -1987, 2923, 103, -2541, 183, 2602, -1502, -1004, 1903, 271, -1100, -260, 681, 638, -3, -1062, 1433, 1552, -1760, -180, 2281, -196, -2560, 2365, 2488, -2689, -1072, 3671, -472, -2864, 2487, 1501, -2254, -260, 2677, -140, -1840, 205, 971, 462, -810, 30, 287, -293, -1777, 91, 2050, -2189, -2077, 2004, 1199, -3569, 132, 2111, -2515]
2228b515L18M722j438m671L256J854k987j54J875l99j088J032J92O63k003m83
2244a826K671J76k601O94L119k615j801L268R74m547J571M159l672j163K961J20
2260A488l123J123J828q63l22O7J122j389k11p1J891p52k120K304J352k698n55
2277i29L765k683k005L165J496l172q20L498j976j249K048m8k062R88J306r41
2293C81k02j180Q49P42l61n85J480p70k234K106J637k741j573M054m60l284L074
2310I33P06l674J79M013j635j991J424Q84r38o16J114q00L47m01L82J511j511
2327g3k071K636J392m346J860L232l302j679M020L37m841K306L047k717j771L832
2343A862n93k729J673L82k34l25K26L99Q42k103n38L448j388k762K017L202m226
$$ y = [-2515, -2197, 2525, 1087, -3584, -328, 1526, -1461, -1615, 260, -139, -1227, -195, -3, 660, -1343, -1826, 845, 1021, -1580, -886, 2233, -382, -2183, 1085, 2059, -2488, -917, 3242, -430, -1593, 1368, 1488, -1635, -512, 1316, 453, 131, 198, 1320, -69, -280, -351, 1540, 788, -1332, 972, 2324, -374, -929, 2836, 153, -1852, 1313, 2809, -363, -1183, 2315, 339, -910, 1138, 1090, -972, 16, 1322, 381, 179, -1001, -152, 590, 229, -356, 1124, 354, -1880, 226, 1863, -878, -2451, 1603, 1143, -2141, 933, 1639, -2035, -1856, 2157, 522, -1469, -45, 839, -99, -715, 399, -401, -54, -455, -73, 1438, -73, -2144, 492, 1884, -2462, -602, 2630, -672, -2351, 1669, 2006, -2835, -529, 2518, -199, -1970, 1862, 1269, -1460, 213, 595, 361, 36, 262, 661, 1503, -600, -1138, 2310, 922, -1840, 177, 3379, -847]
2360h47o72M596k161m033L855L051n446M78K960j174k397J910J232k500K72R85
2376A09P25n86j337l58J740l07k351L357K32m138Q72M656l120l452M794M29m017
2393b752J485L743l995j782L981J37k669N94J970j475j55K05O24K51j700k2K691
2410A131r9l458J998K092l204q74M476q59m475L351K249l825n99L928j075k793
2426b036K485Q99j137j077J029L09l90n11J181R12j978J7J395P03l398Q70L624
2443B897k540k054L406N77m330J824K362j695j330J519R40k898J123J193m86j354
2459h46M92J328N5j158j060K814j399j824K384J036k954K28K809j694j596J656
2475B71J749l022K05L063j642j598Q24J334j061j14p2Q24l79j033J403L7j255
$$ y = [-847, -1519, 3077, 916, -3117, 738, 3789, -1657, -1179, 1781, 607, -1790, 120, 1352, -1148, -876, 109, 834, 248, -1089, -1447, 293, -14, -2365, 992, 1224, -2914, -2042, 2614, -506, -3958, 836, 1265, -2752, -1267, 2476, -1519, -3301, 680, 817, -1852, -1258, 712, -763, -918, -713, -89, 162, -1538, -1560, 1131, 1032, -2426, -428, 1664, -1540, -2414, 2062, 1203, -3272, 79, 2328, -1497, -2096, 1832, 757, -2036, 449, 1348, 211, -866, 163, 472, 82, -429, 752, 1664, -314, -297, 1098, 1801, -1597, -727, 2897, 357, -1697, 1709, 2286, -2044, -220, 2142, 447, -883, 636, 1576, -1322, -199, 994, 508, -846, -354, 974, 1029, -129, -1189, 1625, 226, -1598, 786, 1822, -1132, -904, 1905, 211, -1385, 271, 2020, -1002, -797, 2266, 624, -974, -150, 1184, 123, 9, -63, 761, 382, -651, 752, 789, -466]
2492d66q46K860n47k380J548J771k711j161L666j024k554J791J206k050l93K020
2508G30r43m71J48J165m17j077J08P57L00j959J155J687j415j854L086L65l644
2525b279J751K086k119j789L635j96k837O56K133r82j610K221n5p64m19K97P16
2542D45n84j165J308J463k640P2K868j127l126K827K200l596m06L359r36l040
2558b078K671J526l142N52J673l96j243L10N20j99m32m61J860l72j648R7K486
2575A724j752k117L097Q26l236Q40L078k893j486K996p1k672R86K650k335q16
2591a181J515J80j069PQ16K5R8j578J353R00j888p27K820n27k873K604J074k720
2609a171r47L557q32k702K462R68k224j60K070j044j005Q09P71n0r18K70L89k5
$$ y = [-466, -1312, 1548, 1001, -1379, 169, 1940, -771, -1932, 1734, 710, -1844, -53, 1153, -897, -1290, 730, -213, -684, -536, 629, 212, -865, -757, 0, 300, -1659, -504, 1183, -232, -2086, 1000, 1365, -2279, -528, 1558, -561, -2350, 1285, 1089, -1748, -1092, 1041, 59, -1551, 670, 615, -149, -568, -271, 445, -139, -1304, 4, 1467, -1173, -1101, 1767, 640, -2486, 341, 2541, -1055, -1461, 1898, 962, -2078, 593, 2119, -1023, -471, 1202, 806, -437, -127, 393, 194, -238, -699, 1161, 789, -859, -762, 1724, -28, -2145, 952, 1778, -1458, -618, 2460, -433, -1919, 1077, 1006, -1666, -680, 1970, -365, -1181, 334, 514, -555, -548, 268, 293, 391, -1187, 166, 1066, -822, -1549, 1271, 744, -2129, 475, 1549, -1171, -2118, 1439, 607, -2095, 367, 1335, -889, -1049, 1021, -23, -1028, -219, 552, 502, -416, -146, 243, 218]
2627B18j112P79J459j825r46K550J42l165J542J986k288p27K675J31l016J331
2643b66J637j400j254J750K60q81N6M00O03j567k36J646M09k248N06J993j547
2660a39j406K110Q65l058O75L028j822j497J529R69k286J74J236K13j500N19J189
2677G99q64q25R5J776q62j039O94J334j833j051L027j110j980J770J640k372r95
2694a796K596n97j512J030J428j619mR31m8n12o58Q10Q35o26j196J652Qj964R73
2713b69J941j297k182K687O14k619P68J658j583j005K376M4j679j43J242m66k79
2730a92J22K43J62p79M26P30k29k008J179J886k536p5K140q65k183K216J326k638
2748a075l52K581m69k121J703K68j130K54N98n3l08p1Q8R77j474m76J473K66j580
$$ y = [218, -894, -115, 1344, -481, -1427, 1123, 1265, -1900, -358, 1628, -660, -1387, 1288, 1419, -1597, -266, 1371, -29, -1283, 467, 727, -154, -98, 302, 905, -662, -898, 748, 1157, -1091, -585, 1408, -139, -1545, 565, 1430, -1628, -953, 2075, 253, -1244, 285, 1254, -1032, -858, 378, 591, -909, -390, 799, -65, -890, -795, 981, 119, -920, -226, 1108, -725, -1776, 1251, 141, -1839, -69, 1571, -801, -1796, 800, 203, -1309, -279, 1149, -470, -474, 457, 409, -103, -761, 49, 884, 258, -938, 714, 722, -1242, -269, 1672, 375, -1807, 880, 1494, -1125, -357, 1301, -282, -1287, 1089, 1133, -546, -689, 553, 87, -192, -70, 173, 335, -444, -18, 712, 483, -1525, -346, 1540, -996, -1071, 1069, 204, -1979, 237, 1563, -1075, -1427, 1154, 685, -1436, 267, 535, -595, -341, 257, 204, -104, -175, -87, 890, -584, -1060, 413, 679, -901]
2767i01J43K150j718j011J925M73k841J329K130k111p82J627L20j904J000R41
2783G70q64p25P36O73n08m33l42J231q8j254J073N99j712p0K658j423j679J501
2801A43J099j655o06K429j564j020J687O63j511j51Q12n9k10k03P88o79l50K61
2819a26Q27j7j751R52J536j373q86K013j93j871J111J189j476j006K193j30j597
2836f05Q79O98n34q25Q86L64l43q71J152L97j481j83J125K37j519M95J555j378
2854D9j252K078K33k403R66J467q76j047R25O16j318k42J387k40j197L65J111
2871F22J33j552l6J391o80r62J397P55k242M41J944r53j442N91J701j750l4J329
2889F53o28j545J124P29l67m96l86J233k13r89N74O59j313k21K005k39j988O42
$$ y = [-901, -758, 1392, -326, -1337, 588, 1061, -1780, -451, 1679, -432, -1214, 413, 733, -1171, -171, 770, -94, -819, -83, 590, 82, -351, -693, 538, 450, -804, 269, 868, -844, -914, 1744, 321, -1358, 143, 1242, -413, -1019, 1410, -154, -1174, 513, 1176, -335, -486, 326, 267, 57, -146, 642, -37, -387, -126, 701, 684, -1067, -115, 1421, 48, -838, 1175, 982, -889, 222, 1411, -65, -1071, 1122, 992, -605, 274, 972, 438, -387, 499, 863, 520, -351, 801, 1198, -283, -466, 659, 896, -623, -128, 1427, 49, -1203, 875, 1108, -1295, -329, 1138, 262, -785, 140, 756, -562, -804, 583, 343, -854, -489, 622, 755, -797, -833, 558, -122, -1084, 313, 1068, -1174, -733, 1211, 258, -1184, -593, 1108, -642, -676, 653, 25, -1520, -396, 333, -34, -530, -916, 317, 104, -885, -311, 348, -965, -1186, 819, 580, -1408, -766]
2907g66J875j410j034J791l35j126N76J267j359j12O01M6J9p18P64R0k01p90J025
2926B03N87j337m6J528k50j819J511O91j651L45J397q65j186J623J39j344O9J565
2944A160r55n26M13l7q4K1k24N56M5q75M76R76q63q99J103L82j408P16J351j696
2964c68m97J727o31j619J035R54r55m8O65J75j045N18J84K23p64p0N90O4l17j94
2984c73Q24o79p78J518K69j708K67J722j097q82J419R8j433O21J374j164m27M40
3002A1N00o76J39K15K78n11n69R04M31p38o87J585n31j240Q27O47r70n26J878
3021I67n34j280R71Q28j523NJ192p47m37J92O94k84n62K84M14k27q00P52M39o07
3041b63n43J171R4j345O09J393j311j002J685p5j049K72Q84m32r02J115K57n74
$$ y = [-766, 1109, -301, -1335, 456, 121, -1005, -429, 838, -521, -633, -32, 14, 33, -685, 79, 169, -32, -822, 203, 790, -547, -593, 935, 685, -1134, 377, 1068, -583, -238, 1159, 294, -892, 731, 870, -474, -405, 1160, 205, -321, 92, 55, -29, -8, -232, 324, 369, -506, -30, 946, 83, -816, 287, 669, -739, -23, 1328, -368, -865, 862, 231, -1388, -353, 601, -354, -402, 263, 438, -607, -89, 95, 318, -446, -516, 74, 138, -179, -373, 451, -228, -1006, 512, 781, -927, -660, 1062, -35, -917, 502, 600, -833, -212, 1162, -2, -429, 11, 511, -165, -26, 189, 467, -44, -613, 291, 722, -16, -703, 882, 351, -889, -62, 585, -385, -911, 967, 433, -847, 124, 952, -571, -566, 626, -121, -558, -366, 328, 44, -518, -234, 180, -47, -847, -95, 344, -263, -806, 365, 459, -886, -277, 1116, -195, -1197, 488, 413, -636, -364, 520, 88, -814, 301, 558, -16]
3059a6p27M57R26p28n45J044M33j565P27J088r41j018J328Q17j938K22J386o69
3077B81j159J306J81p98j68P84L39r29J01L39M03r67R8J281p04r90P21R74j152
3096e9p79J629l51j306J104R48j551n51J206L54r19K42O57n53k48K22M67o54j04
3115b46K40O29m24p24R02J59j047J05J220n35j033J108M15j060k25J391r05n48
3133e78Q38n3j57k52K78j4M6K10R4j0m15l09N64J50q19M64P82r15l44R95o8j186
3155f99P47P22q49j76Q12m78p83J220j15m99k24O86m90n7m02L47K26k62q7M65
3175A04j03p69M55M49m86j33N74K50j119M97Q02p84o02P54M04o00oL67j98m66
3195f10N90Q1j79l83M15O66n15p00R25Oq54J93J079j003l07O08N97r71q6R79m17
$$ y = [-16, -743, -286, 640, -88, -633, 411, 844, -721, 6, 1094, 153, -865, 463, 1280, -658, -436, 950, 281, -878, 428, 609, -189, -357, 427, 766, -163, -62, 277, 680, -287, -189, 1092, 388, -602, 119, 1093, -59, -838, 791, 440, -866, 238, 1186, -365, -916, 290, 644, -275, -33, 624, 71, -177, 45, 512, -142, -246, -6, 623, 199, -525, 377, 536, -511, -406, 814, 279, -754, 354, 769, -291, -516, 875, -30, -578, 260, 207, 50, -202, 76, 62, 108, 318, 412, 402, -13, -322, 242, 392, -427, 37, 819, -96, -440, 555, 487, -699, 48, 770, -79, -255, 557, 79, -704, 516, 401, -98, -322, 364, -126, -183, -585, -238, -12, -274, -361, 104, 1, -768, -313, 136, -350, -483, 91, 341, -778, -281, 521, -263, -865, -111, 293, -307, -313, 54, -144, -610, -20, 61, -118, -501, -86, 580, 65, -635, 290, 296, -558, -365, 714, -289, -596, 12, 609, -362, -448, 531, 114]
3216A14o37N33Q35j025r6K30M24m74j70P17m3p94J9P32k4j085Q89M20n26n80J302
3237G61n89q37N99Q42o18n47P43K42r01k50R81j68q81L54O05l30n71L94N47q28
3257d52l77J090K7j061J98R63l54j025J111k4p03J90N79j83m57K81L80l48l95
3276e60N34J81m11k04O30L80r95l2Q53n36n10O27R54j497K08Q69j87r27L41R33
3296F51r69K10M06K6n53J08K71K41m22JL24J11q90J22R78o95m85J270p4j070M8
3317c91J166p83n77P97K51j091L61P41n08o7P1M96n56j7K41l3k0l32J96M54p75
3338c76l80R95J7q21P54J66p11N3Q78l71q73P68L52p90k02J095l97m32M22K7k26
3359e2J91k31K97j25k60K64L01l40K93k65K28n86L06L72m48n21J033j75o47P71
$$ y = [114, -523, 10, 845, -180, -276, -46, 378, -96, -266, 451, 408, -386, -367, 365, 341, -744, 145, 565, 39, -541, 761, 172, -665, -66, 776, 158, -389, 354, 596, -305, -555, 426, 258, -623, -269, 336, 6, -565, -171, 376, -452, -829, 261, 288, -773, -575, 388, 34, -991, 120, 96, -607, -417, 162, -21, -478, -197, 183, -165, -560, -26, 155, -256, -460, 170, 550, -445, -477, 376, -160, -670, -43, 911, -586, -378, 491, 304, -623, -282, 651, -318, -108, 298, 324, -229, -121, 150, 391, -31, -30, 294, 405, -485, -363, 615, -80, -565, 705, 631, -439, -391, 775, -8, -585, 212, 463, -628, -267, 474, -34, -101, -30, 466, -90, -107, 134, 101, 81, -251, -55, 399, -376, -756, 239, 256, -565, 189, 355, -356, -303, 575, 204, -669, 99, 451, -339, -541, 554, 157, -275, 147, 174, -52, 139, -92, 205, 80, -180, 84, 385, 45, 338, 73, 301, -285, 21, 393, -55, -576, 457, 282, -365, 406]
3379D06Jn41k76O96J13o70J00K90J6l02L07L4mm47K15N67o91l06N05M74q92M4
3401c61P95n04l54N66L96j106J07O53j86m96J73N45m07n2j12O90p44J68M06kk89
3422a14l28J069m75m87K71N99p03k94J073j19p58J08O17n14l29O16Ll29j20P35
3442E21j52n28M3O30j06p69M16K82l89m61J089j08p12L6P59m06o09N95M0k28J3
3463d4K71k9m50K66M39k33o21J98O90k92o81L92L78n03o1O63l23q05P50K59n61
3484b97K6M21j19o85P38K8m78j51N36j5l09N5J80J24l17j6N03n7l53R5M91m79
3506g9j69N48j29p27K77O66o83j84M77M46p29K6L85j03J00l36L47j82l00O25J52
3527D28m90K5K12J36o52p0Q38m08m50N19L60o76k34J016n61l88J83N88q81K40
$$ y = [406, 407, -134, -410, 286, 399, -271, -171, 119, 135, -167, 140, 174, 170, -277, -62, 505, -186, -492, 13, 487, -405, -361, 434, -70, -424, 142, 538, -568, -461, 192, 6, -490, -317, 228, -179, -231, -343, 347, -397, -229, 177, 175, -114, -442, 627, 152, -335, -64, 535, -168, -462, 611, 492, -266, -158, 459, -55, -384, 232, 235, -94, -214, 521, 369, -159, -116, 514, 408, -361, 55, 337, -52, -513, 576, 468, -244, -208, 551, 145, -464, 131, 171, -57, -44, 227, 198, -252, 14, 453, 220, -401, -203, 487, 195, -486, -94, 284, -219, -280, 383, 60, -745, 5, 264, -297, -271, 150, 31, -654, 84, 112, -366, -517, 19, 4, -305, -250, -70, 54, -263, -279, 224, 167, -186, -91, 400, -79, -248, 300, 171, -556, -279, 387, -296, -480, -3, 443, -286, -260, 125, 22, 122, -214, 133, -49, -349, 276, 428, -62, -37, 175, 311, -341, -411, 427, 19, -431, 88, 448, -228, -462, 554, -7, -395, -212, 376, -505, -265]
3547b65L29k86Jq8K99N1k74l5R7K37n67K17L56l68j50N62J71r80P71K01j45o41
3569e07N23J34n64J74O37l60l45L56r6O1j94J76J72n41L65J47L36p07N84J11m12
3590E0l04M29L83p84L17J67Q2m39J54J50k57o4K08K37m14O7K25o5o04M80M11m02
3612B7m16K16O51n39l2L40p2l86L9M78m90k20N55K44p38J18N64l29k98Q5M97o12
3634c18M5N43j72k31k8L34k6n27L4N83m63j39M47J60m30j1L74%o01N57m8j20p6
3657a13K45J34k71j32K03K8j78Q2L58J4n10K83K62n25j16M51J17o18L67L34n15
3678a00J1L02Q9m47K27J99Pm32q2K45J4k16J35O04r49L72J53K71n34M9N31o60
3700b11j54M65M17j035M33N88n42j72J86K09k29l02M18j03j32m4K00Q1j68j01
$$ y = [-265, 64, -222, -221, -309, -10, 41, -233, -268, -171, 66, -501, -284, 72, -296, -446, 116, 287, -693, 78, 279, 134, -507, 16, 150, -414, -240, 397, 37, -308, 48, -48, 13, -181, -5, 167, -374, -9, 138, 474, -233, 351, 462, 50, -254, 175, 558, -226, 91, 258, 340, -99, 55, 205, -52, -116, 92, 329, -85, -18, 207, 142, -462, 18, 429, 27, -389, -173, 478, -61, -93, 247, 175, -211, -172, 306, -184, -404, 151, 395, -343, -225, 339, 10, -288, -203, 294, -318, -273, 270, 98, -133, -161, 173, 147, -380, -346, 237, -226, -365, 82, 242, -188, -199, 175, 175, -426, 131, 83, -37, -113, 132, 266, -5, -137, 66, 94, -84, -2, 356, 370, -140, 143, 405, -120, -236, 215, 332, -286, 81, 415, -100, -89, 213, 302, -145, 82, 281, 288, -144, -226, 19, 33, -183, -48, 556, -393, -21, 132, 403, -131, -82, 449, -211, -365, 100, 517, -518, -85, 503, -39, -211, -25, 184, -45, -347, 71, -32, -164, -208, -8, 73, -95, -196]
3720a96N92m41m68P49J10p39M5R56n81k40K73L29p15J03P06m15Kj3J67pm02L03
3742A18k0P5l46K50n9k27k80P46N2r13M61O20o86j55M69Q1l26k49P69k92l83K24
3764g1K00l29m4M26j67j3l70O56j37m80M39j20j78k42N84K46o64K7K78J40p89
3785f08N57L20o25P2L28K26m27O9O3J01l89L28R1j79j79J12N31m10j36J02Q6l70
3807c37K62K32p5j74M64o1m33J4O68n66k19K14K40m48P1L32j28o6k53O70m71k19
3829b83K44L62l20k20N31o2n25O5L97r2l19L72J81o69K19M17K8n02J60P1L2l94
3851c07M01J75j83m88L84J04l02K82R5j49k70Q7L92k30j64M76j28k75K73R1j49
3872A15k33M15k88q6m4K95N0l87K26N8m5n16L28N80o31Q1K12J27o42P02O1n65
$$ y = [-196, 396, -45, -513, 236, 346, -393, -348, 608, 27, -213, 60, 389, -326, -223, 483, 68, 70, 57, 224, 217, -185, 118, 98, 173, -173, 77, 18, -209, -489, 257, 309, -604, -143, 477, -209, -364, 105, 186, -140, -389, 380, 88, -295, -71, 129, -200, -244, 182, 15, 2, -368, 288, 151, -329, 110, -10, -188, -430, 154, 400, -264, -237, 41, 181, -608, -51, 269, -356, -284, 44, 270, -157, -88, -25, 76, -313, 15, 106, -73, -252, -140, 391, -19, -155, -53, 33, -337, -75, 157, 82, -92, 372, 311, -122, -108, 560, -6, -225, -11, 229, -219, -148, 184, 56, -10, -263, 407, -64, -283, -39, 323, 3, -217, 314, 252, -273, -208, 189, 97, -222, 150, 331, -338, -119, 298, 326, -176, -16, 55, 87, -307, 94, 269, 86, -402, -18, 86, -216, 66, 161, 12, -258, -171, 221, -9, -173, 303, 175, -100, 173, 264, 115, -118, 297, 9, -77, -121, 174, 224, -163, 63, 121, 76, -440, -112, 468, -163, -82, 130, 257, -385, 317, 378, -187]
3894a87Q9K33K71p53L08N45m10m61P22m1k45j93L02J29m79o8N22p6m72K82L22
3915C40n20j60N18r2l55J01M71k84k51J78K56l66o9J69L58m76M5L65l38j04J95
3936a9K64n01J03J98K44l50k70M03J43m94L97K91m61l97N86J29n46j51P63l6k14
3957H2K7JQ2n77L24L1l4j55K68J66n20L44J84J38n44K05L19m12k02L98J92o45
3979c28L81M1M4o04N35J35J70o04L37J58l98O4L8J04j44J12l8j14k16L66L1l50
4001b80J88L84k58k17K77j7m88M30J44M2m71K33J63k92J59Q9J31k46Q0K10k72
4022a1j52RK51k82K47J45j20l36J96J71j69O7j84L58k74O2J30j73J30l01J81J87
4044A32q9q6K40o5q4N1J14j34J37j02J30j89K9M41m86o0J18q2k56J95K01j61l4
$$ y = [-187, -98, 135, 406, -347, -39, 506, 96, -365, 357, 316, 71, -122, 180, 309, -170, -238, 284, 208, -264, 18, 340, -180, -340, 178, 86, -269, -168, 303, 19, -232, -54, 202, -164, -233, -64, 294, -182, -137, 228, -110, -214, -19, 245, -256, -153, 45, 289, -61, -331, 72, 215, -279, 118, 409, -52, -449, 137, 266, -280, -431, 332, 296, 82, 109, 110, 192, -385, -61, -30, -64, -219, 49, 215, -305, 39, 223, 361, -183, 22, 341, -71, -273, 125, 317, -328, 53, 94, 138, -466, 69, 204, 374, -230, 107, 265, -133, -69, -31, 73, -71, 41, 3, -111, -327, 39, 70, -280, -92, 292, 34, -183, 94, 77, -411, 19, 163, 205, -266, -33, 130, -162, -3, 86, 217, -29, 51, 261, -11, -163, -154, 97, -185, 62, 207, 87, -249, -53, 118, -51, 16, -168, 190, -84, -22, 108, -65, 65, -236, -55, 132, 43, -43, 197, 132, 48, 99, 213, 79, 216, 114, 244, 55, 84, 525, 39, -21, 97, 15, -241, -46, 155, -6, -40]
4067d0R7j7O4j03J63j45j33J47J32J54n70K64K73o05J69N13j73k82j25L28p8l00
4089b67J90J97j68m0n0J64m85O32j52j00J96k99K58p3r1K72N0m58J59L38m14l20
4111d61N87O0m40K09K77L06n63k24K42j91K12M0J90l55j4J58J16m80L75L41k51
4132A34l88L47Q9j60j65L85j37k59K07lk47J39K9J90k67J00K06k43p9j22K76M4
4154G6k31P0L37k14j21J00j03J56j81M81k86n83N00K60k40k8m3K27l29J93J72
4175B13p7l15K64%j76j42K27J67j96J6M17j01m23K62K44n10k4L25q0l24M35m7
4197A55j58k47M80n7k31j77L02l9r2L60j45j82N8J4K26k71r9K14J40m79J76L15
4219B63n13M4M96j35l0j99K55k73J26J44%l1k36j18K19O9J8J07j87k48K08K19
$$ y = [-40, 57, 40, 104, 1, 164, 19, -114, 33, 165, 319, -251, 13, 286, -319, -150, 363, 190, -92, -217, 111, 33, -267, -77, 120, -48, -88, -138, 26, -459, 173, 21, -79, 117, -182, 76, 3, -88, 184, 234, -224, -65, 273, -141, -461, 126, 186, -254, -45, 232, 538, -25, -249, -7, -198, 14, 54, 244, -111, -125, 33, 149, -331, 44, 385, 134, -254, 93, 182, 22, -143, 242, 105, -154, 53, 50, -197, -58, -29, 161, -106, -6, 200, -43, -122, -244, 32, 76, -155, -85, 252, 38, -83, 17, -86, 70, -111, 370, 84, -499, 1, 261, 21, -7, -50, 177, -152, 41, 213, 136, -179, 85, 85, -91, -233, -6, 161, -35, -19, 398, 297, -126, 136, 380, -130, -154, 171, 91, -233, 202, 155, -3, -250, 230, 173, -58, -235, 67, 28, -64, 296, 151, -31, 27, 41, 267, -4, -103, 111, 251, -228, -52, 263, -250, -206, 290, 155, 125, -74, 181, -92, 34, 178, 178, 147, -89, -207, 12, 81, 99, 206, 19, -229, -21, 198]
4241A98l22O6J6P1n6J2O2o3n1K31j39J77P2k46k29M86j86p4O5K9r2rK5k15J87
4266A5J38q5k27J08J3O8J41J03m94J67J22k04Q5P2J8m4j90K75J2m4k37K40k68
4289b16J15Q2L36k09j92J10P7k49r2J43P6m5O9J88l52j7J69P1O5j89L6K64m22
4312a82M4R6M3M6P2m9k31K27JR1l94K16m5R2k27Q6M61k87j51J51J9k68K90J7k89
4337a71L6K74J83j97j79J39p8q5j8L43j71k44rK38k74K36K1J27m36M08L9J59j93
4360A48k88J79j45J9K58k44j05K15J41j16r9K52l99K51l55M07N7j80p1j14K73
4381H4j82M0L20K2o11K93K11l43J40J80q0k53P3L26p8o5j0K7l46L08K79n32K32
4404C5q7J20l76J13J80l7k2J42J28J9k87J45K0k4o6J92r2K2P4m56J93k02J69J77
$$ y = [198, -124, -58, -42, 29, -27, -15, 47, -16, -67, 164, 25, 202, 274, 28, -201, 285, 99, 25, 90, 119, 27, 18, 43, -172, 15, 153, 68, -159, -51, -38, 30, 171, 274, -220, -53, 69, -135, -50, 22, 40, -4, -194, 81, 93, 49, -188, 52, -216, -101, -19, 317, 108, -84, 26, 103, -146, -238, -95, -19, -64, 5, 193, -159, -176, -7, 64, 129, -60, -24, 240, -182, -138, -42, 1, 47, 119, 70, -161, 66, 67, 158, -236, -20, -65, 27, -200, -114, 347, 60, -91, 60, 79, -189, 101, 118, -171, -135, 139, 322, 125, -54, 85, 7, -78, -96, 247, 76, -168, -177, 61, -213, 23, 44, 171, -265, 143, 182, 341, 148, -140, 39, -106, -87, 171, -73, -178, 37, 178, 62, -37, 215, -184, 67, -288, 119, 176, -4, -75, -189, 84, -98, -58, 262, 284, -327, -34, 177, -166, -26, 154, 74, -179, -106, 220, 142, 77, 67, 94, -252, 56, 335, -197, 35, -52, 68, -308, -195, -15, -52, -74, 68, 196, 215, -72, 73, 93, 69, 3, 195, 103, 125, 199, -257, -64, -266, -97, 80]
4428H0k78k38L64R8m69M36J86k35j98J84N8j92nM77l63l1K2J85J37n31L92j11
4450c2J38k00K90k38K30j33M5q4j35J56j30p9K65j4j98R1R5k76J34l5N4j37R0
4473a03O1j03n7QK97J76m24nL76m8m51o2N52j56j12J7J99j89q9M3J92j97j0L8
4497d7j09j16K55M2J76j74L6N2k52K62k26J73m03L13L83k88l4r4K37q1k59M05
4519B51m00RO2J17j91KK00j51j03L23J95k56k4j00K6J03j85L40k43l0Q1O6M3L
4543A38j76j60%J86K5J47k07j28J41M68p07Q1P5J45o7J77l34J24l2L77j88j68
4565h3J59j43O5j59K97k97K21j51j58K21o3K06n3j40R7L5J45j4r3lj3j27P9Rp5
4590c8l5J28p9R1j4K3J51l95J33N8n6JJ03j61m2L26k58J89l31Q2Q6J72j03j01
$$ y = [80, -198, -436, -72, 26, -443, -7, 179, -56, -254, -70, -12, -204, -209, 268, -95, -126, -104, 81, 218, -313, 79, -32, 106, -94, 196, -42, 188, 55, 100, 16, -119, 37, -93, -172, 93, 79, -119, -28, 67, -209, -75, -110, -56, -193, -103, -42, -145, -202, -194, 103, 279, -145, -150, 226, 178, -273, -335, 217, 61, -51, -34, 165, -24, -113, -70, 122, -75, -85, -47, -156, -272, -17, 25, 201, 27, 63, 115, -137, 125, -101, 72, -331, -18, 365, 77, 43, -51, 186, 105, -154, 251, -149, -140, -78, 39, -152, -150, 50, -101, -204, 119, 314, 58, 34, -66, -40, 63, -122, 218, -25, -55, 26, 92, 135, 138, -38, -198, -198, -12, 13, 160, -47, -175, -34, 434, -273, -192, -117, 28, -39, 138, -196, -72, -104, 273, 85, -83, 76, -67, -2, -161, 136, -161, 60, -91, -249, -28, -91, 115, 62, -78, 19, 54, 199, 185, 92, 89, 76, -51, 28, 37, -38, -73, 55, -24, 67, 53, 76, 227, -168, -35, 23, -33, -32, 71, -90, -132, 194, -64, 125, -206, -124, -38, 134, 31, -70]
4614g0l5m5p1K34j19p2L3L84m45L89j64P5P2k10Q3j94RQ6J52j54m1Q0J70m09K80
4639A8n5j21J19m4N1L79m32K24j53k77K55m1J98j93J48J5J2m01M79j34N0j96K17
4662A18j92j30M76l51O2n2o8J25kJ21j96K06P2j23n2J63J0j91J67l75L79J0l5
4685A42m0p1J85k16j74J87l1O4P9J17k80L8j64J19P2o1N3M4k09J70J48j75r6J26
4709B7J38l48K49k18K65l59N12l9j42jm6K2n4k68J01M79m11Q7k4J29j7r5L6K5
4733D8k19mJ13J30j42K9J29j74j3Q8R3l45L98j21J00k29P5R1l0nJ52j62Q0k20
4757a38K02P4k07k8o4L5J24l3O2OJo7j39L36j77J36o5j4J60k04Q8l67K90o4om7
4783a06n1L81k85K01R1k97K8kN3mJ23j8j75NJ24j01K17k70O1J31l34R8O8K52l43
$$ y = [-70, -105, -150, -221, 13, -106, -178, -145, 239, -206, 183, 19, 94, 166, -44, 39, -155, -146, -60, 92, -62, -103, -23, 147, -262, 18, -37, -158, -39, -83, -32, 347, -85, 139, -14, -291, -36, -77, 121, -72, 76, 91, 103, -298, 181, 47, 97, -99, 118, -74, -204, 272, -79, -17, -69, -137, -12, -14, 107, -89, 117, 189, 66, 14, 177, 187, -4, 163, -212, 167, 177, 142, 102, 31, 216, 0, -174, 13, -18, 46, 125, 242, -38, 0, -164, -45, 27, -34, 19, 63, -146, 24, 172, -3, -99, 27, 165, -183, 66, -152, 113, -246, 266, 227, 85, 84, 38, 60, 6, -262, -161, 318, -93, -6, -30, 99, 82, -13, 23, 48, -171, -175, -62, 68, -74, -45, 84, -90, -103, -15, 78, -267, 131, 10, 110, -119, -44, 47, 17, 12, 164, 2, 82, -138, 64, 138, -69, -97, -161, -126, -2, -35, 27, 33, 34, -33, -172, 164, -13, 123, 58, 44, 204, 0, 88, -279, 11, -53, -59, -106, -157, 224, -61, 140, 231, -66, -38, -40, 13, 9, 132, 114, -61, -56, 68, -33, 184, -86, -25, 106, -228, -130, -62, 190, -153]
4808a53J10Q6j72J15j30K04k92K33J04j54J92j71pM0J38k70M4n3K18o6L6J5J20
4831A87j67J50n4Qj30k01K97j8K08o5j52j43R9M8j11J18j09J83Q3k25J05l18L12
4854A05j71M2k22K91n5K92k68M6pk63J33j7J48o2kj20o2K65k90M06r7J04j32J9
4878H3J3l12K61q2n0M6j85J77R3j37nJ63j19M3j00m2J56R5J0r9k36Q4M42l06k91
4903b98J24L20m80L46j82J72j08J51J70l42j18O1J53K09p0k5k5l98L85k64K05
4924a4k7K46j25o0o2j05K98j99K41k43J31j47K1o6L19n2j37q8M0l2P8J9J41k58
4948h1M04l42K1K8p6J28l0j07J32q7J08k71L13k10L5J74k59J01j26K45MP4KMk90
4973a06J38l0nm0j77K3J48J96n4r2L9p2K81k63J61k13K6L65r4j18l11R2K06l7
$$ y = [-153, -43, 43, -129, -14, -144, 60, -232, 1, 105, -49, 143, -28, -35, 5, 143, -127, -83, -136, 82, 16, 52, 67, 187, 20, 170, 116, 124, -6, -207, 90, 72, 280, 215, 63, -80, 19, 67, -44, 74, -35, 148, 231, 6, 111, -207, 105, -66, -24, -246, 45, -10, 282, 14, 60, 53, -210, -77, -94, 54, -8, -10, -130, -192, 73, -217, 189, 92, 196, 64, 83, 96, -216, 45, -37, -87, -41, -226, -49, 44, -93, -98, 65, -54, -11, -111, -153, 3, 98, 108, 9, -227, -143, 299, -7, -298, -174, 146, -334, 12, -170, 2, -106, 45, 215, -127, -245, -184, -31, 178, 108, 83, 58, -340, 45, -219, -14, -41, 205, 80, 20, -42, -147, 151, -48, 193, -50, 81, -66, -45, -111, 208, 156, 19, -69, -29, -61, 17, 36, 177, -81, 323, -19, 2, 30, -46, 82, 52, -55, 77, -10, 98, -173, 140, -70, -35, 139, -120, -19, -145, 100, 104, 178, 180, 184, -106, 32, 2, -3, -43, -220, -197, -49, 147, 93, 1, 40, -32, 249, -14, 147, -66, -40, 325, 231, 113, -198, -106, 100, 63]
4997F3j02j69J93N5K6Mj47J39m84L53K1K15j95p0m3nJ99P1q8l5l3J33j90K92l2
5022A71k4K5k84L03m09Q2L10j75q7L28k06l9PP0j97J63O4o6p6O7r7J62n3J52j55
5047C6j9q6j46L61j65n2K02k03K09L0p4l2J70m05L44j45J82m97L90k66M6m7M45
5070B78l5l00J64M6k23J41J48l2l4J0r6P8j12j32K09r1j79J92j1j0m1k45J84o3
5094a54P2L3j96J03J55k4j58J08j85K91K3p3k2p2k4J29l2o9J75m8o5n3M09l04
5118A9n3r7K15l88L02K7j76K2K62k41J50j35O5J41j31K9j47J55j93K06Q9lk10
5141i2j2J93N6j78J83j70j10K78k34L10m63J13K89k36K3J4K27n81M38o2J50L7
5163A73n3j67L15j49k58RR8J09q0p3j16M66j64r1p5n7n0K40J2Lj47J70m1n0L0
$$ y = [63, -39, -208, -15, 40, 66, 70, -77, 62, -422, -69, -48, 167, -28, -98, -141, -146, 53, 124, 36, 1, -32, 101, -89, 203, 171, 147, 172, -112, 191, -218, -136, 174, -1, -88, 240, 34, -5, 2, 72, -125, 38, 102, 36, -40, 27, -70, 92, 39, 191, 36, 17, -69, -215, 146, -19, -71, 131, -72, 137, 167, 93, 61, 231, -174, 170, 25, 207, -290, 100, -166, -120, -167, 278, 243, -57, 107, 153, -70, 71, 219, 187, 153, 163, 67, 145, 33, -99, 110, 19, -160, 32, 21, 11, -30, -275, -91, -154, -82, -49, -245, -142, 13, -11, -169, -61, -246, 45, 68, -5, -27, -99, -123, 6, -26, -95, 80, 32, -33, -86, 323, 19, -34, -131, 84, -304, -2, 25, -151, -129, 133, -108, 42, -93, -28, 113, -18, 11, -136, 19, -174, 32, 121, 118, -92, -104, 89, 145, -33, 150, -20, -130, 148, -86, 224, -239, -126, 163, -73, -50, -36, 191, -390, 48, -14, 136, 173, 120, -47, 268, 119, -139, -130, -32, 77, -3, -76, -192, 274, 110, 19, -56, -113, -163, 77, 89, 92, -55, 115, 74, 24, 54]
5188E4j31Ol2n4J20J27j70J83r7J61k14O1N5j73J04l1J36Jk83K14j32K01j14j99
5212b07L21j1m6k49K38p6J92l09K59P5j73K9j19k25M76j86J05k65J83J28k69j22
5234b51K05J09k24J41k2Jj69K96J27j20k25J53k48K93L9j56o4J92j47o1P9J29
5256G7j95J89m6J61j14J63m83K04J47Q5k92m2L00k10q3J05m4J13k5k56L18q0L39
5279C31l34n1k1P8J73o0K5j37p5K78l50kJ71L57k93k6L5j74Q1k1JK2L2o3o8J84
5305I3J58l45M88m70M7L3o9m1L4qO5J41j00Pj45J86k35J82J0K94k21m0K3J7J77
5330B81m68K9J35L16l80p4J90j40N5OJ59j01k09K65j68j57K61j32J09j47Q0j2
5352a02J38j85J71P8k08L0J33k1J8j41R7q8P1J4o5O8qJ10j71J38j02mj11J45j69
$$ y = [54, -77, -71, -103, -157, -37, 90, -80, 103, 6, 167, -47, 14, 69, -104, 0, -31, 105, 106, -177, 37, -95, 106, -8, -207, 114, 103, 57, -192, 46, -30, 162, -147, 112, 187, 14, 43, -76, -301, 175, -11, 94, -171, 12, 140, -129, -251, -46, 63, -161, -20, -42, -41, -210, 86, 213, 93, -132, 21, -227, 66, 105, -51, -115, 77, -70, -131, -52, 77, -118, 71, 25, 186, 72, 235, -248, -44, 103, 188, -104, -146, 154, -56, -139, -34, -78, 35, 10, -246, 72, -8, 331, -3, -54, -75, 3, 176, 116, 141, 4, -71, 207, -143, -145, 26, 383, 90, 64, 99, -75, 6, -15, -14, 8, 40, -23, -91, 93, 251, -94, 394, -76, -29, 4, -65, -106, -72, -80, -15, 126, 26, 33, -112, 74, -161, 21, 31, 325, 104, 64, 87, 104, 281, -187, -158, -23, 293, -87, -161, 29, -111, -56, -50, 109, 8, -201, 64, -104, -261, 0, -132, -23, -170, -90, -102, 36, -149, 22, 100, -108, -78, 55, 34, 52, -89, 8, -80, -9, 5, -60, 8, 0, 110, -61, 77, -25, -29, -140, 5, -164]
5377a64K02J18j68j24K19J81k66%O0N1j34L58l28Q7J33j89n7q7O6K2J34k23K10
5400A01lk28K07J06j51qo1L21k50J5q0K68l64J9J47J82j77n9RO8j5J39j8k07R0
5425E1l0j11k52L03J44p7K45j66j67K03n3j80J23k27L2p6Q7K74k86J63p8K04j39
5448a3j1L71n34J15N6J70k13L3K81j28j42J48k65Q5J51j36J22L4l14J67j1J33
5470I9o6j68jJ09R7M9L6o0k44p9L14k13K47RJ2k40L72l18O4j3k4J59j55K73l16
5495e7j02K76l9j55L8l2J6R5j32J38l7j94O8J34K82k29K7j05rj9n3r0P7K29L6
5520A63l32l0L17j04m6K3J01j13k58L38j35J16o7j24R4R0oj20J4J67j4J88j04
5543A58m15J66J17o4o1K54j95Q8k44K33K3n8Q7q1R7l7J08M8k05k00R8J01L1nj16
$$ y = [-164, 38, 156, -12, -136, 83, 264, -2, -2, 58, 109, -25, 333, 5, 92, 225, 36, -21, -108, -42, -20, 114, -109, 101, 98, -130, 77, 183, 32, 24, -37, 284, 34, 49, -31, 237, -127, -108, 39, 221, 44, -15, -6, 62, 47, 186, 168, -39, 51, 21, -90, -342, -39, 105, 28, 273, 107, -60, 143, 90, -90, 33, -194, -162, -238, -151, 123, -163, 0, -78, 126, -13, -24, 347, -187, -72, -16, 154, -59, -26, 255, 127, -15, 133, -132, -47, 104, -32, 90, 124, -190, -23, -34, 99, 33, -135, -136, -27, 70, 119, 155, 95, -149, -228, 86, -127, 120, 129, 141, -99, 273, -45, 19, 6, -18, 141, -14, 259, -57, -159, 117, 78, -77, -39, -71, -55, 40, -92, 46, 9, -185, -117, 17, 299, 70, 97, -8, -17, -36, -89, -179, -102, 127, 163, -169, -199, 118, 14, -32, -9, 92, -21, -279, 59, -76, 40, -27, -151, -57, 33, 27, -93, -79, 88, 74, 262, 158, -257, -91, 26, -38, -99, 155, -40, 48, -196, 37, 60, 2, 89, 8, 105, 68, 176, 224, 19, -181, -83, 18, 49, 44, -72]
5568g2K25rM9j19J10k41j82J98q3K31m62K74J05jJ64k97R5J82k91O0O8j8l5J74
5592A25l36J26R6r4j3J33J81k09P0K7l6J55j26j66Q9j78j4K50nm7Q0M0l81J80
5616e3p4j75L68P7j27o6J20P6m06M16r4Q5j3j47j7K4J40j99q2J25K23k45R8k21
5640a67K26o5J7J38k02R7k6k19J9K65j86J42J00k33J06n5p2K14m9m6J2P1j03m3
5664e9o1J70j25oK1K73l22j25K41r6l7J23J07j58P0r2Lk5K27K1j95p5L17k34J37
5689A00m0p3L7o9M16k90n6o8O7L7ll06J07J05l18K13J35R5j69K71l99K29J4j89
5713a54J81k70M80l87J81j7k0k6O8j44o7J46Q6m6O0K10j43j14k09K38Lj71K70
5736A55k93J20Q5j68L5J40j60K50k59Q6j08J62LJ9j41K12r3o7j75K83k22K82j14
$$ y = [-72, 153, 144, 193, 74, 184, -57, -239, -41, -124, 107, -355, -81, 24, 23, 187, -110, -15, 167, -124, -64, 4, -14, -49, 125, -211, -85, 11, -83, -96, 37, 218, 9, 79, 106, 70, 225, 99, -67, 22, -156, -170, 80, 75, 28, 108, 148, -233, -53, -127, -302, 66, 143, 16, -50, 70, 146, -260, 156, 62, 147, 134, -13, -30, -6, 134, -65, -147, -22, 201, -44, 54, -167, 59, -6, 11, 149, -53, 44, 18, -201, -182, 83, -103, 39, 139, -94, 12, -43, -115, 99, 50, 4, 16, 87, -16, -59, -120, 50, -75, -81, -60, 213, -109, -234, 7, -89, -126, -3, 104, -54, 16, -76, -73, -98, 129, 150, -45, -120, 197, -37, 100, 60, -13, 24, -45, 371, 81, 25, -43, 24, 61, 58, -248, -141, -36, -354, -141, -6, 89, -80, 191, -208, 21, 35, -154, 27, -243, 237, -150, 31, 14, -6, -32, 36, -108, -175, -29, 57, 11, 71, 281, 138, 24, -185, 53, 56, -115, 155, -138, -18, 67, -101, -66, 74, -86, 164, -95, -9, -117, 45, 48, 67, -74, 138, 45, -22, -197, 86, -136, 146, 32]
5759C2n8J80l34J60Q9Q7l08K00k08J01p3j83M71k01Q7N5m3j4J33l79j88M35k8
5782A3J02O6k78K61j42j0J76k26k3j1j6J19j11p4K13j1J7k39J61K9o7l4J03n7
5806c9Q4lk0J08l1m8j87L00k51J18j90J5k2K58k60J17J23k50N8K33p1j30P6Kk63
5831b73J98k35K37K34r4j10L8m3r0J01J05j64L3J26J36q6j59J46k71J09L4Q7N0
5854A09r2J64l86K16o7J46j19j64L87j71j88K17l0m4j45J99K6k74L35k73J42R1
5876G9Q3o6K5j63P9P3k23J60k14K14pJ72l7j63q1L15k50n1j7K56j77K05l00P8
5900a0P4MQ1l44j3P7K6L6J49J42j70o4N1j04J3N5J1J2o3n3K44M4n08L53J59k99
5926i7J55N8qN0m50L48J74k74M0K7r3J01j56j09J47K12j22q9N9L5K57j50l20L12
$$ y = [32, -26, 154, -180, -20, 69, 156, -152, 48, -160, -59, -132, -315, 156, -45, 42, 97, 54, 40, 173, -206, -394, 41, 13, 115, 181, -97, 164, 22, 12, 188, -38, -61, -72, -88, 31, -80, -154, 59, 48, 65, -174, -13, 16, -51, -85, 18, -39, 45, 42, 22, 130, 99, 51, -136, 164, -87, 31, -159, -144, -166, 92, -168, -51, 72, -178, -120, 113, 42, -88, -12, -10, -273, -75, -310, -73, 161, 67, -43, -5, -48, -138, -37, 68, -96, -63, 63, 199, 113, -46, 100, -171, -62, -28, 59, 109, 17, 181, -205, 11, -56, 90, -29, -193, 194, 23, -165, 52, 22, -22, -167, 32, 58, -216, 119, -154, -12, 79, 162, 96, 121, -42, 37, 110, -113, 47, -167, 47, 40, 212, 175, 12, -69, 246, -4, -55, -72, 184, 7, 212, -88, -10, 64, 68, 149, -195, -208, -131, -105, -69, 80, 222, 52, -12, 39, -65, -52, 3, 14, 26, -37, -90, 154, 198, -310, 43, 202, -97, 58, 116, 108, 158, -292, 56, 230, -44, -4, 23, -70, 31, -125, -234, -87, 125, 3, -86, -27, 8, 265, 115, -205, 107]
5950A07j02J03k81K99j83j31K42m9j01p2L09N5j74n5j34J74L9l6J12j01K98j99
5972A20j89j53L12j18P8k03J3J79o4l6l8J12r4N4Q1r6P6p4K56k85j02J20P1p3
5996e3K90l69J99J70n5k13m2J71J50l92O0L5lL66n18J85J0j97l5K66J03m10J94
6019h8N3o4J28l1k9J62j29L3o8J1j15j98N46k3j58M3j11r3n5M63l46L11j94k11
6043a63m5k01O14k92O4Q2p5j16O3J99k24J40j20l7J98j01K6n7k08J97K35k69P3
6066a7J08J27l37J45J41j56k0J34j31m0j17J15l2R7Q0j87K21r9J52k04n4k63L83
6089D6J38n8qQ1p2k98J51o7J98k11M6K7J83j64q9K7j34K31R5O8k40J19k27J55
6113cl36N22K2l85K10%K7l85M48j25j52O5J58K1j14L91l59j29P9N2j62P8P0j9
$$ y = [107, 5, 108, -173, 126, -57, -188, 54, 5, -96, -168, 141, 196, 22, -33, -167, 7, 46, 10, 122, 21, 319, 120, -69, -222, 90, -28, 50, -153, -140, 39, -25, -61, -99, 13, -81, -27, 54, -42, 34, -40, 216, -69, -171, -51, 20, -53, 237, -132, 67, 237, 182, -31, -73, 98, 248, -144, -84, -49, -52, 314, -204, -19, -9, -206, -241, 25, 128, -282, -88, -35, -99, 29, -2, -31, 131, 2, 35, -33, -22, -137, -335, 211, 188, 30, 73, -38, -131, -186, 277, -69, 242, 48, -163, -208, -409, 205, -87, -23, 59, -16, -132, -69, 130, -94, 46, -74, -111, 87, -14, 12, -45, -253, -56, 179, -90, -17, 91, 218, -119, 26, 167, 11, -9, 125, -6, -46, -163, -48, -80, 17, 97, -90, 131, 32, 184, -20, -74, -337, 46, 184, 126, 118, 199, 127, -171, -20, -87, 111, -100, -54, -27, 156, -8, -97, -70, -204, 27, 122, 190, -50, 69, -158, -3, -339, 183, 205, -180, 30, 30, 57, -328, 120, -5, -157, -92, 66, 87, -27, 364, 5, -124, -45, 7, -155, -77, -7, -26]
6137b6kQ3m0j06j93J10K14j61K24k85L83l02N3o5Q4J14q4j19N9Lq0J11j8j09L6
6162a16N19l69k27Q2Qq3L60j44o7k02J49R1R0K32k62r6j89K58J84j25j57K74k43
6185c3l9K32j83nj14j07L15J56l68J72km37K39L19j35P2k47K45k07O8%K89l91
6208a61J22N5k13R7L10o4j31p8J57j93J26J60j34Rj36o2J84l00L87m5%l10Q5J9
6232a16J69j14O5j18q2K5P3L49k52j40K46k95K56Mrj02k46K03J45r7l8K31j99
6255d2k00K67k09%J71n6j0K10l21P6J24J2j49K08Q5m5o0N4p1j90J15Q7j92J46
6279A0JM0j80K16J10k06o0K30p0k50j03J68N2Pj11J70J80k44NL43l62p3q0J81
6303b6J20j39L11k76o5J33l0Mq9Q5j73j65M9M84j28kl49K09m2M7J15l3k79K81
$$ y = [-26, -28, 55, 15, -91, -284, -174, 40, -121, 103, -182, 201, -101, -48, -113, -29, 85, 1, -118, -59, -56, -136, -25, -43, -152, -116, 403, 34, -193, -111, -103, -186, 174, 30, -37, -239, -90, 1, 91, 323, 61, -35, -224, 34, 218, 93, -64, 210, -33, -72, 160, -23, -28, -142, -249, 66, 222, -146, 26, 24, -413, -174, 145, 10, 82, -165, 80, -127, -59, -59, 230, -161, -39, 16, -197, -100, 210, 146, 15, -63, 94, -99, 27, 187, 53, 62, -74, -136, 48, -252, 135, 90, 90, -220, -135, -116, 53, -61, 4, -114, -196, -171, -98, 251, -1, -141, 105, -190, 66, 70, 61, -41, -287, -84, 61, -36, -74, 157, -42, -242, 25, -184, -184, -13, -69, -79, 131, -190, -114, 10, 22, -127, 81, 166, 121, 61, 115, 44, -146, -31, 56, -136, 10, 11, 51, -129, 87, 197, -9, -69, 161, 91, -159, -262, -94, -42, -35, -146, 24, 204, -40, -35, 308, -54, -127, -207, -26, 94, -45, 266, -10, -75, 58, 28, 32, -57, 28, -145, -310, -261, 223, 95, 93, -256, -47, -89, -42, 73, 40, -239, 42]
6327D2L07j39m09J86J93k49l8K42L4k57O5m6q7L30j37j10J63k03N2P6Kk15J18
6350h0P0j02K01j13j04J48J70k20K11k18L20l63J49m3k38J00o0L15O0m13L74K6
6372A90j62j04J55k6j84O3mK27k28J06j5Qq1J91m6J24j32n1j75P9J69k84M7j01
6396b34J97Q8j22Q5p5L22j97J94k82L5k51O6K80m13M6L85l41J88n6K09l25L18
6418A17j14l6R6j12M9J35j59pJ1j94L54J30k70n2N6J18k15j08K20j9J8rJ44k17
6442f4J69k85L44r5j77K10j10j0J23J93j77J73k58P4k36J17M7Q1j94K5J41k16
6464a25J18q8L44k23l08L9L19p7j59K97k13l9O4L81j86l03j11K30l3j02o6K69
6486B8j06jJ96J63l13j63J66N5j58p4J47J56j59P4J58j84r0n3P1J68J85k94j8
$$ y = [42, 349, 210, -199, -13, 180, -69, -107, 135, 169, -88, -23, -69, -156, 174, 37, -73, 90, -113, -61, 15, 17, -198, -80, -10, -112, 89, -24, -128, 20, 190, -30, 181, -37, 283, -80, 69, 26, -212, -112, -172, 143, 203, -210, 164, 190, 28, -76, 79, 53, -131, -68, -72, 155, -73, 33, 18, 26, -55, 136, 90, 214, 82, 31, -144, -65, 104, -180, -133, -234, -37, 51, -71, 14, -61, 261, 64, 258, -24, 11, -240, -174, 106, -307, -261, 124, -217, -29, -85, 124, -201, 117, 3, -33, 63, -49, 0, 135, -24, -31, -20, -214, 140, 270, 0, -52, 4, 122, -93, -201, 19, 0, 18, 9, 153, -64, 105, -180, 164, 69, -108, 102, -8, -18, 105, 298, 121, 294, 36, 110, -126, -9, 38, 119, -75, -50, 91, -125, -7, -95, 249, 26, -282, -243, 76, -1, -160, 137, -76, -115, -51, 330, 144, -159, -270, -40, -73, -175, -241, 28, -78, -79, 117, 280, -33, -196, -30, 25, -133, -207, -60, 96, -63, 11, 169, -15, -105, -158, -87, 81, 266, -28, -46]
6509d6J72j00j13L01k80J26j79N4o9J00K10j34k22L31q8P1j71j31K16j60L10j71
6531B7k7J21M0k78K95j03qk93J82J47J16n23N0L14k46J20L36j96j98J57N7j65
6553g5q8K10o6J35l1O6k04j6J5n5l5J4Q6P5m9J9k9L1QK6N9l80L81j75RJ05l48
6580c12N55k31pK41j44j11k0K40j71j77N1N6N9m9J93m45J24J60J9L47m66K17j44
6603a5J65k28K37r4j3J89k11q9K12q5p5m9L41j03l24k0K46R8l8j96j99L83r4j88
6627a50j71O3J67J59K6j99J80L1j34J45k72J88N7N1k99K93q1j16R7j37L99l93
6649i6K69n4N7l06J7j51K20J17j00Jj04K88k06K9J18mk43N6K97j42o6mR3k55J8
6674a51P9m5J2j03K11k1j78L08J79k64Q9l09J88L1Q2J9n7N9j87k8J71k91Q2L1
$$ y = [-46, 126, 26, -87, 214, -66, 60, -119, -65, -134, -34, 176, 42, -180, 151, 63, 134, -37, -168, 48, -112, 198, 27, 0, 121, 161, -117, 178, 75, 67, -226, -44, 103, 219, -304, -254, 60, -186, -66, 270, 74, -124, 33, 90, -75, -163, 47, -19, 116, 85, 151, -53, -69, -54, -109, -144, -130, -44, 31, -18, 1, -28, 3, 11, 37, 96, -284, 97, -78, -69, 36, -312, 243, 12, 5, 246, 102, -9, -29, 211, 40, -137, -86, -30, 29, -20, 173, -272, -148, 12, 31, 378, -88, 129, -15, 150, -78, 159, 65, 52, 241, 30, -59, 153, 68, -7, -56, 285, 182, -142, -162, 84, 182, 144, -52, -251, 132, 38, -150, -321, -258, -91, 68, 94, -105, 75, 106, -28, 117, -155, 33, 90, 141, -158, 135, 54, -62, 35, -102, 297, -96, 173, 119, 176, -130, -113, -264, -44, 73, -27, -26, -130, 158, -48, -19, 99, 95, -148, -92, 205, 63, -3, -7, 86, -169, -151, -72, -117, -105, -208, 3, -18, -196, 112, 291, 27, 116, -193, -5, 26, 108, 127, 70, 129, -58, -86, 85, -206, -124, -93]
6698i3J05m5jP5J20j03M4l20L12J37l04N9l2j22Q2J15P5MJ13k08Q6p0q7M5LJ49
6724A39k28P8M2%p4J5J93k20M1j80J79l0n2J04J17j00R4j78O4j81K39Q0k52J62
6748E2N3j44j18M19j10l0p4N6M0J7k50J35j1j51J41K30j92o7n7K2K50k99K62O8
6772B42j60j64j22L45k55o9R1%L9K22j01Pm75O23m47M91j54k11j00K20q0lJ21
6795F0l41L22J19k83J12k18M27p2k47J48M7OK0l4k56J02l4M57n39K07L3o6j08
6818a38K02K28k62M0P5j46K3q4K87n37K06O6j1j34M48k06j91L9L79k39q2J37l8
6841F2J5j06J1L5N0r8p2J24J5j09m2M6l3L99l0k26O3M1j17J48j26j08J54k27L25
6866A94l63K09m2j56R2J00r3O1j27KK16O3k41l03M48J20l69J63O2p7m5J05k9Q0
$$ y = [-93, 12, -33, -34, 41, 161, 58, 102, -218, 94, 231, -73, -14, -46, -168, -86, 29, 104, 108, 221, 13, 99, 29, -58, -13, -10, 139, -89, -11, 31, 31, -43, -28, 165, -55, -14, -194, -15, -45, -97, 7, 124, 24, 118, -60, 4, -177, 62, 142, -110, 52, 105, -39, -157, 262, 152, 122, 48, 104, 144, 161, -89, 46, 35, -116, 25, 255, 63, -4, -61, -39, 211, -88, 174, 242, 82, -82, -204, 141, -114, -183, -92, -92, -53, 169, 68, 75, -400, 223, -224, 267, 113, -98, -198, 22, -58, -61, 60, -281, 41, 160, -123, -11, -229, 198, 126, -121, 27, 74, 80, 100, 66, -190, -88, -122, 335, -204, 3, 36, -30, -138, 64, 292, 30, 70, 145, -1, 22, -62, 225, -312, -106, -40, -51, -185, 263, 57, -134, -95, 284, 45, -37, 100, 62, 77, -29, -18, 17, 67, -31, -103, 21, 36, -73, -115, -69, -102, 297, 267, 41, 104, 145, 28, 176, 50, -58, 96, -131, 194, -169, 40, -2, -158, -66, 34, -59, 2, -125, -123, 93, 156, -85, -388, 60, 180, -189, -26, 36, -41, -86, 19, -10, 70]
6890G0m0PO3k34O6N1K3q0J01J95l05Q7m3J3p4J83L5k56K11k03M23m41J55j18o
6915a17j23J11j43J4J99O5k80K65Ln4J75j20J19j11O2j63R7L1j6l39L70J51k71
6938g5M2O2K4O8J71l47j80M1r4M34l1l06L45k69Q7J02k69K80j70J6J1Q3L2P3o1
6963F9k83L82m06J75N1K82j29pL1p7k56J86J25p2j60J85k26L49k78KL67j44k48
6986h2j79J47r9J93K08j84O1j84J48R2l25m1L48k63J15K33j53K37l12P5k30J48
7008d7n8J44m1j06J1K54l63J94mm0j89L55nj8o5j98K74j70o0N5J02j50N5J70L5
7033A35o9j10Qo4P6m3L4j26L87k96j5j1J84m4k21L06J78m62JO2J51k16O4J90j02
7058cn4J34J19M1p5j23R6j22N2J65pk70j3K26j25k95J89J96j2j91L41r8m21M48
$$ y = [70, 30, 37, 100, -134, -68, -17, 6, -74, 27, 222, -83, 4, -39, -26, -100, 83, 118, -138, 73, -130, 293, -148, 7, -111, -117, -240, -129, -272, -258, -59, 6, -274, -9, -6, -60, 115, -5, 114, 3, 65, -98, -1, 30, 14, -325, 45, 196, -75, -33, 29, 53, 121, 292, -55, -235, -194, -288, 146, 115, -191, 154, -115, -28, 74, -195, 85, -85, -69, -58, 25, 57, 130, 69, -214, 168, -238, -63, -12, 270, 141, 134, 165, 88, -168, 18, 143, 71, -89, 96, -130, 219, -59, -57, 310, 166, -82, -261, -114, -213, -20, 188, 4, 65, -119, 29, 121, -204, -245, 103, -160, -45, 188, 35, 272, -40, 35, -195, -47, -105, 39, -2, -108, -97, 157, -206, -12, -16, -56, -245, 110, 105, 87, 22, -176, 98, -72, -132, -77, 25, -125, -70, 100, 135, 66, -44, -36, -100, -24, -67, -33, -159, 228, -68, -83, -94, 90, 46, -175, 131, 309, -153, -152, -90, 61, -155, -91, 99, -3, -57, 77, 196, 237, 162, 39, 135, 13, 65, 230, 223, -47, -60, 166, 41, -254, -65, 131, 119, -72, 269, 171, -250, 198]
7082A98j85L55l83Lj75P0K04J38j21o5k04L79k21N3J3K69m76nl2K87k81K38j69
7105a10P7L1m0J2J14J59j91O0q3k18L50l29L04k22J25k1mq3J73j9j48J55k26%
7129a34m2J31m1K0J17J53k44j13L32q6j76K19lm3n0Qk06J41j03K20j21k03L19
7152I5M2k64r2K24j21j94J71o4J61rj31K99K8k45MJ88j13l41M95mj43j20K70j45
7176io8J33Q3l6k42K27l5k66K53K62l80l24L12Nk8J63M6j09l0r1J08k5Mj96K91
7201D8q3p4k6J44J10L4R1m53L84r3p3O6j26J05J5P5J25j75n3j87L70q2k72J65
7225C5L29l69k47L82j4j50P7J26l0l56K74J14k07J12K32m41K00J58j13l14J79
7246b3l7n6N7k16J99K44j2j53M1L72m08j11L07k03j76J84J20l55L63J10q5k95
$$ y = [198, 13, 368, -15, -12, -187, -117, 87, 225, 104, 39, -165, 214, -7, 46, 59, 328, -148, -153, -185, 102, -179, 59, -110, -33, -2, -42, -30, 84, 243, 52, 112, 29, -189, 161, -168, 136, -86, 39, 18, 14, -69, 104, 85, -63, 92, -134, -134, -176, -45, -86, -66, 51, 204, -40, -153, 179, 93, -83, 136, 133, 90, 40, 48, -158, -17, -120, 100, -21, -224, 95, 137, -127, -219, 5, -116, -310, -139, -203, -42, -51, -182, 117, 145, -100, -96, 92, -21, -362, 133, 129, -14, -134, 136, -9, -77, 56, 139, 103, -139, 88, 53, -213, 40, 302, -78, -402, -90, -85, -113, 50, 96, -13, -43, -134, -26, -51, -47, -243, 48, -35, -109, -135, 9, 119, 153, 244, -209, 175, 82, 9, 75, -51, 54, 69, 144, 269, 94, 41, -146, 224, 142, -130, 35, 364, -5, -252, 130, 116, -34, 43, 169, 139, -217, 57, 171, -36, 76, 308, -133, 67, 225, 112, -202, -23, -60, -116, -59, -275, -76, 168, 156, 3, 44, 416, 8, -103, 204, 1, -175, 9, 129, -226, 137, 247, 162, -133]
7268a33O4k15M46l85K99j71q3J21K94k24j50jR7M9n7J00N1k91kL35p1j32J93O5
7292A99m12L12q4O3l19K78K47k13k07L17l5j56j48J36M4k22K55Krk25mL04p5m31
7316c83N87K40p63K88K2l1o8J48P8q8k01J13Q2n8j35L31j49j22J23r2Q2K2o2J20
7340H4O3k08K15k30o6m3J72q4mK03o4k72L67l0j65r3K37K4k97J20J15Q0j79j2
7364f7N7M7l9O1J86j90N6Q3O5l17J16R4j63j81J74Q2oj94l6L25k62K5Nm7K30J11
7390B15j87j20o2J49K4j63n7J78J4j15m0J21J7N4LL6k82K06J33j03o1j63L57k55
7414a01o6J29P6o1j73J12K58p1k43L11j64k74K62O2j90j19L25o7j52L37M4k69
7436c4N4L43o19P7K91j5j68M2j40J78J42l20J45K32l15lJ70K17l20K1J27M2m36
$$ y = [-133, -69, -284, 162, -223, 76, -95, -178, -57, 237, 13, -137, -138, -41, 8, -49, 51, 102, -189, -191, 144, 73, -59, 134, 199, -213, 99, 15, 78, -241, 37, 284, 71, -136, 181, 146, -10, -158, -22, 22, -200, 55, 57, 48, -177, -181, 123, 48, -383, 204, 444, -319, -31, -9, -40, -108, 40, 118, 30, -171, -58, 24, -34, -169, 162, 13, -109, 14, -78, 4, 26, -36, 84, 147, -61, 154, -76, -142, -185, -13, -97, -101, 102, 38, -234, 133, 103, -62, -155, 82, 106, -191, -71, 44, 124, -55, -67, -10, 37, -2, 59, 245, 55, 111, 194, 259, -58, 58, 152, -11, -192, -18, 64, 58, -136, -172, 153, -109, -84, -79, -126, 104, 215, 28, -92, -154, -5, 19, -144, -201, -23, -9, -124, -164, -43, -26, 28, 31, 67, -215, -9, 124, 21, -40, -203, 154, -101, -167, -38, 38, -23, -196, -84, 174, 103, -140, 171, 7, -267, -5, 57, -133, -252, 73, 6, -146, 191, 235, -34, 20, 363, -256, -179, 112, 97, -71, -29, -169, 9, 151, -169, -24, 208, -107, -110, 60, 277, -43, -22, 105, 147, -289]
7459b89K52M02m69K14j7qj00J16l00Q3J29J99J07k87k31L87j65l21M79m2K4j88
7481b5K44q0k55L3J69Q9l09R1J49l37R5O0l1q9J35O4m9J08l62M03r5l22M06l4
7505E8j64l9K90j7l84L70J0k27Q4Om1j09K71l59K96kJ20m70K94J10j28N7J45l21
7529a50J7L83m38K21j50O8J13j51L47m32P1J84j73J3M1k1nK89j98R6j69r5K73
7552A34k50N9O7K4J57o3r2o5k85K06L68j48k22R0J11k33Q8J24k24K00MK4r8M9
7576B5n3Rmj24K64o4Q3p4P5k41r1J22P7K0Q8O2k16J46L2j16j86K79n2j75J57K7
7602G0M3k85L28l23M55k72o5K5J02j04L7L2M6j37q9K21J4l01J05J25j76nL23j99
7626c0l2OJ95r6l23K96J27l17Q6J25j43P3j05N30l15Q6k34J24N3j01J16r9k17
$$ y = [-289, -37, 365, -104, 110, 93, 85, -15, 101, -199, -116, 13, 212, 319, 32, -199, 188, 23, -298, 181, 139, 163, -25, 219, 139, -116, -83, 86, 175, -134, -43, 106, -231, -136, -76, -107, -196, -61, 3, -46, 62, -300, 103, 8, -314, 92, 58, -106, -145, 145, 128, -256, 114, 124, -103, -19, -13, -54, -163, 108, -251, 45, 43, 163, -307, -13, 97, -31, 26, 171, -150, -133, 250, -188, 33, -117, -49, 64, -87, 260, -172, -101, 83, -90, -77, -36, -57, -62, 227, 29, 125, -44, -139, 134, -116, -57, 10, 34, 191, 128, 36, -29, -314, -108, 260, 112, -110, -20, 91, -142, -54, 70, -154, 46, 50, 74, -24, 25, -28, -19, -23, -147, 117, 53, 136, 62, 137, -104, -195, -73, 4, 24, 112, 174, -42, 104, 136, 20, -166, 113, 61, -114, 43, 70, 113, -172, 156, -167, 288, 16, -49, -24, 78, -26, 11, 43, 89, -48, -137, 84, 98, -203, -98, 27, -149, -154, 169, -30, -62, -56, 139, 43, -280, 16, 143, -174, -88, 37, -106, -33, -138, 392, 77, 163, -71, 53, 106, 5, 121, 22, -195]
7649a95R4j10J28K8J71r6l0J07J95l47k03L64K91l35Q4j48K68j44m90M86o2p2
7671a6j86M55k14JN2j14l7J25j15p0J92k74K08k12K3m9J75M1j4J8k9J8j82N12
7695C08l66J0N1k0k56J36J25M5j26o6K26m0O9R4p6l46J37J30Pk23R9K84o1n3J0
7720I8k75J15Q5R3q6J62j14q6J29r5p6p4J50j10J73q2J10l34K35j45q1L99K68
7743D59m77K37k71M2p7R8L12j17l73j3K95m66N67m7q8k58K26L46m16l69L75J57
7765A42k66m2K96l55j53K69K85k46j8J88k8k5Nj47K02k24K68l1l93l1M16J39k96
7788d5J74k15K13k21L00r0r1j12K62k06j71K61n8k20J58j55K56p0q0Q9L2R8j90
7811h1K21j76j77K64J7j87J28r9K64k35l7OJ88q9L15m56M20m44L24j18j37k3L86
$$ y = [-195, -101, -211, -83, -55, 116, 20, -10, 97, 292, -55, -258, 106, 397, 62, 146, -2, 266, 122, -368, 118, 56, -16, -202, 253, 39, 40, 92, -22, -59, 66, -49, -119, 73, -201, 7, -205, -182, -231, -56, -15, -29, -11, -40, -22, -204, 308, -58, -48, 3, -17, -273, -137, -12, 33, -93, -159, 67, 27, 96, 190, 114, -232, -95, 35, 42, -181, -82, 202, 141, 88, 98, -177, -62, 23, 116, 30, 192, 78, -8, 121, 26, -50, -124, 26, -84, 89, 7, 117, -217, 18, -127, -208, 191, 459, -18, 219, -52, -10, -87, 11, 323, 206, -167, -180, 115, -351, 216, 169, 81, -177, 49, 395, -21, -390, -15, 142, -124, -166, 130, -225, -378, -109, 176, -70, -88, 100, 72, 47, 52, -95, 107, -117, 151, 120, -273, -304, 112, 251, -45, 129, -86, 127, -94, 206, 116, 25, -87, 175, -31, -202, 59, 1, -219, -61, -216, 40, -30, -110, -21, 11, 109, -81, 140, -36, -213, 51, 68, -119, 9, -90, 174, -61, -98, -92, 96, 7, 322, -134, 286, -158, 166, 48, -89, -112, 274]
7834B74l12n0Q2k6J55k66K08j30o5J92K06j38k02R2qk23J30J38q4k10J86k06L19
7857F2k90L42O5l12K91K40l89m9J04J96q7l24J61j65L14l40Q5K62l71J05K52j6
7879A36K05j58r4k09o0K27n7R0k61l5L88j44Q8j60l8J70p6j06K42l34Q9p3J17
7902e3j12J83J4j95K25J00k95J09n4k00L10l5J23k33J16Qk75O8K31J24k76o6K94
7925A11j71m4q3J24O1J61J32m21J07j53J27J91pj18K98J02l88q5N6j20k60N24
7947A44Kj94k37M74p9j4L16k91j68L74k94q8k3j31K11p8o2K10o1J43k46J77J16
7970B01k71n8R1J38k89jM24j26j83J68q6oN8J58r3j93j60K57l28K41j88M61j24
7993I1k24J95j43j26J56j17N2M6J75J16m3l05J94j52j1J82Rj59J72j54J49j05
$$ y = [274, -38, -88, -6, -32, 123, -143, 65, -65, -130, 62, 268, 130, -72, 20, 12, -211, -81, 57, -27, -237, -51, -257, 62, -228, 114, 179, -133, 158, 398, 9, -40, 64, 260, 173, -151, 10, -155, 159, -181, -96, 166, -205, -100, 152, 136, 341, 183, 89, -120, -180, 47, -10, 80, -181, -216, 172, 28, 116, -44, -82, 88, 12, -94, 148, -186, -97, -170, -53, -165, 18, 32, -163, 62, 162, -133, -24, -78, -278, 32, -3, 120, -113, 3, 11, -264, -196, 35, 159, -117, -183, 111, -60, -104, -187, -63, -2, 159, 291, -130, -23, -176, -49, 142, 135, 17, 315, 417, 29, -56, 0, -120, -380, 144, 146, -48, -285, 189, 110, 96, 412, 121, -47, 327, 33, -55, -78, -209, 2, -76, -138, 72, 11, 154, -92, 85, 201, -70, -128, -37, 101, -188, -189, 235, 109, -74, 94, 8, 2, 60, 218, 125, -68, -228, 29, -299, -58, -246, 215, 91, -133, 62, -81, -207, -51, -168, -116, -70, 105, 221, 178, -127, 67, -85, -96, 86, 95, -64, 108, -46, 103, -2]
8015bk67K51M7l3k05K53k16K27P0j03J0r9R1J82j57j23L77k55k50M10j43m8P4
8038I1j6J15pk00K0O4j6j23J17l5p1j89K42J02r2K59j66k65K12Q3j49J18l5pj84
8063a32K2R6j2j28L9K43o9K25k83J49m5q7J30m4k13j14L72l75K06p1K11j51J20
8086H9l14J65J55k11J77k64J16j5J05p1l9o9K18k02K23m5q8r4K54J6k07OK58O
8110A69l74M09j87Q6Q9n0l98L18J9j67Q6O4m3lj3k47J69J49j64J29J42l74J16
8133g5nk8J91j66J23rk35J32n6M27l38N6l0J61q1%k15M4J76j50j22MK24k06O1
8158a17L2K15l2j29q3L40k84q3K43m1Lj20M6N0j35j04J88J99o0j08J15q5M8k45
8182a47J21j59O1K32j73j39K69M8l37
$$ y = [-2, -269, -18, 29, -4, -209, 44, -172, 55, 125, 22, 32, -67, 24, 206, 49, -74, 303, 48, -202, 208, 65, 17, 91, 75, 190, 183, -17, 3, 67, 51, -72, 45, 10, -61, -250, -8, 94, 2, 261, 95, -170, 42, 125, -24, 94, 59, 52, -132, -110, -14, -26, -154, -115, 128, 59, 284, 1, 150, 105, 18, 148, 104, -109, -223, 149, -226, -20, -91, 120, -31, 89, -225, -60, 95, -116, 61, -203, -87, -102, 3, -68, -107, -176, 42, -160, 63, 18, -70, -164, 90, 106, -101, -95, 163, 169, -205, 204, 17, 103, 192, 142, -256, 62, 81, -86, 0, 64, 21, 18, 5, -242, -73, 76, -88, 41, 183, -191, -75, -80, -108, 83, -83, 40, 31, -204, -72, -128, 299, -39, 17, -13, 148, 67, 67, -148, -104, 72, -78, -200, -196, 28, -178, -117, -85, 130, 98, -31, -114, 226, -58, -141, 102, 61, 64, -56, -10, 40, -95, -199, -11, 188, 128, 20, 135, 50, 98, -147, -26, -185, -124, 108, -65, -204, 65, 113, -224]
8191b24
$$ Imaginary data points
##PAGE= N=2
##DATA TABLE= (X++(I..I)), XYDATA
0@%%%%%%%%qJ6j6J6k4L2m0M8n6P2q8J07j31J60j92K24k62L05l53M09m73N45o22
31c31P10q09R16j035J165j306J465j640J831k038K263k512K783l080L405l757
47a970M142m566N030n539O102o724P417q192R063j0053J1187j2501J4044j5885
61h445J8128k0933K4558k9442L6409m7224O6411j10472L91701J53693n93750K84355
73A64989P8448j42476Q9642J51919k61819p1628K00140R8269j68214m6883p7243
84A5144o196K31674n9347j44894J06721r8662j54234K53218Q8403l50860L6948
95h2085K67553p5277j87894J55586k4199k48722J68770K06564j99377r4277J79995
106F6637o0001q0031L7797k1133J9828L4571j2357m5235O4493m5383q4389J12058
$$ y = [0, 0, 0, 0, 0, 0, 0, 0, 0, -8, 8, -8, 8, -16, 16, -24, 24, -32, 40, -48, 59, -72, 88, -104, 120, -142, 163, -190, 219, -254, 291, -331, 379, -430, 486, -549, 616, -690, 775, -865, 966, -1072, 1191, -1321, 1462, -1618, 1787, -1970, 2172, -2394, 2636, -2903, 3199, -3525, 3892, -4300, 4763, -5290, 5897, -6604, 7440, -8445, 9683, -11250, 13308, -16134, 20275, -26949, 39462, -71010, 320691, 474384, -119366, 164989, 243437, 100961, 190603, 342522, 80703, 9075, 209215, 307484, 139270, 92387, 15144, 8948, 240622, 181275, 36381, 143102, 44440, -109794, 143424, 231827, -119033, -82085, 185468, 110191, -77703, 77883, 53684, -195038, -26268, 180296, -19081, -113358, 66637, 6636, -73395, -35598, -56731, -36903, -2332, -14689, -59924, 4569, -40814, -125203, -13145]
118a3145K4370j72689R5784K17390j97329r9766J53517m3079j24202J73957J08852
129A23660k24487m612J65000k2514p9755M1187n1562k0787J46939K7253o4617
140C5705n9200l7164K2751J54845j9659j66852P1513R1148p0248P182Q4842j75497
152f0634p4831K31713N6104j50438q178M7259j03650M7813J06163p1506r5677
163g5862M6802P1464m04j1445j08980j1398R4318O008k6216N3568m5565j15488
175a23198J19099N9689j37549j6772J44457l8781p9151J07892j4192j16438K6103
186f8841R7856n3544j1399N7576k6782j2279n739j9008J4063M6047n0761J8738
198a4073O7273q0468m0783R8333M274j49762P2802J34174q8199m5645R0676o1178
$$ y = [-13145, 11225, -161464, -65680, 151710, -45619, -145385, 8132, -34947, -159149, 14808, 123660, -100827, -105439, 59561, 37047, -42708, -1521, -53083, -73870, 73069, 100322, 35705, -23495, -60659, -37908, 116937, 97278, -69574, 1939, 93087, 22839, 30021, 114863, -60634, -135465, 96248, 152352, 1914, -6264, 40995, -62655, -14842, 91321, 19815, -75862, -29060, 42404, 42000, 30555, -78425, -89823, 4495, 10503, -15713, 37855, -7710, -123198, -4099, 55590, -81959, -98731, 45726, 6945, -72206, 35686, 21494, -94944, -68841, 29015, -24529, -35928, 21648, -5134, -17413, -23152, -42160, -28097, 17950, -32811, -14073, 53200, -27268, -68051, 30282, 34556, -115206, -42404, 91770, 3571, -42074, 48602, -12576]
210a2576j01305J37070M4799j01030j0219O5587l902j3418J0140n6187O642L8537
222D138R111K5170K2653j12152l6696J54383l0696j04439Q1781M7823j22655N7691
234c888J22732j45153r9221J31793O1199r6853M2722K8132r0896J4110O3359k3018
246E018l3479J6904j8478N9102K1895r6320n500P2973m6925m2123J40203k1200
258E2070j46196P3447J07822j31616m7977J49904m2246q1889R3578M2038j13285
269d4350j249O7997l1842l185J9241K180N891M017n8317K2624O0697p4067m851
282c5214J04572l4107j08622J03420M1460j43973K0825J27104n3694p3816J08072
293E6027p126j03691L4413O6258m3378k1455M1903j2941J2814p367l3611J4923
$$ y = [-12576, -113881, 23189, 67988, -33042, -43261, 22326, 18424, 5006, 15146, -41041, -34399, 4138, 13249, 38419, 61072, -51080, -87776, 66607, 35911, -68528, 13253, 61076, -61579, -3888, 118844, -26309, -125530, 6263, 67462, -29391, 13331, 41463, -49433, -35323, 28036, 5018, -28461, -11557, -30035, 29067, 50962, -45358, -50858, 22115, -24810, -66933, 73270, 52070, -94126, -20679, 87143, -44473, -92450, 57454, 15208, -66681, 26897, 68935, -44350, -45599, 22398, -9444, -12629, 6612, 8792, 14683, 18700, -39617, -16993, 43704, -30363, -35214, 69358, 35251, -73371, 30049, 71509, -72464, -51639, 75465, 21771, -52045, 56027, 48901, -54790, -20377, 45881, 2503, -18952, 22951, 10010, 22824, 15457, -18154, -3231]
305c231J9019l9334K4933P9920p9663n7358Q6341J3282j02967M7713Q2089r1768
317b1024q085R6065l2051r5331N6422L5481m7255K1332K9033k4078j9604J9515
329A0420j6472J3459L309l2842L5955L8645n2910l0344O8884m2200n1262Q2406
341B7048K6060q3449J5189P5000p1848l3842O2780l350n2211M3080L3998n0929
353a2474k22O119p996M247P694j2209K4112Q319n2627K4059K9756n2127j9601
366e2950Q6539j4274o9407O1046K2444q0552J037P9505m5023l3198O2194K371
378A9732m5705R820J9288l2618J6614Q407n772K2628j3123l7013K8981K6726o8222
391e0257K1029O9306m6355m2981P7798j685r9813N2396O0263o4118j1384P7015
$$ y = [-3231, 15788, -23546, 1387, 81307, 1644, -55714, 30627, 43909, -59058, -11345, 70744, -21024, -29109, 66956, 34905, -60426, -4004, 31477, -15778, 5554, 34587, 10509, -9095, 10420, -6052, 7407, 10716, -22126, 13829, 52474, -436, -30780, 38104, -4096, -55358, 27048, 53108, -30341, -15152, 59848, -12000, -45842, 16938, 13588, -38623, 4457, 38455, -12474, -12696, -6577, -14573, -10326, -2632, -14841, 9271, 17590, -35037, -10978, 18778, -33349, -52950, 33589, 19315, -50092, 10954, 33398, -47154, -46117, 33388, -11635, -44833, 17361, 19732, -25973, -16153, 3135, -29483, -12869, -4462, -10234, 12394, -729, -37742, -8761, 17965, -50257, -29228, 40078, -6277, -49258, 28540, 26855, -72958, -20562, 39701, -24417, -35801, 41214]
403D1214k8483n0943M5191L546k7712J0923K1753j1352J6937q118l1861L6327
415A7422K797m7024L1757O1516p0034j6899Q2091l8962p1417O7035M5324q6767
427b3161J9697P1034n1615l9517N5596m798m8251M0800J4087j9742O423k076k1748
440c271K1315Q161m0629M0118K6570n8800O108O8128o1070n1531Q9261M127o8672
453b0185L7593N6166p7840k1220P7089k2820n0950M1559K2796l9524J8021qk3551
466b874J1558m536n521K6733M118n0744J9143L6118m8939k3658O6777j3250o8384
479e3459P1031K5579q5441L555O0990l7064k8747N3277P2m1034O123L1167k7102
492b1053q327J6255q729J9881k254k6472K0189J4195n4083J8099N5851m0075k6120
$$ y = [41214, 12731, -38212, 6979, 10525, -17187, -6264, 15489, 4137, 21074, 12956, -18905, 17422, 20219, -26805, 4952, 66468, -3566, -20465, 61626, 22664, -48753, 18282, 63606, -23161, -3464, 67570, 15955, -23562, 32034, 27236, -21015, 19785, 33872, 14130, 20553, 18477, -3271, 18044, 26205, -14424, 25694, 52264, -6536, -428, 67700, 6630, -44901, 44360, 48487, -20185, 17408, 73574, -4266, -25486, 51603, 28783, -22167, 19392, 42188, 2664, 20685, 20677, -2874, 8684, 4148, -1373, 25360, 29478, -21266, -2123, 33995, -14944, -38602, 28175, 14925, -53459, 17572, 43151, -42290, -38735, 22255, -14809, -43556, 9721, 9793, -31241, -25118, 6049, -21053, -29380, -13125, -21854, -1973, -4227, -30699, -10510, 3685, -50398, -32299, 23552, -16523, -42643]
505d2643M9936P427o5452K4969M6160m8334j7496O0355l167m8329K7556P927k0658
518b1749L350J1804L807J991o412q712K0674r688k1180J9538K5086k9988n395
531a6874N0394k8538m2222L9664K3653m7951J2442M2468l0623j7274K3671M473
543A3283k6727R614J3859m313k383k805K984J96j0687j5567L5096N663l9724J8367
557c144K6906l7173j5789M3898j5215k9722L0193K2406l5286q376L3055k1208
569i455j3741K2646O795j1837J586j862J802J0216k1439K630K3033n978j7438
582a3042K7294M904m8048J5904M2091k9111k6738M9639k58m1209K0970J8712k7180
595f072r173L1184n066r452P725o470l040O838q042p25K4129k3531r063L7452
$$ y = [-42643, 7293, 14720, -50732, -25763, 20397, -27937, -45433, 14922, 11755, -36574, -9018, -1091, -21749, -18399, -6595, -2788, -797, -7209, -15921, 4753, -4935, -26115, -6577, 18509, -11479, -16874, 33520, 4982, -37240, 2424, 26077, -21874, -9432, 33036, 2413, -14861, 8810, 13283, -13444, -3830, 10029, 5716, 3333, 528, 3512, 3708, -6979, -22546, 12550, 18213, -21511, -3144, 23762, -13411, -29200, 14698, -517, -30239, -46, 22360, -12926, -21302, 11753, -9455, -23196, -550, 6245, -5592, -4006, -5868, -4066, 6150, -15289, -12659, 10374, 4396, -13042, 14252, 19156, -28892, -12988, 29103, -8, -26746, 22893, 22635, -18574, 2396, 21108, -6072, -15245, 15939, 10873, 1421, 9146, 2676, -364, 6474, -1568, -2293, 21836, -1695, -10758, 26694]
609B6694j0279m2977K0660L4910l7798m479M2760j8317l8307L8443J2114m6571
621b3147J6059K4907j5827p478J3727p259p271O133o007O179J0269j1600j2859
634a4174L0472r922l6567L2904J4484l8991J4204M0560m0227k0587M1295l12l6972
647b3833J4848L1172k8547q89K2046j7688j0473J9652l834n516J4487j5358L403
660e30J6695j6624j6346K5545O162k9778K2267K2629l7248j3470M4707j3529l2664
673b2184L4019O631k9998J1872K5845k7969j5072K1299N273n697L79k290o509
686d401J2255p792p091J5756r419j4017K7578J0390m2314O979K8181k2377j2077
699a8349L5163k712l9063K1182K3965k5081j2404K1679m867p858J6209m055q465
$$ y = [26694, 16415, -26562, -5902, 29008, -8790, -13269, 29491, 11174, -27133, 11310, 23424, -23147, -7088, 17819, 1992, -5486, 8241, 982, -6289, -156, -6163, 16, 10285, -1315, -14174, 16298, 6376, -30191, 2713, 17197, -21794, -7590, 32970, -7257, -27844, 13451, 13139, -23833, -8985, 22187, -6360, -7249, 14797, -2891, -13364, 6288, 2454, -3062, 11425, -3933, -530, 16165, -459, -16805, 8740, 14902, -14876, 7391, 30020, -7228, -20698, 24009, 10480, -22184, 11835, 18466, -11532, 340, 26185, -1784, -16856, 4443, 9716, 4019, 4398, 2108, -4401, 7854, 62, -7029, 8727, -692, -14709, 12869, 23259, -19055, -12076, 16105, -6272, -18349, 16814, 14102, -24961, -3779, 20186, -4895, -17299, 4380, -487, -8345, 7864, 3809, -4656]
712d656k755P48O779Q780j5323n931K6009o058k3679J3031J8176l0705R31L6481
726B1828j5555k4028K2489R892k9265P474J8566j0500q895J2490M077j1876l2
739c335r24P311K895j1734K795J7115j1653j8343K2708j308k2268J5909K2778
752B1946k6034j4514L0239k986k2840R837J3708j7524L398J5681r486p606j071
765g252L434O343L249j1773L464R234j3507J77J6158r829k3178K6675J6789k7095
779g111k841J8566j3273j1400K6370k433k0505P211J4292p846n320M930o739M456
793a643N425k900K862J717j5177K658K1844j5092j1163K0127L232k1966J2718
806B642J5373k6818l545K6099l253k0130J6386M881j6129M456O725n666m84O842
$$ y = [-4656, -7411, -6663, 116, 8896, -6427, -12358, 13651, 7593, -16086, -3055, 15121, -15584, -14653, 21828, 6273, -17755, 4734, 14626, -14639, -7165, 11401, 901, -7994, 4496, 8573, -3303, -3335, -4259, 3052, 5947, -5787, -2992, 14123, 2470, -15873, 6835, 5527, -16741, -832, 21946, -4088, -18602, 11637, 8651, -14189, -4352, 9356, -8168, -4770, 10911, 1425, -6181, -7252, -3818, 2525, 5774, -5999, -2535, 6699, -6808, -6631, 9527, -302, -23480, 3195, 19984, -7111, -9952, 8614, -4659, -16059, 10311, 7878, -12627, -5416, 8876, 1030, -4290, 640, -6099, -1643, 3782, 882, 3744, 5461, -9716, -7058, 14786, -306, -11469, 8658, 11890, -10076, 2642, 18015, -8803, -12348, 13751, 10498, -9632, 6754, 11635, -4494, -38, 6687, 1021, 537, 7379]
820G379o333L219J947j0156L844R528j1519o287K3166o085j9208J4172P832k3110
834a1611M037K4432j5791j2227J6708K774j6229O827P748j3988K766J0073j564
847C955m512l77p178N623J0125j1404j056J0674o417r056J7407k431k2421J0716
861f352J7338j2317p471J7689r836j3968J5664P299j5322m37J1421n487M52J707
875C80m672j600L578J90K450N339j2259j641J3088l908j3363J2734P511j8021
889a0194O753J4301j3195j1792J6676J780j2900O923P949p775n675Q677k263k790
903c525J653M48M126j734o184K835P818j1992k619J5138k345j2373R090R367j8524
918h821j144J6754m167j2024R665O832j1598J226N750k081n275K621M856L162
$$ y = [7379, 1046, 4265, 6212, -3944, -100, 9428, -2091, -8378, 14788, 8703, -10505, 3667, 11499, -11611, -7574, 16858, 1067, -11160, 5548, 8322, -7907, -1080, 6668, -7320, -4554, 5519, 3955, -557, -934, -8112, -2489, 7636, -3768, -4824, 5850, -567, -9623, 7784, 5353, -17068, -6352, 10986, -1331, -8802, 8887, -949, -14917, 747, 8046, -7276, -7713, 3708, -1779, -1327, 380, -4292, -5892, -2314, -2124, 326, 5665, -6594, -8235, 4853, 945, -12418, 316, 7827, -10194, -3441, 10860, -2335, -14127, 2549, 4329, -8571, -1648, 6301, -1474, -7149, 1528, -735, -3525, -1872, -1424, 2702, 968, -5216, -2381, 5437, -6555, -9174, 5964, 3619, -8754, 336, 9703, -8821, -9965, 6789, 2622, -9402, 263, 7095, -4503, -3277, 2473, 392, -4883, -2262, 2594, 5756]
932E756n325p026R326P36r179L250J2017r664q455J6698J200j7609K859J4719
946I303j0336l656J2735k881r708K927O349l210j536o80L165K156m077j574L612
961B589k91r665Q938R897j3585l735J5025m911j3749J2302M290j1058N56J2235
975H838n326r010P772L09n079K769K720k652L156l295l602P438l770n692P546
990B122N920j1985Q51J1407q643q303J1685L163j4011P918Q806j1749k371R185
1004C995l302o159P490J11l808K217J58l260K815L89n866Q349J866q937K566P429
1020F053r772m147J3952l214j0069Q994O735j4030J099J0778q453l296Q771N63
1034C964o714L715P57m142J887J301k071L043K339p843M070M936r864K76J0608
$$ y = [5756, 431, -6595, 2731, 3467, -5712, -2462, 9555, -109, -8564, 8134, 9334, -8275, -5416, 9303, -1033, -4689, 8046, 5165, -4543, -1616, 4733, 1523, -13, -693, 2472, 4628, 551, -1023, 2589, 2298, -7367, 1571, 11468, -2117, -5852, 9173, 4262, -9487, 2815, 7105, -3953, -3397, 8838, 3512, -5498, 2274, 2583, -2496, 273, 2993, 341, 3497, 202, -3400, 4038, 268, -5424, 2122, 8042, -3943, -3092, 8315, -328, -8631, 3054, 6217, -7794, 124, 8930, -2819, -5190, 3995, 693, -5466, 2024, 2135, -1673, 544, 702, -2558, 257, 646, -5220, 3129, 4995, -3942, -1376, 6053, -3719, -7866, 6086, 2872, -7197, 1797, 8532, -5498, -4399, 6379, -2074, -5370, 3401, 3964, -2750, 965, 1722, -2420, -533, 768, -1303, 1740, 4079, -3764, 306, 5242, -4622, -4346, 6262]
1049F262n286o831J1684m28j1482M044Q312p931l654J1562k798p573N413K613
1063C907o706J956K501k447L080r86k303K043P13o010K784O994o658k438Q413
1078D843j265j0868P330N682j0869J583R497m485o594P457l38o188J741M479p95
1093A210k069J327j746J668j116k399L297K187n477J336Q625q472n090Q754R13
1108B948q333M966O861q313k960P406Q03p801L256M075l272J072O19l56j459j974
1124b462N62O224k672n550N470K766o366j941Q363l996o181Q012M300r386o29
1139c486P603m933k866M292J783l026j116K644O5j381k911K034L521j996l258
1154c031M858J341r160L608O201n679l261Q729m0q669L166M954m208l251N823
$$ y = [6262, 976, -5855, 5829, 5401, -6081, -2037, 6275, -1656, -5310, 6252, 3454, -4119, 1294, 3907, -2799, -843, 1658, -789, 2291, 1305, -998, 1045, 1758, -4252, -1468, 5526, -1132, -3570, 4843, 3578, -7290, 40, 5722, -5147, -3564, 5933, 1448, -5146, 2311, 1973, -4215, -2474, 2005, 1210, -859, 468, -1278, 390, -726, -3125, 172, 2359, -3118, -1782, 6843, -1629, -6719, 2035, 2948, -5385, -419, 6442, -1871, -4831, 2575, 3378, -4423, -1167, 2908, -364, 708, 1327, 971, -488, -2462, -1900, 4324, 1652, -3898, 1572, 4338, -2028, -3969, 4394, 398, -5783, 2229, 6529, -2857, -3486, 4117, -816, -3682, 610, 2393, -633, -1749, 895, 960, -421, -3332, -1298, 2223, 227, -3031, 1827, 3168, -5992, -2384, 3817, -1862, -5123, 3606, 3566, -5103, -1937, 3017, -1191, -4442, 1381]
1169A381p25k343K112J56j092j064m87J722L820l837j963M820j470n020L799M534
1185D343p582r1R005k522o567L999J859o115M169M080l891k663L354Q94k034R37
1201A175j819N02K575R6k217K566k195m452O048K260n892M35N873m424k946O398
1217C983k153o271L834N962n736p42L426k936j761L442n7k442K360q01k10R62
1233H60j859j859L159J125m735L473L606o063j626O574k943n210O794J304n435
1248b835Q86M476l845k169M305o21k334J511K461k014J89k087m96L835p57k221
1264a716K398J141m734K291L930n051l244O858J753o620K978K655n318l52N353
1279B322o53l761J731Q40M2o28o76L3N12J09K8L199k615m642L772L992n575o41
$$ y = [1381, 656, -1687, 425, 581, -511, -1575, -2062, -340, 3480, -357, -2320, 2500, 1030, -3990, -191, 4343, -3239, -3330, 5675, 3153, -3414, 585, 2444, -3671, 498, 4578, 687, -1976, 1378, 2272, 238, 1175, -644, -142, 2433, 2529, 312, 2878, 683, -3769, 2279, 4539, -1353, -918, 4955, 531, -2415, 3983, 1830, -4441, -607, 5355, -381, -1123, 2303, -633, -2394, 1048, 991, -1451, 909, 108, -102, 860, -999, -2858, 301, 1426, -3309, 164, 3770, -2293, -3919, 2655, -288, -5498, 1296, 2600, -2835, -1949, 2527, -1318, -3487, 818, 197, -2137, -626, 1835, -179, 10, -2077, -2573, 1262, 505, -1716, 682, 1823, -2911, -620, 3310, -1741, -4985, 1873, 3626, -2994, -16, 2639, -2679, -3031, 2322, 1669, -2092, -361, 479, 521, -107, -783, -750, -238, -129, -101, 3098, 483, -4159, -387, 3605, -1970, -2611]
1297b611N663k675l043M135J649o394P34N035j743k068K020O41k861P69L89Q97
1313E37k78j893J679K894k867l233M469m5m225L132L795m257k619O448j778n147
1329c388L246L663l381q55L278j439j413P2J142k76Q2o73J834J067l876k33L831
1346B681j315l921M267K624o063P22N060k797m901M591J678l720J296K518k576
1361A44k511K896J75m80m95j85J293O35k700q72L726k628j855N060P01o032J335
1378a793N211n234j334M828p62m156L476K511m438q06K282J77q75J679j202k27
1394f63J251k170O64J951j871j633M713k81m875K958K193m574l52O322k809l648
1410b824L908J609m396Q52L153l039L8K787o15j603O43p93j28J816j432r2K038
$$ y = [-2611, 3052, 377, -2666, 1469, 3118, -3276, -2542, 2493, 750, -1318, 702, 1343, -1518, -749, -360, 537, 259, -1634, 45, 2939, 72, -3161, 1308, 1263, -2962, 170, 3965, -292, -2911, 3537, 1759, -3388, -142, 3521, 140, -715, 2563, 1124, -289, -217, 925, 649, 731, 58, 1892, 2959, -917, -1150, 2681, 1366, -2555, 1712, 4336, -1727, -1005, 4055, 1258, -3643, 948, 2626, -1094, 202, 2720, 144, -2367, 529, 704, 224, -271, -456, 837, 1472, -1228, -2100, 1626, -1002, -2857, 2203, 2904, -3128, -1793, 3418, -1816, -3150, 1678, 916, -3240, 236, 2747, -1691, -2497, -215, -38, -913, 766, -436, -663, 588, -1582, -918, 1033, -838, -2471, 2242, 1961, -2914, 44, 2237, -2337, -2689, 3633, 824, -2824, 1084, 2693, -1703, -851, 2302, -737, -699, 2088, 1473, -130, 513, -280, -408, 1408, -24, -116, 1922]
1427A922o85k783K225J827n252J366M761l266k448N058j316m827L531K085l141
1442i43p53L645j420k222J551K9q52N05M16o37K066k038j201K734j087k882K739
1459c50L262m771l74M254j404l842K946K311m590J190L626k094k391J709K03o18
1475i33N58M56O30p36q71L92J832j752k302L486R07k695M38L318m159k084N188
1492A673O09m062R66K899k423n27J470M4k060N61K251l6j276j756J497J269j791
1509f92m35K352q40l128L779J627m659q08M019p68k072K558O65l301m37L324q91
1526B93j843J220L56N28o35r23O24N67k310K317K172l306o10K729J27m047J919
1543h22L295k992j700M112m80l981K966O86j826j97J538N15o13p76l96J137q38
$$ y = [1922, 1237, -1546, 679, 2506, -2746, -1380, 3381, 115, -2333, 2725, 1409, -3418, 113, 2198, -943, -1696, 1949, 529, -1693, -142, -113, -965, -460, -44, -681, 1385, -653, -1854, 880, -207, -3089, -350, 2912, -1859, -2233, 2021, 617, -3225, -279, 2032, -2558, -1368, 2258, 164, -2227, -518, -315, -933, -375, 81, 711, -25, -896, -504, 1328, -424, -2726, 760, 1667, -1028, -590, 2728, -1431, -3515, 1673, 2282, -1780, -814, 2085, -338, -865, 605, 649, -1411, -850, 1401, 1365, 89, -1667, -170, 1099, -692, -1127, 1225, 385, -2743, 1036, 2663, -1996, -2804, 1215, 447, -1625, 933, 1598, -1703, -2140, 1184, 293, -1550, -330, 26, 554, -81, -1004, -380, 187, -2123, 194, 2366, -940, -1550, 1179, 1306, -2741, -822, 2473, -519, -2219, 1893, 1413, -2568, 398, 1084, -742, -939, 599, 1114, 501, -275, -671, 466, -372]
1560c72l18J682R21l064m99M825k515l415K970J879l838J860L929m219l130L854
1576E50K200l456L67J797j348k30J384l85j176o79j64L087N70l553KK766j653
1593G9j586L968j239m352K986M412m122k853M039j010k053L015J154l458j10J966
1609H36l21l04m31k80J028P80j783O69J676l408k64L863p80l837L269J942m463
1626a808j78M065j960k932M018M67l574J070K257j995j038J581m76J107k76j113
1642g85K50N09j236K79L175k830k090L913J398m815O48L330l461k86M311n48m835
1659c073J873K787k170l37J336n99r48K024m61j69j138j440K362K207k419j386
1675a551K859j422j791K847J411m294l88N259j575l371K361P98k889J465K236
$$ y = [-372, -690, 992, 1913, -1151, -1650, 3175, 660, -2755, 215, 2094, -1744, 116, 4045, -174, -3304, 550, 2750, -706, -339, 1458, 110, -120, 1264, 879, -297, -976, -1140, 1947, 2517, -1036, -1034, 1732, 79, -1507, 2461, 1222, -3130, -144, 4268, 146, -2707, 1332, 322, -1731, 1284, 2438, -1020, -1130, 836, 515, 211, -220, -500, 528, 1308, -475, 194, 1870, -1538, -1802, 2061, 1281, -2556, 713, 2655, -1808, -1986, 2079, 119, -2813, 1205, 1672, -1902, -832, 1425, -570, -1608, -27, -503, 604, 328, -785, -535, -26, -1262, -983, 2192, -638, -2728, 1185, 2583, -2232, -1584, 1746, -1715, -2001, 2310, 1762, -3073, -1200, 1587, -583, -920, 416, -183, -1131, 893, 432, 263, -875, -2315, 47, 2254, -165, -1551, 1308, -114, -1905, 942, 2353, -1941, -2329, 2930, 1355, -2016, 345, 1143, -1746, -281, 1955]
1690A955j498r94j4J063J23r94m45J231Q53k187J274J817k398k557M294L23m175
1707b329K337K521k692j729L663j062k519J677J942j598j256K127n01o28l54p9
1723d80J717j69j748J219J341l588R39L238j722k895L057K180m317N04L036k581
1739b69k220M228O55l188N23O43n53j21M08k68J99j42l18K004r95k937Q10L399
1757A858k198j850M019j247l627K730K829m425q06M032l83k719K001J154l695
1772b327Q14J996r5q59j67p9J219k04k502K057J412l033P37L676k155m137M436
1789G89J259m569Q31M966l330k883M458n2l120K74K709j494j91J102p3j21j175
1806f20k19J614R88l242J533K884l295k083M423M41n090K545L666m069j370L868
$$ y = [1955, 457, -537, -551, 512, 635, -359, -804, 427, 1280, -907, 367, 2184, -214, -2771, 1523, 1846, -2329, 8, 2529, -163, -1892, 1771, 709, -1810, -133, 1809, 211, -1045, 1082, 581, -47, -401, -480, 1237, 1068, -680, 539, 1880, -1708, -769, 2469, 747, -2148, 909, 3089, -1228, -724, 2312, -269, -2489, 1739, 2394, -794, -271, 372, -181, -302, 106, -162, 37, -105, -423, 1581, 586, -2351, -1541, 1858, -340, -2190, 1829, 582, -3045, -315, 2514, -1911, -2717, 1315, 932, -1787, 214, 1368, -2327, -1513, 483, 388, -471, -638, -717, 502, 298, -2204, -147, 1265, -1768, -1031, 2645, 490, -3647, 789, 2048, -2521, -1690, 3276, -54, -2937, 1521, 1469, -1651, -1377, 1332, -162, -353, 749, 676, 555, -620, -839, 775, 1763, -1479, 54, 2938, -357, -2440, 1983, 2424, -2666, -121, 3545, -524, -1894, 1974]
1822A974p37m116K803K031k356o17J661k28q41k02l20J541p77q92J146J669l215
1839a476j377M282j280l205L352K051n139O04M338k305k858K411J798k726N47
1854i83J811j142j169Q15N53J44P1j282J823L2k207J071J894k394j162M301m87
1871A689l313O66L027k565r96L649j186k084J511J825k010o89N23O40N66j120
1887A33J144K93r03j749K105J164k894J57L095j150l169L779n3l724J269L033
1903B530k276j636K440j88j058o78J183j94n71O31J13N91k044o7K005m95k521
1920b235K115K437m205K7L309j147l272K762K261l621L47K356j156k188K251N33
1936E74j400N01N47M96n05j403J54K723j726k086L286N49l557J300L571m054j891
$$ y = [1974, 1237, -2879, -76, 1955, -401, -1018, 643, 415, -426, -628, -948, 593, -184, -1076, 70, 1739, -1476, -2853, 1429, 149, -3056, 296, 2347, -2792, -2188, 2150, -155, -3013, -602, 1196, -1530, -983, 828, -314, -1483, -668, -115, 29, 100, -1182, 641, 673, -1534, -463, 1431, -963, -2125, 2176, 1689, -1624, -958, 2069, -496, -1492, 2157, 971, -1113, 398, 2223, 213, -476, 47, 687, 1253, 133, 1277, 1570, 667, -1082, 1023, 2187, -707, -550, 2545, 1395, -1774, 2005, 1952, -1772, -503, 2530, 254, -1382, 1058, 870, -188, -866, 317, 123, -448, 183, 296, 887, -1157, -1224, 781, 286, -2235, -120, 2317, -1888, -1861, 1448, 301, -2971, -209, 2052, -1569, -1222, 1134, -22, -2210, 41, 574, -826, -325, 222, 718, 213, -1190, -1036, 1687, -39, -2125, 1161, 1710, -1847, -547, 3024, -1030, -2921]
1953b921M888L64m531J897L234m367L7L281q18k424J310J252p33j50j092Q39M13
1970D79n75m36K470q07l961L451K653n052q97N772k404l586M471Q02m666Q9M929
1987B732k708k278K902P16k157J16J136j193O99j042Q31K047j699k428L145J109
2003A928m688J852L956k949l381N235Q17o314K839L956l431k479M560k98k850
2018a247J248P14o91p25P65K34J145j973j330L331n30l414J640L963m452j169
2034b491N302j623m564K812L666m479k75L118q04k616J738J469k223K19N49Q96
2050F94k61j253n56K075o85k623L295Q21l410K81M114k721k923L844O04l401J103
2067a002L269l199j311K715K45j633J34J501q20K12n18L01O91j304m57K540M3
$$ y = [-2921, 1967, 2331, -2200, -303, 2931, -1436, -1399, 1882, 1064, -1360, -50, 1202, 469, 319, -773, 66, 479, -96, -532, 1938, 1131, -2830, 621, 3274, -1778, -2675, 3097, 693, -2893, 1578, 2380, -2286, -2197, 2732, 24, -2254, 648, 1364, -793, -677, 459, -734, -35, -1077, -246, 1801, 102, -2326, 819, 1928, -2760, -908, 3048, 99, -3282, 1953, 2770, -3544, -705, 3251, -180, -2659, 1901, 1603, -1247, 1, 715, 24, -701, 64, 298, 1443, -530, -1860, 1471, 941, -2473, -833, 3130, -1322, -2491, 2811, 1188, -3376, -564, 3102, -1377, -1652, 1466, 662, -1954, -216, 1253, -970, -751, -202, 694, 433, -820, -1376, 699, 14, -2609, 686, 1507, -1903, -1622, 2492, -229, -3152, 692, 1296, -2105, -1002, 2267, -932, -2243, 472, 717, -916, -782, 719, -101, 111, -407, -106, 585, -719, -1176, 1364, 1407]
2084A407l194K152J461k725m78L647p65l686L544J224l306ML003j432j724K239
2100A371m0l16j111R47j50p4q52O47J529j732p30J965O83m149J918L038l600p36
2118a392L754p67l859K743J430k424n83K423j75k169J098K40l82k80n47J263P63
2135A136k227r2L411k656k247L133J297l983P24M216l497k766M171Q83m456J291
2151a662L371k719n23J321K54j324J98K85J234m18j934J710J255k129j556M131
2167A494k70m301L112L194m702j403N561j559l768K928K594l588j007L687j649
2182C23j280Q53J326o30o43n15J184J077l208P22L040j647k700L660J499n648
2198b587Q58N031k895l440M929M38m660J742L070k538k592L059Q90r98j024O34
$$ y = [1407, -1787, 365, 1826, -899, -1377, 2270, 1505, -2181, 1363, 2587, -719, -715, 2288, 856, -868, 1371, 1331, 1015, -96, 851, 701, 627, -225, 422, 1951, 219, -511, 1454, 2137, -2012, -94, 2944, -656, -1392, 2362, 1595, -2264, 479, 1909, -515, -1098, 1325, 1150, -1019, 79, 319, -63, -343, -890, 373, 1136, -1091, -1183, 2228, -428, -2675, 458, 1755, -2228, -1504, 2712, -785, -3551, 620, 1503, -2953, -1662, 1709, -1010, -1533, -212, 42, -1282, -1084, -799, 435, 17, -1917, -207, 1048, -1081, -2637, 1494, 1224, -3077, 35, 3229, -1473, -2876, 2685, 1126, -2642, 286, 2880, -708, -1715, 1972, 323, -957, -104, 1222, 592, -51, -566, 618, 1695, -1513, -791, 2249, 602, -2098, 1562, 3061, -2587, -1729, 3302, 407, -3033, 1896, 2334, -2326, -584, 2486, -52, -2644, 415, 1305, 307, -717, -83]
2214h3M80o56p11P18K079k897j181M211k37n125K448L811m523n33M372n70m800
2231c197K285L121l304n78K265M27k219J275L83k13r83p18K677J27k125k67L275
2248B231j806k752L135J483l763m2N177l054k433K811J141l133M21K535r58j118
$$ y = [-83, 397, -259, -970, -252, 1827, -1070, -2251, 1960, 1723, -3402, -954, 2857, -1666, -2199, 2173, 1603, -3197, -912, 2209, -1095, -1673, 592, 1019, -1200, 75, 458, 245, -738, -1456, 1221, 1348, -777, -1044, 2231, 425, -2327, 808, 2291, -1472, -1514, 3663, 609, -1824, 987, 2128, -1005, -584, 1951, 993, -125]
$$ [...]
8191b41
##END NTUPLES=NMR FID
##END=
