##TITLE=1H_CA-8752-2
 CDCl3, 8 sc, 
 23.9.2020
##JCAMPDX= 6.0         $$ Bruker NMR JCAMP-DX V2.0
##DATA TYPE= NMR FID
##DATA CLASS= NTUPLES
##ORIGIN= UXNMR, Bruker Analytische Messtechnik GmbH
##OWNER= root
$$ XWIN-NMR		Version 3.5
$$ Wed Sep 23 08:29:02 2020 Russian Standard Time (UT+4h)  she@DPX200
##.OBSERVE FREQUENCY= 200.1315066352
##.OBSERVE NUCLEUS= ^1H
##.DELAY= (6, 6)
##.ACQUISITION MODE= SIMULTANEOUS
##.ACQUISITION SCHEME= undefined
##.AVERAGES= 8
##.DIGITISER RES= 18
##SPECTROMETER/DATA SYSTEM= spect
##.PULSE SEQUENCE= zg30
##.SOLVENT NAME= CDCl3
##.SHIFT REFERENCE= (INTERNAL, CDCl3, 0, 15.7039)
##AUDIT TRAIL= $$ (NUMBER, WHEN, WHO, WHERE, WHAT)
$$ ##TITLE= Audit trail, XWIN-NMR		Version 3.5
$$ ##JCAMPDX= 5.01
$$ ##ORIGIN= Bruker BioSpin GmbH
$$ ##OWNER= she
$$ F:/spectra/data/she/nmr/H-F/1/audita.txt
$$ ##AUDIT TRAIL=  $$ (NUMBER, WHEN, WHO, WHERE, WHAT)
(   1,<2020-09-23 08:27:47.12 +0400>,<she>,<DPX200>,
      <created by zg, POWCHK disabled, PULCHK disabled
       configuration hash MD5:
       00 E9 B6 7A A2 85 ED C7 34 08 36 98 17 FE 4E 26
       data hash MD5: 16K
       AD 38 24 F4 B1 1D 63 C4 DE B0 3A BC D8 75 48 9F>)
$$ ##END=
$$ 
$$ hash MD5
$$ 3C 18 6F 9B B7 DC 66 80 9A 38 64 DB 13 13 B5 1F
##$RELAX= 
##$RELAX= 
##$RELAX= 
##$RELAX= 
##$RELAX= 
##$RELAX= 
$$ Bruker specific parameters
$$ --------------------------
##$DU= <F:/spectra>
##$EXPNO= 1
##$NAME= <H-F>
##$PROCNO= 1
##$TYPE= <nmr>
##$USER= <she>
##$AMP= (0..31)
100 100 100 100 100 100 100 100 100 100 100 100 100 100 100 100 100 100 
100 100 100 100 100 100 100 100 100 100 100 100 100 100 
##$AQSEQ= 0
##$AQ_mod= 1
##$AUNM= <au_zg>
##$AUTOPOS= <>
##$BF1= 200.13
##$BF2= 200.13
##$BF3= 200.13
##$BF4= 200.13
##$BF5= 200.13
##$BF6= 200.13
##$BF7= 200.13
##$BF8= 200.13
##$BYTORDA= 1
##$CFDGTYP= 0
##$CFRGTYP= 5
##$CHEMSTR= <none>
##$CNST= (0..31)
1 1 145 1 1 1 1 1 1 1 1 1 1 1 1 1 1 1 1 1 1 1 1 1 1 1 1 1 1 1 1 1 
##$CPDPRG= <>
##$CPDPRG1= <>
##$CPDPRG2= <>
##$CPDPRG3= <>
##$CPDPRG4= <mlev>
##$CPDPRG5= <mlev>
##$CPDPRG6= <mlev>
##$CPDPRG7= <mlev>
##$CPDPRG8= <mlev>
##$CPDPRGB= <>
##$CPDPRGT= <>
##$D= (0..31)
0 1.2 0 0 0 0 0 0 0 0.06 0 0.03 0 0 0 0 0.0002 0 0 0 0 0 0 0 0 0 0 0 0 
0 0 0 
##$DATE= 1600835266
##$DBL= (0..7)
120 120 120 120 120 120 120 120 
##$DBP= (0..7)
150 150 150 150 150 150 150 150 
##$DBP07= 0
##$DBPNAM0= <>
##$DBPNAM1= <>
##$DBPNAM2= <>
##$DBPNAM3= <>
##$DBPNAM4= <>
##$DBPNAM5= <>
##$DBPNAM6= <>
##$DBPNAM7= <>
##$DBPOAL= (0..7)
0.5 0.5 0.5 0.5 0.5 0.5 0.5 0.5 
##$DBPOFFS= (0..7)
0 0 0 0 0 0 0 0 
##$DE= 6
##$DECBNUC= <off>
##$DECIM= 32
##$DECNUC= <off>
##$DECSTAT= 4
##$DIGMOD= 1
##$DIGTYP= 9
##$DL= (0..7)
0 120 120 120 120 120 120 120 
##$DP= (0..7)
150 150 150 150 150 150 150 150 
##$DP07= 0
##$DPNAME0= <>
##$DPNAME1= <>
##$DPNAME2= <>
##$DPNAME3= <>
##$DPNAME4= <>
##$DPNAME5= <>
##$DPNAME6= <>
##$DPNAME7= <>
##$DPOAL= (0..7)
0.5 0.5 0.5 0.5 0.5 0.5 0.5 0.5 
##$DPOFFS= (0..7)
0 0 0 0 0 0 0 0 
##$DQDMODE= 0
##$DR= 18
##$DS= 0
##$DSLIST= <SSSSSSSSSSSSSSS>
$$ [...]
##$SUBNAM2= <"">
##$SUBNAM3= <"">
##$SUBNAM4= <"">
##$SUBNAM5= <"">
##$SUBNAM6= <"">
##$SUBNAM7= <"">
##$SUBNAM8= <"">
##$SUBNAM9= <"">
##$SW= 16.880792210976
##$SWIBOX= (0..15)
0 0 2 0 0 0 0 0 0 0 0 0 0 0 0 0 
##$SW_h= 3378.37837837838
##$TD= 16384
##$TD0= 1
##$TE= 0
##$TE2= 300
##$TE3= 300
##$TEG= 300
##$TL= (0..7)
0 120 120 120 120 120 120 120 
##$TP= (0..7)
150 150 150 150 150 150 150 150 
##$TP07= 0
##$TPNAME0= <>
##$TPNAME1= <>
##$TPNAME2= <>
##$TPNAME3= <>
##$TPNAME4= <>
##$TPNAME5= <>
##$TPNAME6= <>
##$TPNAME7= <>
##$TPOAL= (0..7)
0.5 0.5 0.5 0.5 0.5 0.5 0.5 0.5 
##$TPOFFS= (0..7)
0 0 0 0 0 0 0 0 
##$TUNHIN= 0
##$TUNHOUT= 0
##$TUNXOUT= 0
##$USERA1= <user>
##$USERA2= <user>
##$USERA3= <user>
##$USERA4= <user>
##$USERA5= <user>
##$V9= 5
##$VALIST= <valist>
##$VCLIST= <CCCCCCCCCCCCCCC>
##$VD= 0
##$VDLIST= <DDDDDDDDDDDDDDD>
##$VPLIST= <PPPPPPPPPPPPPPP>
##$VTLIST= <TTTTTTTTTTTTTTT>
##$WBST= 1024
##$WBSW= 4
##$XGAIN= (0..3)
0 0 0 0 
##$XL= 0
##$YL= 0
##$YMAX_a= 401706
##$YMIN_a= -312426
##$ZGOPTNS= <>
##$ZL1= 120
##$ZL2= 120
##$ZL3= 120
##$ZL4= 120
##$ABSF1= 10
##$ABSF2= 0
##$ABSG= 5
##$ABSL= 3
##$ALPHA= 0
##$AQORDER= 0
##$ASSFAC= 0
##$ASSFACI= 0
##$ASSFACX= 0
##$ASSWID= 0
##$AUNMP= <proc_1d>
##$AZFE= 0.1
##$AZFW= 0.1
##$BCFW= 1
##$BC_mod= 2
##$BYTORDP= 1
##$COROFFS= 0
##$CY= 11.3945322036743
##$DATMOD= 1
##$DC= 2
##$DFILT= <>
##$DTYPP= 0
##$F1P= 16.9975609425685
##$F2P= -3.02152046262296
##$FCOR= 0.5
##$FTSIZE= 0
##$FT_mod= 4
##$GAMMA= 1
##$GB= 0.15
##$INTBC= 1
##$INTSCL= 1
##$ISEN= 128
##$LB= 0.24
##$LEV0= 0
##$LPBIN= 0
##$MAXI= 10000
##$MC2= 0
##$MEAN= 0
##$ME_mod= 0
##$MI= 1.114404
##$NCOEF= 0
##$NC_proc= 0
##$NLEV= 6
##$NOISF1= 3.799351
##$NOISF2= 2.8
##$NSP= 1
##$NTH_PI= 0
##$NZP= 0
##$OFFSET= 15.70392
##$PC= 1
##$PHC0= -9969.108
##$PHC1= 14.2009
##$PH_mod= 1
##$PKNL= yes
##$PPARMOD= 0
##$PSCAL= 0
##$PSIGN= 0
##$REVERSE= no
##$SF= 200.130013532006
##$SI= 16384
##$SIGF1= 3
##$SIGF2= 2
##$SINO= 400
##$SIOLD= 16384
##$SREGLST= <1H.CDCl3>
##$SSB= 0
##$STSI= 0
##$STSR= 0
##$SW_p= 3612.71676300578
##$SYMM= 0
##$S_DEV= 0
##$TDeff= 0
##$TDoff= 0
##$TI= <>
##$TILT= no
##$TM1= 0
##$TM2= 0
##$TOPLEV= 0
##$USERP1= <user>
##$USERP2= <user>
##$USERP3= <user>
##$USERP4= <user>
##$USERP5= <user>
##$WDW= 1
##$XDIM= 8192
##$YMAX_p= 0
##$YMIN_p= 0
$$ End of Bruker specific parameters
$$ ---------------------------------
##NTUPLES= NMR FID
##VAR_NAME=  TIME,          FID/REAL,        FID/IMAG
##SYMBOL=    X,             R,               I
##VAR_TYPE=  INDEPENDENT,   DEPENDENT,       DEPENDENT
##VAR_FORM=  AFFN,          ASDF,            ASDF
##VAR_DIM=   8192,          8192,            8192
##UNITS=     SECONDS,       ARBITRARY UNITS, ARBITRARY UNITS
##FACTOR=    0.000296,      1,               1
##FIRST=     0,             0,               0
##LAST=      2.424536,      0,               0
##MIN=       0,             -312426,         0
##MAX=       2.424536,      401706,          0
$$ Real data points
##PAGE= N=1
##DATA TABLE= (X++(R..R)), XYDATA
$$ [...]
2272D08k612K600J432k271j301K390J378l983Q75L183k050k396K760J205k554
2287i36p31J807K113m131M90K914j223j677J245J164r35j032J87K592j987j637
2303a777K661J52j463m41J433J96j730k82L550j759l268L737N82j698q76J075
2319I2J478k146q07L162r80l077K970P60j194j491M49K620j851j942L189N83l925
2336b110K309J621j608j339J35L053j415k231J763J499l221J672Q70j321J51j240
2352a412K806M52l675J056K681k079m73O40K50N7k198K953J528n516P47M660j683
2369G94j637J081o3L86k417K407K207n347J451L821j964j881N53L61K156k607
2385f99Q7K963l723J60L562j530j749P8J335K112l193j561M869l345M5K469j658
$$ plain form
2272 408 -2204 396 1828 -443 -1744 646 2024 -1959 -1084 2099 49 -2347 413 1618 -936
2287 -936 -1667 140 2253 -1878 -1388 1526 303 -1374 -129 1035 100 -932 -745 1847 -140 -1777
2303 -1777 884 1036 -427 -868 565 761 -969 -1251 2299 540 -2728 1009 1591 -107 -983 92
2319 92 1570 -576 -1383 1779 799 -2278 692 1452 258 -1233 -784 1836 -15 -1957 1232 1815 -2110
2336 -2110 199 1820 212 -1127 -992 2061 646 -1585 178 1677 -1544 128 998 -323 -172 -1412
2352 -1412 1394 1846 -1829 -773 1908 -171 -644 -4 246 303 -1895 1058 2586 -2930 -2183 2477 794
2369 794 -843 238 175 561 -1856 551 2758 -2589 -1138 2683 719 -1162 -609 -248 1908 -699
2385 -699 -612 2351 -1372 -1212 2350 820 -929 -851 484 2596 -597 -2158 2711 -634 -589 1880 222
2402B22n24n92R63K639k900k781M873j181j217J447j103p4n70L03L595l180l965
2419d045N886K69l632J496o5L88r45L58K579k818l141N566K30l880J715o40J377
2436F98l3j937K338l13l142K933K061m131M22j0K489M03m164K228J791l946K803
2453D90J912l796N99J83K509J20n004K396K773l269Q32J887k425N00k46K038Q05
2470B304n532K462M003l600o99K295j081l90J00J512O13m913K227M304l980o48
2486a023J500n54Q65o18n80J953l191O41L719k650j275O81O37J407k076j243L671
2503A864k654j095M281k074k033Q52J886L62k319j390M222j760k207L751j251
2518D35j697N36J353R17k662j250L908n01k997K559k07j257N63N71J525k529j714
$$ plain form
2402 222 -302 -894 69 2708 -192 -2973 1900 719 -498 949 -154 -228 -798 -495 3100 -80 -4045
2419 -4045 1841 2110 -1522 -26 -91 297 -648 -290 2289 -529 -3670 1896 2126 -1754 -39 -679 698
2436 698 665 -1272 1066 753 -2389 544 2605 -1526 -1104 -1114 1375 1778 -2386 -158 1633 -2313 490
2453 490 2402 -1394 -795 -612 1897 2017 -2987 -591 2182 -1087 -255 1632 -793 -293 -539 1499 2304
2470 2304 -3228 -766 3237 -363 -1062 1233 152 -238 -138 1374 1987 -2926 -699 3605 -375 -1023
2486 -1023 477 -77 788 170 -410 1543 -1648 -1007 2712 62 -1213 -532 105 1512 -564 -1807 1864
2503 1864 -790 -1885 2396 322 -1711 -859 1027 1389 -930 -2320 1902 142 -2065 1686 435
2518 435 -1262 -726 627 1544 -1118 -2368 1540 1039 -1958 601 394 -863 -300 271 1796 -733 -2447
2535b447L781L85l673K184L47n48K98p77J419j044j559K222J333l074P66O30O24
2552H67l92k095K746%k899K152K010l223m52K141O98j504j774L007R9l100J616
2569a03J788k548k88J885J05m62j777J643J456k801K86J780o77j299J106P97m54
2586D37j878J256K241k941k62J968k80j356J31J240J48j678K37K476j859j317
2602a437J468J004j095j026J114J409j891j007L245j158k285J419J941j705j684
2617a688J883J411k384p00K863p28k198J704Q38m57j772J076J270r61j131J220
2633B46Q69j721m1R27P33j877Q7K176r93j950J201J780k014o27J348J078k085
2650h63l66K119n35j603L68K183r38j593J168J369j429j662K440O33k261m32K829
$$ plain form
2535 -2447 1334 1719 -1954 230 577 29 327 -450 969 -75 -1634 588 1921 -1153 -387 243 867
2552 867 475 -1620 1126 1126 -1773 379 2389 -834 -1286 855 1553 49 -1725 1282 1381 -1719 -103
2569 -103 1685 -863 -1151 734 839 377 -1400 243 1699 -1102 -816 964 287 -1012 94 891 437
2586 437 -1441 -185 2056 -885 -1147 821 541 -815 -684 556 704 -974 -737 1739 -120 -1437
2602 -1437 31 1035 -60 -1086 28 1437 -454 -1461 1784 626 -1659 -240 1701 -4 -1688
2617 -1688 195 1606 -778 -1478 1385 657 -1541 163 1001 544 -1228 -152 1118 157 -974 246
2633 246 1115 -606 -647 280 1013 -864 -777 1399 406 -1544 -343 1437 -577 -1204 144 1222 -863
2650 -863 -1229 890 355 -1248 -880 1303 365 -1228 -60 1309 -120 -1782 658 1291 -970 -1402 1427
2667A427m24k529J166J914j542j613K120N57k052p2J940k64j460L55J336j83j473
2684g97N21J306r15j044Q57J488j512q08J377O83j850k85K471p34j803O78J848
2701A481j458j189J551R29j712n15J917j51j914N11J804p21j447P98J351j215
2717B0j406K017O17j737o46K215J08k494P23J663o61j675J560P04j140q44J026
2734E0Q69j485l97J475L54j727N74J027k53j491O25J555j583r72J567J309k410
2751i13k65K257j97j752K06K259j686j297J863J024k288n9K094q92p39m22J691
2768H84m06j686J303R74j214p33J227K93o70j164J479R05k338Q72J204j006r17
2785i93J007P22o12j396J220J684k401n0J421k87p23L2Q22K91j805L55K696k251
$$ plain form
2667 1427 1003 -1526 -360 1554 12 -1601 519 1076 -976 -1048 892 628 -832 -477 859 676 -797
2684 -797 -276 1030 115 -929 -72 1416 -96 -904 473 1156 -694 -979 1492 758 -1045 -367 1481
2701 1481 23 -1166 385 1314 -398 -913 1004 853 -1061 -550 1254 533 -914 -116 1235 20
2717 20 -1386 631 1248 -489 -1135 1080 1188 -1306 -583 1080 419 -1256 304 1008 -132 -976 50
2734 50 919 -566 -963 512 866 -861 -287 740 487 -1004 -379 1176 -407 -1379 188 1497 -913
2751 -913 -1178 1079 882 -870 -664 1595 -91 -1388 475 1499 -789 -848 1246 354 -385 -807 884
2768 884 478 -1208 95 1069 -145 -878 349 642 -28 -1192 287 1192 -1146 -274 930 -76 -993
2785 -993 14 736 124 -1272 -52 1632 -769 -819 602 315 -408 -376 446 737 -1068 -713 1983 -268
2803b68r19J685L20j076p31J588M17k191P64K626k504j180K305K0n91j036P01
2820g0P85q25n36J883r82j366J504L29K03j941P9K527r80j739K029j14j678J094
2838B02K70O06k115L9K847j156k043J639M65j462J017j92P96j386j288L198k42
2855A195l020J501J321j313L30l15R63q72j398L222m70l229J591J668j324J25
2871b5n07N24L09j571J952J37k484J051J354k46o20j413J158J587k508R31J629
2888A258k817P80J634j34j188q77J340K022l170L61K163k201P54Q14m53l56r75
2905a045J054K168k835q25K551j166J05J89J59L6j566J105K350k730j296L266
2921A520j349M4k89j91R53j106M25J477j811j178K711l31n96n59p23K582j156
$$ plain form
2803 -268 -1187 498 818 -258 -989 599 1016 -1175 -411 2215 -289 -1469 836 856 265 -771 -70
2820 -70 715 -110 -646 1237 255 -1111 393 722 925 -1016 -937 1590 610 -1129 900 786 -892 202
2838 202 472 1078 -1037 -998 1849 693 -1350 289 754 -708 309 117 913 -473 -1761 1437 1195
2855 1195 -1825 -324 997 -316 14 -301 662 -210 -1608 1614 1144 -2085 -494 1174 -150 -25
2871 -25 -532 -8 301 -1270 682 819 -1665 -614 740 494 -126 -1539 -381 1206 -1302 -371 1258
2888 1258 -1559 -779 855 721 -467 -1344 -4 2018 -1152 -791 1372 -829 -75 739 286 -70 -1045
2905 -1045 9 2177 -658 -1483 1068 -98 7 196 355 391 -1175 -70 2280 -450 -1746 1520
2921 1520 171 215 -74 -265 688 -418 7 1484 -327 -1505 1206 875 279 -280 -1003 1579 423
2938D23j585K642j281j832K460K04j272n24k44K728j717j608K721j015j339K035
2954G96r8j093k28l67K236o31k505K161M8r18Q56o8l27j13p20K177j75l183K206
2973E4J227j489m1K55j78M02j134J629J52k631J675J127j061k84l26Q23O68j620
2991g52P54J283k456O93J688j159o94J59J141J93j690L63J824k247N93J435j336
3008b08m97K34O56P72j639j19K035j585j56J274p88o3n74R20R72j980l28J992
3026I18l38j333R33r2L2r89Q42J194j642p37K063k26j259N56Q1N37r41n1J593
3045A141j309j036J974K20j524k15J287L86j441l8J890j264q64J030P10j219l76
3062f48R93J04n80n60J212k03r30N99P20q31l98N99P33n53j292J230O56j258k45
$$ plain form
2938 423 -1162 1480 199 -1633 827 1031 -241 -765 -1009 1719 2 -1606 1115 100 -1239 796
2954 796 698 -395 -623 -990 1246 615 -1890 271 319 -599 257 189 -138 -251 -971 1206 1031 -2152 54
2973 54 1281 -208 -249 6 -172 230 -904 725 877 -1754 -79 1048 -13 -297 -623 200 868 -752
2991 -752 2 1285 -1171 -478 1210 51 -643 -484 657 850 -840 -477 1347 -900 -307 1128 -208
3008 -208 -705 -471 185 957 -682 -801 1234 -351 -507 767 -21 -84 -658 262 1234 -746 -1074 918
3026 918 580 -753 180 88 120 -869 -27 1167 -475 -1212 851 625 -634 -78 3 540 -401 -452 1141
3045 1141 -168 -1204 770 990 -534 -749 538 924 -517 -555 1335 71 -793 237 947 -272 -648
3062 -648 345 449 -131 -691 521 318 -612 -13 707 -124 -522 77 810 257 -1035 195 851 -407 -652
3081f52J038r6j033M74R46l07j574J054J092j363LN67L04r30j34R86J33j553Q00
3100b45J162j204n79Q90P66j060m48J081K14j023k34J504p32q91O10Q20p83q14
3118i66Q48P90q89o59J229j55p25J80L49L99j130M54J195q89r75J052Q12j329
3136d09j85J366N6j887Q82J107p37r51R27N34j023j08P13L15j114l1J042j11j202
3155h16O12J034r79l75M76P53r90m67J099K52r24j21J227o40p99M31R01p06o93
3174g25Q92P78q94o79J074J64r13j34Q06K37j182N86P82o80q92J010N24j039m24
3193g09J261n3j404Q98Q46p49r31P75O37q31k60P58L88r08j05Q24j45p25J79R26
3213F72m01r27K76J294j100n06R58M37j014k21R35K20j221K72R63m41p02Q98j77
$$ plain form
3081 -652 386 290 -743 -269 677 370 -1204 -150 942 -421 -418 149 453 -477 -611 375 508 -1045 -245
3100 -245 917 -287 -866 24 790 -270 -718 363 577 -446 -680 824 92 -799 -189 631 -152 -966
3118 -966 -118 672 -217 -876 353 198 -527 -347 2 401 -729 -275 920 31 -944 108 920 -409
3136 -409 -594 772 828 -1059 -177 930 193 -758 169 703 -320 -428 285 600 -514 -545 497 386 -816
3155 -816 -204 830 -149 -524 -48 705 -285 -752 347 599 -325 -446 781 141 -658 -227 674 -32 -725
3174 -725 167 945 51 -628 446 610 -303 -437 369 606 -576 10 792 112 -780 230 754 -285 -709
3193 -709 552 499 -905 -7 839 90 -841 -66 571 -260 -520 238 626 -282 -387 437 292 -433 -254 672
3213 672 271 -656 -380 914 -186 -692 266 703 -311 -532 403 623 -598 -326 637 196 -506 392 215
3232B15j28p36J074K23j284O8J037l5j462R39M27k49p97O30P70j305k45J605o41
3251A06p39M00N59j74n71m3J386j161k85Q65p4l00j70L1J085q42n89J295m60o44
3271c25L25N74n77n60O06Q27j054q53J624j20j035O49J46k00n05N72N69n53j243
3290a133J358P74j386M74L36j15o7j91N64l63j217J014Q81j511Q5P45J11j09o90
3309d40M43N40j308P64J030j540j64M99M86m1j075Q70O20j162O6J517j017p84
3327f96P93K06Jj160O02R26j083M5J100j022l88Q21k4M73j561M02J773j331k24
3346c47O70m58n0K5k86R93j291p0J948r76p19O54J01l38J95m68J035o52n81J567
3366I52r87p31O15M26M59p58p29J411q77m54J540n27j253Q63O57K0p30p64J375
$$ plain form
3232 215 87 -649 425 648 -636 -568 469 434 -1028 -89 338 89 -708 -78 692 -613 -858 747 106
3251 106 -633 -233 326 152 -419 -462 924 -237 -522 343 269 -31 -201 -170 915 73 -516 779 319 -325
3271 -325 0 574 -3 -563 43 870 -184 -1037 587 467 -568 81 227 27 -478 94 663 110 -1133
3290 -1133 225 999 -387 87 423 308 241 50 614 251 -966 48 929 -582 -497 248 359 250 -440
3309 -440 3 543 -765 -1 1029 -511 -675 -176 310 269 -806 64 684 -478 -412 1105 88 -696
3327 -696 97 303 304 -856 -254 672 -411 -366 734 -288 -676 145 121 594 -967 -565 1208 -123 -347
3346 -347 323 -135 -185 -160 -446 547 -744 -814 1134 158 -561 93 194 -144 51 -417 618 -34 -615 952
3366 952 -35 -766 -151 275 734 -24 -753 658 -219 -673 867 340 -913 -50 607 627 -103 -867 508
3385E08J4j467J529m13j059J033N11j00r39o44J601N0j471Q93J96n97O16j89j36
3404f4k94m85J177P86j866N16O54m63K55o01M86J0r90J158Q45j890L24J163m93
3423B28P7q13M81N65j126P45Q82j571J7J368l12l55q11M58J062j427M37O77j125
3442e43N1R81m72K2o37J94J595j506PP30p82K01M50l53K56p74J82J460j357p47
3462a042J382k39j99pJ73J82q03r7J729j096r61J349M4l75j60LL17k75m34J238
3482G29m64j274J288q1j06k82k37Q94n21o20J112l10r74R85K9m6k76k22R48m64
3502A08p70P53O41r89M94N4j72m16j98R39K6r91N73M58o51n8M00L96n50r83J128
3523A92L11j271O52Q70j102j10N04R5Oo85P18R2r18Q7J078n79n6R3k8J25n54K68
$$ plain form
3385 508 522 -945 584 171 -888 145 656 556 -383 -1027 574 624 -847 46 242 -355 261 72 -64
3404 -64 -358 -843 334 1120 -746 -230 424 -39 216 -385 101 111 -879 279 1124 -766 -442 721 228
3423 228 305 -508 -27 538 -588 157 1039 -532 -515 853 541 186 -625 -167 895 -532 -95 582 -543
3442 -543 -492 489 17 39 -598 -404 1191 -315 -308 422 -360 -159 291 -62 194 -580 -398 1062 -295 -1042
3462 -1042 340 101 -98 -105 68 250 -553 -650 1079 -17 -978 371 415 40 -120 -117 200 -75 -509 729
3482 729 265 -1009 279 198 92 -190 -427 467 -54 -674 438 128 -846 139 168 122 -154 -376 572 108
3502 108 -662 91 732 -257 237 291 119 -297 -495 444 470 -521 52 510 -141 -199 201 597 47 -936 192
3523 192 503 -768 -116 754 -348 -458 46 141 147 -538 180 272 -646 -559 519 -60 -116 -23 -51 74 -480 -212
3545b12O25o25l51R86j1o36q9P37J91q19K0P31n92m00L52L26k47m30O87K59r61
3566d59j6Q58m34l35L11N81m89o28P67N62n11q18Q65L26j060K93P36m42o25N40
3586B2M05n31p97J355j45p26K13K98L82j054L52K86O0o95M90P33o14l13J55N07
3606C83n85k01N21qo06L75N23m93l79L59Q24q75n1L98M34q77k92J169m79m49K76
3627c3N32m70n25P18J11l61o18Q56J16o47J53L40J37o14L75L86k04q19O22J60
3647B15m27q0K56M01p14K5O56r6n87K97M24j91o32M44M22n01j87M22L75j152N39
3668i1M92M4q55L22K04j384J046K43L79n74o8Q67l53o01j31O87k07n10M21M19
3688C50p2n46K30M14k63p14Q60K70q01J46M24j52m60j51Q95m47m25M99M02q17
$$ plain form
3545 -212 413 -212 -563 423 412 -224 -313 424 615 -204 -184 547 -45 -445 -93 233 -14 -444 243 502 -459
3566 -459 -475 383 -51 -386 -75 506 17 -611 156 718 207 -611 254 580 -480 -187 549 107 -518 22
3586 22 427 -104 -901 454 309 -417 -204 94 476 -578 -226 60 120 -575 -85 648 34 -279 -124 383
3606 383 -202 -403 118 110 -496 -121 402 -91 -470 -111 713 -162 -213 185 619 -258 -550 619 140 -309 -33
3627 -33 499 29 -496 222 333 -28 -646 210 326 -321 -168 172 309 -305 70 456 252 -567 55 215
3647 215 -212 -292 -36 365 -349 -324 332 236 -351 -54 370 179 -453 -9 413 -88 -275 147 522 -630 -91
3668 -91 401 445 -410 -88 116 -1268 -222 21 400 -174 -242 625 272 -329 -460 227 20 -490 -69 350
3688 350 278 -268 -38 376 113 -601 259 529 -272 -126 298 146 -314 -465 430 -17 -442 57 459 -358
3708c58K42M31Q7q43P4O44l29n88M66O13n26j78L97Rj05l33P66k00q21L30P48
3729E26n40k82M62rJ07q28M90M25o55Q2P10k56l60K14J16J05o97N29L62p81J3
3750b67N30ko36J26L98M29q33q5Q37p10L8L49J74n28Q0J61L19p15j44R30m75l98
3772d22L31M88n71k70M29O16q14l09R71j18l91J0r7R8L19k74L47m78k92O05N4
3793B32m93K38L9J78J7n79P08k93p26Q98k4l07J09l24O06n2p10O41j3q83J107
3814C69P9p91M9j81J002k46r87P43K72p60M37M25o78L83n87P41J82j129N20O02
3834D45n16R1L86m13nj31Q1N12j064K81J127o30j51j89J72K77p40N87M02j352
3854h30N59R63n42k95K62J4L01m98j43R90j397N23R22r12l50N58M9K94o52j67
$$ plain form
3708 -358 -116 315 402 -441 -367 277 -52 -640 -174 439 -87 -265 132 141 36 -297 469 269 -552 -222 526
3729 526 -14 -296 166 157 264 -564 -74 351 -304 -222 488 232 -128 86 202 307 -390 139 501 -280 -267
3750 -267 263 261 -375 -249 149 578 -255 -340 497 -213 -175 174 348 -180 -100 61 380 -335 -479 451 -24 -422
3772 -422 -91 397 -174 -444 -15 601 -213 -522 449 331 -60 -50 -147 -49 270 -4 343 -135 -427 178 232
3793 232 -261 -23 16 194 211 -368 340 47 -679 219 195 -112 -3 -327 279 227 -483 158 145 -738 369
3814 369 448 -343 -294 -475 527 281 -706 37 309 -451 -14 411 -267 116 -471 270 452 -677 -157 445
3834 445 -71 20 406 -7 -12 -143 -62 450 -614 -333 794 164 13 -176 -4 273 -467 120 522 -830
3854 -830 -271 692 150 -145 117 131 432 -66 -209 781 -616 -93 829 -83 -433 125 174 468 -184 -351
3874c51O72m65j29Q56n61o8o9K35L37n11o53R26J18n12N15l75j75r2J75M81n40
3895a86n20J010P9p02K92J27J2o4l4N18m28o77N03N93q14k5M15J36k38k60N96
3916C33l93n32Q74L57j197M13J74P8J42o27K49J80m50M68K03p15L97l5O31l32
3936B18r34O43M97q01L46L78l98j17K8N65l13o20M59P15p93j60O15l88K07k45
3956i8J9N38r74K60Q98o54k31L56J17k30m02N85M7n06j61R82j49m46Q5K4m4j26
3978a10r2M09j60l82Q27k67n86K42J16J21o07J38O84k72k54K37J43m67K73K48
3998B41n3l99q0M62o4p11P14K13m32j31L21Q8l90m17P90K10p52J35O93m49j02
4019a13j40L75m11j34O35j07k92j95O15j36k05j89L47P8m22L16K11k48k59M92
$$ plain form
3874 -351 321 -144 -273 583 22 -46 -115 120 457 -54 -707 219 337 -175 340 -35 -210 -302 -127 354 -186
3895 -186 -706 304 383 -319 -27 100 112 48 14 532 104 -573 -70 523 -291 -316 99 235 -3 -263 333
3916 333 -60 -592 282 639 -558 -145 29 107 249 -378 -129 51 -399 69 272 -443 -46 -81 550 218
3936 218 -716 -73 424 -377 -31 347 -51 -168 -140 425 112 -508 -49 666 -127 -287 328 -60 147 -98
3956 -98 -79 459 -515 -255 643 -11 -242 114 231 1 -401 184 231 -275 -436 546 397 -49 36 60 16 -110
3978 -110 -202 207 47 -335 492 225 -361 -119 -3 118 -489 -351 333 61 -193 44 187 -280 -7 241
3998 241 188 -211 -291 171 107 -604 110 323 -109 -240 81 169 -221 -638 152 362 -390 -255 438 -11 -113
4019 -113 -253 122 -289 -423 212 105 -187 -382 233 97 -108 -297 50 128 -294 22 233 -15 -274 218
4039B18o3l55J38L7L70o30LO54m84l53M21N81o30k71M38L74p20J44L90k25k64
4060b27P1N23n38r8L95J78l84j49J61K69j75k07L02O3j77j0J91j59k65L72K30
4081C66k04m97L40K43m04JK19K44o33K28M17j13o60L01M88m47j19K66J59l80K04
4102A9K78j36o03L34J76j68j29K72L16o40m0M84p3j59K8M54m25q7Q2M3k9j49J52
4125@J55n7m59N64K01n96J06O62n20o26N75O1j37j80K82L15m84j79O48k00l97
4146b66N4M38j66m73L38J88l8k00LK20l54L8N31j16l14j27O18k88l62M94L4l24
4168g2l78O56l3l36j17K40N0j64K08J57K22n42J78k0j4l32M69j4r9j52K86m7k98
4191a52J30L43k69k44K73L30n29r6L56K9l15q6M95n7n62K83J87m46K06jK41J0
$$ plain form
4039 218 155 -200 -62 -25 345 -285 -282 372 -112 -465 -44 537 -93 -364 74 448 -272 -128 262 37 -227
4060 -227 -156 367 -171 -269 126 304 -80 -229 -68 201 26 -181 121 184 7 -3 188 29 -236 136 366
4081 366 162 -335 5 248 -156 -155 64 308 -325 -97 320 207 -453 -152 336 -111 -230 36 195 -185 19
4102 19 297 161 -442 -108 68 -100 -229 43 359 -281 -321 163 90 -69 -41 413 -12 -99 -17 26 -3 -152 0
4125 0 155 98 -361 203 404 -192 -86 576 56 -570 5 66 -71 -251 31 346 -138 -317 331 131 -266
4146 -266 -212 226 60 -413 -75 113 75 -125 -122 98 -256 -218 313 197 -117 -244 374 86 -276 218 252 -72
4168 -72 -450 206 173 -163 -280 -40 10 -154 54 211 433 -109 69 49 35 -297 172 158 59 -93 193 146 -152
4191 -152 -22 321 52 -192 81 411 -118 -214 142 171 -144 -230 265 208 -354 -71 116 -330 -124 -125 116 126
4213A26p15Q01j04l23K67J87l53l27K62M79J00r44Q48J55o05l5J64J10j60O8m26
4234d25O32p94P97J67l63k16L39J99n14j18L19L24p15J87K91l57J08J77L2J38
4254B08k04M5L25m81j09M15m47L27j99L79j06m27J05L46k26j27K55J03r7J8n8
4275D5K42o13k7M96K11o13L24M1k41J24k10M96k01n91P88k04n33L80J97kJ02l84
4297a73L44n6m72M78J14o95L27N07k55Q7n87M46K65p28L62K93m37K68j1j10K62
4318B29j017Q09L70p54K57J76l13j70N07j07J71o76L91M79q58K27J94K9jJ89j38
4339fJ7l23L10N10p21j1O56l29l13K12O4Q7m76J03P97q26l02O07J67l50L2j73
4361b68P43n00j27N56o59j88M43J96n5n01K33P01j73r47N56p5j25Q6K89j17l39
$$ plain form
4213 126 -589 212 108 -215 52 239 -114 -441 -179 300 400 -544 304 459 -146 -181 -17 93 -67 1 -425
4234 -425 207 -587 210 377 14 -202 137 336 -178 -296 23 347 -368 -181 110 -247 -139 38 70 208
4254 208 4 49 374 -107 -216 199 -248 79 -120 259 153 -274 -169 177 -49 -176 79 182 85 103 45
4275 45 287 -326 -353 143 354 -259 65 106 -135 -11 -221 275 74 -517 271 67 -466 -86 111 109 211 -173
4297 -173 171 115 -357 121 235 -460 -133 374 119 206 -381 65 330 -398 -36 257 -180 88 77 -33 229
4318 229 -788 21 391 -363 -106 70 -243 -413 94 -13 158 -518 -127 352 -506 -279 -85 -56 -57 132 -6
4339 -6 11 -312 -2 508 -213 -224 432 103 -210 2 66 153 -323 -220 577 -249 -551 56 223 -127 -95 -268
4361 -268 475 -25 -152 404 -255 -443 0 196 141 -360 -127 574 401 -546 10 -65 -190 -104 185 68 -271
4382b71j82Q25j38p90O01L49n23K44j53L20m23j6O24k90o91P78Kj49L4j32N6Q2
4404A57m82M04J29n61M51K09k02j72m49O69J30p00Q22n3m90N0K56k9p7m96N01
4425F7J77o46K67M47o94L2M33j6l51l64P78K01o52L12J26j71j46L13k38q9l9K62
4447IR2j78l43M78N2m25L24P9O4l49l3O99n26l46O03J44l26k34J14J11p2k25N96
4470C08j19m32O21l06j75N7R2J12j39k02K94M6m57M67J25l58j95J48M14m11j88
4491b98M55J73n60MM94l23k28K11K22k29l00M57J18m80K28K28J78k18j18L57k86
4512H5l86K07K11k3m12N05pj27m05M24M08o66J28J28M2m61J47L51%j83O8J52l40
4535a54N3L40J79o14J57K76k3m77Q9M22l61n5J63P3j08lJ38P7l19j33O08l4n47
$$ plain form
4382 -271 -453 372 234 -556 45 394 -129 115 -38 282 -141 -157 467 177 -514 264 266 117 151 19 75 157
4404 157 -325 79 208 -353 98 307 105 -67 -516 153 283 -417 405 352 -138 -88 168 139 62 -434 67
4425 67 244 -402 -135 312 -382 -350 83 67 -284 -648 130 331 -321 -9 117 -54 -200 113 -125 -214 -253 9
4447 9 101 -77 -420 58 110 -315 9 88 152 -197 -230 469 -57 -403 200 344 18 -216 -102 9 -63 -288 308
4470 308 189 -243 378 72 -103 -46 46 158 19 -183 111 157 -300 167 292 -66 -261 -113 301 -110 -298
4491 -298 157 330 -230 -226 268 -55 -283 -72 150 -79 -379 78 196 -284 -56 172 350 132 14 371 85
4512 85 -301 -94 117 94 -318 187 180 53 -352 72 480 -186 -58 70 112 -349 -202 149 149 -34 34 186 -154
4535 -154 -101 239 418 -196 -39 237 214 -263 -174 248 -113 -168 -5 68 -40 -43 95 172 -147 -280 328 294 -253
4558b53M79K0k11l11M43K98n68j32L36J25m74j7N00J21n49J99J75l04j74M38J30
4579B71p96K66O35p4m61R4M15m30m78M77N03l54o5J30k16j02K60O4N77p25k62
4600b71N45r08K22M21J5N07q58M12j20r4r6K24n19J6n1Q32R3q25Q40J83l30k41
4622cM36P1p67k15J277k73q55J037n63m31K1K90N27o95m9L67k8l71J31L55k84
4643b2p2K0K30k15K4j45M58l57K49P0j7n09K47J54Km25o2N18k25m67Q09k39l57
4666c31P8M83m8l04J4J67O2n64N08K26l42j09K7N13n08l8L59p0k26N4K76k06l45
4689c24J27N65k48l05M15r5j52J07J89k55k31J53J46J51m49J31N10m79J0J95k09
4710d8o5m3L72Q5m23J22N78o56j8J83j78R5j52J43L62p90M28N85o16j62k12N29
$$ plain form
4558 -253 226 246 35 -276 167 465 -103 -235 101 226 -248 -265 235 356 -193 6 181 -123 -297 141 271
4579 271 -525 -259 376 302 -159 -65 350 -80 -558 -81 422 68 3 133 -83 -185 75 139 716 -9 -271
4600 -271 274 -634 -412 9 24 531 -327 85 -35 -129 -225 -1 -520 -504 -555 277 370 -455 385 568 238 -3
4622 -3 433 504 -263 -478 799 526 -329 708 145 -286 -265 25 552 -143 -192 175 147 -224 -93 262 -22
4643 -22 -94 -74 156 -59 -35 -180 278 -79 170 240 223 -286 -39 115 117 -308 -370 148 -77 -544 265 26 -331
4666 -331 -253 230 182 -122 -108 59 121 -443 65 291 -51 -160 -133 380 -128 -166 193 123 -103 -49 227 21 -324
4689 -324 -197 368 120 -185 230 135 -17 90 279 24 -207 -54 92 243 -206 -75 435 -44 -34 161 -48
4710 -48 -113 -156 216 301 -122 0 578 -78 -96 87 -91 4 -148 -5 357 -433 -5 580 -36 -198 -410 119
4732A19J7k95K50K13q46L59L88k88j15q2M65j8m27J15M61n39J97M42k82J6m36
4753b86K44M52n86j4N97l65j36K91j15lk46K2N79n71n18R05Nq72O43k07L01k54
4775a34j7N29m99l17P64K12r91M10M5K05j4m15M64l3p43P29K96q11R8K45K81P1
4797C75n62J90J94k82J02K14m69K1K60L24O8j023N12N95n89p1L29m28k5L3L37
4818A05J68r01N94P36q66J21J87m59J08L20k57L96r05N55P87p44q2P6J94O8l10
4839a09J90K83o87J39P01o42K9J63j50M68m63k2M44k78k03P72p58q5l0J90N10
4860D62p27j03O69j79n12P89j60m72J87R2L07p16j64P61j30l33L54j09M6o8k21
4881b27P70o52l99P82R5n81rJ38KJ9M9M51n72m77Q21J01o30J45M79j78k1o32O36
$$ plain form
4732 119 136 -159 91 304 -542 -183 205 -83 -198 -280 185 167 -260 -145 316 -223 -26 416 134 150 -286
4753 -286 -42 410 -176 -190 407 42 -94 197 82 79 -167 -145 434 -137 -655 250 255 -617 26 -181 120 -134
4775 -134 -151 378 -121 -438 326 538 -453 -43 2 207 193 -222 242 209 -534 195 491 -320 -222 23 304 375
4797 375 -187 3 197 -85 17 231 -238 -217 43 367 435 -588 -76 519 -70 -141 188 -240 -265 -232 105
4818 105 273 -628 -34 702 -164 -43 144 -315 -207 113 -144 252 -653 -98 689 -55 -137 -61 133 201 -109
4839 -109 81 364 -323 -184 517 -125 -96 67 -83 385 -78 -100 344 66 -137 635 -123 -208 -238 -48 462
4860 462 -265 -368 301 122 -390 399 239 -233 -46 46 353 -363 -527 234 104 -229 125 16 62 -6 -227
4881 -227 543 -109 -508 274 369 -212 -221 -83 -81 -62 -13 438 -134 -611 210 311 -319 -174 305 127 106 -526 110
4904A10j7m39P02m38j04o6K58K44l16l66N05K57o35M77J47l19l8K23M7j35l92
4925b95M06L63p74l5O87n56J78O0M3J4n63M35M22m07l09L08K81n26K37K80O4n24
4947b11j03P39n90L5L02j02j81j05M42q7k88L1M70l54k33N02n1k21k67L72J83
4968B83l35j48M98l00l73M12j98M23m92k0P57n34n03P62k48k52K13K56J6l25Q2
4989b6K76r2k68J85K30m34k57M74L93n64k01M73r2l48k8Q42o97L9Q4K14k31j95
5011b23K78Q7m41J8O37k58j56R6p6j17j51L00K76m26O4J18M99o76kK32m7l42J86
5034a24L00j78j59R0K76k34N1O2J09l35J85J28j16j97J42M08p89J96L94k23m2
5055e6k68M85r6k17p0M14m3j47J43k74K60l65L78q0l30Q9J78J26k53O4p1K64n11
$$ plain form
4904 110 93 -346 356 -82 -186 -252 6 250 -66 -432 73 330 -305 172 319 0 -38 185 232 97 -295
4925 -295 111 474 -300 -335 352 -204 -26 34 77 91 -472 -37 385 -22 -331 -23 258 -268 -31 249 313 -211
4947 -211 -314 425 -165 -130 172 70 -111 -216 226 139 -149 -118 352 -2 -235 267 216 -5 -272 100 283
4968 283 -52 -200 298 -2 -375 37 -161 262 -230 -250 507 -27 -530 232 -16 -268 -55 201 217 -108 -26
4989 -26 250 158 -110 75 305 -129 -386 88 481 -83 -284 189 97 -251 -279 563 -134 -95 -11 203 -28 -223
5011 -223 55 142 -299 -281 356 98 -58 38 -38 -155 -306 -6 270 -156 -92 26 525 -151 -153 79 32 -310 -124
5034 -124 176 -2 -161 -71 205 -29 22 84 193 -142 43 171 55 -142 0 408 -381 -185 209 -14 -56
5055 -56 -324 161 65 -152 -222 192 149 2 145 -129 131 -234 144 64 -266 -177 1 127 -126 -62 -133 131 -380
5078c80M89q3j24JL08l9m42L88Q7J08l96KN27n80l0J93R8k52j13K02K36k33p3
5101a06M48k68k02p0K37K8m15M41J86m11q7M5K94j88k30N83j97k90L37kj70k86
5123c23L67o5k00P7L02K29o41L55J56m90j9J52K56j83l92L67M72p27Q5M43j46
5144G5l71K76K30l44p5J88L27o82R5K93L7j63J4J75J85n45K80N40m45l30M22J08
5166B90m10k5L22K2k96L20J2o9k21K84k36J91k46j70K56n4l98L68N2k76L0O04
5188C50k59n3k70P01l04n42M14K60o88N26kJ35l63j39P41m50k41K94K72k49k45
5209a12R6J55k0k78O47l23m49L00Q4j55j98J40J91j20k77N88k62l93M35J38j99
5230a2n3k73N77j99l21J07M88n22o0M54j13k36k63N24K51o23J5N78m88N5J37O2
$$ plain form
5078 -380 109 26 -98 -97 211 172 -270 118 205 313 -83 -81 446 -134 -164 29 127 -125 -238 -36 200 -33 -106
5101 -106 342 74 -128 -198 39 67 -348 93 279 -132 -219 -174 120 -68 -298 285 88 -202 135 133 -37 -323
5123 -323 44 -21 -221 -144 158 387 -254 101 257 -233 -252 -100 156 -27 -419 -52 420 -307 -222 221 75
5144 75 -296 -20 210 -134 -209 -21 306 -376 -281 12 49 -114 -100 75 260 -285 -5 535 90 -240 182 290
5166 290 -120 -145 177 199 -97 223 235 166 -55 229 -7 184 -62 -232 24 -30 -428 -60 -8 -284 -254 350
5188 350 91 38 -232 469 165 -377 37 297 -391 135 133 268 -95 -234 507 57 -184 110 382 133 -112
5209 -112 -16 139 119 -159 488 165 -284 16 100 -55 -253 -113 78 -42 -319 269 7 -386 49 187 -12
5230 -12 -65 -338 239 40 -281 -174 314 -208 -268 186 73 -163 -426 98 349 -274 -259 319 -169 -114 23 85
5252H5k0m69N53J97l70j40P62n64K44j03l69J98j88JM34n67j45N92N7k03PJ25
5274A17Q4m24k48P76n38K7L53M0j43j11j5L08m23O4K18j46j94M03J9l20j04M6
5296b11O46k94l60M06j15k98J62K63l49k86M0Q20k01m20M42K5l27N6L5j65J26
5317ek18L80Mn74M22L68n41K13k78M35l54L0L66J39o87J70L27k82J94l2nK18l82
5340i2R0K80o15M03K10j04n11j77O42M10p71J44M94p44Q6M98j94k88R2K92K91
5361D36p30M26kj79K5K23n07K48k03K75L50p04J35N76k93m69N54l02K20j57KL64
5383B88l81k21L20K00k49j63K67m7k80P7P81p19k35O89L9m97J43q2K40k26n7L85
5405B72j79o93R08k6o06J04k2M72l03k62O95k00o27O57q9j75n11J104n59J55j35
$$ plain form
5252 85 65 -404 149 346 -24 -164 598 34 278 175 -194 4 -184 -183 251 -316 -461 131 188 -15 -8 117
5274 117 201 -223 -471 305 -233 -206 147 187 44 -67 -82 226 -197 -133 85 -61 -255 148 167 -153 -257 -211
5296 -211 435 141 -219 187 72 -226 -64 199 -150 -436 -396 424 223 -197 245 270 -57 -1 34 -131 -5
5317 -5 -223 157 161 -413 9 377 -164 49 -229 206 -148 -118 248 387 -300 -130 197 -85 109 77 72 290 -92
5340 -92 -2 278 -337 66 276 172 -339 -516 126 536 -235 -91 403 -341 -255 243 49 -239 -147 145 436
5361 436 -294 132 130 -49 -24 199 -308 -60 -263 12 362 -342 -207 369 76 -393 161 -141 79 -78 -76 288
5383 288 -93 -314 6 206 -43 -206 61 14 -266 -189 592 -127 -362 327 366 -131 12 -70 170 -56 -113 272
5405 272 93 -600 308 282 -324 -220 -242 230 -73 -335 360 160 -467 190 101 -74 -585 519 -40 115 -20
5426b0N5K31o74L68L05k17l67J78J31M9q5K76j74j57j13L93K25m64j17L08n0n21
5448d40M84K04l82l9N33l87j29J1M30j3n00J11K75m08Q5L75j33M0n23P05k75k
5470B2j8K14k70k74J98M26k03n36L27M51m68j96M17L80o35L3J23J1k70J30M38
5491C00l14l46N09K03l26j40K64mk66k06K64M10n85J40K57p7j49K93j4j87k26
5512b00J75L77n66J38M10k43k03J31J92k40l52L89L89n05k03L53J67n48P5L52
5532H8J71m91J79K16l18K23J7L66n56OK75J43n42n6L13j68k16L93J21k38j67L58
5554A17J71m43J43L68l38j76K12R4r5j46R3j26Q0J0J25J73k47j3K10N6m59K28
5576C7L93l71j09K83p0p6l88K29L93n14k15M51O4m09J66M40j51m67M69l0j54l13
$$ plain form
5426 -20 35 266 -408 -40 265 48 -319 -141 -10 39 -46 230 56 -101 -214 179 404 -60 -177 131 81 -440
5448 -440 44 248 -134 -173 360 -27 -156 -145 285 272 -228 -117 158 -250 -165 210 77 117 -406 299 24 22
5470 22 4 218 -52 -326 -128 298 95 -441 -114 337 -131 -327 90 470 -165 -132 -9 2 -268 -138 300
5491 300 -14 -360 149 352 26 -114 150 146 -120 -326 -62 348 -237 -97 160 83 -66 227 213 26 -200
5512 -200 -25 352 -214 -76 334 91 -112 19 211 -29 -381 8 397 -108 -311 42 209 -339 -264 88
5532 88 259 -232 -53 163 -155 68 85 451 -105 -99 176 319 -223 -279 34 -134 -350 43 164 -74 -241 117
5554 117 288 -155 -12 356 18 -158 54 148 53 -93 0 -126 -46 -36 89 262 15 2 212 268 -191 37
5576 37 430 59 -50 233 163 87 -301 -72 321 -193 -408 43 107 -302 -136 304 153 -314 155 125 -29 -342
5598c42O41m00j70L87j1P5j36q4K68j67k81L48M3j24j26L1J54k56j14Q33n27o9
5620b7J06J02l21l32P03J23l46l2J00Q1m05N60j56k15j92J16M06k77j56K24L2
5641I4k41P0K08j85J27j51M93m72j09L49L2l41k02L32K5j98N5K91L8j69l93O94
5663C47l12j71M63l27p8m2K39L62o70J80K20k01o8R7k3J88m70J72K43m79L3L81
5685H4j92J34O8O4R0m89K6O11p47J65Q2K22m27L57p2K72l64j62N69k43l66K41
5707g7J01N5Op0J34j93r5M06j58m14L44l7%N4l99M84o0m19P20l13l25L45m23N24
5731A90m37n8M58j28k90N17Q7o38Q9J25L63l78k24N77j42k35L85lm53M40r9q2
5753F4l4j48m4M43m48j03K70J0o4j84N47j50m27K55M36p67K77K35j18l9l52N66
$$ plain form
5598 -342 299 -101 -271 116 105 180 44 -40 228 61 -220 128 171 47 -79 -48 106 -150 -264 569 42 -27
5620 -27 79 181 -140 -472 231 354 8 -24 76 157 -248 312 156 -59 -251 -135 271 -6 -162 62 94
5641 94 -147 -77 131 -54 73 -78 415 -57 -166 183 215 -126 -328 4 29 -169 -114 177 215 46 -347 347
5663 347 35 -136 327 0 -78 -120 119 481 -189 -9 211 10 -58 39 16 204 -266 -94 149 -330 -297 84
5685 84 -108 26 94 158 248 -241 -215 396 -351 -186 -104 118 -309 48 -24 248 -116 -278 291 48 -318 -77
5707 -77 24 79 85 15 149 -44 -139 267 109 -305 39 2 2 56 -343 141 81 -338 382 69 -256 89 -334 190
5731 190 -247 -305 153 25 -265 252 339 -299 -210 -85 278 -100 -324 253 111 -124 261 258 -195 245 146 64
5753 64 30 -118 -162 281 -167 -270 0 10 -54 -238 309 159 -268 -13 423 -344 -67 168 50 11 -341 225
5775B25q3l20M26K52n65k11O21j09k41l9M6K95n68K21K49m44K69J53k55K61m34
5796b51K25L77m94N3J38k39K19J26J29k64k18P1M29k49l24M84j04r0j45J76k46
5817a97r1Q6L84j07n14M75k0N4N3o8L0j63j32M44l67l12N11J99k84k85J57M80
5839C33m41k20O74p6l26J98J34l15Q0j52L50Q2m72K17l7l97L73J74k83Pj13M20
5861B10Q9l54q2M72n52j4L03j85k3J16K18M3n98J82N77p5o13L12P9m7k51L39J49
5884B95l01l8qQ1j20J96j25J08j91J30P5l64n6L99L25l92l71L33K40l76O9J26
5906C5L3p3J27k95J58o7J68M5k81k11L68J33l33K31Q7l51k2K54J29j40l54M70
5928A11j39J17j1m5j95j60J56M28j90j14L1l1J93j44n1K76m35J34l5P3K6K11j03
$$ plain form
5775 225 142 -178 248 500 -65 -276 345 236 -5 -44 2 297 -271 -50 199 -245 24 177 -78 183 -251
5796 -251 -26 351 -143 -90 48 -191 28 154 283 19 -199 -128 301 52 -272 212 108 18 -127 49 -197
5817 -197 -288 -202 182 75 -439 36 16 70 123 55 85 -78 -210 234 -133 -445 66 265 -19 -304 -147 333
5839 333 -108 -328 346 270 -56 142 276 -39 41 -111 239 321 -151 66 29 -368 5 179 -104 -97 -210 210
5861 210 299 -55 -137 335 -217 -231 72 -113 -136 -20 198 241 -357 -175 402 327 -286 26 105 58 -193 146 295
5884 295 -6 -44 -52 29 -91 105 -20 88 -103 27 102 -262 -318 81 406 14 -357 -24 216 -160 -91 35
5906 35 68 -5 122 -173 -15 -82 86 131 -150 -361 7 140 -193 38 125 -226 -248 6 135 -5 -359 111
5928 111 -28 89 78 33 -162 -322 -166 262 72 -42 -11 -42 151 7 -44 232 -203 -69 -104 -31 -5 206 103
5951A03k13q9J42L99l90k00L37j70P7O4O3j82k78M35J01k58j06K02J85k96K3J32
5973H1k14R3J3J18r9m76M32J95l3k80J11N59m45j02kJ75m27J73M83n80l3K88n
5996B5k88J8J04K36k68N2J90N1j61K0M0n0j03Q5K87k66rK34m09J76j32J85M2l27
6020b68K77R0j00l50N60L7m15k3J50K69m81N1K92Jm23J44K29k8J13j19MN4k36
6043a72L08r4k86J19K09p1j99J19K57l92n1J66M42n96j9L10J08k10l8J58j44m7
6065a23K77J27l44j23M51l30Q6k55M88j84k89qL69r2j98j3J30o4j58O68j15l39
6087c9p8J28j8k99L30j22r9J79j97M11o05N20p4J55r6k59K11N2k49K59J72m23
6109a41k2M65r6m59K41J02J93n52J93M85o77P9L05ll43p8O07K0n39K48L9J59l17
$$ plain form
5951 103 -110 -199 -57 342 -48 -248 89 -81 -4 60 123 -59 -337 98 199 -59 -165 37 222 -74 -51 81
5973 81 -133 -40 -27 91 -8 -484 -52 143 110 -170 -59 500 55 -47 -49 126 -301 -128 355 -225 -258 30 25
5996 25 -263 -245 -141 95 -173 -121 69 120 -41 -21 19 -31 -134 -49 238 -28 -37 197 -212 -36 -168 17 59 -268
6020 -268 9 99 -1 -351 209 246 -169 -192 -42 227 -254 -203 89 90 -333 -189 40 12 125 6 10 64 -172
6043 -172 136 42 -244 -125 84 13 -186 -67 190 -202 -253 -87 355 -241 -260 50 158 -52 -90 68 -76 -123
6065 -123 154 281 -63 -186 265 -65 21 -234 254 70 -219 -227 142 50 -148 -161 -31 -95 -253 415 300 -39
6087 -39 -117 11 -7 -306 24 -98 -197 -18 -215 196 -409 111 37 192 96 -163 48 100 -149 110 282 -141
6109 -141 -163 302 206 -253 -12 90 283 -269 -76 409 -268 -189 116 113 -230 -308 299 319 -220 28 67 226 -91
6132i1k3j9M9qj55N16n80k18P17Q8o63M86j62N0J3o5L13k19l06N08j12m85K13
6155a53K20J63m83K03K13P5j23k00M09l98K54J18q2k6m04J97K4L2L0J46q3j57
6177b5J80K7k8l46L35j84J09J45j71l4n5K32pm7n65L61L45P1l87l3j55J85Qj45
6201a84L50l79j21N76n3l82r3L36K63l67J64K09m82R3L86r7l7l98J65n2L6j25
6223a92J27%o7L79m29j40K43l5J88l78M5K58J93j95j96L13k07k63J45M71k13m99
6245d52O57j7l09K22k27K2q1J57K50k30l13N29n9l56J56k33J87L3J4L01j70m01
6267c20L95J85m78O3jL90j96k20K35qk74K50rk00K40k29L22l2n20K56N80m89J27
6290F7R2m15K98q6K65j16k23p5L69l38N1R4O4k44R8K82o0k00J7M21n72M0K76j86
$$ plain form
6132 -91 -114 -133 -84 -92 -247 269 -311 -529 188 276 -387 99 -63 -13 0 -65 248 29 -277 231 119 -366 -153
6155 -153 67 230 -253 -50 163 238 115 -85 324 -74 180 298 216 190 -214 -17 7 39 69 215 132 -25
6177 -25 155 182 154 -192 143 -41 68 213 42 8 -47 185 178 131 -434 -73 272 343 -44 -77 -232 -47 -39 -184
6201 -184 166 -213 -334 242 189 -193 -286 50 313 -54 110 319 -163 -70 316 219 182 -216 -51 -103 -67 -192
6223 -192 -65 -65 -132 247 -182 -322 -79 -114 74 -304 -259 -1 192 -3 -199 114 -93 -356 -211 260 47 -452
6245 -452 205 188 -121 101 -126 -104 -185 -28 222 -8 -321 208 149 -207 -51 -284 -97 -64 -50 251 81 -320
6267 -320 75 260 -218 -155 -156 234 38 -182 53 45 -229 21 12 -188 52 -177 145 113 -407 -151 429 -60 67
6290 67 159 -256 42 -44 221 105 -118 -193 176 -162 -111 -17 47 -197 -99 183 123 -77 -60 361 -211 -171 105 -81
6314h1J44K53l32K37k99K35J75k84k96N61k20L11k68j58O2j30M7K26k54k12L30
6335D7J42k4l37j8L22j19P5P5r9m85O65q4M7l68m9K76P3m1j10J01m55K60N5N10
6359D59l68m35N69k66n3j63M98k95K43l11M70k63m50P57l36r0k7L61k70j05PP1
6381CM5l68J69M05k92K26l47K96J21l36K17j75k64K15j2P7n7k8J98j06l9K6J63
6404A37j92j15J85j48l0L48k0j35j03j10K83l24J2R8J20M4j63K04j42l71M08J63
6426A49k13JJ80j47qj30J09L0Q5j31L25k4m05K77j41j24N9Q3J60m46K27K16j4
6449A18j81O8K57k67J77k45J35LO8j34j85K56r9o0J34k57O7K3jl17N71m0j38L
6473d4R4j76K0J4J05N7r5q9K11k2k96K48PN8k01K05j97j2r9K24K16m83l3L66j29
$$ plain form
6314 -81 63 316 -16 221 -78 157 332 48 -248 313 93 404 136 -22 40 -90 -43 183 -71 -283 47
6335 47 189 165 -172 -190 132 13 88 163 64 -421 244 160 207 -161 -210 66 139 98 -12 89 -366 -106 -51 459
6359 459 91 -344 225 -41 -94 -257 241 -54 189 -122 348 85 -365 392 56 -34 -61 300 30 -75 -68 3
6381 3 48 -320 -151 254 -38 188 -159 137 258 -78 139 -36 -300 -85 -97 -20 -77 -105 93 -13 -52 -26 137
6404 137 -55 -170 15 -133 -163 185 165 30 -73 -183 100 -224 -212 -114 6 50 -113 91 -51 -422 -14 149
6426 149 -64 -63 117 -30 -38 -168 -59 -29 56 -75 250 226 -179 98 -43 -167 -108 -25 135 -311 -84 132 118
6449 118 -63 5 262 -5 172 -73 62 65 133 -1 -186 70 -29 -89 45 -212 -145 -122 -123 -440 131 91 -47 -44
6473 -44 50 -126 -106 -92 13 70 -25 -114 97 75 -221 27 34 92 -109 96 -101 -113 -212 12 228 -255 -288 78 -51
6498e1n93R81J26j059P27j07l32K58j39J60K2l07J27L22k66j59K78J7k0n6M2J01
6520G2R3l55J67J51N3k97P2j42J04L63J09j84n20j9L69k50J39J41k5j20K3L9l9
6543e6k10N42q3l19N1K25j87r8K41o4Q4k41N8N27m67L36j39k05O1J4O1j5n7R5
6567A54Pj42j47J40M0j90N4J31L09n05m7m1K47j56qJ37O8l0q9K38j92j69J95j4
6591a0p6l01N51J8l96J78J31l08m5L80j57k8k1K50o6k8L1K05o79M69l15R1k6j13
6615b65K16J25k03k59O92k06n4n7M3Q6l14J04L31j56k22J8Q2l5J3P3n5j06K57
6638A08j03K36l96K97j06K47q4K4k28j23K77p3J1j66j1K39k99L1j1M31k46m7k7
6661a9K02k28j2J22KK4k24J91j20M1J01n0M7k54M02m03N9M6J8O4l9J20k85L8Q2
$$ plain form
6498 -51 -644 337 463 -596 131 24 -308 -50 -189 -29 -7 -314 -187 135 -131 -290 -12 5 -15 -71 -29 72
6520 72 165 -190 -23 128 181 -116 -44 -186 -82 281 390 206 -314 -333 36 -214 -75 66 41 -79 -56 -17 -56
6543 -56 -266 276 193 -126 -75 150 -37 -135 106 42 126 -115 -57 470 3 339 200 -5 56 70 131 116 59 154
6567 154 161 19 -128 12 52 -138 -84 47 356 -149 -196 -237 10 -146 -154 -17 51 21 -68 170 -22 -191 4 -10
6591 -10 -86 -387 164 182 -214 -36 95 -213 -258 122 -35 -63 -84 166 100 72 103 308 -371 98 -217 -126 -152 -265
6615 -265 -49 76 -127 -386 306 100 46 -11 32 118 -196 -92 239 83 -139 -121 -39 -74 -61 12 -43 -149 108
6638 108 5 241 -155 142 36 283 199 223 -5 -128 149 76 87 -79 -90 149 -150 -119 -130 301 55 8 -19
6661 -19 183 -45 -57 65 67 91 -133 58 -62 -21 80 30 77 -177 225 -178 -119 -73 -55 9 -30 90 -195 -157 -75
6686g5P4j5J8j86J69J68j46J07j13k10k2K21j29M6j19K17o4j99J96J69l0r0K4
6709A1Q7k60m5L30n0j45p4L71k59N8j98J42j46j02M6K23J93k97Q5J90q0k89J64
6732d5J24j99j95M04n8k90L47k15L9J40j30M10k60k02J59k23K77K5p2J48j72Q1
6754I3Q5p9k64J04K80j48j56k27K17J97l55M06m0j18N1J3M6k98N8Q9N6k49M14
6777A75j36o3j18K01K4M4m18L34J10l66K2K67J7pj66K08o1q8k3R8m77L39J93j17
6801ho5J79j42J6M7r8K14l29J71L33j10l91K17N5k54k3J7K67Ol8Q3j52j95O2N9
6826g9O5o1QJ25P7k12L50m59R8Q5L35l45l25O45k05J24m94K58J09m11j3L17J52
6849A44k45p2L88r1j85QL11k41J10q3k23J70k91L18K12k93n8l3Q9n8k3J52K23
$$ plain form
6686 -75 -1 -16 2 -184 -15 153 7 114 1 -209 -231 -10 -139 -93 -212 5 -59 -258 -62 107 77 -13 11
6709 11 98 -162 -207 123 73 -72 -146 225 -34 24 -174 -32 -178 -280 -234 -11 182 -115 -30 160 80 -209 -45
6732 -45 79 -120 -315 89 31 -259 88 -127 -88 52 -78 332 72 -130 29 -194 83 108 36 184 12 93
6754 93 178 99 -165 -61 219 71 -85 -312 -95 102 -253 153 113 -5 46 59 105 -193 -135 -46 10 -239 175
6777 175 39 -24 -142 59 83 127 -291 43 153 -213 -191 76 93 86 -80 128 67 -21 -44 54 -423 -84 109 -8
6801 -8 -73 106 -36 -20 27 -71 143 -186 -15 318 208 -183 34 89 -165 -188 -171 96 102 64 147 -5 -200 -138 -79
6826 -79 -14 -75 -67 58 135 -77 273 -186 -88 -3 332 -13 -338 307 102 226 -268 -10 99 -312 -325 -8 144
6849 144 -101 -173 215 124 -61 -53 258 17 127 44 -179 -9 -300 18 230 -63 -121 -154 -65 -123 -146 6 229
6872B29m03K54l08J72q8P3L05j40j37j11J18r1L5J85k61L28m1l05K98k11%M8n
6895e6j16J70J76k14J74j64%j00K7J82j4n6R1j57j83P9J59m1J08K6N3R0q5m42
6919b93L69l42O2K32r1j36M1K06K9k82K28J79l93N8OJ51j61n2J83R1n2L5r2N8
6943C4J1n78r7J162r86Q81P92j595N29n5J03l87J79K6n2k69L60l4k54j41K76L01
6965B06m04pJ75J89k47J98k44M65o09J96RK7N2k03L18p5l87K20L10k61Q1k11J33
6988f9j10K86r3Q0k47K19n9M7j44j1K36jm44M19j46j69K77l6k16Q3J09j28J78
7011F1J25l53O5j53Q4J30K17q6J37j86k10j9J77J78k56O7Q6p5k45J62K43j27l65
7034c43M28k1q3j53J51N2o5l24M09oq6m1Q1R4j6k49K51j06j34K10j89p2J53K07
$$ plain form
6872 229 -174 80 -228 -56 -144 -71 234 94 -43 -154 -36 -127 -92 93 -168 160 119 -186 112 -99 -99 -51 -56
6895 -56 -172 -2 174 -40 134 -30 -30 -130 -103 79 65 9 100 -57 -240 -161 -2 -43 65 91 144 234 149 -293
6919 -293 76 -266 -204 28 -63 -199 -158 48 77 -205 23 202 -191 -133 -127 24 -137 -189 -6 85 33 68 -24 34
6943 34 45 -533 -630 532 -454 427 1219 -376 153 98 201 -186 -7 19 -33 -302 58 24 -230 -371 -95 206
6965 206 -198 -205 -30 159 -88 110 -134 331 -278 -82 -73 -46 6 -197 121 46 -341 -121 189 -72 9 -202 -69
6988 -69 -179 107 14 94 -153 66 7 54 -90 -101 135 134 -310 109 -37 -206 71 35 -181 -98 11 -117 61
7011 61 186 -167 -102 -255 -171 -41 176 90 227 41 -169 -188 -11 167 -89 -22 64 -11 -256 -94 149 22 -343
7034 -343 85 64 -19 -172 -21 31 -34 -358 51 45 -41 -82 -1 93 77 -172 79 -27 -161 49 -140 -212 -59 148
7058A48l26P6J82J33o51L32O3K59j64k67M46p8l36j0L48Q0k63R8J03l93K52k9
7080CM6j0j50o7N45l05m0K72m70M49l15j07K65J3J11k17k05J75J20j39l6n7M82
7103C63j97r0j6j28k95M85j29o3K63k18p4K31l9l59M12j78pJ48j1J06l56L02j90
7126d0M0lJ55m27K22j40J92mj80J74J85j42r4K11r4m9j80P0J38k08N8J1l8K23
7150H0k3n1p3M5j2K18r4k33K46K74m22P9K57p23P73l04k35L26j81K25j91o0OK15
7174A42l6j70J66k47K64k97K15K95k86k70J59J15M2j23O5O1m96M76J95k36k7R2
7196I9j17j15j2R8K82n24L76J22l29K83j80J72K23n99K50n9M6q6L31n6m31L53
7218A27jQ9r3l23K31k74J73J56J32k54J44o0L6p9R6J16o05K09J64P9k8J62k09
$$ plain form
7058 148 -178 -102 80 213 -438 -106 -43 216 52 -215 231 153 -183 -193 155 235 -28 70 173 -220 32 3
7080 3 49 39 -111 -178 367 62 22 294 -176 273 -42 -149 116 129 240 23 -182 -7 113 -26 -62 -119 363
7103 363 166 76 60 -68 -363 122 -7 -70 193 -25 -99 132 93 -266 146 -32 -39 109 98 204 -152 150 -40
7126 -40 0 -3 152 -275 -53 -193 -1 -5 -185 -11 174 32 -62 149 55 6 -174 -104 34 -174 -116 -105 -143 80
7150 80 57 6 -67 -22 -34 184 90 -143 103 377 -45 34 291 -432 341 37 -198 128 -53 172 -19 -79 -73 142
7174 142 106 -64 102 -145 119 -178 37 332 46 -224 -65 50 92 -31 34 95 -401 75 270 34 7 99
7196 99 -18 -133 -145 -47 235 -289 87 209 -120 163 -17 155 378 -221 29 -30 16 -70 261 205 -226 127
7218 127 126 215 122 -201 30 -244 -71 85 217 -37 107 47 83 4 100 216 -389 -180 -16 63 35 197 -12
7241a2Q6j1k73L67J44m38J95Oj00p8j95L67J03l28K49R2j98j14L19J29m58j52
7263c00O82k31K11k33M7j63j01r2J29k74J79R9J82l34J09K06q4r8K00n2k27J99
7285E4K0J93l21n0N15o26K74J30r3k14k3J97q4p3o3J46J83o7J8l8j57J3J08L3
7309G5J6m81M68L8j08j48j6R4k15K49r7R6l48K83J0m5r7O3M31l40r2L00m5j82
7333i1L7J79j94l89K76K34k17j07K96J05p2J05j10J39k42K46L9k17k00j93K03
7354a73J87k47L42Q9l16J33O1Q6k41K87Nk54j2j29O5O8K42l55M65m08j51M65l01
7377i2K02L44L4l32L7n18M03l88K38N73p41O16n55O81o57L5L61J32q4J27q25L47
7399f2nJ84K69l77jo77R91j64j86k95K67l69J08j46L39j36q9Q0J23l98M18J90
$$ plain form
7241 -12 74 63 -210 157 301 -137 58 64 -36 -114 -309 58 161 -167 82 174 -24 -138 181 310 -148 -300
7263 -300 382 151 362 129 176 13 -88 -180 -51 -325 -146 -47 135 -199 -90 116 32 -66 134 82 -145 54
7285 54 74 267 -54 -104 411 -215 59 189 96 -118 -141 56 -28 -101 -164 -18 165 98 116 78 -79 -66 42 75
7309 75 91 -390 78 116 8 -140 -156 -62 -277 -28 -125 -29 -377 -94 -84 -129 -226 -163 268 -72 -164 136 91 -91
7333 -91 -54 125 -69 -458 -182 52 -165 -272 24 129 57 162 52 191 -51 195 234 17 -183 -376 -173
7354 -173 14 -233 109 198 -118 15 76 162 -79 208 213 -41 -53 -182 -117 -49 193 -162 303 -105 -256 209 -92
7377 -92 110 454 488 156 193 -325 78 -310 -72 501 -240 376 -179 502 -155 -120 241 373 289 416 -409 -62
7399 -62 -67 117 386 9 8 -669 322 158 -28 -323 -56 -425 -317 -463 -124 -260 -349 -269 -146 -544 -126 64
7421F4j21J8k28K6M96l74M13m20O40J00m89N50m70k5k95L33l85J81J28l37j21
7442c16N17k82J41l93L37o7J0j63L65k32j01J63J08k06L5L7J80k85J12J25r2K0
7464A3rJ64l1n10M34R6j35J74k57L60l37k41kJ48pL76l8j15p0J41j62L2k06J93
7488A1L59m99M3K67j08k50m5N83j36m16K77Qm94M50L1O4k46K75p1n1j45L2L04
7511B43l81NL11o4q2%R9o9K18l85M68j99n43M13J74n8l94M5K45p4Q7m0J04j08
7535A5J07o1o1j16R7j6k87J59P9J84l59J61K24o9m3r7M2N0k08J80J78j46j67K64
7559A10r0o4j10L36l27J4j63L43M6m0j69K84j43j77J73K16n76L93Q4j45R7K9j48
7582b7L34p22N76J67n84R7K12N7l3k89K68r1j95J13K31j42J5p5Q8j31N9j5L17
$$ plain form
7421 64 -57 -39 -267 -241 255 -119 294 -126 514 614 125 675 205 180 -115 218 -167 14 142 -195 -316
7442 -316 201 -81 60 -333 4 -63 -53 -216 149 -83 -184 -21 87 -119 -84 -47 133 -152 -40 85 -7 13
7464 13 4 168 137 -373 61 157 22 196 -61 299 -38 -279 -281 -133 -140 236 198 83 13 154 -8 24 -182 11
7488 11 370 -129 -86 181 73 -177 -222 361 225 -191 86 94 -400 50 81 145 -101 174 103 52 -93 -61 243
7511 243 -138 -133 178 114 32 32 131 62 280 -105 363 164 -379 34 208 150 -244 -199 46 -28 59 19 123 15
7535 15 122 61 0 -116 -19 -35 -322 -163 -84 100 -259 -98 126 57 14 -83 -41 9 -199 -19 159 13 -154 110
7559 110 20 -44 -154 182 -145 -131 -294 49 95 55 -114 170 27 -150 23 239 -337 56 140 -5 92 121 -27
7582 -27 307 -415 161 328 -256 -159 53 110 77 -212 56 -35 -230 -117 114 -28 -13 -88 0 -131 -72 -87 230
7605B30j40k09K25k15M6N6M4L0j08K46Q9l64j32M39k08j91Q8J10K03l86o9M77
7627B61n11K94K27l1o4l68L18J10k48j24M11m11R7K76m5j49k23K45J82j44k83
7648a80K54L8j81J3N7J14p6oJ23Lm92K40K30j63K7J12p6k33R2K09Q4l59J89J83
7672B02k73J34o4L4J45k71J88Q3n49M71q0j63L5L01k93O0Q0l3K40l72j97M83k51
7695i0m8m0J71J96k73K09R6m37R3L08p7o6k02J20K29k99P8M0J20k56M68l90j00
7718a50MQ2L53k31k03J98Nj21J6K1j27j05K68n4j4j14M79k99N1n0j50K17l8J18
7742A56Jk78Q8L18m88o6L26P9j48k64K54J53j64k31J63J57k48k74L41K43j56j10
7764a48J3K64k31L93k14j09j64K22R4l36J01K36l17K08Rr0J11k52J15J18J24l66
$$ plain form
7605 230 90 -119 106 -109 -63 -7 37 67 -41 205 294 -70 -202 237 29 -162 -74 36 239 -147 -216 261
7627 261 -250 44 271 240 176 -192 126 236 -12 -136 275 -136 -39 237 192 43 -180 65 247 103 -180
7648 -180 74 112 -69 -56 1 115 39 33 156 159 -333 -93 137 -26 1 113 37 -196 -104 105 189 -170 19 202
7672 202 -71 63 -1 33 178 -93 95 178 -371 100 20 -143 -108 193 -100 -40 40 7 247 -125 -322 161 -90
7695 -90 -138 -178 -7 189 -84 125 221 -216 -123 185 108 42 -160 -40 189 -110 -32 8 128 -128 340 -50 -150
7718 -150 -146 -64 289 58 -145 53 58 -63 -47 -26 -153 -258 10 -44 -58 -172 307 8 59 9 -141 76 38 156
7742 156 157 -121 -33 285 -203 -269 57 136 -12 -276 -22 131 -33 -264 -101 56 -192 -466 -125 118 -38 -148
7764 -148 -135 129 -102 291 77 -32 -196 26 120 -216 -115 121 -196 12 21 -69 42 -210 -95 23 147 -219
7786b19N02K9m00j14J09l9J20O3K03k43l6K93k30j83K67K61l98k5M2M9K6l82L44
7809C9J35l12j93M45J01j51j08N1lq8J76q1J31m0k33J38J7m07L60N8j13P2Q3j61
7833h4O3q6K86j02j81P1O3l5q2P0J32l5k18L27q3M4k36J64j68P1p9K35k08m4q
7858a23m8L33l86L16o4m11J40K39J50l76K55j15R5K8J19k45k8l0J44k66J53J79
7880E9J9k64n6J43K28j15l29L56q4kK61j49j91j02M41N5m50R2M8L65k03m18L12
7903A6K88m44j24M23k24J17l2J40j62q2L08O7j62n0K1M15q09m5M03R8l30l28O64
7926A68k31L28l09o0k52K32r4Q3o4q8N39L1l75J37P7l87QJ10M37j19j38M23j91
7949B65m47m3N35m87K85L67n20j59j26l2j75J56P46k92K68l01j82KL21l43K21
$$ plain form
7786 -219 283 312 -88 -202 -93 -132 -12 51 254 11 -25 268 38 -145 122 383 -15 -40 2 51 77 -305 39
7809 39 174 -138 -331 114 215 64 -44 7 4 -84 92 11 142 102 -131 7 24 -383 -23 35 -78 -6 77 -84
7833 -84 -21 -107 179 77 -104 -33 30 -5 -87 -17 115 80 -138 189 106 150 -86 78 -90 -19 -98 137 -71 -115 -123
7858 -123 -171 162 -224 92 28 -383 -243 -4 146 -230 25 -90 5 33 152 -93 -121 -151 -7 -273 -120 59
7880 59 78 -186 -242 -99 129 14 -315 41 -43 -45 216 67 -124 -226 215 270 -180 -88 -40 325 122 -296 16
7903 16 304 -140 -264 159 -65 52 20 160 -2 -84 224 291 129 79 100 515 -294 -339 64 162 -168 -496 168
7926 168 -63 265 -44 -104 -356 -124 -218 -135 -199 -287 252 283 -92 45 122 -265 -257 -147 290 171 33 456 265
7949 265 -182 -225 310 -177 108 475 -45 -204 -330 -362 -537 -381 365 73 341 40 -142 -140 181 -162 59
7970E9M8k07M1m8K89l04j74L18kk30J77M8k82M31k07p4K3J02j21K91j62J12p3
7993E5K17k96j47L07k79n6J31L93l60k1K21m18K25k22K74J35j83q7J79N5k48P5
8015e0K53q4l61l9N03k51L3L07l55J04l43J46N8J8J87r5j64N2J28q4J14m1P1N8
8039A65k24m4K36Q8k58J07R8j30N4k39K40j56K2J58Q9l01K60j11R7n1l10K06j52
8062a56O7K86l09j01K52j83P1o8L7J48K9j85J65J25l94P6K95J51l20j84L23o0
8084F5m37L84n9J2L4q5L97k26j42R1m8j25J62r5q8J14O0j02J68M1j29k8l1m2N41
8109D32n43J64k95L17k78Q7m1L33k45n0K29j7Kl64K34lM1R8J62n26q0N13l1K4
8133A63k15j92L62l56J59k5j02J45J88L4k29j19J48O0j83lL20n0k22J97k98k8
$$ plain form
7970 59 107 -100 -59 -107 182 -122 -296 22 20 -210 -33 15 -267 164 -43 -117 -94 8 -113 178 16 128 55
7993 55 272 -24 -171 136 -143 -199 -68 325 -35 -56 165 -253 -28 -250 24 159 -24 -111 68 123 -125 -50
8015 -50 203 119 -242 -281 222 -29 4 311 -44 60 -283 -137 -79 -61 126 31 -133 -81 47 -37 77 36 107 165
8039 165 -59 -103 133 221 -37 70 168 38 92 -147 93 -63 -41 117 206 -95 165 54 151 100 -210 -4 -156
8062 -156 -89 197 -112 -213 39 -144 -73 -141 -104 44 73 -112 53 178 -216 -140 155 306 -14 -198 125 65
8084 65 -372 12 -47 -35 -1 -86 311 85 -57 34 -14 -139 23 -72 -160 -46 14 -88 80 121 -8 -36 -67 -109 432
8109 432 -111 53 -242 75 -203 -116 -157 176 -69 -119 110 93 95 -269 -35 -38 3 101 263 -263 -343 170 139 163
8133 163 -52 -244 118 -238 -79 -104 -206 -61 127 161 -68 -187 -39 21 -162 -165 155 105 -117 80 -218 -246
8155b46K43l1m9J49j53L36k52ok6N4J76k66k61J67M63n67K26J36j03P9q7K96j31
8178A47j99M33j77n32L38J24j29R2j32J81Nm34K11
$$ plain form
8155 -246 -3 -34 -83 66 -87 249 -3 -9 -35 19 195 -71 -332 -165 298 -269 -43 93 -10 69 -18 278 147
8178 147 -52 381 204 -328 10 134 5 97 -35 146 151 -283 -72
8191g2
$$ Imaginary data points
##PAGE= N=2
##DATA TABLE= (X++(I..I)), XYDATA
0@%%%%%%%Qj6J6j6K4l2M0n6P2q8J04j22J46j76K12k53K99l54M13m78N55o39P35
30C94q43R59j089J235j393J569j765J976k209K465k743L048l381L745m142M576
46B402n050N566o135O759p442Q197r033R962j1002J2174j3502J5024j6791J8862
60I991k1334K4348k8113L2970l9497M8766o3032Q7972j43711M79165J4181o73431
72b71725N23975j68952Q0524J841j00084Q0390j71422J01300K92904l40126n9434
83c0809J32343j02378R6602M6508j74926Q8721L8830j39605J39886O2598k21797
94f4027m3643J10280J70324r9958j75405J20019M2745j33459J94475n8351k76634
105b13634K35656N1014j76l1986j94705J74503L6774o6953q445m3245J09944n5429
$$ plain form
0 0 0 0 0 0 0 0 0 8 -8 8 -8 16 -16 24 -32 40 -48 56 -66 80 -96 116 -137 162 -192 221 -257 298 -341 394
30 394 -449 510 -579 656 -737 832 -933 1043 -1166 1299 -1444 1604 -1777 1968 -2174 2402
46 2402 -2648 2918 -3217 3542 -3900 4297 -4736 5226 -5776 6398 -7104 7920 -8871 9991
60 9991 -11343 13005 -15108 17862 -21635 27131 -35901 52071 -91640 387525 401706 -271725
72 -271725 252250 83298 163822 165663 65579 145969 -25453 75847 368751 28625 -30809
83 -30809 101534 -844 95758 142266 -32660 56061 94891 -44714 95172 157770 -64027
94 -64027 -107670 2610 172934 72976 -102429 17590 60335 -73124 121351 63000 -213634
105 -213634 22022 73036 72860 40874 -153831 20672 57446 -9507 -17952 -61197 48747 -6682
117f682n6936J77222r5956j65786J24303J25483j36325o2192K17070j23398j20125
128a23322J92243J2473j34134o7067J43026P6423j18071K664O9118r6476P1885
139B8762M8273j71374J23697J2470p9684J33375l6179q5451L2491N0115l305j10459
151e7269M6849J64712j56837o0321K01904n8600j47052R1404L9857o4888K8229
162B7988j4545O6732m0284p8462J33981o4556p3275O9418K814J8876l7346n1994
174d0653J55357n5183j79880J68028K0168j01674L7557K0001J3940m5143K899
185d583Q2456j09686m7189J52863n9383l4891M0784l6761L8891p50n4744J1871
197b1122M9893l9105k7608M8136N0371p5835p3338J29419j1124j10804Q1436N4572
$$ plain form
117 -6682 -63618 113604 17648 -148138 -23835 101648 -34677 -96869 120201 -3197 -123322
128 -123322 68921 81394 -52740 -119807 23219 99642 -18429 -15765 53353 -43123 28762
139 28762 77035 -94339 29358 41828 -37856 95519 59340 -26111 6380 56495 53190 -57269
151 -57269 -10420 154292 -2545 -62866 139038 80438 -66614 24790 64647 -241 27988
162 27988 13443 80175 39891 -38571 95410 30854 -42421 26997 29811 48687 11341 -40653
174 -40653 114704 59521 -120359 47669 67837 -33837 3720 23721 37661 -7482 -4583
185 -4583 77873 -31813 -79002 73861 14478 -20413 20371 -16390 22501 21751 -32993 -21122
197 -21122 28771 -10334 -37942 10194 60565 -15270 -88608 40811 29687 -81117 319 54891
209E4891j15129K2439J10075n6226r6534K3557J09516m9496o1884O3087J2083
220A6379k7482K330N646q789j2045k1624N6907J5368n0742L465M4283o557p7787
233f0648N1348M4497o7352j7448P3344K6760o8544j7206M2824K469l9485K7982
245a459l469m252J8806j7576L6342j9061o5951L6709P3873o6552m8827Q4502L6001
258E9086q9956k6548J26171n4396j10184J06805N8133j08639M807R1186m6444
269A0021n5763L6935N7907o8173l0359Q1988o116l0430j503l158J5167J0751m5689
282b8422K7137L5601m3081k344L3642J0205p0761J1484P4097m2896m5829P0675
294B9508J3980o6700J6501K2379J687l7731k925N0457n158k4148k839K6920l867
$$ plain form
209 54891 -60238 -37799 72276 16050 -80484 -56927 52589 3093 -58791 4296 16379
220 16379 -11103 -8773 -3127 -11916 -23961 -45585 11322 26690 -24052 -20587 23696 17139 -60648
233 -60648 -9300 35197 -32155 -49603 23741 50501 -18043 -35249 7575 10044 -29441 -1459
245 -1459 -4928 -9180 9626 -7950 28392 9331 -56620 -19911 53962 -12590 -61417 23085 59086
258 59086 -30870 -57418 68753 14357 -95827 10978 69111 -39528 -34721 56465 10021
269 10021 -45742 -8807 49100 -19073 -49432 32556 26440 -3990 -5493 -8651 6516 17267 -28422
282 -28422 -1285 34316 -8765 -11109 22533 32738 -38023 -26539 47558 4662 -41167 29508
294 29508 43488 -23212 -6711 15668 17355 -20376 -23301 27156 21998 -2150 -4989 21931 18064
307A8064m3916K472P0617m9608n4693J00067R690q6807K276Q1785m0785p3268
319f4106P0161M8925q3760m347Q8797n0475m2136L7354P848k2774J282K0103n206
332A666N324q761j2880J0459K2571n2325M49Q1030m9742m2604O3597J9476p8467
345d0207K614P4311k8403o6290O1796M9512q5740O311M6683j4155l1861J564M4329
358B0464j3577k9540J6623K6463j9952k7510O824M8087k6471n0514P4355R445
370C4697o9107J2797N5573l5283m3253M6211L2992m2777j8929O2933k9012l5195
382b8353M0051j0505j3013K0912j1162M536K9613l9433n459K0729Q771k2312k9934
395c5559P7165j4130p7470P7952K7004j01919K5562O0142k9990l3718J8451N7414
$$ plain form
307 18064 -25852 -23380 47237 -2371 -57064 43003 52693 -34114 -31838 49947 9162 -64106
319 -64106 6055 54980 -28780 -33127 55670 5195 -36941 413 8261 -14513 -13231 6872 1666
332 1666 6990 -1771 -14651 -4192 18379 -33946 -33497 47533 -2209 -44813 18784 38260 -40207
345 -40207 -37593 36718 8315 -57975 3821 53333 -32407 -26096 20587 6432 -25429 -23865 20464
358 20464 6887 -22653 -6030 20433 481 -27029 -20205 27882 1411 -49103 25252 34697
370 34697 -34410 -21613 33960 -1323 -44576 1635 34627 -8150 -27079 35854 6842 -28353
382 -28353 11698 1193 -11820 9092 -2070 2466 32079 -7354 -12813 7916 16687 -5625 -35559
395 -35559 41606 27476 -49994 27958 54962 -46957 -21395 38747 8757 -24961 -6510 50904
407E0904n5421k5982O7907k5108m8063L4686K1815j6413O38j4667K3297P740l6564
420a5231O869K3596j6360j6090L1665J2416k4648l2697M6210K2438p1926K3321
432a0437L9909l4508j478K5895j1930q330j7256J8933K7731l8696m456J9659J6604
445B1640j7944k2311K2516J1363m0226M784P3606n3288n4389Q0000J5222p2813
457c1840R224M0994j4344k6230J9707N6001p4679k5128R3930l8456l6765L1905
469D319j3348J9276J1580l4383L2656k1132j9429M1159j5991O604k0726j1117
481b0532O9682j7786p1714N3426J4960n5346M1581R668j8513q932m533N2421j4627
494B9755p0439M4801K4976l8957L3377j5904k148J1424l8518O1170K207r6306
$$ plain form
407 50904 -4517 -30499 37408 12300 -35763 -1077 20738 4325 4963 -9704 13593 21333 -15231
420 -15231 -8362 15234 -1126 -17216 14449 26865 2217 -30480 15730 38168 -33758 -10437
432 -10437 29472 -5036 -6514 19381 7451 -879 -18135 798 28529 -10167 -14623 5036 21640
445 21640 3696 -18615 3901 15264 -24962 -20178 53428 140 -54249 25751 40973 -31840
457 -31840 -22616 18378 4034 -22196 -2489 53512 -21167 -46295 47635 9179 -27586 4319
469 4319 -9029 10247 21827 -12556 20100 -1032 -20461 20698 4707 11311 -9415 -20532
481 -20532 49150 31364 -40350 13076 28036 -27310 14271 23939 5426 -3506 -8039 44382 29755
494 29755 -40684 4117 29093 -9864 23513 7609 5461 16885 -21633 39537 41744 -54562
506e4562M8346N9285m6064k161n682J5995j589l4161O3948k3986o7843O4727L3266
519D9519n0530J163K700q033K5076j8001M765Q002k9304J7362K4894j7316j1613
532a316k5700J7944O0355o4563j0289N8096m8391n393N2132k3621l8505K039M1917
545A4705L0450p4333L861N7983m7764K932K7908k3375p437N727J5726K5166m4475
558a2926k3652N6496j5177k4089K4162k577j0014J985R235K8193m5173l2716P3792
571B7539j8523k6162K8774k2816R728J8189k2824R914o992k4399M4089m174j6903
584d560K536j5717M3537j2135n2838M8367J7325n9883L4246L1975m0098q512J2361
597c396K5789k2597l0814M9371J568n2251M6749J2358n0641K1640j471J4234M139
$$ plain form
506 -54562 -6216 53069 7005 4844 -838 15157 13568 -20593 43355 19369 -48474 16253 49519
519 49519 -1011 152 2852 -5181 19895 1894 6659 14661 -14643 2719 27613 10297 -1316
532 -1316 -27016 -9072 51283 -13280 -23569 34527 -13864 -19257 32875 9254 -29251 -27212 14705
545 14705 45155 -29178 -25317 32666 -15098 -12166 15742 -7633 -15070 -9343 6383 31549 -12926
558 -12926 -36578 19918 4741 -19348 4814 2237 -7777 -5792 3443 31636 -13537 -46253 27539
571 27539 9016 -17146 11628 -11188 -1460 16729 -6095 3819 -3173 -27572 16517 12343 -4560
584 -4560 -2024 -17741 25796 13661 -39177 9190 26515 -33368 878 32853 -7245 -15757 -3396
597 -3396 22393 -204 -31018 18353 19921 -32330 14419 26777 -23864 -2224 -3695 10539 14678
610A4678m3796L0821K4464l2706K247L629o073J4806k0769K0289Q656m6932L6418
623E732K4222m6786k262K4388k810J326j5343J1025J8498l3644Q673J7694j4689
636c976n985J21J3215J6694l3566o55L9863m1448m544M2042j7094l2392J8556
649i169M0114j8971m2177K2347L2934l8857J260L0080k4859p202K6126J681j9765
662f458k913K058J5658m421j2399R424J629J982j0559J691J8793j7582k5093M0062
676A1872J3719m1473Q015J6914p150r903R519P309j8630n618L2520K437l8297
689a8766R119J5261K183j0220j2695K3765K862k7990J5673K4265l5047p101K5014
702F323O585k0651o044L4292j7129k8370L3258J2859l9852L457K5733j513p845
$$ plain form
610 14678 -29118 1703 26167 -6539 -4292 -663 -6736 8070 -12699 7590 16246 -30686 5732
623 5732 29954 -16832 -19094 5294 2484 3810 -11533 -508 17990 -15654 -6981 10713 -3976
636 -3976 -9961 -9840 3375 20069 -13497 -14152 25711 -15737 -20281 21761 4667 -27725 -9169
649 -9169 30945 11974 -30203 -7856 25078 -13779 -12519 17561 -7298 -14500 11626 13307 -6458
662 -6458 -9371 -7313 8345 3924 -8475 949 2578 4560 -5999 -4308 14485 -3097 -28190 11872
676 11872 25591 -15882 -7867 9047 1897 -8006 1513 8822 -9808 -15426 17094 19531 -18766
689 -18766 -9647 5614 7797 -2423 -15118 8647 11509 -16481 -808 23457 -11590 -18691 6323
702 6323 12908 -7743 -13787 20505 3376 -24994 8264 21123 -18729 -15272 10461 8948 1103
715A103r229J0418o83m448K149j044J643j235l042J2699N766l1952J1469K5179
729A8793k3836j3131K7188R745l4382K997L5755j2566l5995K3205J9152k3900
741f975J037J5667k141j9633J0248J6178j3139j4669R345J6980o859j2726K212
754d475J8377j4542j3379J9499O111j7968l976K2966m924j5927O921R830j4331
767e818l324J9715n736r943j467J0210M991r673j1688R951J3339j1528p369J0850
781B510Q674k4365M152K6156k0589j6273K4970J1091k8750K172K5214j1021k6962
794b3021K0837K1332k7706l166J6601L121j1589p15O277m478l972N976O865o469
808a07m107j75J3762m755j8836J1618J3054j2165q992J9131K72j5048n12J4910
$$ plain form
715 1103 -8126 2292 1609 -2839 -690 -1734 -91 -1326 -4368 8331 14097 -17855 -6386 18793
729 18793 -5043 -18174 9014 18759 -15623 -12626 23129 10563 -25432 -2227 16925 -6975
741 -6975 -5938 9729 7588 -12045 -1797 14381 1242 -13427 -4082 12898 6039 -6687 -4475
754 -4475 13902 -640 -14019 5480 11591 -6377 -10353 12613 7689 -8238 -1317 8513 -5818
767 -5818 -9142 10573 4837 -5106 -6573 3637 8628 -1045 -12733 -2782 10557 -971 -8340 2510
781 2510 11184 -13181 -9029 17127 -3462 -19735 5235 16326 -12424 -10252 14962 3941 -23021
794 -23021 -2184 19148 -8558 -11724 4877 7998 -3591 -4306 1971 -2507 -6479 -503 6362 -107
808 -107 -4214 -4389 9373 4618 -14218 -2600 10454 -1711 -10703 8428 8700 -6348 -6860 8050
822H050k373j7533J2461P013p260l534P135K308q523o076J1654J0931k2217j57
836h121K0359k023j8218K889J8538j1711j4810K0358R842k8361O980K0257j2569
849C410j2672J0303J0899j4350j017R288K187r685o3O304k541J115o506M310Q586
864I568p131r385J3923J685j8075Q068J1003o812j1611J2499J0909j8384q271
877a2014K1747j201k0210J1923P184m273p024L628J0739j1900j0162J5206R317
890A2960k1520K532J3879j323j0748l464J9077j0507j7047K2217R173k6472N536
903e707J3857o533l471n161R910o75j0105J0999L868j2855L488L83K972P811k3926
918a5145J1051J8485k0032o33J3041n673j0194N465J2306k069k5331J7957K0543
$$ plain form
822 8050 5677 -11856 605 7618 358 -3176 3959 6267 -2256 -8332 3322 14253 -7964 -8121
836 -8121 12238 10215 -8003 -5114 13424 1713 -13097 7261 17103 -11258 -4278 15979 3410
849 3410 -9262 1041 11940 -2410 -3427 5861 8048 -1637 -1700 4604 2063 3178 -3328 982 9568
864 9568 2437 -6948 6975 8660 -9415 -1347 9656 2844 -8767 3732 14641 -3743 -12014
877 -12014 9733 8532 -11678 245 7429 3156 -3868 -240 10499 -1401 -11563 3643 12960
890 12960 -8560 -6028 7851 6528 -4220 -7684 11393 886 -16161 6056 15229 -11243 -5707
903 -5707 8150 1617 -1854 -7015 2895 2220 -7885 3114 6982 -5873 -2385 -2002 970 8781 -15145
918 -15145 -4094 14391 -5641 -6274 6767 1094 -9100 -3635 8671 6602 -18729 -772 19771
931A9771k9356K462J5927j1576l198Q553K482q79j5614J0075J8136k2273j548
944g038J0201l113L254l129m16R696j7542P01K6393k1719q128J4104J272J999
958F535q631k83R133j0399r21J7241j4923m829R777k81Q635j3400j0521K0692
972G825J07j8581J5229K496j3788M093P828O350k1123n477K9351o552k3736K2582
986F604N82j9994J5071L227l935r485k482K1154m499j7026J0327J334o298J0856
1000E436r639Q53M476j2625J7023O138k5003M001J5275o376O06p934O370O514
1014E115j7619J7369N457k6279Q811J3893p294L779j2036K644J8248k0252N894
1027b270J0281j8216L633J1103J692l698j6891J1737K0453k7315L003J6750j8867
$$ plain form
931 19771 -9585 -7123 8804 -2772 -5970 2583 5065 4186 -11428 -1353 16783 -5490 -7038
944 -7038 3163 50 3304 175 -241 9455 -8087 -7386 19007 -2712 -10840 3264 4536 6535
958 6535 -2096 -2379 6754 -3645 -4566 12675 -2248 -7077 2700 2419 11054 -2346 -12867 7825
972 7825 7932 -10649 4580 7076 -6712 -2619 5209 11559 -9564 -15041 14310 7758 -15978 6604
986 6604 7186 -12808 2263 5490 1555 -7930 -10412 10742 6243 -10783 -456 878 -5420 5436
1000 5436 -4203 -3350 1126 -11499 5524 11662 -13341 -9340 5935 -441 165 -7769 -1399 5115
1014 5115 -12504 4865 10322 -15957 -7146 6747 -547 3232 -8804 -6160 12088 -8164 -2270
1027 -2270 8011 -10205 -6572 4531 6223 2525 -14366 -2629 17824 -9491 -6488 10262 -8605
1040h605M303J3830o300o384m643P588J2337j8368J532J0128j1401J1076L52j0841
1054e396P673m868m493J9646j0046j3892J2647L205R41r509m40J1189j1794j080
1068f217K1117j3713j6723K0217K963p629m770L75R153n082m173J1193m953j2764
1082a1006J3581K821m362n522l692J6482l758j4289J2980K752j7256J1199Q325
1095H255r644l610k96J3438m339j2415R756J354q609R318p36n632N861q753Q077
1110B025P341j6540N42J1864j617n844N6N215P69j4518J4115Q350k3743O178J6486
1125A0679q645p391O143K060j979p187Q691M729j5611O985Q042n430k751j555
1139c220K642N358q339n47J1388r647k491P636J263o114n612Q362N622j0363j412
$$ plain form
1040 -8605 -4302 9528 3228 -3156 -7799 -211 12126 -6242 -4710 5418 -5983 5093 5445 -5396
1054 -5396 2277 -2591 -7084 12562 2516 -11376 1271 4476 5417 -4092 -4532 6657 -5137 -6217
1068 -6217 14900 1187 -15536 4681 7644 15 -4755 -4380 4773 -309 -4482 6711 1758 -11006
1082 -11006 2575 5396 1034 -4488 -8180 8302 4544 -9745 3235 5987 -11269 -70 8255
1095 8255 -1389 -4999 -5295 8143 3804 -8611 1145 2499 -6110 3208 2472 -3160 2701 -6052 2025
1110 2025 9366 -7174 -6632 5232 3615 -2229 -2173 3042 3811 -10707 3408 11758 -11985 -5807 10679
1125 10679 2034 -5357 786 2846 867 -6320 2371 7100 -8511 -1526 6516 1086 -1665 -3220
1139 -3220 -578 4780 -3559 -4106 7282 -2365 -4856 2780 4043 -2071 -7683 679 6301 -4062 -5474
1154e474J1533p067l296N282J93j491m751L729O491m557q299R206K893p953j127
1169d688O702L232j2743L499J3443r088j1215J3297M414j3677K852R602l128r787
1183g285P185O945r041m042P710K812p100J778K156J049k473k600M108J661n456
1198b593j143Q581k835n483K299N774m459p413J0064K541q926o56R869k836o706
1213c922K153M480j086n952M944L754m522l976O167K733p861r34O975J992j0520
1228e575L913R264p732o723Q615M180r287M7O521J35o794M200L582o563L91K551
1244G25J616j806k354R56M558j756n507L063M507l694o123R488K117j0399J335
1259c274R385m428q134Q293L205p310j446R477j656r338L579O208k131o718M073
$$ plain form
1154 -5474 6059 -1008 -4304 978 1171 -320 -5071 -1342 5149 592 -7707 1499 4392 -3561 -4688
1169 -4688 2014 5246 -7497 -3998 9445 357 -10858 2439 6853 -6824 -3972 5630 2502 -7285
1183 -7285 -100 6845 -2196 -6238 1472 4284 -2816 -1038 1118 2167 -306 -2906 1202 2863 -2593
1198 -2593 -3736 4845 2010 -3473 -1174 4600 141 -7272 2792 5333 -3593 -4249 5620 2784 -3922
1213 -3922 -1769 2711 1625 -4327 617 4371 -151 -4127 2040 4773 -3088 -4022 2953 4945 -5575
1228 -5575 -1662 7602 -130 -6853 1762 5942 -3345 -3298 3223 3358 -3436 764 4346 -2217 -1826 725
1244 725 2341 535 -1819 -863 3695 1939 -3568 -505 4002 308 -5815 3673 5790 -4609 -3274
1259 -3274 6111 1683 -6451 1842 5047 -2263 -3709 5768 4112 -5226 -1647 4561 2430 -4288 -215
1274b15M132k540m001L002M335p062j460O510J502p886J300P713l932o630N717
1289D85N139r431K69O738M46n599p5M092j814o58p92J551R59k358k29M953j701
1306A975p230M807N588m951n831Q489M122j2165K031J0550o068p728Q051L820
1320E460o350k377P205l89p678M934K969l297k931L212K418k42m828j34P422m932
1336D62m053N394K257m942j757N470J911q101N96R008p876j785O856j252k545
1351c57k405L373M072n781l838P711l75l797l87K643K442q914L308R329q917o628
1367h521J2356J142j1058M086N574l673o731O180O527q929l816J0217j766n719
1381d131M690l412J576P24k195M760k191n205M241M598l830l742k24P908k417
$$ plain form
1274 -215 3917 1377 -2624 378 4713 -2349 -3809 2701 4203 -3683 -2383 5330 1398 -5232 485
1289 485 5624 -3807 -3538 3200 3646 -1953 -2028 2064 250 -408 -1200 351 1310 -1048 -1277 3676 1975
1306 1975 -5255 -448 5140 189 -5642 2847 6969 -5196 -3165 7385 1317 -6411 1640 5460
1320 5460 -890 -3267 3938 3549 -4129 805 3774 477 -2454 758 3176 2934 -1894 -2028 5394 462
1336 462 -3591 1803 4060 -882 -2639 2831 4742 -3359 -2763 6245 -1631 -3416 3440 2188 -357
1351 -357 -2762 611 4683 -1098 -4936 2775 2400 -1397 -1784 859 3301 -5613 -2305 7024 -1893 -8521
1367 -8521 3835 4977 -6081 -1995 3579 -94 -6825 -645 5882 -3047 -6863 3354 1588 -4131
1381 -4131 559 -2853 -1277 -553 -2748 2012 -179 -5384 -1143 3455 -375 -4117 -4341 3567 1150
1396A150p614R477o77q575M950O690o742k595K476M020M75p270M208K549o716
1411d194L604M840m240j867j546N882N299j4587L444R497q144K22N707l605k855
1426b543O65N928J470j3214N727Q371r031K844K036m556K722l60q98N462p467
1441b844k451R962k414j812l429P56O927o577k305J1145r917m958J5400m543o932
1456c992N52K871N624p469j691Q282o671k095J0378n877l554J438M16O839n409
1471c58n996Q924o94o552P183j736m334J651R32O677o503o905J0541K24p346O509
1487B217k649l461N972l242L974j908q080Q002L662n513n13q26L369K406q076
1502d666O783J424j1953Q376P865r894k794N246J740j8o337N083J992r821Q981
$$ plain form
1396 1150 -6464 3013 2336 -6239 -1289 5401 -1341 -3936 -1460 2560 3035 -4235 -27 2522 -4194
1411 -4194 -590 4250 10 -1857 -3403 2479 7778 -6809 -3365 6132 -2012 -1790 3917 312 -2543
1426 -2543 -1878 4050 5520 -7694 -1967 6404 -2627 217 2253 -2303 419 59 -839 4623 -2844
1441 -2844 -5295 4667 2253 441 -2988 -2232 4695 -1882 -4187 6958 -2959 -7917 7483 2940 -3992
1456 -3992 -3440 -569 5055 -2414 -4105 4177 -2494 -4589 5789 -88 -3642 -2204 -1788 5051 -358
1471 -358 -6354 2570 1876 -4676 2507 771 -3563 -1912 -980 5697 -806 -7711 2830 3054 -4292 2217
1487 2217 -432 -3893 2079 -1163 2811 903 -7177 825 4487 -1026 -1539 -2365 1004 3410 -4666
1502 -4666 2117 3541 -8412 -36 7829 -2065 -4859 387 2127 2109 -4228 855 2847 -6974 2007
1517B007M372j0034R60L040J53L488p621J46P949p025K702L156n280L05q8L614
1533A844L010r931N24J1302p640j377M794m112N53N90J494K473p201j456J1078
1548E945m634n011L915r91K853l134l59O744p530m537J3460l499r308N274K358
1563A546M35m284J372N534p585j551J0684n053o512O289l39J024j086l758M626
1578A342q42l127M033L15m201J504J9M628l637o568R003J302q379L986L791n170
1594b001K05J836K541k446n980Q032J523o697K161K489j804n65j56J722P64p072
1610e448O100M978p693j737O092l75m161M85L815q94n505N257L520p175L55M597
1626B211j200j791k37J048K401k896r39L828j920k010R7L360L13n327J525O853
$$ plain form
1517 2007 6379 -3655 -2695 345 498 3986 -3635 -3489 4460 -2565 137 3293 -1987 -1682 -1770 1844
1533 1844 4854 -5077 -4553 6749 -891 -2268 2526 -1586 -1033 -443 1051 3524 -3677 -5133 5945
1548 5945 1311 -3700 215 -776 2077 -1057 -1416 5328 -2202 -6739 6721 3222 -6086 -812 1546
1563 1546 1981 -2303 -931 4603 -2982 -4533 6151 1098 -5414 875 536 1560 474 -3284 1342
1578 1342 500 -2627 1406 1721 -2480 -976 -957 3671 34 -6534 2469 3771 -4608 -622 3169 -2001
1594 -2001 -1796 40 2581 135 -5845 2187 3710 -2987 -826 1663 -141 -706 -862 860 1624 -5448
1610 -5448 652 5630 -2063 -3800 2292 1917 -2244 -1759 2056 1162 -4343 914 4434 -2741 -2386 2211
1626 2211 1011 -780 -1017 31 2432 -464 -1403 2425 505 -1505 -1408 1952 2265 -3062 -1537 5316
1642E316n192m650Q358k411m333J693N175k708n021L895M379n250k525N963j226
1657A463k768Q12J878L16l619O52M124j476m960M406K074l321j467K789K337n772
1673b532L25N370j906m236L328K075k708q22R84K001k241j100K420Q03j757j844
1689a840K949J349l900j350N875r74n413K828M455m021m008O365L09n163N31N527
1705C519k309m415M041J665l369j228L448L32k729n0K115J178l457MK381Q85m098
1722b087R73M029k654k621K297L132m233j544M387N36m415P61M303k237k530N84
1738a319L862k531k869K960K027k431k806M334J367m675n29N590j499n289L319
1753d89L743l650l391N246J274n224O58M589j800m321L673J711k346j599K290
$$ plain form
1642 5316 124 -4526 3832 1421 -2912 -1219 3956 1248 -3773 122 4501 -749 -3274 2689 1463
1657 1463 -1305 -493 1385 1701 -1918 -1266 2858 1382 -3578 828 2902 -419 -1886 903 3240 -2532
1673 -2532 -2207 3163 1257 -2979 349 2424 -284 -1106 -122 1879 -362 -1462 958 1761 4 -1840
1689 -1840 1109 2458 -1442 -2792 3083 2109 -3304 -476 3979 -42 -4050 2315 2624 -2539 -2008 3519
1705 3519 1210 -3205 836 2501 -868 -2096 1352 1684 -1045 -1095 1020 2198 -1259 -1255 1126 2011 -2087
1722 -2087 -1114 2915 261 -2360 -63 3069 -1164 -2708 1679 2215 -2200 -1439 2864 627 -1903 -1319
1738 -1319 2543 12 -2857 103 2130 -301 -3107 1227 2594 -2081 -2610 2980 1481 -3808 -489
1753 -489 3254 -396 -3787 1459 2733 -2491 -1833 2756 956 -3365 308 2019 -327 -1926 364
1768C64J429k124q62J710J326k883k21J648J525k794j395M947j156l948J979L581
1784C126l395k170L674J619m191j450N775j583l794J262L588k292k531K625K055
1799B318k224l364M706J005m459j41M375j013l955K207K745j586m621M570K205
1814B768n260M37L593n85k342M22J858k01l317K023L181l383r80J080K512j471
1830C35l371K110L817m657j241O347k754l842K544L760k548m388L814L722n154
1845a506j173O668m287k744L377J526n17l574R99M234k423l057L941j150j352
1860a038J195O90J515m538K49N833k492m463L842N29j890J469j250K150k796j263
1876b258N062r77m621K352R77J82J15l414M409r55m821O197M24o079J482M016
$$ plain form
1768 364 1793 -331 -1193 517 1843 -1040 -1261 387 1912 -882 -2277 2670 1514 -2434 -455 3126
1784 3126 -269 -2439 1235 2854 -1337 -2787 2988 1405 -2389 -1127 2461 169 -2362 263 2318
1799 2318 94 -3270 1436 2441 -2018 -2159 2216 1203 -2752 -545 2200 614 -4007 563 2768
1814 2768 -2492 -2055 1538 953 -1389 -967 891 690 -2627 -604 2577 -806 -1786 -706 1806 335
1830 335 -3036 -926 2891 -1766 -3007 3340 586 -3256 -712 3048 500 -3888 -74 3648 -1506
1845 -1506 -2679 3989 -298 -3042 335 1861 1344 -2230 -1231 3003 580 -2477 1464 314 -1038
1860 -1038 157 847 2362 -2176 -1927 3906 1414 -3049 793 1322 -568 901 -349 1801 -995 -2258
1876 -2258 2804 1827 -2794 -442 535 717 832 -2582 1827 872 -3949 2248 2672 -3407 -1925 2091
1892B091l02k501k790N728p68n476O309j82n836K772L171j571j104k426L493J849
1908B457n317L493O44l264J672Q93K72j85m487L659N232p772J085L504k679P46
1924d7M55L3m6l492L367N093p801j46M507j059K35k156M38K855l913O31O029o351
1942a368k668O253m77j107k484J527L199m267L85N659o510k063P387j994j278
1957A94j823N0M535k395k447L901k834j049M517k742P50j892k070P629k799n995
1973d470N029J227l216K369j001N63j833j880P670k703o777N537J889l190J289
1988E03j367R78L9l308O803j540p173M873K995k573j088j047K678Q30m270M995
2004B328l13o647M810K821k943j169n93K459J711m624K306J817m806L089J704
$$ plain form
1892 2091 1789 -712 -3502 2226 1458 -4018 2291 2109 -3727 -955 2216 645 -459 -2885 608 2457
1908 2457 -2860 633 1277 -1987 -315 578 850 665 -3822 -163 5069 -2703 -1618 1886 -793 -47
1924 -47 408 441 395 -3097 270 5363 -2438 -2584 1923 864 1099 -1057 -619 2236 -1677 -1046 4983 -1368
1942 -1368 -4036 2217 1740 633 -1851 -324 2875 -1392 -1007 4652 -1858 -3921 3466 1472 194
1957 194 -1629 -1579 2956 561 -1886 2015 -819 -1868 2649 -93 657 -1235 -3305 4324 1525 -4470
1973 -4470 559 1786 -1430 939 -62 501 -1332 -3212 4458 1755 -5022 515 2404 -786 503
1988 503 -864 114 153 -3155 3648 2108 -5065 -192 2803 230 -858 -1905 773 1603 -2667 2328
2004 2328 2015 -4632 178 2999 56 -1113 -1706 753 2464 -2160 146 1963 -2843 246 1950
2019A950j275j074k037L227L768o467j94N021l921L78K111j80k151j723M244K911
2035D588p277m73P022m333l15K082j071k09j371K429K146m742j487O319k662j564
2051i18J281p78J906k559P25L313l860k190N807j218k468N50j68K833k589q61
2067a194L482k407k168L980M1k246l42k1M169k809l078M496m83l380J913K206
2083B159k090j876J146L912k836l816N306J5m015J754K263k270o34P84K247j644
2099D05l403M101L31k153l4J026L56p19j150K441M03m524K686K021j874j632J548
2116a71J843j911j692K720J181m511J821K743j906j767J001K450j644j990J626
2131b07K269l462m52L540n56k390j39L564j636k716J644K989l153j196L666p17
$$ plain form
2019 1950 675 -399 -2436 791 4559 -1908 -2102 2919 -1002 -624 1487 1307 -844 -2567 1677 4588
2035 4588 -2689 -3162 3860 -473 -788 1294 223 14 -1357 1072 3218 -1524 -3011 3308 646 -918
2051 -918 363 -415 1491 -1068 -343 2970 -890 -3080 2727 1509 -959 -409 -577 2256 -333 -1194
2067 -1194 2288 -119 -2287 1693 1734 -512 -854 -875 3294 485 -2593 1903 1420 -1960 -47 2159
2083 2159 69 -1807 -661 3251 415 -3401 1905 1920 -2095 -341 1922 -348 -982 -198 2049 405
2099 405 -2998 1103 1434 -719 -753 273 629 -90 -1240 1201 1604 -2920 -234 1787 -87 -1719 -171
2116 -171 1672 -239 -1931 789 1970 -2541 -720 2023 117 -1650 -649 1801 157 -1833 -207
2131 -207 2062 -1400 -1852 1688 1132 -1258 -1397 2167 531 -2185 -541 2448 -705 -1901 1765 1048
2147A048k203O4K764q54k006Q09J846r28j820J615M50k99j558J246J736k212q58
2164a160K175Q49l448O48K520o53k638J311L061l382j617L041J421l911L57K997
2180A571j039k331R24L086k356k086K373J543k612j063L077K37k724n51L637j377
2196C09k557J999K319k361j848K768L94j750q25K736k62k489Q49J924l73k829
2212a996J331J996r42k126J413K305k521j276K812R03l595K83L520j308l026J804
2228d23L138l439j366K905J457l794J26L242q05k239O86K772k388j011J443R60
2244A264j453j234K479L53j912p30K685m32k564J084J865q57k371J917J565j988
2260c29j332K386O88k509K19J577O42k849K81L215j813k222K245J817k645r32
$$ plain form
2147 1048 -1155 -1091 1673 819 -1187 -378 1468 540 -1280 335 785 486 -1072 174 1910 -302 -1160
2164 -1160 1015 1864 -1584 -936 1584 931 -1707 -396 2665 -717 -2334 707 2128 -1783 -1426 1571
2180 1571 532 -1799 -875 2211 -145 -2231 142 1685 -927 -1990 1087 1324 -1400 -1951 1686 309
2196 309 -2248 -249 2070 -291 -2139 629 1023 -727 -1552 1184 922 -1567 -718 1206 833 -1996
2212 -1996 -665 1331 389 -1737 -324 1981 -540 -1816 996 1899 -1696 -1413 2107 799 -2227 -423
2228 -423 2715 -724 -2090 815 2272 -1522 -1396 1846 1041 -1198 -512 2260 -128 -1139 304 1264
2244 1264 -189 -1423 1056 1409 -503 -1233 1452 1020 -1544 -460 1405 548 -1823 94 1659 -329
2260 -329 -1661 725 1413 -1096 -877 700 1342 -1507 -1226 1989 176 -2046 199 2016 -629 -1561
2276a561K003J986l721n81L926j368k828K506J747k765q58J868J431k379j208
2291a802L886j474k047J191J527j070r60M98J919r77k744L039O66k063l02J603
2307H90J59j412o46K871n23l791K982J869k672r36J522J351j508j472K423O49
2323A756m045K652J871k583o61N08K342j574k195K188J492l838J320L015k611
2338c63r09M57K477r79k629J319K084k560K30K164k282M82j10J353O32l371L63
2355a642L212r27k233J630j68K06j155Q16K308m149k16N076j713l206K216K68
2371C23J29j112J36K833m123l95N260k133k869J788N19J113j429j534L290k258
2387d62j401M395j538k983J345J177J357j957k553M503j117k531L716j657j277
$$ plain form
2276 -1561 442 2428 -1293 -1874 2052 684 -2144 362 2109 -656 -1514 354 1785 -594 -1802
2291 -1802 2084 610 -1437 -246 1281 211 -749 -251 1668 691 -2053 986 1652 -411 -713 890
2307 890 1049 -363 -1009 1862 1339 -2452 530 2399 -273 -1209 313 1664 156 -1316 1107 1756
2323 1756 -2289 363 2234 -349 -1010 -502 1840 266 -1929 259 1751 -2087 -767 2248 -363
2338 -363 -1272 -815 1662 683 -1946 -627 1457 -1103 -873 1291 -991 -509 -619 734 1366 -2005 -1642
2355 -1642 1570 643 -1590 40 -128 78 -1077 -261 2047 -2102 -2318 2758 1045 -2161 55 323
2371 323 452 -660 -524 2309 -1814 -2209 3051 918 -1951 -163 356 1469 40 -1494 1796 -462
2387 -462 -1863 2532 994 -1989 -644 533 1890 -67 -2620 1883 766 -1765 1951 294 -983
2402i83J068K42J478j463l240M055R55l513K051j85p09N7P6J913j210m276M844
2419A160K013n125J276J011j74J82r78J808r27l544M444J980n423J075J463j38
2435A03P53k043J189R25l472K880K057l772l39J843O39J011l879J049L025l136
2451a167N11L003l541n13K167L20Q01m324J242M254l303q00K518j781n01J305
2467A91K90R13m067M99N697l479k404L035m46j102J079l5R65l348N53N261l729
2484a27k172K919j80l36J52j076J599j495j136M468k226k585K034R00M53j185
2500Gj825K951l62k906L978r31l188J813J753j30j714j393L731m24l306L151L6
2517A241k839J735O82K90j457j508L123J110m235J822J537k307P59M26O85j311
$$ plain form
2402 -983 85 327 1805 342 -2898 1157 2112 -1401 650 465 -244 -187 -111 1802 592 -3684 1160
2419 1160 3173 -1952 -676 335 161 343 -635 1173 246 -3298 1146 3126 -2297 -1222 241 103
2435 103 856 -1187 2 927 -2545 335 2392 -1380 -1719 124 763 1774 -2105 -1056 1969 -1167
2451 -1167 -656 2347 -1194 -1707 460 780 1581 -2743 -1501 2753 -550 -1350 1168 -613 -1114 191
2467 191 481 1394 -2673 -2174 3523 44 -2360 675 229 -873 206 171 1136 -2212 -1659 3602 -127
2484 -127 -2299 620 440 104 256 -820 779 -716 -1852 2616 390 -2195 -161 739 1192 7
2500 7 -1818 1133 771 -2135 1843 912 -2276 -463 1290 1160 -554 -1947 1784 1360 -1946 1205 1241
2517 1241 -1598 137 819 1109 -348 -1856 1267 2377 -1858 -36 1501 -806 -47 379 1064 -247
2533b47j727L265Q65l881J002J906j743O68l89O14K44k189J850J557k861l88K508
2550A054o69n51j349J527J577l080R34K490k264j834L174K11j559j273J629J104
2566A121k942Q96K689k367q72K499j56j521n15P58K295k668m12K126p20j321R53
2583a57R12m80j227J02K697k282j354K855p3j814M95J100k90j218K16K141j002
2600F21k179J774Q98j186j088J498O51j053j343K817l39k943J850J417j168j538
2616a311J420J469k117q80K451mk641J439J138p77j402P15J548j120j159J088
2632a43J561k152p3J157N52j657m63K381o46j855P76K056j560j219J841N73j592
2649d63q18K042K90k047J91K117o83j649Q99J199r62j651J949J279k692m02K667
$$ plain form
2533 -247 -1974 1291 2156 -1725 -723 1183 -560 108 -281 333 577 -1612 238 1795 -1066 -1454 1054
2550 1054 385 -166 -1515 12 1589 -1491 -557 1933 -331 -2165 1009 1220 -339 -1612 17 1121
2566 1121 -1821 -925 1764 -603 -1475 1024 868 -653 -1168 -410 1885 -783 -1195 931 211 -1110 -157
2583 -157 755 275 -952 -850 1847 -435 -1789 1066 993 -821 -326 774 484 -734 -518 1623 621
2600 621 -1558 216 1114 -72 -1160 338 989 -64 -1407 1410 1071 -1872 -22 1395 227 -1311
2616 -1311 109 1578 -539 -1419 1032 1028 -1613 -174 964 187 -1215 -500 1048 -72 -1231 -143
2632 -143 1418 -734 -807 350 902 -755 -1218 1163 517 -1338 -562 1494 -66 -1285 556 1129 -463
2649 -463 -1281 761 1051 -996 -805 1312 629 -1020 -121 1078 116 -1535 414 1693 -999 -1401 1266
2666A266l29k262Q44J912j240j944K083R55j869m52J847L32k043N62J312l83j209
2683f18J31J402r18p22L28J596j147j124J071J238j497j011K324m43j814N04K262
2700A562j505j708J949J089j699j059K019r7j799K25J840o20j346P52J391o37
2716C57k006K064O67j997J33J559L11k378O08J689o83j697J151J421j573k26O80
2733H0R70j507l75J413m8j097K8J335m11j008P1J732r32j472J546J033j940q61
2751a443K559n55j605M87J765n26k373K196Q68k047k28J815l19j353K60J020M14
2768I35k023J006J382j234j175J531K56q88l17L47J599k277P8K003j365p55J210
2785C13M54j000n36K35K035j954q73J889k30r38PJ202L9j505p6K727j951j871
$$ plain form
2666 1266 937 -1325 -481 1431 191 -1753 330 1285 -584 -1036 811 1143 -900 -338 974 591 -618
2683 -618 -487 915 -3 -725 -397 1199 52 -1072 -1 1237 -260 -1271 1053 610 -1204 -700 1562
2700 1562 57 -1651 298 1387 -312 -1371 648 551 -1248 -1023 817 197 -1149 -397 994 357
2716 357 -1649 415 1082 -915 -782 777 1088 -1290 -682 1007 324 -1373 -222 1199 -374 -600 80
2733 80 1050 -457 -832 581 533 -564 -536 799 388 -620 -549 1183 251 -1221 325 1358 -582 -1443
2751 -1443 1116 561 -1044 -557 1208 682 -1691 505 1373 -674 -902 913 594 -759 -499 521 935
2768 935 -1088 -82 1300 66 -1109 422 678 -210 -527 -180 1419 -858 -780 1223 -142 -897 313
2785 313 767 -233 -769 -534 1501 -453 -1326 563 333 -605 -598 604 643 -862 -938 1789 -162 -2033
2803b033K427M03j060p57J017O92j511j95K662j489k417K731L81j075m09L41J175
2820H83r32q94J669l75j975J809O37p07q00m74K383n69k239J875N68k285J458
2837C2O25k20j171o82K879m77k515J228J427j658L91P27p86J8j211K543L42l342
2855a850J186K007j224o03O13J58L67k007K501M07l682J284K625j592n71K35j52
2872b98J122j483O28J373k520O41J590p98n29o38O85K009k598J8K387k177l97
2889i85K435p44j579j19J095J771k502r57L045j764l86J730j181k62k35M16J852
2906A630j711k416L716o04j612J576q67M02m43K5J890k018k076L707j64j952P75
2923a42m62R68k61o43J353r36j659K456M17j983N52q55J900R4k519K464j03k345
$$ plain form
2803 -2033 394 797 -263 -1020 -3 689 -822 -1017 1645 156 -2261 470 851 -224 -633 -292 883
2820 883 -49 -943 726 351 -1624 185 822 115 -685 -1159 1224 655 -1584 291 859 -1426 32
2837 32 657 437 -734 -1416 1463 986 -1529 -301 1126 -532 -141 586 -200 -182 -1393 1150 1492 -1850
2855 -1850 -664 1343 119 -484 129 287 654 -1353 1148 1555 -2127 -843 1782 190 -381 -146 -298
2872 -298 824 -659 -31 1342 -1178 -537 1053 255 -274 -912 -227 1782 -816 -798 1589 -588 -985
2889 -985 1450 706 -873 -992 103 1874 -628 -1585 1460 -304 -690 1040 -141 -403 -638 -222 1630
2906 1630 -81 -2497 1219 615 -997 579 -288 114 -329 -304 1586 -432 -2508 1199 1035 -917 -142
2923 -142 -604 364 103 -540 813 -123 -1782 674 1091 -892 -340 -1195 705 799 -1720 744 641 -1704
2941a704K283P46k199Q1K04J867m35k930K524L42j971J513R10k183N78j8J436
2958A044J3k817J744J438j673L02O96j162K86n6Q75O65l127J633J704j760m74
2975f69R04k36L09m03J97J151k577J037J784j465q60O64O12O0q30K7J369k006
2993i32j22K585j433j142M37J206K70j595j45K211j806n21K436j738q01Q89O63
3010D62J75j429j39J741n51j111J514o74L7j43P5J277j759n41J743J61j804J066
3028A00J31j86l40J27J289j285q15J516M72j984O04R40l38l93l83J579q44j077
3046h87J539K54j797L62R91k17n54m49J597m96j151J331K79j366j15J069P8p38
3064b70n19J220J18j203N66O91o98o19Q04M79m49j119R88J038j509j76J010J13
$$ plain form
2941 -1704 579 1325 -874 -793 -589 1278 843 -2087 437 779 -1192 321 1231 -952 -374 -392 1044
2958 1044 1057 -1760 -16 1422 -251 51 747 -415 -129 -185 690 1355 -1772 -139 1565 -195 -669
2975 -669 235 -1 308 -95 102 1253 -1324 -287 1497 32 -828 -164 448 508 -322 -295 1074 -932
2993 -932 -1054 1531 98 -1044 -607 599 869 -726 -871 1340 -466 -987 1449 -289 -1090 -201 462
3010 462 637 -792 -931 810 259 -852 662 -12 25 -118 -43 1234 -525 -1066 677 838 -966 100
3028 100 231 45 -295 -168 1121 -164 -979 537 1009 -975 -371 569 231 -162 -545 1034 190 -887
3046 -887 652 906 -891 -529 462 245 -309 -758 839 343 -808 523 802 -564 -679 390 468 -270
3064 -270 -789 431 549 -654 -88 603 -95 -714 90 569 120 -999 -11 1027 -482 -658 352 465
3082D65j350L79J078l43j299P85J775k090k38J045M35j274J01J178l09r36MJ729
3100A135j065r56J040O88r59o45J109L46j159K8J365n77j111P27N06m98o06Q46
3118B14O70q80p23J274j1j224L62O02K28j149K60J411r17q72J158O67j588l14
3136h32J296L96j658L29J458r48p01O61J010j490k64J007J02p82p0P35j52n61
3154d64K34R59o02q97P69M47n07q75J441o1p73q0Q24m1q02K76L82j45r14J017
3174A88K08n24l89N52O92j365K63Q82J89j143j2J543r85j010Q86N28o34n58J175
3193D86K96j371J05J288q53m95M25J128q73r00R76L87p51l64J103l80n67K24O38
3212E02j91q20K28J055p89q25J312k8p55j76R16R4j283N86P60k38j221J062P8
$$ plain form
3082 465 -885 -506 572 229 -1070 -285 1490 -600 -838 207 642 -632 -531 647 338 -598 -594 1135
3100 1135 70 -886 154 842 -117 -762 347 693 -466 -438 927 350 -761 -34 472 -26 -632 214
3118 214 884 4 -719 555 544 -680 -318 284 512 -637 -377 1034 117 -755 403 1070 -518 -832
3136 -832 464 860 -798 -469 989 41 -660 1 1011 -479 -743 264 366 -416 -486 249 97 -464
3154 -464 -230 729 127 -770 -1 446 -61 -936 505 444 -329 -409 415 374 -428 -152 230 85 -829 188
3174 188 396 -128 -517 35 727 -638 -375 507 696 -447 -459 1084 99 -911 -25 503 -131 -689 486
3193 486 782 -589 -484 804 -49 -544 -119 1009 136 -764 212 599 -152 -516 587 207 -360 -136 502
3212 502 311 -509 -281 774 -15 -840 472 444 -311 -487 429 523 -760 -174 586 348 -873 189 267
3231B67m20m03M94R19j562r0J431j84j380P49Q22m74n88J17J143j365j68J247
3249E55J21j361J88R52k14m08k15R05m47p78R36J91o55l29P30K29m16p26R68K09
3269D35j246P86M99m59l44N68K64n29q62J254N36j617L83R53o92l06K24P97p00
3288e6o90P17J195j813J2J181m24k49j33O20j33j249R07J372j875q7J086J6k6
3307C71j116J068L6q37m4J619j444l10J013j3m5j112O50R79r12l26J168n47r17
3326g19J016P7K81j289J9J819j217o04J187n79p10J258m17O2p49j06J854r02j134
3345h53J070J6n95O95k41K36o12n27J606n59j175J072J43J1j57n55R33m46q37
3364g75J672o75j260J067M78m22k85l37P76L97j626J867k93j675R62N59k5o43
$$ plain form
3231 267 -153 -556 -62 857 -705 -795 636 452 -928 -179 643 169 -419 -302 841 -524 -692 555
3249 555 676 -685 -497 455 241 -167 -382 523 76 -702 234 425 -230 -559 171 400 -16 -742 226 435
3269 435 -811 -25 474 15 -329 239 503 -26 -888 366 902 -715 -332 621 -71 -377 -153 644 -56
3288 -56 -746 -29 1166 -647 -635 546 122 -127 -260 360 227 -1022 -115 1257 -618 -705 381 397 371
3307 371 -745 323 359 -478 -522 1097 -347 -657 356 343 298 -814 -164 815 -97 -423 745 198 -719
3326 -719 297 374 655 -634 -615 1204 -13 -617 570 -9 -719 539 122 184 -565 -671 1183 281 -853
3345 -853 217 233 -362 333 92 328 -284 -811 795 236 -939 133 276 287 130 -425 508 62 -775
3364 -775 897 222 -1038 29 507 85 -200 -537 239 636 -990 877 584 -1091 -129 430 405 -238
3382b38n31R19M12j482J080K58j293J023J14k33n52j36R69O33j561L42Q82j296
3400f90Q91K31l67j65p92J105R88k099M59J310j076M00l18o7M94p90N61Q54j525
3419e96k70J770o42j37n23K90O88j102O16P52j364j16J217j80m89j22k39J283
3437H36r97k36Q90p32n37J272j33n12n69L48J442j015j014J390n16n1M25k52K6
3456F5m28j68J420n34j503J337K35n56J13R3K0k23k11J217n04j579J478M65j071
3475c34J79J33L70l21o74J138J76j755J301L37o77j52J77O78l75m37L79M20j176
3494f13P21M38m61m39K39O18k54o56L43P62j135K70N48k34k64L4M55J50j213J07
3514e84J302q51l84Q35j25J20r12P88M10j179J18J198o06o41O83k2j21n48O78
$$ plain form
3382 -238 -769 150 562 -920 160 418 -875 148 262 29 -523 -659 310 943 -618 -276 606 -690
3400 -690 201 432 65 -100 -892 213 1201 -898 -439 871 -205 195 -123 -190 304 -486 75 929 -596
3419 -596 -866 904 262 125 -398 -108 580 -522 94 846 -518 -634 583 403 -86 -208 -447 836
3437 836 -161 -397 493 -239 -776 496 363 -149 -718 -370 1072 57 -957 433 -83 -134 291 39 65
3456 65 -363 -531 889 355 -1148 189 424 -132 -19 74 94 -129 -340 877 373 -1206 272 737 -334
3475 -334 -155 -22 348 27 -647 491 667 -1088 213 550 -127 -279 -102 576 201 -236 143 563 -613
3494 -613 108 546 85 -354 -115 503 249 -407 -64 698 -437 -167 381 147 -117 -83 372 522 -691 -584
3514 -584 718 -133 -517 318 193 313 -599 189 599 -580 -462 736 130 -511 172 150 29 -519 159
3533A59N11r80j59J237m26p35J89J80p2o6j56O38k36n47N99K53p92M4O44Q6n87
3554b16k73J446p25o33N50L74n08n81O69L74n92l26Q96j80n30K17O88p30m73O71
3574A18L48k70r50J186k4q36M98K80j73p28M95N63o74l58M69M78p74O2L43R6p53
3595f04L93L66K0o16J34R68o29k92K21L84o01o3P57k46l20j91Q53l63m58L08M36
3616D57k16p04R06k70q5m29N26L72j122L19N65l1q86Q92K73o80m40P14L33p23
3636b29K6N73j90n18L71L13l0p86O68L02n89o1K36P49q51j43N78m0q64J98L34
3657D7kl50K79O30r31k04N66K17n13M9L54J60q40N58L96K22r03J13Q78p51o76
3678g01R07K33r36K21O89j28o41K80M16k78m47M36L07k78l65M55K22p64J86M85
$$ plain form
3533 159 670 -310 -469 768 342 -393 -204 -24 -96 -162 -318 320 84 -463 136 389 -403 -359 285 371 -216
3554 -216 -489 957 232 -401 149 523 15 -566 103 477 -115 -441 455 275 -255 -38 650 -80 -553 118
3574 118 466 196 -754 432 408 -428 70 350 177 -551 -56 507 -167 -525 -56 422 -352 -290 53 149 -604
3595 -604 -211 155 175 -441 -307 661 32 -260 -39 345 -256 -319 438 192 -128 -319 534 171 -287 21 457
3616 457 241 -463 443 173 88 -341 185 557 -565 -246 319 288 -598 294 567 -113 -553 161 494 -229
3636 -229 -203 370 180 -338 33 346 316 -470 198 500 -89 -150 86 835 -16 -159 419 379 -485 -287 47
3657 47 45 -305 -26 604 -327 -531 35 252 -261 -212 142 302 -538 20 416 638 -265 -152 726 -25 -701
3678 -701 206 439 -497 -276 413 285 -356 -76 340 62 -385 51 358 80 -285 170 392 -372 -186 299
3698B99k3m64l2O49l14l57M41K40q54j87Q31o4m63q8P96N4r44K94O02m57m38Q65
3720C86k36l51r2O56J32j167M33R27n12m62M44L4j49k06Q3L36j73l71O59l42m33
3741d04M97J62j27m13L8Q14q68j01N61L90p18m10P07J08l00l23J009p21k75O03
3761B29Q2o32M4M51M26q44o22J432m37o18N15J57m70M0N29M43q03n84J267m18
3781A87n33O58k82m3r9j06M32O6o38N06M60r74K77M5J06J66o48O60l6o61N42M65
3803E50r22j75N78K54P7r25N55N18r12J16P85p99lK28J45M25r89O38K62l54r8
3824d6L77n24l2N49j2J71j078K99J066r80J39Q2k73K26J93l14O47j015p3J425
3844H27o90n20L41J0N6o5l02P05q17L13J050n54r06K68M41p6j17j76P80p92k52
$$ plain form
3698 299 276 -188 -220 429 115 -242 199 439 -415 -602 229 165 -298 -386 410 464 -480 -186 416 -41 -479 386
3720 386 150 -201 -293 363 495 -672 -239 688 176 -286 158 192 43 -163 -80 256 83 -288 371 29 -404
3741 -404 93 255 128 -285 -247 567 -301 -402 159 549 -169 -579 128 236 -64 -387 622 -99 -374 229
3761 229 311 -321 -277 174 600 -244 -866 566 129 -489 26 183 -287 -247 282 725 -78 -662 605 187
3781 187 -346 312 30 -13 -112 -218 214 280 -358 148 608 -366 -89 -44 62 228 -420 240 204 -457 85 550
3803 550 -372 -547 31 285 362 -563 -8 510 -402 -286 499 -300 -303 -75 70 495 -494 144 406 52 -46
3824 -46 331 -193 -225 324 312 483 -595 -296 770 -210 -71 11 -262 -36 157 -157 490 -525 -598 827
3844 827 137 -383 -42 -32 24 -41 -343 362 -455 -142 908 354 -552 -284 157 81 -36 -212 568 -224 -476
3865d76J205p35m97M85L33j45k78n18Q42P3p95J021l34n75M17R5K52m19n37Q45
3885B59N86j324N23J25n32L72P2J15k52q31Q96O83r63K57L87l51K3j28O45m73
3905H9p46P53M15q55m4O91k38j27m87P02j10k96M07N16j058j69P82l1K17m58n3
3926a00K08n95O21N40r42k68P97k22J42m02K9P65p14J19K67m3k95N46k97Q9q73
3947f28M60P13m74o68O05qm45M36J52j08m34J33R60p53m41O10J25l77j26M96l
3968B25k59m71N99M5o49O06l0J52j88O0N9j79k24L52J59m80M05l1M0k78k40L80
3990E3J83m81q7Q43r24K88l5N17l80n65J023l18k44j65O33m03N7K65L4k26m57
4011c89P14M1o98M45K75o28J38L52k88Q1j76K67R7l10P9K07k07M5l1Q6P0m76L64
$$ plain form
3865 -476 729 -6 -503 -18 315 170 -108 -626 216 289 -506 515 181 -394 23 118 370 -49 -586 259
3885 259 845 -479 44 169 -363 9 81 196 -56 -887 9 692 -271 -14 373 22 45 -83 562 89
3905 89 -657 96 511 -344 -388 303 65 -62 -549 153 43 -253 154 670 -388 -557 225 194 411 -47 -100
3926 -100 108 -487 134 674 -268 -536 261 39 181 -221 -192 573 -141 -22 245 202 -93 453 156 245 -628
3947 -628 -168 545 71 -597 8 0 -445 -9 143 35 -399 -266 694 -59 -500 110 235 -142 -268 228 225
3968 225 -34 -505 94 139 -510 96 66 218 30 90 149 -30 -254 98 257 -223 182 151 191 -87 -327 53
3990 53 236 -245 -332 511 -413 -125 -160 357 -23 -588 435 117 -127 -292 341 -62 -5 260 294 68 -389
4011 -389 325 366 -332 113 388 -240 -102 250 -38 43 -133 134 231 -79 0 207 0 45 14 100 170 -306 58
4034E8K26m81k30N84K21n58J79O8J00l53j35O46j45p66L93N36m73k33K58L04k40
4055d1n75P85m8l07J65L45l55q8Q9K36m83O5M59O9k43r5K02N0n74J71K32l3j40
4078a14K67J41m07j12J21M89m57k9K27J93o03L23J16m6k95k0M94k47m43M54J06
4099A58l05N5L08l5l08j68O76l01l32L08L00m37j92N30q3m21K10L37l98o6J54
4120a0Q3L01m39R9K75k89l00M10P0l11j06L40O2m09K21L03p6m34O1O56m65q8K54
4143B08J5m15j03O20k92o4R5K86j99m59K01L76j62n01N28R4l74L7L85Pp02N09
4165I0q6j30j08M01J58n22J10Q5L91o67L49j10K77l43J89Q8j1l75L51J29m68o4
4187b66N36Rk16k59N31j60o10M39K11m41j54L78K2k01q7K44L58o86J66M58m54
$$ plain form
4034 58 284 -197 -427 157 378 -180 -1 67 167 -186 -321 325 180 -586 -193 343 -130 -363 -105 199 -41
4055 -41 -616 169 121 -186 -21 324 -31 -119 -30 206 -277 -212 247 316 73 -22 180 230 -344 -173 59 26 -114
4078 -114 153 294 -113 -225 -104 385 -72 -101 126 319 -284 39 155 109 -186 -206 288 41 -402 52 158
4099 158 -147 -92 216 181 -127 -295 381 80 -252 56 356 -81 -273 257 174 -247 -37 300 -98 -164 -10
4120 -10 73 374 -65 34 309 20 -280 130 200 -111 -217 123 185 -224 -3 300 224 -210 -149 507 42 -46 208
4143 208 223 -192 -295 325 33 -31 64 350 151 -308 -107 269 107 -394 134 228 -146 -109 276 283 -419 90
4165 90 4 -126 -234 167 325 -197 -87 -2 389 -278 71 -39 238 -105 84 172 161 -214 137 266 -202 -266
4187 -266 270 279 63 -196 335 175 -435 4 215 -226 -380 -2 20 -181 -268 -24 334 -352 -186 272 -182
4208a82j88L90K10k63l67N45K44n24k61O10j44l30o5L39Qk43K40J30k28j01K23
4229D3N3j7j04L7J53j52j91O37p50j80O33O8k35l00R1L86k47j11O33m18l64M71
4251A36Qj4m45L54J82j08m29L43J9m41J70M42k44pj67L92Q3p44J63M80n10L23
4273a4j99K51j20k63N23J21p68O02J1j85J90m99M75j12l02N81Oo90O4P20l04m8
4295D0n19N39K89p64N65L28p21j14P48k06k79j10K48M30p54K95L44n53mM73n28
4316b53K26l32J65M89o37N1M46om92L92Pj42p2j5P44q18k15R10j61m49N7k0K87
4339A62n19J51N19o38ML88J62n09L14q3P4k16j70Q86n42m79R19k32j49j77R9K85
4361B49q0l83L47j08n59Q33j39N8l66p4N70j71o87L68K89l61L48j06j15j49r5
$$ plain form
4208 -182 -370 20 230 -33 -400 145 389 -135 -396 214 70 -260 -325 14 22 -221 19 149 -79 -180 43
4229 43 96 79 -25 12 165 13 -178 459 -291 -471 162 230 -5 -305 -214 172 -75 -186 447 29 -335 136
4251 136 144 130 -315 39 221 113 -316 27 46 -395 -225 217 -27 -34 -201 191 274 -470 -307 173 -337 -14
4273 -14 -213 38 -82 -345 178 299 -469 133 144 -41 149 -350 125 13 -289 292 298 -392 -328 392 88 40
4295 40 -479 60 349 -415 150 478 -243 -357 391 185 -94 -204 44 474 -280 15 359 -194 -198 275 -253
4316 -253 -27 -359 -194 295 -342 -291 155 149 -343 49 56 -86 -158 -173 571 -247 -462 448 287 -162 -105 -125 162
4339 162 -357 -206 313 -325 -321 67 229 -280 34 -49 25 -191 -361 525 -17 -496 423 191 42 -135 -36 249
4361 249 169 -214 133 25 -534 299 160 218 -148 -222 348 177 -510 -142 147 -214 134 28 -87 -236 -331
4382c31Q22j66j055M34P49o36R6M00l48Rl09O66R9j028L85O01l42j88J27k15M12
4403A82l94M72p2n47J43M15j32m30L13R3N48q70J77K85m42L1M64j39k22M6k00
4424b79O77m55k66Q06m68k13M78j46m83q7O71j22j57l05N24j8m10K53Lq3L2R9
4446E1K33k09o46O07J41k76K96p7K2l35K60K7J64o08L81J63n68L19o6L00j91o4
4468g6K17R2m24K75L30n87R4R9M07n31l06M56J80o37L94J11r2r6J72J79k07j88
4490a38J09L55m22K5M67k83k12j22K20j67k91M45N04n48k21M12O2k07N4J04R0
4511B36k87J20K53l75k48N92l2m67K49j05O3k72K55M98k27n55L42K20l86J27p4
4532g3N98l85m05L76K07m99J96K88l80j7K2L01j33l27L92J80m81k69N01J02l20
$$ plain form
4382 -331 491 325 -730 -296 453 -183 -87 313 -35 -26 -335 331 430 -598 -213 388 46 -142 -15 -230 182
4403 182 -212 260 188 -359 -216 199 67 -363 -50 43 591 -279 -102 183 -259 -228 236 97 -125 -79 -279
4424 -279 398 -57 -323 483 15 -198 280 134 -349 -436 235 113 -44 -349 175 157 -253 0 3 -80 -48 51
4446 51 284 75 -571 36 177 -99 197 120 142 -193 67 94 258 -350 31 194 -374 -55 -121 179 -12 -76
4468 -76 141 233 -191 84 414 -173 -79 20 427 -104 -410 46 226 -411 -17 94 2 -94 78 257 50 -138
4490 -138 -29 326 -96 -71 396 113 -99 -221 -1 -168 -459 -14 490 -58 -279 133 195 -12 42 146 236
4511 236 -51 69 322 -53 -301 291 259 -208 41 -64 -1 -273 -18 480 253 -302 40 260 -126 1 -73
4532 -73 525 140 -265 111 318 -181 15 303 -77 -94 -72 229 96 -231 161 341 -140 -409 92 194 -126
4553a26M8L68J4o36N74r9k17j3q6L21k65j32L21P7k91M6K73j38m57M57n7Q1l14
4576b51J82M64p00L3J33J33k15L50K47n62n03R85L04l67o10M32N0M02p59L94P7
4597B19o97K70M07N7p10O93K7n74L27k25J12Jl04R87m07M6m4m1m79j45K69N33
4619C22q51K96KJ17J74L06J68M68j106o0N18n98J06O5K16k17J33k08L59n31L4
4640b87N45l25l34L54K63Qn71N84J22l28n06P46q2j77j1K50J54n85L0N12j53n15
4662c06O34J86n32l3K23m6n28M44M7k4l03K30L97n89r1J70M81m21k18M60m5m10
4684b74L36L55o18K28L4J92K7p39O34m6k10k9M20l73j03J15L85p0n38J78l6J84
4706E2r2K40k59J69q3J67K90r06J96O86n27k69N29k27K89k67j14M54n88J3N18
$$ plain form
4553 -126 -78 290 304 -332 242 143 -74 -87 -173 148 -117 -249 72 149 -142 -96 177 39 -418 39 -18 63 -251
4576 -251 -69 395 -305 -272 -139 -6 -221 129 376 -186 -689 296 600 233 -377 55 105 507 -252 142 219
4597 219 -478 -208 199 256 -454 239 266 -308 19 -206 -94 -93 -397 590 183 229 185 144 -335 -480 -211 322
4619 322 -529 -233 -231 -114 60 366 534 1002 -104 -164 354 -244 -138 -73 143 -74 59 -149 210 -321 -287
4640 -287 258 -67 -401 -47 216 224 -347 237 359 31 -475 271 189 12 1 251 405 -180 -150 362 209 -306
4662 -306 328 514 -18 -51 172 126 -402 42 89 65 -238 -8 389 -200 -291 -121 360 -61 -279 181 136 -274
4684 -274 62 417 -201 27 61 253 280 -459 175 129 -81 -110 310 -63 -166 -51 334 264 -274 -96 -132 52
4706 52 -40 200 -59 110 27 194 484 -422 -226 460 -67 -336 193 -34 255 -12 -126 328 -260 -247 271
4727B71l43k40L26L23j94q5p9L62l87k18N71l36m5K9K30J13l70p2N10k27j77L24
4749B86qn14J69J23L76m40l89N05R6j66R7j01k51M87k61K62k31n62P93R2o28J27
4771a38J55J19n6l07N82m41l16O90J32p41Q5O28l22M3m02M21Q3l95L77K59p41
4792b85O3K54M8J66p01M43L27m58O8K70l15J2L33K0n7p16K02O45m02j08L85l33
4814a39PR4K08J31p48L28O79p53K8L61k50K52k07K51Q8o23r5R79m79m54M09O4
4836A31L2j1l79K79m47r4R96n55o29Q44J09k68q9j27N23m02l97Q49k39l49M17
4857A94J28J4p70J19N99J63q49M91J57m98J60K09L96o42l31R00l46l86M51p5m00
$$ plain form
4727 271 -72 -312 14 337 143 58 -21 341 -46 -264 307 -29 -74 -45 185 298 -72 -144 366 139 -38 286
4749 286 278 -236 -67 56 432 -8 -397 108 204 38 135 34 -217 270 9 271 40 -522 271 363 -265 -138
4771 -138 17 136 80 -227 355 -86 -402 288 420 -321 -236 392 70 113 -289 132 215 -180 197 456 -285
4792 -285 -222 32 80 246 -455 -12 315 -143 -75 195 -120 -108 225 245 188 -528 -326 319 -83 -191 194 -139
4814 -139 -132 -38 170 301 -447 -119 560 -193 -165 196 -54 198 -9 242 330 -293 -388 591 112 -342 67 131
4836 131 163 152 -227 52 -395 -489 507 -48 -677 167 276 8 -81 -208 315 -87 -484 365 126 -223 194
4857 194 322 336 -434 -315 284 447 -402 89 246 -252 -92 117 513 -129 -460 440 94 -292 159 84 -316
$$ [...]
8191B87
##END NTUPLES=NMR FID
##END=
